##TITLE=1H_SA_26.118'
 CDCl3, 8 sc, 
 17.9.2019
##JCAMPDX= 6.0         $$ Bruker NMR JCAMP-DX V2.0
##DATA TYPE= NMR FID
##DATA CLASS= NTUPLES
##ORIGIN= UXNMR, Bruker Analytische Messtechnik GmbH
##OWNER= root
$$ XWIN-NMR		Version 3.5
$$ Tue Sep 17 15:46:49 2019 Russian Standard Time (UT+4h)  she@DPX200
##.OBSERVE FREQUENCY= 200.1315
##.OBSERVE NUCLEUS= ^1H
##.DELAY= (6, 6)
##.ACQUISITION MODE= SIMULTANEOUS
##.ACQUISITION SCHEME= undefined
##.AVERAGES= 8
##.DIGITISER RES= 18
##SPECTROMETER/DATA SYSTEM= spect
##.PULSE SEQUENCE= zg30
##.SOLVENT NAME= CDCl3
##.SHIFT REFERENCE= (INTERNAL, CDCl3, 0, 15.7039)
##AUDIT TRAIL= $$ (NUMBER, WHEN, WHO, WHERE, WHAT)
$$ ##TITLE= Audit trail, XWIN-NMR		Version 3.5
$$ ##JCAMPDX= 5.01
$$ ##ORIGIN= Bruker BioSpin GmbH
$$ ##OWNER= she
$$ F:/spectra/data/she/nmr/H-F/1/audita.txt
$$ ##AUDIT TRAIL=  $$ (NUMBER, WHEN, WHO, WHERE, WHAT)
(   1,<2019-09-17 15:44:51.68 +0400>,<she>,<DPX200>,
      <created by zg, POWCHK disabled, PULCHK disabled
       configuration hash MD5:
       00 E9 B6 7A A2 85 ED C7 34 08 36 98 17 FE 4E 26
       data hash MD5: 16K
       03 A9 38 C2 37 FE 79 CF FF 3D DD 5D D7 BA EB 58>)
$$ ##END=
$$ 
$$ hash MD5
$$ 49 B8 7A E8 B9 82 6F 72 91 E2 04 29 3C 2C 97 8A
##$RELAX= 
##$RELAX= 
##$RELAX= 
##$RELAX= 
##$RELAX= 
##$RELAX= 
$$ Bruker specific parameters
$$ --------------------------
##$DU= <F:/spectra>
##$EXPNO= 1
##$NAME= <H-F>
##$PROCNO= 1
##$TYPE= <nmr>
##$USER= <she>
##$AMP= (0..31)
100 100 100 100 100 100 100 100 100 100 100 100 100 100 100 100 100 100 
100 100 100 100 100 100 100 100 100 100 100 100 100 100 
##$AQSEQ= 0
##$AQ_mod= 1
##$AUNM= <au_zg>
##$AUTOPOS= <>
##$BF1= 200.13
##$BF2= 200.13
##$BF3= 200.13
##$BF4= 200.13
##$BF5= 200.13
##$BF6= 200.13
##$BF7= 200.13
##$BF8= 200.13
##$BYTORDA= 1
##$CFDGTYP= 0
##$CFRGTYP= 5
##$CHEMSTR= <none>
##$CNST= (0..31)
1 1 145 1 1 1 1 1 1 1 1 1 1 1 1 1 1 1 1 1 1 1 1 1 1 1 1 1 1 1 1 1 
##$CPDPRG= <>
##$CPDPRG1= <>
##$CPDPRG2= <>
##$CPDPRG3= <>
##$CPDPRG4= <mlev>
##$CPDPRG5= <mlev>
##$CPDPRG6= <mlev>
##$CPDPRG7= <mlev>
##$CPDPRG8= <mlev>
##$CPDPRGB= <>
##$CPDPRGT= <>
##$D= (0..31)
0 1.2 0 0 0 0 0 0 0 0 0 0.03 0 0 0 0 0 0 0 0 0 0 0 0 0 0 0 0 0 0 0 0 
##$DATE= 1568720690
##$DBL= (0..7)
120 120 120 120 120 120 120 120 
##$DBP= (0..7)
150 150 150 150 150 150 150 150 
##$DBP07= 0
##$DBPNAM0= <>
##$DBPNAM1= <>
##$DBPNAM2= <>
##$DBPNAM3= <>
##$DBPNAM4= <>
##$DBPNAM5= <>
##$DBPNAM6= <>
##$DBPNAM7= <>
##$DBPOAL= (0..7)
0.5 0.5 0.5 0.5 0.5 0.5 0.5 0.5 
##$DBPOFFS= (0..7)
0 0 0 0 0 0 0 0 
##$DE= 6
##$DECBNUC= <off>
##$DECIM= 24
##$DECNUC= <off>
##$DECSTAT= 4
##$DIGMOD= 1
##$DIGTYP= 9
##$DL= (0..7)
0 120 120 120 120 120 120 120 
##$DP= (0..7)
150 150 150 150 150 150 150 150 
##$DP07= 0
##$DPNAME0= <>
##$DPNAME1= <>
##$DPNAME2= <>
##$DPNAME3= <>
##$DPNAME4= <>
##$DPNAME5= <>
##$DPNAME6= <>
##$DPNAME7= <>
##$DPOAL= (0..7)
0.5 0.5 0.5 0.5 0.5 0.5 0.5 0.5 
##$DPOFFS= (0..7)
0 0 0 0 0 0 0 0 
##$DQDMODE= 0
##$DR= 18
##$DS= 0
##$DSLIST= <SSSSSSSSSSSSSSS>
##$DSPFIRM= 0
$$ [...]
##$SUBNAM2= <"">
##$SUBNAM3= <"">
##$SUBNAM4= <"">
##$SUBNAM5= <"">
##$SUBNAM6= <"">
##$SUBNAM7= <"">
##$SUBNAM8= <"">
##$SUBNAM9= <"">
##$SW= 24.0689530833862
##$SWIBOX= (0..15)
0 0 2 0 0 0 0 0 0 0 0 0 0 0 0 0 
##$SW_h= 4816.95568400771
##$TD= 16384
##$TD0= 1
##$TE= 0
##$TE2= 300
##$TE3= 300
##$TEG= 300
##$TL= (0..7)
0 120 120 120 120 120 120 120 
##$TP= (0..7)
150 150 150 150 150 150 150 150 
##$TP07= 0
##$TPNAME0= <>
##$TPNAME1= <>
##$TPNAME2= <>
##$TPNAME3= <>
##$TPNAME4= <>
##$TPNAME5= <>
##$TPNAME6= <>
##$TPNAME7= <>
##$TPOAL= (0..7)
0.5 0.5 0.5 0.5 0.5 0.5 0.5 0.5 
##$TPOFFS= (0..7)
0 0 0 0 0 0 0 0 
##$TUNHIN= 0
##$TUNHOUT= 0
##$TUNXOUT= 0
##$USERA1= <user>
##$USERA2= <user>
##$USERA3= <user>
##$USERA4= <user>
##$USERA5= <user>
##$V9= 5
##$VALIST= <valist>
##$VCLIST= <CCCCCCCCCCCCCCC>
##$VD= 0
##$VDLIST= <DDDDDDDDDDDDDDD>
##$VPLIST= <PPPPPPPPPPPPPPP>
##$VTLIST= <TTTTTTTTTTTTTTT>
##$WBST= 1024
##$WBSW= 4
##$XGAIN= (0..3)
0 0 0 0 
##$XL= 0
##$YL= 0
##$YMAX_a= 46758
##$YMIN_a= -45545
##$ZGOPTNS= <>
##$ZL1= 120
##$ZL2= 120
##$ZL3= 120
##$ZL4= 120
##$ABSF1= 10
##$ABSF2= 0
##$ABSG= 5
##$ABSL= 3
##$ALPHA= 0
##$AQORDER= 0
##$ASSFAC= 0
##$ASSFACI= 0
##$ASSFACX= 0
##$ASSWID= 0
##$AUNMP= <proc_1d>
##$AZFE= 0.1
##$AZFW= 0.1
##$BCFW= 1
##$BC_mod= 2
##$BYTORDP= 1
##$COROFFS= 0
##$CY= 11.3945322036743
##$DATMOD= 1
##$DC= 2
##$DFILT= <>
##$DTYPP= 0
##$F1P= 20.1720416913024
##$F2P= 0.152960286110954
##$FCOR= 0.5
##$FTSIZE= 0
##$FT_mod= 4
##$GAMMA= 1
##$GB= 0.15
##$INTBC= 1
##$INTSCL= 1
##$ISEN= 128
##$LB= 0.24
##$LEV0= 0
##$LPBIN= 0
##$MAXI= 10000
##$MC2= 0
##$MEAN= 0
##$ME_mod= 0
##$MI= 1.114404
##$NCOEF= 0
##$NC_proc= 0
##$NLEV= 6
##$NOISF1= 3.799351
##$NOISF2= 2.8
##$NSP= 1
##$NTH_PI= 0
##$NZP= 0
##$OFFSET= 15.70392
##$PC= 1
##$PHC0= -9580.475
##$PHC1= 25.20096
##$PH_mod= 1
##$PKNL= yes
##$PPARMOD= 0
##$PSCAL= 0
##$PSIGN= 0
##$REVERSE= no
##$SF= 200.130013532006
##$SI= 16384
##$SIGF1= 3
##$SIGF2= 2
##$SINO= 400
##$SIOLD= 16384
##$SREGLST= <1H.CDCl3>
##$SSB= 0
##$STSI= 0
##$STSR= 0
##$SW_p= 3612.71676300578
##$SYMM= 0
##$S_DEV= 0
##$TDeff= 0
##$TDoff= 0
##$TI= <>
##$TILT= no
##$TM1= 0
##$TM2= 0
##$TOPLEV= 0
##$USERP1= <user>
##$USERP2= <user>
##$USERP3= <user>
##$USERP4= <user>
##$USERP5= <user>
##$WDW= 1
##$XDIM= 8192
##$YMAX_p= 0
##$YMIN_p= 0
$$ End of Bruker specific parameters
$$ ---------------------------------
##NTUPLES= NMR FID
##VAR_NAME=  TIME,          FID/REAL,        FID/IMAG
##SYMBOL=    X,             R,               I
##VAR_TYPE=  INDEPENDENT,   DEPENDENT,       DEPENDENT
##VAR_FORM=  AFFN,          ASDF,            ASDF
##VAR_DIM=   8192,          8192,            8192
##UNITS=     SECONDS,       ARBITRARY UNITS, ARBITRARY UNITS
##FACTOR=    0.0002076,     1,               1
##FIRST=     0,             0,               0
##LAST=      1.7004516,     0,               0
##MIN=       0,             -45545,          0
##MAX=       1.7004516,     46758,           0
$$ Real data points
##PAGE= N=1
##DATA TABLE= (X++(R..R)), XYDATA
$$ [...]
$$ plain form
2026 -243 882 347 -935 -672 400 541 -262 -161 680 133 -471 337 1397 681 -777 -275 1108 1198
2044 1198 -44 50 885 632 237 578 1381 855 -559 424 1178 1263 -11 -90 952 1323 410 463 997 540
2064 540 142 348 1219 1115 -51 -139 1277 1293 234 249 507 604 -135 93 797 663 -607 -688 732 712
2084 712 -105 -352 265 170 -506 -358 482 182 -457 -494 591 681 -235 -824 -159 372 -53 -423 -216 156 -694
2105 -694 -579 433 320 -529 -1259 -334 356 -462 -927 -876 -235 -567 -679 -480 -3 -832 -1322 -293 -398 -663
2125 -663 -1002 -303 193 -226 -611 -249 116 -189 -362 10 573 -223 -510 -336 308 -286 -467 -199 73 -34
2145 -34 -342 -44 333 207 -746 -335 3 81 -280 -285 206 87 -217 -227 266 105 -271 -76 463 292 -206 65
2167 65 529 632 274 -113 829 419 214 490 769 466 94 112 480 725 204 227 780 603 52 274 276 250
$$ packed form
2026b43J125n35j282K63J072J41q03J01Q41n47o04Q08J060p16j458N02J383R0
2044A198j242R4Q35k53l95L41Q03n26j414R83P54Q5j274p9J042L71r13N3N34m57
2064E40l98K06Q71j04j166q8J416J6j059J5K58R7p39K28P04j34j270q1J420k0
2084G12q17k47O17r5o76J48Q40l00o39l7J085R0r16n89O65N31m25l70K07L72q50
2105f94J15J012j13q49p30R25O90q18m65N1O41l32j12J99M77q29m90J029j05k65
2125f63l39O99M96m19l85L62L65l05j73L72N63p96k87J74O44n94j81K68K72j07
2145c4l08K98L77j26r53M11L38P8l61nM91j19l04j0M93j61l76J95N39j71m98K71
2167F5M64J03l58l87R42m10k05K76K79l03l72J8L68K45n21K3N53j77n51K22Kk6
$$ plain form
2189 250 -140 -21 441 498 154 -35 608 537 139 262 659 299 332 611 578 486 420 262 498 643 521 272
2211 272 178 125 470 92 420 56 73 -13 -274 -221 -259 -158 -148 -609 -443 -381 -487 -319 -519 -727 -420 -341 -715
2234 -715 -548 -424 -279 -13 -742 -498 -98 -213 -435 -505 -158 -496 -304 -308 -452 -601 -719 -478 -515 -1022 -802
2255 -802 -809 -611 -663 -595 -1010 -676 -687 -957 -525 -569 -558 -550 -701 -364 -130 -386 -592 111 -112 -352 74 313 110
2278 110 231 12 493 263 -22 -64 116 235 -155 257 283 268 131 49 387 18 492 193 255 82 196 480
2300 480 723 346 623 630 514 756 432 293 239 773 451 674 423 736 532 516 527 655 302 365 447 457 260
2323 260 287 502 380 358 439 394 258 256 204 92 72 115 176 192 95 139 -111 201 184 140 -138 -62 -99 -241 -183 -199
2349 -199 21 -52 -182 170 173 -291 -15 -116 133 238 -90 191 152 -291 -48 29 75 -434 -456 -317 -144 -352
$$ packed form
2189B50l90J19M62N7l44j89O43p1l98J23L97l60L3K79l3r2o6j58K36J45j22k49
2211B72r4n3L45l78L28l64J7q6k61N3l8J01J0m61J66O2j06J68k00k08L07P9l74
2234g15J67J24J45K66p29K44M00j15k22p0L47l38J92mj44j49j18K41l7n07K20
2255h02pJ98n2O8m15L34j1k70M32m4J1Qj51L37K34k56k06P03k23k40M26K39k03
2278A10J21k19M81k30k85m2J80J19l90M12K6j5j37q2L38l69M74k99O2j73J14K84
2300D80K43l77K77Pj16K42l24j39n4N34l22K23k51L13k04j6J1J28l53O3Q2J0j97
2323B60K7K15j22k2Q1m5j36kn2j12k0M3O1J6r7M4k50L12j7m4k78P6l7j42N8j6
2349a99K20p3j30L52Lm64K76j01K49J05l28K81l9m43K43P7M6n09k2J39J73k08
$$ plain form
2371 -352 -368 -160 86 -556 -822 -357 -293 -680 -635 -679 -206 -559 -891 -362 -401 -585 -774 46 -240 -328 -612 -272
2393 -272 -39 -10 -370 -150 113 41 -225 248 72 -302 -477 -347 239 -337 -423 -156 -22 -184 -465 -486 108
2414 108 -714 -704 -194 -6 -259 -666 -324 287 56 -81 -326 432 157 295 279 497 414 200 419 1208 624
2435 624 415 518 822 704 513 717 1025 605 231 506 871 807 -16 45 1109 456 79 -108 708 392
2455 392 -165 296 854 265 -383 81 945 909 227 -157 395 482 36 122 326 181 99 167 897 414 -193 -250
2477 -250 445 739 -31 -448 338 324 -557 -257 235 110 -901 -501 -15 340 -671 -1203 -174 -130 -946 -725
2497 -725 -424 -612 -972 -1131 -197 -74 -1103 -1359 -746 -345 -857 -1107 -481 -364 -1201 -1044 81 -69 -1128
2516 -1128 -1174 -207 610 -385 -1073 -74 54 -243 -209 27 268 -432 -723 128 440 -304 -903 -124 310 -98
$$ packed form
2371c52j6K08K46o42k66M65O4l87M5m4M73l53l32N29l9j84j89Q20k86q8k84L40
2393b72K33K9l60K20K63p2k66M73j76l74j75J30N86n76q6K67J34j62k81k1N94
2414A08q22J0N10J88k53m07L42O11k31j37k45P58k75J38j6K18q3k14K19P89n84
2435F24k09J03L04j18j91K04L08m20l74K75L65o4q23O1J064o53l77j87Q16l16
2455C92n57M61N58n89o48M64Q64l6o82l84N52Q7m46Q6K04j45q2O8P30m83o07n7
2477b50O95K94p70m17P86j4q81L00M92j25j011M00M86L55j011n32J029M4q16K21
2497g25L01j88l60j59R34J23j029k56O13M01n12k50O26J17q37J57J125j50j059
2516a128m6R67Q17r95o88R99J28k97L4K36K41p00k91Q51L12p44n99P79M34m08
$$ plain form
2536 -98 -96 -102 251 -583 -672 174 364 -314 -904 -279 531 309 -490 57 351 35 96 540 1217 -6 -280 463
2558 463 1296 799 -65 323 562 561 219 217 719 264 77 449 1144 574 -809 14 791 615 -240 -76 401
2579 401 61 -356 164 832 65 -775 -410 860 500 -278 -416 372 112 -347 -70 121 68 -679 -407 928
2599 928 443 -483 -412 331 581 35 21 180 -89 -469 -91 711 195 -877 -524 698 600 21 -482 13
2619 13 159 -403 -182 335 178 -1114 -652 287 270 -571 -870 -209 -25 -462 -739 -233 -225 -713 -489 396 244
2640 244 -244 -407 -218 683 312 -264 164 480 -215 -391 510 328 -530 -589 480 773 272 -507 331 259
2660 259 56 -211 103 189 -226 -354 244 746 -391 -664 -323 321 222 33 84 490 -59 -158 528 783 -53
2681 -53 -558 526 980 498 -121 338 510 475 -264 485 742 -59 -196 308 757 218 -781 -381 -1 158
$$ packed form
2536i8KoL53q34q9Q46J90o78n90O25Q10k22p99N47K94l16O1M44O77j223k74P43
2558D63Q33m97q64L88K39jl42kN02m55j87L72O95n70j383Q23P77j76q55J64M77
2579D01l40m17N20O68p67q40L65J270l60p78j38P88k60m59K77J91n3p47K72J335
2599I28m85r26P1P43K50n46j4J59k69l80L78Q02n16j072L53J222r8n79n03M95
2619A3J46n62K21N17j57j292M62R39j7q41k99O61J84m37k77N06Qm88K24Q85j52
2640B44m88j63J89R01l71n76M28L16o95j76R01j82q58n9J069K93n01p79Q38p2
2660B59k03k67L14Q6m15j28N98N02j137k73L41O44r9j89N1M06n49r9O86K55q36
2681e3n05J084M54m82o19M59J72l5p39P49K57q01j37N04M49n39r99M00L80J59
$$ plain form
2701 158 -146 -284 339 -100 -488 139 316 -131 -897 -377 269 -110 -442 -447 550 6 -368 123 -197 15 -767
2722 -767 -302 652 125 -866 -562 58 -278 -412 -291 147 -649 -740 -294 -197 -186 -872 -861 -115 -264 -480 -780
2743 -780 -331 -526 -654 -532 111 31 -863 -495 129 113 -469 -640 -171 -18 -270 -382 -184 -8 -498 -623 -31
2764 -31 -55 -592 -448 -93 -75 86 -541 -38 -224 -430 -650 -165 -14 -447 -423 264 388 173 -78 -17 -28 -178
2786 -178 -143 241 368 243 101 369 307 -16 101 419 796 219 136 279 554 248 145 185 441 38 51 316
2808 316 370 285 -66 238 55 285 -177 141 437 40 151 367 594 418 139 456 450 479 -7 394 389 286
2830 286 48 311 696 169 161 176 674 536 166 157 386 126 157 128 299 102 350 94 264 376 -449 82
2852 82 117 210 -143 355 168 87 -254 27 326 -182 -143 -222 -325 -52 -216 -373 -1 98 -87 -68 -287 318 -338
$$ packed form
2701A58l04j38O23m39l88O27J77m47p66N20O46l79l32nR97n44l74M91l20K12p82
2722g67M65R54n27r91L04O20l36j34J21M38p96r1M46R7J1o86J1P46j49k16l00
2743g80M49j95j28J22O43q0q94L68O24j6n82j71M69J53k52j12J98J76m90j25N92
2764c1k4n37J44L55J8J61o27N03j86k06k20M85J51m33K4O87J24k15k51O1j1j50
2786a78L5L84J27j25j42K68o2l23J17L18L77n77q3J43K75l06j03M0K56m03J3K65
2808C16N4q5l51L04j83K30m62L18K96l97J11K16K27j76k79L17oK9m86M01nj03
2830B86k38K63L85n27qJ5M98j38l70rK29k60L1k9J71j97K48k56J70J12q25N31
2852H2L5R3l53M98j87q1l41K81K99n08L9p9j03K73j64j57L72R9j85J9k19O05o56
$$ plain form
2875 -338 -234 74 -110 -104 -262 -272 -218 -506 -564 -41 -161 -337 -359 -512 -312 -552 -477 -233 -323 -482 -269 -254 -483
2898 -483 -519 -331 -281 40 -184 -456 -63 -88 -323 -78 -153 92 111 77 208 40 105 4 3 528 214 150 264
2921 264 314 378 331 749 312 222 400 422 281 421 70 268 743 459 171 411 661 197 556 7 608 344
2943 344 468 261 429 508 336 589 389 376 491 325 495 428 367 277 363 219 468 635 257 343 -153 -87 179
2966 179 -3 -51 118 61 106 -376 -14 0 -2 -463 -440 -228 -409 -504 -443 -403 -331 -266 -429 -56 -532 -485 -114 -247
2990 -247 -457 -664 -480 -603 -414 -634 -723 -431 -147 -712 -299 -220 -23 -426 -352 -202 -491 -568 -600 -33 -622 -498
3012 -498 -753 -304 -424 -100 -302 -49 -316 -254 123 -115 -152 -319 -376 -8 -56 -155 -196 222 110 27 -45 106 433
3035 433 -151 -38 434 479 28 69 113 421 -214 88 513 446 158 -80 107 51 192 -205 -105 222 2 -102
$$ packed form
2875c38J04L08j84Oj58j0N4k88n8N23j20j76k2j53K00k40P5K44r0j59K13J5k29
2898d83l6J88N0L21k24k72L93k5k35K45p5K45J9l4J31j68O5j01jN25l14o4J14
2921B64N0O4m7M18m37r0J78K2j41J40l51J98M75k84k88K40K50m64L59n49O01k64
2943C44J24k07J68P9j72K53k00j3J15j66J70o7o1r0Q6j44K49J67l78Q6m96O6K66
2966A79j82m8J69n7M5m82L62J4km61K3K12j81r5O1M0P2O5j63L73m76M7L71j33
2990b47k10k07J84j23J89k20q9K92K84n65M13P9J97m03P4J50k89p7l2N67n89J24
3012d98k55M49j20L24k02K53k67O2L77k38l7j67n7L68m8r9m1M18j12q3p2J51L27
3035D33n84J13M72M5m51M1M4L08o35L02M25o7k88k38J87n6J41l97J00L27k20j04
$$ plain form
3057 -102 314 197 -182 -357 345 278 234 -80 423 163 244 364 203 375 223 440 464 801 215 36 461
3078 461 768 470 249 502 696 336 86 118 431 151 -203 275 743 343 -238 178 -20 103 -264 31
3098 31 521 -162 -580 70 454 -108 -254 -156 252 110 62 393 319 264 -116 249 231 334 -253 204 311 78
3120 78 -196 -285 304 37 -181 97 395 -199 -674 -291 358 -215 -647 -403 -68 -51 -526 -29 -107 -440 -789
3141 -789 -59 143 -127 -671 -612 29 328 -323 -181 22 81 -163 91 419 71 -388 -170 332 381 -421 -326
3162 -326 -19 97 9 73 158 122 -562 -332 344 173 -679 -567 -13 300 -68 -510 -106 147 -691 -122 310
3183 310 213 -168 -204 470 505 164 -64 47 117 388 126 215 543 48 -78 579 596 100 -380 496 608 463
3205 463 21 509 214 199 -190 370 679 -43 -415 42 467 121 -373 -23 392 -158 -254 298 174 -355 -351
$$ packed form
3057a02M16j17l79j75P02o7m4l14N03k60Q1J20j61J72j52K17K4L37n86j79M25
3078D61L07k98k21K53J94l60k50L2L13k80l54M78M68m00n81M16j98J23l67K95
3098C1M90o83m18O50L84n62j46R8M08j42m8L31p4n5l80L65j8J03n87M57J07k33
3120G8k74q9N89k67k18K78K98n94m75L83O49n73m32K44L35J7m75M97p8l33l49
3141g89P30K02k70n44N9O41K99o51J42K03N9k44K54L28l48m59K18N02M9q02R5
3162c26L07J16q8O4Q5l6o84K30O76j71q52J12N54L13l68m42M04K53q38N69M32
3183C10r7l81l6O74L5l41k28J11P0K71k62Q9L28m95j26O57J7m96m80Q76J12j45
3205D63m42M88k95j5l89N60L09p22l72M57M25l46m94L50M15n50r6N52j24n29M
$$ plain form
3226 -351 179 359 -3 -598 -109 328 103 -78 144 -66 -122 -285 334 530 39 -573 -174 291 36 -226
3246 -226 1 142 -436 -139 -209 94 -377 -902 -105 397 -233 -684 -471 16 -102 -429 -206 -68 -515 -846
3266 -846 -501 -90 -238 -425 -522 209 98 -290 -328 -178 -187 -614 -278 451 128 -663 -3 342 420 -107 -244 -79
3288 -79 -67 -64 -240 233 94 -313 -211 668 323 75 -301 192 171 208 -91 287 269 -413 115 297 456 -290
3310 -290 -72 485 574 90 224 260 462 77 131 585 311 58 135 372 706 253 -175 408 404 468 -73 404
3332 404 183 -138 -94 375 292 -490 -97 217 370 83 291 270 284 257 -5 268 290 -342 -234 35 309 -269
3354 -269 -217 -248 126 -17 -166 124 88 168 -251 110 -64 -67 -163 -83 273 54 -413 -32 7 -247 -147 -189 -79
3377 -79 -376 -401 -105 285 204 -349 -180 9 -80 -302 -65 474 -22 -284 192 573 78 -265 -146 324 41
$$ packed form
3226c51N30J80l62n95M89M37k25j81K22k10n6j63O19J96m91o12L99M65k55k62
3246b26K27J41n78K97p0L03m71n25P97N02o30m51K13M87j18l27K23J38m47l31
3266h46L45M11j48j87r7P31j11l88l8J50rm27L36P29l23p91O60L45P8n27j37J65
3288g9J2Lj76M73j39m07J02Q79l45k48l76M93k1L7k99L78j8o82N28J82J59p46
3310b90K18N57Q9m84J34L6K02l85N4M54k74k53P7K37L34m53m28N83mO4n41M77
3332D04k21l21M4M69q3p82L93L14J53k87K08k1J4k7k62K73K2o32J08K69K74n78
3354b69N2l1L74j43j49K90l6Q0m19L61j74lr6Q0L56k19m67L81L9k54J00m2J10
3377g9k97k5K96L90q1n53J69J89q9k22K37N39m96k62M76L81m95l43J19M70k83
$$ plain form
3398 41 -153 185 -17 -216 155 -121 168 20 -169 100 236 119 145 -109 -182 -31 -6 46 113 389 100 216
3420 216 352 362 117 -101 373 566 94 -17 2 7 297 384 73 273 134 -155 215 381 -29 -125 238 -56
3442 -56 84 168 281 101 23 -76 310 -144 -347 -12 52 140 49 -482 445 -34 15 -458 -233 -50 -114 -256 31
3465 31 -51 -66 -117 -98 -106 155 47 199 -38 -31 -176 41 341 -168 -21 71 81 -173 -190 -168 -470 -147 -202 -161 -221
3490 -221 -410 -89 -294 -159 -256 -230 -387 -87 -32 -186 -274 129 -248 -488 -127 -183 15 -146 -199 -41 -127 -229
3512 -229 -168 -106 -323 -27 -243 -95 -154 -366 -115 -310 -245 -348 -181 25 -299 102 -2 -341 -295 -180 -271 -27
3534 -27 -7 -237 -201 -317 150 -186 -37 39 39 -80 -74 71 -70 -214 46 224 165 -459 160 106 103 -23 73 192
3558 192 51 328 157 284 42 218 41 174 128 179 216 111 269 336 -66 219 227 19 134 153 126 -8 451
$$ packed form
3398D1j94L38k02j99L71k76K89j48j89K69J36j17K6k54p3J51K5N2O7K76k89J16
3420B16J36J0k45k18M74J93m72j11J9NK90Q7l11K00j39k89L70J66m10r6L63k94
3442e6J40Q4J13j80p8r9L86m54k03L35O4Q8r1n31R27m79M9m73K25J83o4j42K87
3465C1q2j5n1J9qK61j08J52k37Pj45K17L00n09J47R2J0k54j7K2l02L23n5M1o0
3490b21j89L21k05J35r7K6j57L00N5j54q8M03l77k40L61n6J98j61n3J58q6j02
3512b29O1O2k17K96k16J48n9k12K51j95O5j03J67K06l24M01j04l39M6J15r1K44
3534b7K0k30L6j16M67l36J49P6%j19OJ45j41j44K60J78n9o24O19n4lj26R6J19
3558A92j41K77j71J27k42J76j77J33m6N1L7j05J58O7m02K85Qk08J15J9k7j34M59
$$ plain form
3581 451 243 479 196 106 528 26 275 130 107 438 320 -63 17 337 130 47 118 179 143 159 258 -213 47
3604 47 27 103 -186 -84 -240 -121 -126 -278 -105 -209 14 20 -302 -222 -37 -44 -279 -361 -377 -105 -219 -156 -196 -121 42
3629 42 -413 -143 -206 -155 -204 -202 -216 -265 -44 -240 -47 -119 -42 -315 -274 -367 -352 -272 -371 -381 -367 -251 -293 -387 -197 88
3655 88 -292 -154 59 178 -326 -82 119 205 -17 -154 129 29 181 -230 267 114 123 32 157 319 32 -18
3677 -18 -115 271 74 165 -439 -40 -64 132 138 545 158 -307 -15 639 689 -195 371 251 248 87 137 244 317 139
3701 139 61 462 70 -276 -67 414 372 156 228 169 456 184 129 302 131 15 -187 184 518 -48 -66 223
3723 223 -95 -211 7 461 -13 -292 -375 183 -106 -393 -343 187 143 -395 180 12 288 -204 -265 -135 148
3744 148 -18 -322 25 131 -250 -223 236 -368 -188 -45 127 -160 -349 -792 -170 203 145 -280 -177 -8 -105
$$ packed form
3581D51k08K36k83r0M22n02K49j45k3L31j18l83Q0L20k07q3P1O1l6J6R9m71K60
3604D7k0P6k89J02j56J19nj52J73j04K23Ol22Q0J85pk35q2j6K72j14O3m0P5J63
3629D2m55K70o3N1m9Kj4m9K21j96J93p2P7k73M1r3J5Q0r9j0J4J16m2r4J90K85
3655H8l80J38K13J19n04K44K01Q6k22j37K83j00J52m11M97j53Rr1J25J62k87n0
3677a8r7L86j97R1o04L99k4J96OM07l87m65K92O54N0q84N66j20lj61N0J07P3j78
3701A39p8M01l92l46K09M81m2k16P2n9K87k72n5J73j71j16k02L71L34n66j8K89
3723B23l18j16K18M54m74k79q3N58k89k87N0N30m4n38N75j68K76m92o1J30K83
3744A48j66l04L47J06l81K7M59o04J80J43J72k87j89m43O22L73n8m25J03J69r7
$$ plain form
3765 -105 -300 -171 82 -747 -257 54 265 -462 -441 -382 51 -160 -270 47 -225 -135 -355 -15 -42 -130 -329 -60
3787 -60 185 -77 -247 84 186 139 -137 66 237 83 46 -75 -21 164 -342 -22 169 221 -224 239 -63 -128
3809 -128 -112 152 181 -74 -151 157 197 174 -324 -11 194 47 -165 181 324 -56 -253 51 569 185 -120 2
3831 2 242 -26 18 287 449 -75 -86 157 368 400 36 -252 409 486 45 -104 137 165 -76 139 178 127 -328
3854 -328 43 235 258 -475 -337 95 296 -197 -304 -121 60 -318 -221 436 150 -325 -309 -94 262 -123 -244
3875 -244 45 66 -135 -270 128 415 -391 -209 -70 376 -76 -542 -131 -109 -349 -220 55 175 -297 -577 -68
3896 -68 126 -113 -640 -116 164 -186 -212 -114 126 -128 -377 185 -29 196 -510 -20 145 -102 -87 -112 44 22
3918 22 -143 199 157 -8 -175 -94 -199 -103 -133 -13 43 182 -231 10 49 -31 -248 206 359 -179 -106 -132 488
$$ packed form
3765a05j95J29K53q29M90L11K11p27K1N9M33k11j10L17k72R0k20L40k7q8j99K69
3787f0K45k62j70L31J02m7k76K03J71j54l7j21N4J85n06L20J91N2m45M63l02o5
3809a28J6K64K9k55p7L08M0k3m98L13K05j47k12L46J43l80j97L04N18l84l05J22
3831BK40k68M4K69J62n24j1K43K11L2l64k88O61P7m41j49K41K8k41K15L9n1m55
3854c28L71J92K3p33J38M32K01m93j07J83J81l78R7O57k86m75J6K15L56l85j21
3875b44K89K1k01j35L98K87q06J82J39M46m52m66M11K2k40J29K75J20m72k80N09
3896f8J94k39n27N24K80l50k6R8K40k54k49N62k14K25p06M90J65k47J5k5J56k2
3918B2j65L42m2j65j67Q1j05R6l0J20N6J39m13K41L9q0k17M54J53n38P3k6O20
$$ plain form
3941 488 432 -83 159 110 116 49 457 396 181 -234 79 318 247 -421 30 350 263 -126 339 204 -36 -64 -398
3964 -398 315 135 20 129 401 -41 17 172 369 -15 88 284 222 57 101 226 39 316 303 307 133 66
3986 66 -7 -102 205 145 -174 236 295 343 -271 -128 143 12 -150 -229 49 -140 -350 -456 -146 45 -1 -567 -71
4009 -71 89 -190 -313 157 115 -10 -303 36 -39 -184 -288 52 68 -244 -234 -88 -50 106 -56 100 107 -100 -279
4032 -279 21 228 -128 -190 259 -41 -8 -169 -331 -185 -60 -27 -44 20 -121 -211 -134 386 306 18 127 380 -88
4055 -88 361 28 148 105 15 388 330 85 -26 118 378 238 63 -42 323 160 181 156 147 297 -98 222 34
4078 34 406 7 224 81 118 105 189 101 182 46 -109 65 68 -155 -17 89 -62 -217 68 115 231 -331 -191
4101 -191 385 339 83 -198 -170 103 146 29 21 18 81 -71 232 -14 -156 -2 125 18 -314 -169 91 -44 -54
$$ packed form
3941D88n6n15K42m9Oo7M08o1k15m15L13K39p1o68M51L20q7l89M65j35k40k8l34
3964c98P13j80j15J09K72m42N8J55J97l84J03J96o2j65M4J25j87K77j3Mj74o7
3986F6p3r5L07o0l19M10N9M8o14J43K71j31j62p9K78j89k10j06L10J91m6n66M96
4009g1J60k79j23M70m2j25k93L39p5j45j04L40J6l12J0J46L8J56j62J56Pk07j79
4032b79L00K07l56o2M49l00L3j61j62J46J25L3j7O4j41r0P7N20q0k88J09K53m68
4055h8M49l33J20m3r0L73n8k45j11J44K60j40j75j05L65j63K1k5rJ50l95L20j88
4078C4L72l99K17j43L7j3Q4q8Q1j36j55J74Lk23J38J06j51j55K85M7J16n62J40
4101a91N76m6k56k81K8K73M3j17qlO3j52L03k46j42J54J27j07l32J45K60j35j0
$$ plain form
4124 -54 -204 -62 -51 -274 -31 -148 -174 44 -531 -162 189 130 -173 -11 39 -158 -104 -94 72 -212 -295 -134 194
4147 194 -39 -103 320 -145 -58 163 -115 209 -191 -218 147 -160 -166 -231 -79 59 -204 -64 -34 212 -143 94
4169 94 104 122 -169 229 175 31 136 -49 140 -47 277 337 -53 -92 174 -4 124 388 -43 -169 -198 -37
4191 -37 100 193 34 5 229 268 -126 227 28 -81 -75 234 -69 63 240 130 69 160 372 33 -22 -96 -171 157
4215 157 -140 -66 -127 175 -86 139 74 -320 -149 -90 29 4 -68 -150 -107 165 -217 -63 -154 -31 -63 -136 -131 8
4239 8 2 150 -311 19 -13 -241 -253 -128 -31 -306 -144 72 -169 -352 -477 -383 -195 -450 -46 -78 -21 1 -193 -480
4263 -480 53 -177 -103 136 -306 -231 55 -57 103 -11 -291 -228 -203 -75 -322 293 -207 -140 -221 -242 -41 30 -155
4286 -155 -28 -100 -264 -253 76 -1 -11 -107 -121 46 -211 90 318 -214 -162 41 350 308 250 -42 318 349 333 145
$$ packed form
4124e4j50J42J1k23K43j17k6K18n75L69L51n9l03J62N0j97N4J0J66k84q3J61L28
4147A94k33o4M23m65Q7K21k78L24m00k7L65l07oo5J52J38k63J40L0K46l55K37
4169I4J0J8k91L98n4j44J05j85J89j87L24O0l90l9K66j78J28K64m31j26k9J61
4191c7J37R3j59k9K24L9l94L53j99j09OL09l03J32J77j10o1R1K12l39n5p4p5L28
4215A57k97P4o1L02k61K25o5l94J71N9J19k5p2q2M3K72l82J54r1J23l2p3NJ39
4239HoJ48m61L30l2k28j2J25R7k75J62K16k41j83j25R4J88k55M04l2N7K2j94k87
4263d80N33k30P4K39m42P5K86j12J60j14k80O3K5J28k47O15n00O7q1k1K01P1j85
4286a55J27p2j64J1L29p7j0r6j4J67k57L01K28n32N2K03L09m2n8k92L60L1j6j88
$$ plain form
4310 145 300 285 17 61 92 227 27 238 -2 360 324 166 79 -92 198 140 128 332 -398 -53 336 284 245
4333 245 62 -8 189 -100 255 212 81 -54 10 261 78 212 -10 98 425 -10 131 45 318 -64 -43 240
4355 240 208 35 -16 -176 512 335 -90 -119 162 45 -288 -201 224 -235 -345 52 20 -42 -361 -234 -160 -234 -482
4378 -482 -323 -79 -137 -515 -101 -5 -89 -396 -192 168 24 -339 -83 -128 -53 -124 -95 -69 -121 -223 -109 -127 -298
4401 -298 -351 -537 -34 -57 -137 -311 -50 -371 -444 -100 104 -125 -309 21 -111 104 -101 -172 54 163 -15 -161
4423 -161 379 349 -260 -23 381 291 199 188 38 78 176 52 336 -90 -151 15 -104 213 -84 -282 244 461
4445 461 442 31 -3 106 150 508 265 170 -67 13 -91 257 279 33 232 358 364 176 243 540 265 244 177 440
4469 440 156 -147 21 598 115 142 61 404 8 -110 255 245 50 -437 125 381 226 -46 -151 227 103
$$ packed form
4310A45J55j5k68M4L1J35k00K11k40L62l6j58q7j71K90n8j2K04p30L45L89n2l9
4333B45j83p0J97k89L55m3j31j35O4K51j83J34k22J08L27m35J41q6K73l82K1K83
4355B40l2j73n1j60O88j77m25k9K81j17l33Q7M25m59j10L97l2o2l19J27P4p4k48
4378d82J59K44n8l78M14R6q4l07K04L60j44l63K56m5P5p1K9K6n2j02J14j8j71
4401b98n3j86N03k3q0j74K61l21p3L44K04k29j84L30j32K15k05p1K26J09j78j46
4423a61N40l0o09K37M04r0r2j1j50M0R8j24K84m26o1J66j19L17k97j98N26K17
4445D61j9m11l4J09M4L58k43r5k37Q0j04L48K2k46J99J26Oj88O7K97k75k1o7K63
4469D40k84l03J68N77m83K7q1L43l96j18L65j0j95m87N62K56j55k72j05L78j24
$$ plain form
4490 103 5 188 39 49 -111 -124 281 -37 -189 -13 -57 -72 -257 -103 204 -239 -176 18 -18 -130 -404 -248
4512 -248 43 -33 -352 121 50 44 -172 -290 -45 -61 -409 -130 -161 -29 -200 -420 138 68 -295 -147 -261 17
4534 17 -71 -9 72 -19 -206 -210 66 -148 -320 -314 21 213 -238 -239 286 100 -124 -13 96 187 -7 -244 59 10
4558 10 -82 -35 72 191 115 185 248 536 114 -64 165 311 44 24 241 181 -219 384 321 293 210 -23 85 273
4582 273 -39 -116 282 -186 236 126 -93 272 147 112 234 630 295 329 70 299 4 -207 215 -141 -146 261
4604 261 103 426 174 -95 118 17 -74 -133 92 141 93 -79 76 -185 -281 -429 108 245 25 -135 -86 -309
4626 -309 -107 115 -196 281 -130 33 -226 254 -61 -293 -251 -88 -124 -252 -397 -10 -446 -458 -235 -211 32
4647 32 -185 61 -273 170 -101 95 -232 -220 -157 -307 -22 -289 159 -63 -285 247 -103 -73 -73 224 -96 -103 174
$$ packed form
4490A03r8J83j49J0j60j3M05l18j52J76m4j5j85J54L07m43O3J94l6j12k74J56
4512b48K91p6l19M73p1ok16j18K45j6l48K79l1J32j71k20N58p0l63J48j14K78
4534A7q8O2Q1r1j87mK76k14j72OL35J92m51jN25j86k24J11J09R1j94k37L03m9
4558A0r2M7J07J19p6P0O3K88m22j78K29J46k67k0K17o0m00O03o3k8q3k33J08J88
4582B73l12p7L98m68M22j10k19L65j25l5J22L96l35L4k59K29k95k11M22l56nM07
4604B61j58L23k52k69K13j01r1n9K25M9m8j72J55k61r6j48N37J37k20j60M9k23
4626c09K02K22l11M77m11J63k59M80l15k32M2J63l6j28j45L87m36j2K23K4K43
4647C2k17K46l34M43k71J96l27J2O3j50K85k67M48k22k22N32l50L0%K97l20pK77
$$ plain form
4670 174 24 -153 100 -17 -74 -330 -90 234 1 -283 110 17 -38 -111 85 14 -24 -271 177 270 -8 -146
4692 -146 253 200 161 -116 -37 23 278 314 135 18 202 226 121 335 172 201 345 67 272 -51 -23 107 114
4715 114 14 96 119 343 -26 136 -231 202 -190 108 118 320 101 -147 -64 268 -311 -272 182 149 -265 -68
4737 -68 109 37 -261 -282 -46 127 199 -85 135 -165 79 10 31 105 140 46 214 47 -5 -287 103 30 -82 -134
4761 -134 -140 -161 -23 -241 -239 -68 -161 -461 -111 -123 -275 -10 -242 -112 99 9 -184 96 274 -17 -23 -26 13 50 -134
4786 -134 229 -53 79 38 115 85 27 -56 -305 -46 -32 -414 -424 31 -200 -170 31 -178 -100 72 113 85 -182 -53
4810 -53 203 246 -28 66 168 170 371 82 -10 122 18 169 262 371 -20 36 123 243 40 -102 -115 -87 -133 54
4834 54 -55 72 164 -88 36 -96 300 -70 289 -7 155 83 -8 -75 -19 61 -91 -48 212 45 86 270 100
$$ packed form
4670A74j50j77K53j17n7k56K40L24k33k84L93r3n5p3J96p1l8k47M48R3k78j38
4692a46L99n3l9k77P9O0K55L6j79j17J84K4j05K14j63K9J44k78K05l23K8J30P
4715A14j00Q2K3K24l69J62l67M33l92K98J0K02k19k48Q3L32n79L9M54l3m14J97
4737f8J77p2k98k1K36J73P2k84K20l00K44o9K1P4L5r4J68j67n2k82L90p3j12n2
4761a34ok1J38k18KJ71r3l00L50j2j52K65k32J30K11r0j93K80J78k91olL9L7j84
4786a34L63k82J32m1P7l0n8q3k49K59J4l82j0M55k31L0K01k09P8J72M1k8k67J29
4810e3K56M3k74R4J02KK01k89r2J32j04J51R3J09l91N6Q7J20k03j42j3K8m6J87
4834E4j09J27R2k52J24j32L96l70L59k96J62p2r1o7N6Q0j52M3K60j67M1J84j70
$$ plain form
4857 100 168 -11 52 -107 -27 -296 -167 97 -35 -145 210 -190 -320 -71 105 -24 -59 -30 -37 231 -229 -28
4879 -28 -18 163 215 -190 7 -117 -169 -216 -345 -474 49 -258 -105 -70 -188 -326 -310 -228 -462 127 118 30 -203 5
4903 5 -60 7 169 -235 151 267 -218 242 179 201 -35 -98 75 104 128 -222 267 -39 -194 54 -127 180 -214
4926 -214 211 -135 -11 -182 116 324 -61 -50 57 133 93 284 -42 158 430 360 98 249 107 137 32 134
4948 134 199 41 267 75 275 254 8 -59 -124 -222 53 -86 -40 87 -17 215 -3 -275 159 73 -122 323
4970 323 29 -131 176 134 78 306 197 228 110 -120 62 83 -207 -50 -120 -117 -38 -109 -292 -85 -131 -353 -233
4993 -233 -62 -351 -145 -157 -16 -29 -386 -85 -292 -92 -151 61 -191 -318 -279 -216 -137 -144 71 -14 -452 -463 -144
5016 -144 -29 -334 -252 -135 -247 27 -59 -66 -79 -151 -182 -227 118 -57 -414 -234 -55 172 -62 -29 109 -74 -106
$$ packed form
4857A00O8j79O3j59Q0k69J29K64j32j10L55m00j30K49J76j29l5K9pK68m60K01
4879b8J0J81N2m05J97j24n2m7j29j29N23l07J53L5j18j38J6Q2k34N89rq8k33K08
4903Eo5O7J62m04L86J16m85M60o3K2k36o3J73K9K4l50M89l06j55K48j81L07l94
4926b14M25l46J24j71K98K08l85J1J07P6m0J91l26K00K72p0k62J51j42L0j05J02
4948A34O5j58K26j92K00k1k46o7o5r8K75j39M6J27j04K32k18k72M34q6j95M45
4970C23k94j60L07m2n6K28j09L1j18k30J82K1k90J57p0LP9p1j83K07m6k22J20
4993b33J71k89K06j2J41j3l57L01k07K00n9K12k52j27L9O3P9pK15q5m38j1L19
5016a44J15l05Q2J17j12K74q6pj3p2l1m5L45j75l57J80J79K27k34L3J38j83l2
$$ plain form
5039 -106 24 -97 -210 -119 228 233 13 -364 112 82 14 36 155 58 93 73 -140 242 158 216 -71 77 96 215
5063 215 132 155 275 138 179 63 67 158 300 121 135 39 27 285 238 140 315 265 219 -66 -104 319 223 219 -145 71
5089 71 196 309 -165 235 -73 92 36 119 134 64 -221 -91 326 98 351 117 61 -393 -118 9 -121 -109
5111 -109 15 -45 131 5 -201 1 -42 52 20 -71 -82 -306 -200 -178 105 -270 -286 77 -224 -264 -446 -87 128
5134 128 -542 -129 -164 86 -120 -124 -99 -150 -158 -370 47 12 -67 -35 -32 204 -196 -155 -34 224 195 -165 -400 75 -154
5159 -154 -169 37 -265 181 -273 -93 -123 -314 -94 -161 35 297 -118 -24 327 -103 -231 -12 425 32 -96
5180 -96 254 247 255 -52 -191 200 337 317 147 420 12 177 -219 313 254 -114 -71 316 99 254 67 100 110
5203 110 -91 458 401 -10 -61 168 263 315 44 -199 229 153 -81 247 28 -97 39 -39 230 286 76 101 106
$$ packed form
5039a06J30j21j13R1L47Nk20l77M76l0o8K2J19r7L5k0k13L82q4N8k87J48J9J19
5063B15q3K3J20j37M1j16MR1J42j79J4r6j2K58m7r8J75n0m6k85l8M23r6ml64K16
5089G1J25J13m74M00l08J65n6Q3J5p0k85J30M17k28K53k34n6m54K75J27j30J2
5111a09J24o0J76j26k06K02m3R4l2r1j1k24J06K2K83l75j6L63l01m0j82L59K15
5134A28o70M13l5K50k06mK5n1qk12M17l5p9L2LK36m00M1J21K58k9l60k35M75k29
5159a54j5K06l02M46m54J80l0j91K20o7J96K62m15R4L51m30j28K19M37l93j28
5180i6L50pQl07j39L91J37k0j70K73m08J65l96N32n9l68M3L87k17J55j87L3J0
5203A10k01N49n7m11n1K29R5N2k71k43M28p6k34L28k19j25J36p8K69N6k10K5N
$$ plain form
5226 106 -29 121 -18 -107 -122 -84 44 221 -1 -30 17 138 -125 -101 59 -49 -143 -220 -108 -66 215 -338 -169
5249 -169 -246 -299 -2 -152 -65 7 118 -72 183 92 -276 188 33 -87 59 200 27 -53 -83 -162 -81 93 -238
5272 -238 -326 -27 -86 -338 -549 -96 126 -467 -231 43 -107 -309 -256 90 -116 -202 -39 24 141 107 -253 146
5294 146 46 310 -118 49 -2 -148 1 98 37 236 141 -82 195 0 -130 -54 134 -32 -297 -56 11 148
5316 148 -325 103 100 -253 -12 305 36 126 -28 118 52 196 234 146 428 436 186 -115 323 -67 -113 268 277 535
5340 535 187 123 286 74 -23 -7 100 34 318 34 309 93 175 268 334 -15 104 118 133 -57 143 179 58
5363 58 -44 -170 173 53 -69 -138 65 -11 -55 -303 -152 -24 -8 19 -244 -271 -273 -170 -69 -73 -22 60 28 113 30
5388 30 -121 -459 -155 0 -166 -283 -248 -422 -94 25 -82 -344 -233 -470 -61 -460 -355 -401 -321 -237 -375 -49
$$ packed form
5226A06j35J50j39q9j5L8J28J77k22k9M7J21k63K4J60j08r4p7J12M2K81n53J69
5249a69p7n3K97j50Q7P2J11j90K55r1l68M64j55j20J46J41j73q0l0p9Q1J74l31
5272b38q8K99n9k52k11M53K22n93K36K74j50k02N3L46k06q6J63O3J17l4l60L99
5294A46j00K64m28J67n1j46J49R7o1J99r5k23K77j95j30P6J88j66k65K41O7J37
5316A48m73M28ll53K41L17k69R0j54J46o6J44L8q8K82Qk50l01M38l90m6L81RK58
5340E35l48o4J63k12r7J6J07o6K84k84K75k16Q2R3O6l49J19J4J5j90K00L6j21
5363E8j02j26L43j20j22o9K03p6m4k48J51J28J6K7k63k7kJ03J01mN1Q2l2Q5q3
5388C0j51l38L04J55j66j17L5j74L28J19j07k62J11k37M09l99J05m6Q0Q4j38L26
$$ plain form
5410 -49 -247 -54 -277 -130 -105 -139 80 -327 275 -268 -5 -168 -68 -94 -42 233 20 219 68 119 -80 190
5432 190 8 282 -14 223 60 -277 -17 144 63 -287 114 355 273 94 284 96 191 260 -2 302 157
5453 157 137 252 286 160 250 -49 95 184 325 -67 56 -13 -96 105 93 -136 55 97 -116 -94 23 -288 109
5476 109 -200 -395 20 -189 -21 -84 14 170 109 66 -75 126 88 -180 -262 -54 284 61 -233 -255 -255 -128 -396
5499 -396 -115 -299 -204 -175 -138 -31 32 -169 -252 96 90 29 -2 89 60 138 -220 -96 -107 -14 41 -215 75 23 150
5524 150 -33 -14 -217 141 46 -211 -71 73 -56 -71 -252 -228 -101 -209 -179 -26 -585 -65 54 97 178 32
5546 32 12 182 233 237 302 -80 -70 325 32 -136 -37 184 45 6 -95 93 -94 180 -90 -60 -207 -322 -69
5569 -69 -3 155 95 -39 31 175 359 214 -360 212 119 314 -34 186 60 260 313 -143 -8 -7 74 115 71 97
$$ packed form
5410d9j98J93k23J47K5l4K19m07O02n43K63j63J00k6N2K75k13J99j51N1j99K70
5432A90j82K74k96K37j63l37K60J61q1l50M01K41q2j79J90j88R5O9k62L04j45
5453A57k0J15L4j26R0k99J44Q9J41l92J23o9q3K01j2k29J91M2k13K2J17l11L97
5476A09l09j95M15k09J68o3R8J56o1m3j41K01l8k68q2K08L38k23k94k2%J27k68
5499c96K81j84R5K9L7J07O3k01q3L48oo1l1R1k9P8l58J24j1R3N5k56K90n2J27
5524A50j83J9k03L58r5k57J40J44j29j5j81K4J27j08L0J53n59N20J19M3Q1j46
5546C2k0J70N1MO5l82J0L95k93j68R9K21j39l9j01J88j87K74k70L0j47j15K53
5569f9O6J58o0j34P0J44J84j45n74N72r3J95l48K20j26K00N3m56J35JQ1M1m4K6
$$ plain form
5593 97 310 55 -333 -92 70 -136 149 115 128 -280 7 -120 -230 -162 -109 29 255 -66 5 -315 -105 -36
5615 -36 45 -211 199 -221 46 150 241 -79 -107 113 -227 -134 -122 -256 40 -21 -36 -105 105 188 -68 -105 -77 -123
5639 -123 -150 -203 146 -10 -22 -252 283 -122 -144 -156 -54 -230 -235 -133 -59 -39 92 -106 -6 78 -152 195 -68
5662 -68 -323 73 -19 235 -225 -355 237 211 -48 104 -42 -4 -12 -67 28 83 37 98 123 -139 -294 123 219 -44
5686 -44 242 -125 -79 150 83 -273 102 207 174 100 57 279 358 179 227 319 189 175 227 63 151 225 293 306 -25
5711 -25 21 163 47 -206 157 -71 243 118 -165 155 157 -165 -271 -5 208 210 -108 -22 -22 344 -173 44 189
5734 189 -64 -247 -76 126 -216 -207 -223 303 308 63 297 -92 -229 -35 -53 68 -199 -141 -147 60 -78 -338 -236
5757 -236 68 18 -227 -414 -149 -115 -9 -238 -94 -76 -349 -181 134 83 -94 -100 39 404 -103 -90 4 12 -83 -162
$$ packed form
5593I7K13k55l88K41J62k06K85l4J3m08K87j27j10O8N3J38K26l21P1l20K10O9
5615c6Q1k56M10m20K67J04R1l20k8K20l40R3J2j34K96o1j5o9K10Q3k56l7K8m6
5639a23k7n3L49j56j2k30N35m05k2j2J02j76nJ02P4K0J31j98J00Q4k30L47k63
5662f8k55L96r2K54m60j30N92k6k59J52j46L8qn5R5N5m6O1K5k62j55M17R6k63
5686d4K86l67M6K29o7l56L75J05l3p4m3K22P9j79M8R2j30j4N2j64Q8P4O8J3l31
5711b5M6J42j16k53L63k28L14j25k83L20Kl22j06K66K13Kl18Q6%L66n17K17J45
5734A89k53j83J71K02l42Rj6N26Nk45K34l89j37J94j8J21k67N8oK07j38k60J02
5757b36L04n0k45j87K65L4J06k29J44J8k73J68L15n1j77oJ39L65n07J3R4Qr5p9
$$ plain form
5781 -162 212 62 218 -241 208 -326 -173 -93 149 -75 -256 -206 -251 -1 -207 -352 -131 -232 -68 -29 30 85
5803 85 35 -244 112 -25 169 -95 381 260 99 107 89 235 151 -66 -28 173 209 244 228 230 -24 -43 217 -15
5827 -15 161 -76 20 321 -139 -311 297 138 95 -41 -134 304 140 278 -87 127 63 -128 258 398 -142 87
5849 87 108 69 335 -10 -24 -109 372 -2 -63 38 24 -111 -177 140 -71 -280 -255 -81 -116 -332 -47 -96 -44 33
5873 33 125 -86 -134 227 17 110 358 -285 -193 77 -144 -100 -334 -173 -170 -450 -269 -58 -11 -170 42 -154 -280
5896 -280 86 -202 -33 118 -24 80 -103 66 -155 33 -264 49 -248 191 -118 64 271 168 7 45
5916 45 -240 -117 196 -26 277 209 96 -68 32 -192 -42 -68 -173 3 210 -134 16 389 71 187 -27
5937 -27 353 188 163 25 218 396 -88 -28 259 71 296 -43 -95 308 35 -102 -166 -167 147 19 116 95 67
$$ packed form
5781a62L74j50J56m59M49n34J53Q0K42k24j81N0m5K50k06j45K21j01J64L9N9N5
5803H5n0k79L56j37J94k64M76j21j61Qj8J46q4k17L8K01L6L5j6Kk54j9K60k32
5827a5J76k37R6L01m60j72O08j59m3j36r3M38j64J38l65K14o4j91L86J40n40K29
5849H7K1l9K66l45j4q5M81l74o1J01j4j35o6L17k11k09K5J74l5k16K85m9N2P7
5873C3R2k11m8L61k10R3K48o43R2K70k21M4k34J61Lk80J81K11M7j59K12j96j26
5896b80L66k88J69J51j42J04j83J69k21J88k97L13k97M39l09J82K07j03j61L8
5916D5k85J23L13k22L03o8j13j64J00k24J50k6j05J76K07l44J50L73l18J16k14
5937b7L80j65k5j38J93J78m84O0K87j88K25l39n2M03k73j37o4jL14j28R7k1k8
$$ plain form
5960 67 99 120 131 31 -5 -209 381 183 320 -123 119 -239 174 119 130 -63 215 -116 248 113 -113 94
5982 94 -193 160 -163 163 34 -80 148 -104 -151 -105 -126 -201 -51 82 191 5 -195 133 127 1 -286 -211 -108
6005 -108 -301 -292 -212 -240 -207 -48 44 -55 79 93 -226 -139 -3 -386 -27 -160 -41 -187 -266 -161 -62 -170 -16 -239
6029 -239 -18 -122 3 -356 -72 -97 -181 2 -183 -185 9 -208 -264 -238 -101 -361 -111 -180 -53 -288 -241 -263 -256 19
6053 19 197 -10 18 71 37 23 -76 -43 -113 120 193 37 -25 107 -163 302 -226 -20 61 22 315 161 53 124
6077 124 125 54 255 426 -203 132 139 157 209 78 230 392 521 84 51 51 224 33 597 162 15 -28 345 201
6101 201 163 56 503 255 -57 419 158 29 -142 -60 -176 68 -196 7 -66 231 -88 182 185 -209 75 -148
6123 -148 75 193 142 -32 98 11 -84 -219 115 96 66 153 56 -81 -30 -62 -290 41 44 -145 -148 147 9 -162
$$ packed form
5960F7L2K1J1j00l6k04N90j98J37m43K42l58M13n5J1j93K78l31L64j35k26K07
5982I4k87L53l23L26j29j14K28k52m7M6k1p5J50J33J09j86k00L28oj26k87P5J03
6005a08j93RQ0k8L3J59R2r9J34J4l19Q7J36l83L59j33J19j46p9J05R9j08J54k23
6029b39K21j04J25l59K84k5q4J83j85kJ94k17n6K6J37k60K50o9J27k35M7k2PK75
6053A9J78k07K8N3l4j4r9L3p0K33P3j56o2J32k70M65n28K06Q1l9K93j54j08P1
6077A24Jp1K01J71o29L35PJ8N2j31J52J62J29m37l3%J73j91N64m35j47m3L73j44
6101B01l8j07M47k48l12M76k61j29j71Q2j16K44k64K03p3K97l19K70Ll94K84k23
6123a48K23J18n1j74J30q7r5j35L34j9l0Q7r7j37N1l2k28L31Lj89lK95j38j71
$$ plain form
6147 -162 173 -48 -372 -129 -164 -121 47 -274 6 -177 11 -49 84 -155 236 -151 -339 101 -279 -110 -242
6168 -242 169 -17 -1 118 81 82 -16 153 -86 41 105 98 41 383 82 75 65 -21 83 60 -33 -1 -39 61 67 -34
6194 -34 130 81 -10 -68 -37 -132 -13 141 59 97 358 264 190 149 34 12 342 138 162 313 -4 176 277 325 42
6219 42 -32 241 396 109 -293 -59 121 -265 -170 75 -84 456 -61 172 -103 159 -290 -146 -307 -123 21
6240 21 -49 370 -62 -60 306 -71 -101 -165 84 54 78 82 123 -224 -183 -131 81 202 208 -85 -135 90 -96 26 -38 34
6266 34 26 -264 -12 246 2 -56 -291 -83 27 -110 -27 109 -178 114 53 -80 14 -152 20 396 26 297
6288 297 51 -40 -115 -115 -211 -138 -179 -290 -274 -35 31 2 -140 80 -160 -188 -308 -245 -315 -323 71 128 -286 -81 -269
6313 -269 -34 181 -147 -155 189 -227 96 113 253 -83 -35 16 224 237 91 -7 152 173 -170 -83 192 -43 -234
$$ packed form
6147a62L35k21l24K43l5M3J68l21K80j83J88o0J33k39L91l87j88M40l80J69j32
6168b42M11j86J6J19l7Jr8J69k39J27O4pn7L42l01pj0q6J04k3r3L2l8J00Oj01
6194c4J64m9r1n8L1r5J19J54q2L8K61r4p4m1j15k2L30k04K4J51l17J80J01M8k83
6219D2p4K73J55k87m02K34J80l86R5K45j59N40n17K33k75K62m49J44j61J84J44
6240B1p0M19m32KL66l77l0o4K49l0K4MM1l47M1N2K12J21Ok93n0K25j86J22o4P2
6266C4qk90K52K58k44n8k35K08J10j37Q3J36k87K92o1j33R4j66J72L76l70K71
6288B97k46r1p5%r6P3m1j11J6K39O6k9j42K20k40k8j20O3p0qL94N7m14K05j88
6313b69K35K15l28qL44m16L23J7J40l36M8N1K08J3j46r8J59K1l43Q7K75k35j91
$$ plain form
6336 -234 328 236 286 -50 -137 -144 35 -26 53 -75 94 -114 311 6 -66 134 -81 356 324 -15 -72 120 311
6359 311 48 -404 55 118 -2 107 -149 -207 231 -125 234 -42 121 -97 112 -203 -386 -147 -230 376 -61
6380 -61 -160 -15 -99 -190 245 -127 108 79 -287 -241 -23 -42 -10 -82 3 36 18 -57 137 224 -211 -126 225 -197 -210
6405 -210 -210 33 -121 -244 -46 0 15 -334 227 -111 -172 -179 -116 153 35 53 23 0 -78 -217 110 -57 176 338
6429 338 217 -163 -240 -28 40 -85 -233 -127 64 214 62 227 117 203 -41 226 -142 263 250 202 61 300
6451 300 144 394 326 208 273 -95 -252 239 258 -30 81 353 160 107 -205 -365 -118 82 -28 224 283 8
6473 8 18 -14 63 -121 179 96 8 155 68 179 259 -54 -25 -14 312 98 -75 -87 148 -157 -255 36 8 -303 -55
6498 -55 -309 -111 -324 -243 201 459 -316 -41 -205 -165 143 -438 -129 -277 11 -106 -112 -37 36 -116 -165 -103 -81
$$ packed form
6336b34N62r2N0l36q7pJ79o1P9j28J69k08M25l05p2K00k15M37l2l39n7J92J91
6359C11k63m52M59O3j20J09k56n8M38l56L59k76J63k18K09l15j83K39q3O06m37
6380f1r9J45q4r1M35l72K35k9l66M6K18j9L2p2Q5L3j8p5J94Q7m35Q5L51m22j3
6405b10%K43j54j23J98M6J5l49N61l38o1pO3K69j18J8l0k3p8j39L27j67K33J62
6429C38j21l80p7K12O8j25j48J06J91J50j52J65j10Q6k44K67l68M05j3m8j41K39
6451C00j56K50o8j18O5l68j57M91J9k88J11K72j93n3l12j60K47K00j10K52N9k75
6473HJ0l2P7j84L00q3q8J47q7J11Q0l13K9J1L26k14j73j2K35l05r8K91k8l11K48
6498e5k54J98k13Q1M44K58p75K75j64M0L08n81L09j48K88j17oP5P3j52m9O2K2
$$ plain form
6521 -81 -229 -294 -248 -194 -193 16 36 -105 -141 104 -39 -94 -188 -35 260 -215 69 179 -190 315 -156 -5 109
6544 109 -307 -22 38 -145 219 -3 -6 192 115 -90 -95 1 -176 -57 -222 190 -31 165 -146 261 247 -162 -34
6567 -34 433 371 137 429 63 227 431 572 218 24 219 367 28 147 118 -174 247 265 -62 -302 -84
6588 -84 -30 -277 -89 -8 13 -402 143 -203 10 -167 -138 -77 70 -339 88 65 187 122 -8 -238 304 14 -108
6611 -108 140 235 327 92 30 57 56 94 25 -145 -64 -18 -216 54 127 -376 -72 -175 -50 -132 -137 -130 -186 -141 -123 88
6637 88 -66 154 150 6 -189 -207 179 -4 74 -422 -364 -174 97 -252 132 2 -413 -19 -190 -118 -92 -42 131
6660 131 157 -5 -217 17 35 -67 54 215 124 80 -336 -53 -153 7 201 -251 67 -238 102 42 61 59 222
6683 222 252 -60 100 -33 -25 -110 265 -281 100 195 -183 224 26 148 -126 159 230 18 194 309 -3 -13
$$ packed form
6521h1j48o5M6N4JK09K0j41l6K45j43n5r4J53K95m75K84J10l69N05m71J51J14
6544A09m16K85O0j83L64k22lJ98p7k05nR6j77J19j65M12k21J96l11M07j4m09J28
6567c4M67o2k34K92l66J64K04J41l54j94J95J48l39J19k9k92M21J8l27k40K18
6588h4N4k47J88Q1K1m15N45l46K13j77K9O1J47m09M27k3J22o5j30k30N42k90j22
6611a08K48R5R2k35o2K7jL8o9j70Q1M6j98K70P3n03L04j03J25q2nPn6M5J8K11
6637H8j54K20mj44j95j8L86j83P8m96N8J90K71l49L84j30m15L94j71P2K6N0J73
6660A31K6j62k12K34J8j02J21J61r1m4m16K83j00J60J94m52L18l05L40o0J9kJ63
6683B22L0l12J60j33Qq5L75n46L81R5l78M07j98J22k74K85P1k12J76J15l12j0
$$ plain form
6705 -13 198 -83 28 -390 95 2 20 98 -103 353 -96 189 71 203 -291 150 179 211 -48 56 119 61 -175
6728 -175 6 -151 -234 133 132 -36 -16 198 165 257 -145 -93 -39 34 -73 158 74 17 -35 221 -67 -34 265 -300
6752 -300 -92 53 -177 23 -146 -159 60 -101 27 67 -101 42 -69 -100 60 -5 -323 90 -105 -293 82
6773 82 168 148 -175 -251 104 72 170 56 -13 45 -116 -257 -342 -103 -6 -16 -69 51 156 -142 10 -63 -50 -79 -277
6798 -277 233 31 -71 -55 20 -138 28 153 78 -259 59 -3 -292 -365 -126 -106 64 -139 -27 29 -70 -60 133
6821 133 -209 139 170 126 -5 -80 -69 54 22 265 203 -37 42 -39 283 -11 41 127 328 281 213 180 213 199 146
6846 146 245 249 187 -143 206 214 137 183 45 182 122 295 219 115 -82 -13 -175 -57 76 -273 157 52 158 347
6870 347 101 155 128 51 -84 126 -501 -148 175 127 34 -157 -105 -239 -158 -149 -21 -56 -224 192 163 -38 -140 21
$$ packed form
6705a3K11k81J11m18M85r3J8P8k01M56m49K85j18J32m94M41K9L2k59J04O3n8k36
6728a75J81j57q3L67jj68K0K14l3R2m02N2N4P3j07K31q4n7n2K56k88L3K99n65
6752c00K08J45k30K00j69j3K19j61J28M0j68J43j11l1J60o5l18M13j95j88L75
6773H2Q6k0l23p6L55l2R8j14o9N8j61j41q5K39R7j0n3J20J05k98J52p3J3k9j98
6798b77N10k02j02J6P5j58J66J25p5l37L18o2k89p3K39K0J70k03J12N6r9J0J93
6821A33l42L48L1m4j31p5J1J23l2K43o2k40P9q1L22k94N2Q6K01m7o8l3L3j4n3
6846A46R9Mo2l30L49Qp7M6j38J37o0J73p6j04j97O9j62J18J33l49M30j05J06J89
6870C47k46N4k7p7j35K10o27L53L23m8r3j91N2j34Q1RJ28l5j68M16k9k01j02J61
$$ plain form
6894 21 -150 -34 -111 -107 -55 9 17 -214 252 -249 -197 48 -134 -75 -321 82 88 -30 42 -255 34 265 161 16
6918 16 117 79 33 -259 306 149 51 -37 -194 54 -88 157 35 275 -424 -43 251 61 14 48 296 168
6940 168 139 68 66 339 227 -104 91 336 67 -28 344 24 -7 123 71 77 246 141 177 30 218 -119 -13
6963 -13 136 148 162 92 211 -36 -81 110 -123 6 221 256 33 -9 90 59 208 -81 2 180 209 83 46 -65
6987 -65 156 19 322 -9 -183 -36 -199 -46 -137 -93 -161 39 -74 -118 134 162 99 72 43 -56 52 -106 -98 -155
7011 -155 -15 -90 -153 119 -317 93 66 163 153 -138 86 73 180 -116 -118 136 -58 21 -202 107 52 -16 45 164
7035 164 -171 72 -126 -273 -222 -373 11 -102 -232 105 261 38 -11 57 -84 139 -219 -153 40 187 -35
7056 -35 -320 -142 64 -16 -315 -59 35 6 116 171 219 73 16 -69 208 129 151 -158 -51 31 -77 6 110 -26
$$ packed form
6894B1j71J16p7MN2O4Qk31M66n01N2K45j82N9k46M03Oj18P2k97K89K31j04j45
6918A6J01l8m6k92N65j57r8q8j57K48j42K45j22K40o99L81K94j90m7L4K48j28
6940A68k9p1kK73j12l31J95K45k69r5L72l20l1J30n2OJ69j05L6j47J88l37J06
6963a3J49J2J4p0J19k47m5J91k33J29K15L5k23m2R9l1J49k89Q3J78K9j26l7j11
6987f5K21j37L03l31j74J47j63J53r1M4o8K00j13m4K52K8o3k7k9r9J08j58Qn7
7011a55J40p5o3K72m36M10k7R7j0k91K24j3J07k96kK54j94P9k23L09n5o8O1J19
7035A64l35K43j98j47N1j51L84j13j30L37J56k23m9O8j41K23l58O6J93J47k22
7056c5k85J78K06q0k99K56R4k9J10N5M8j46n7q5K77p9K2l09J07Q2j08Q3J04j36
$$ plain form
7080 -26 94 348 436 515 119 -83 299 175 169 102 75 75 226 260 266 78 -95 -128 -164 17 -128 -44 -86 -197 43
7105 43 62 -201 -113 -102 -237 -295 225 -125 -280 -41 289 7 78 50 -210 30 -243 76 -58 47 -8 9 121
7128 121 7 8 -341 -146 -38 251 -212 -86 -395 175 -313 -192 -262 -188 -289 -172 13 -327 -72 -271 -19
7149 -19 -257 -111 -307 -281 -127 -213 -140 77 -189 -84 238 7 123 -120 -361 26 -103 -278 166 -19 147
7170 147 -148 19 -182 -109 -443 33 -292 281 329 90 300 -196 -33 173 92 -154 -290 287 151 154 -85 -64
7192 -64 173 53 12 34 -44 -143 100 -98 -242 158 116 81 -82 4 212 120 213 489 346 474 -163 203 -6
7215 -6 342 91 -139 -42 -13 164 101 92 210 81 92 -85 118 -244 126 -147 42 190 317 0 -49 4 216
7238 216 -171 -62 150 95 143 -209 31 27 -161 154 254 -264 -225 -173 224 -12 -117 373 -39 -245 -225 141
$$ packed form
7080b6J20K54Q8P9l96k02L82j24oo7k7%J51L4Oj88j73l3l6J81j45Q4m2j11K40
7105D3J9k63Q8J1j35n8N20l50j55K39L30k82P1k8k60K40k73L19j34J05n5J7J12
7128A21j14Jl49J95J08K89m63J26l09N70m88J21p0P4j01J17J85l40K55j99K52
7149a9k38J46j96K6J54q6P3K17k66J05L22k31J16k43k41L87j29j75M44j85J66
7170A47k95J67k01P3l34M76l25N73M8k39K10m96J63K06q1k46j36N77j36Lk39K1
7192f4K37j20m1K2p8r9K43j98j44M00m2l5j63Q6K08r2R3K76j43J28o37L66k09
7215fL48k51k30R7K9J77o3rJ18j29J1j77K03l62L70k73J89J48J27l17m9N3K12
7238B16l87J09K12n5M8l52K40mj88L15J00n18L9N2L97k36j05M90m12k06K0L66
$$ plain form
7260 141 112 -271 -46 22 216 86 -17 -38 -225 -379 -1 85 -85 -94 -36 99 -25 10 -113 -157 -114 172 -72
7283 -72 -159 68 -183 -157 100 376 247 -263 -170 15 -115 2 -111 -99 -190 110 310 -273 96 28 46 83 265
7306 265 -174 44 198 -34 -213 -4 -165 -48 212 76 -172 -107 -27 279 -188 -71 -44 27 75 70 154 16 136
7329 136 103 227 22 175 157 240 146 147 66 145 -57 85 68 -208 54 2 40 -40 337 177 213 432 -121 134
7353 134 113 91 -21 41 8 264 -114 159 -100 -169 -29 152 -45 -196 306 127 -54 74 -117 24 188 -105
7375 -105 108 -132 130 185 18 -383 -37 -189 -117 -99 49 -3 241 -215 68 78 -338 -162 -91 -180 9 -278
7397 -278 -5 -355 -241 -17 -48 -142 -66 -211 -174 -149 21 -192 193 -233 -242 -109 -190 -176 279 -80 -96 -64 -387 -99
7421 -99 -61 180 73 -60 -151 -28 58 -46 249 226 385 -95 482 140 -3 -72 134 164 -203 -95 -87 -304 -101
$$ packed form
7260A41k9l83K25O8J94j30j03k1j87j54L78Q6j70rN8J35j24L5j23m4M3K86k44
7283g2q7K27k51K6K57K76j29n10R3J85j30J17j13J2r1L00K00n83L69o8J8L7J82
7306B65m39K18J54k32j79K09j61J17K60j36k48O5Q0L06m67J17K7P1M8nQ4j38J20
7329A36l3J24k05J53j8Q3r4Jq1P9k02J42j7k76K62n2L8q0L77j60L6K19n53K55
7353A34k1k2j12O2l3K56l78K73k59o9J40J81j97j51N02j79j81J28j91J41J64k93
7375a05K13k40K62N5j67m01L46j52P2J8J48n2K44m56K83J0m16J76P1q9J89k87
7397b78K73l50J14K24l1r4P6j45L7K5J70k13L85m26rJ33q1J4M55l59j6L2l23K88
7421i9L8K41j07j33r1J23Q6j04K95k3J59m80N77l42j43o9K06L0l67J08Qk17K03
$$ plain form
7444 -101 22 -378 87 -48 11 250 109 -138 -144 2 195 -98 106 107 158 -298 -26 278 102 -257 73 -18
7466 -18 62 200 -33 109 -158 -209 180 110 -136 -79 -28 240 -134 307 0 54 -46 -275 64 -177 215 -114
7488 -114 -33 -5 -342 139 -7 71 10 -32 -322 155 156 -79 71 -40 32 59 114 -226 28 51 105 -258 42 -154
7512 -154 -82 -156 -14 -86 -314 31 -245 -172 -77 169 -60 145 -507 -408 -96 -157 -128 -46 14 107 62 -7 -60 -68 -337
7537 -337 -38 214 -136 -143 -144 -102 -68 -114 -94 -174 -218 -102 -46 19 -73 63 -148 17 88 101 176 31 36 342 182 -66
7563 -66 209 -71 -30 63 14 223 190 59 -227 90 217 -4 254 -69 88 237 -1 -374 17 119 128 -207
7585 -207 385 -120 13 303 212 478 245 30 -279 -29 117 65 -38 7 -34 140 157 203 100 166 99 253 415
7608 415 130 -13 122 -52 -15 66 159 64 127 6 97 -347 -8 -168 -112 -89 -30 23 -62 -385 -137 -65 303 -115
$$ packed form
7444a01J23m00M65j35N9K39j41k47oJ46J93k93K04JN1m56K72L04j76l59L30r1
7466a8Q0J38k33J42k67n1L89p0k46N7N1K68l74M41l07N4j00k29L39k41L92l29
7488a14Q1K8l37M81j46P8o1m2k90M77Jk35J50j11P2K7N5l40K54K3N4l63L00j96
7512a54P2p4J42p2k28L45k76P3R5K46k29K05o52R9L12o1K9Q2O0R3m5o9n3qk69
7537c37K99K52l50pjM2L4m6K0q0m4J16N6O5r2J36k11J65P1J3P5j45NL06j60k48
7563f6K75k80M1R3m9K09l3j31k86L17J27k21K58l23J57J49k38l73L91J02Rl35
7585b07N92n05J33K90r1K66k33k15l09K50J46n2j03M5m1J74J7M6j03O6o7J54J62
7608D15k85j43J35j74L7Q1R3r5O3j21R1m44L39j60N6K3N9N3q5l23K48P2L68m18
$$ plain form
7632 -115 -106 -67 -38 118 -11 88 -73 13 -102 12 -84 67 10 76 -165 32 -137 -13 -218 -200 231 -86 -27 -138
7656 -138 304 21 -459 -174 -179 -92 -24 35 -178 45 -114 -74 123 -129 114 -8 14 159 -46 -43 190 192 -79 120
7680 120 170 -178 154 33 7 -21 -65 253 184 -34 168 -563 -188 184 -199 39 -303 90 -75 16 -65 14 -65
7703 -65 114 267 151 -71 -118 -56 45 14 53 125 122 -161 -52 -138 189 108 -111 -82 164 -108 -4 57 -203 58
7727 58 79 44 60 -59 419 71 -10 242 -26 206 -35 51 76 27 199 -20 91 -40 -169 -212 -13 190 2
7750 2 -16 46 29 -187 -253 -22 -70 -171 67 -31 204 57 149 -199 34 -39 -35 44 120 75 -489 -159 36 -195 170
7775 170 -38 -7 -162 -40 -98 20 41 -56 121 159 -101 -105 -131 -270 -306 -116 149 140 41 89 54 68 -42 -97 -100 -63
7801 -63 -266 -32 61 196 342 47 -137 330 102 69 -114 -222 -176 177 143 276 165 238 89 -14 58 -32 73
$$ packed form
7632a15RL9K9J56j29R9j61Q6j15J14r6J51n7O6k41J97j69J24k05J8M31l17N9j11
7656a38M42k83m80K85nQ7O8N9k13K23j59M0J97k52K43j22K2J45k05LK33Kk71J99
7680A20N0l48L32j21k6k8m4L18o9k18K02p31L75L72l83K38l42L93j65R1q1P9p9
7703f5J79J53j16k22m7O2J01l1L9P2lk83J09q6L27q1k19K9K46k72J04O1k60K61
7727E8K1l5J6j19M78l48q1K52k68K32k41Q6K5m9J72k19J11j31j29m3J99K03j88
7750Bj8O2j7k16o6K31m8j01K38r8K35j47R2l48K33p3MP9P6m5n64L30J95k31L65
7775A70k08L1j55J22n8J18K1r7J77L8k60mk6j39l6J90K65rr9M8l5J4j10n5lL7
7801f3k03K34R3J35J46k95j84M67k28l3j83j08M6L53l4J33j11P3j49j03P2r0J05
$$ plain form
7824 73 62 -50 315 -155 -65 325 96 -52 10 259 99 -176 70 213 -12 237 206 -36 247 134 166 370
7846 370 -99 171 -49 113 -43 -18 148 68 92 171 146 -7 97 3 -192 116 -177 106 139 57 -52 120 132
7869 132 -133 73 -59 -109 194 176 96 -122 -27 -440 187 117 -113 342 37 -214 18 2 258 -91 -28 -120 -24
7892 -24 -61 -34 -202 -73 -342 -96 -303 -223 325 -256 291 -193 -156 -95 -314 -292 -65 116 -235 -170 -202 -176 135
7915 135 22 210 -5 53 -216 116 224 -44 -167 13 102 -26 -80 -129 189 -68 -233 79 -115 -66 111 137
7937 137 -53 -3 -382 -135 119 66 182 -129 -125 -61 131 150 155 -13 172 190 -51 -214 -92 125 -79 207 39
7960 39 -409 140 169 -90 -72 -69 -31 115 -82 225 0 -124 301 -23 92 -61 -31 -6 -82 19 -4 151 -77
7983 -77 -104 -162 14 49 172 -232 -135 109 48 -51 -76 73 326 -135 -195 213 -123 -64 236 71 -113 65 314
$$ packed form
7824G3j1j12L65m70R0L90k29j48O2K49j60k75K46J43k25K49l1k42K83j13L2K04
7846C70m69K70k20J62j56K5J66q0K4P9k5j53J04r4j95L08k93K83L3q2j09J72J2
7869A32k65K06j32n0L03j8q0k18R5m13O27p0k30M55l05k51K32j6K56l49O3r2R6
7892b4l7K7j68J29k69K46k07Q0N48n81N47m84L7O1k19K2K27J81l51O5l2K6L11
7915A35j13J88k15N8k69L32J08k68j23J80Q9j28n4m9L18k57j65L12j94M9J77K6
7937A37j90N0l79K47K54n3J16l11MO4J92J9Nj68J85J8k41j63J22K17k04K86j68
7960C9m48N49K9k59J8LL8J46j97L07k25j24M25l24J15j53L0K5p6J01k3J55k28
7983g7k7n8J76L5J23m04R7K44o1r9k5J49K53m61o0M08l36N9L00j65j84J78K49
$$ plain form
8006 314 169 231 -154 -13 23 -60 212 -147 123 -127 202 -122 -95 -70 -220 -212 -46 -141 -291 -71 29 -137 6
8029 6 -133 -24 -229 -342 43 -143 -24 -347 171 -200 18 -92 -153 267 30 20 -84 -163 -102 -59 -86 -99 -128
8052 -128 -12 102 52 20 -21 -338 132 362 51 -189 167 47 -204 -111 24 -197 -350 145 -351 315 164
8073 164 2 70 82 214 122 197 20 196 250 -141 84 -302 239 -6 131 68 -3 56 238 223 161 193 -129 -73
8097 -73 -40 -22 -28 4 243 21 -64 -57 -63 46 36 23 157 62 -18 -198 67 -191 -16 -77 76 131 -159 73 27 228
8123 228 291 -81 185 64 103 -62 289 225 177 -196 -38 167 -232 -65 -316 95 -136 6 -180 146 -219
8144 -219 12 -37 154 73 -94 -56 61 -143 -41 -102 -146 98 167 -161 -14 89 172 -42 -276 20 -159 -301
8166 -301 182 -178 -209 -39 -196 -137 -381 67 79 187 36 -292 -223 40 -27 61 37 -52 28 -61 -162 36 -22 -229
$$ packed form
8006C14j45O2l85J41L6q3K72l59K70k50L29l24K7K5j50QJ66r5j50K20J00j66J43
8029Fj39J09k05j13L85j86J19l23N18l71K18j10o1M20k37j0j04p9O1M3k7j3k9
8052a28J16J14n0l2m1l17M70K30l11k40L56j20k51R3J35k21j53M95m96O66j51
8073A64j62O8J2J32r2P5j77J76N4l91K25l86N41k45J37o3p1N9J82j5o2L2l22N6
8097g3L3J8oL2K39k22q5PoJ09j0j3J34r5q0j80K65k58J75o1J53N5k90K32m6K01
8123B28O3l72K66j21L9j65L51o4m8l73J58K05l99J67k51M11k31J42j86L26l65
8144b19K31m9J91q1j67L8J17k04J02o1m4K44O9l28J47J03Q3k14k34K96j79j42
8166c01M83l60l1J70j57N9k44M48J2J08j51l28O9K63o7Q8k4q9Q0q9j01J98n8k07
$$ plain form
8190 -229 40
$$ packed form
8190b29K69
8191D0
$$ Imaginary data points
##PAGE= N=2
##DATA TABLE= (X++(I..I)), XYDATA
$$ plain form
0 0 0 0 0 0 0 0 0 0 0 0 0 0 0 0 0 3 -8 8 -8 8 -8 9 -11 16 -16 18 -22 24 -27 32 -35 40 -43 50 -55 60 -68 76
38 76 -85 93 -101 114 -125 139 -154 171 -192 212 -236 267 -301 343 -395 461 -549 670 -851 1149
58 1149 -1733 3287 -14060 -45545 -2326 22615 -2005 -20086 6526 18865 -3512 -9516 19684
71 19684 27018 -1115 -12640 14280 29201 9218 -8272 3446 15706 6473 -3112 5240 11160
84 11160 -2700 -12508 1629 16479 4626 -14275 -7590 11200 10654 -3437 -1744 9380 7357
97 7357 -276 7997 19009 11555 -1605 4844 20635 20141 7434 4119 11384 13828 10913 10081 10630
112 10630 7051 2314 4060 9940 10867 2112 -5513 -1320 8240 6936 -2959 -5102 995 1210 -2094
127 -2094 2037 6004 -2153 -9254 -323 10811 4714 -6399 -3519 4729 3693 342 3661 4051 -2664
$$ packed form
0@%%%%%%%%%%%%%%%Lj1J6j6J6j6J7k0K7l2L4m0M6n1N9o7P5q3R3j05J15j28J44
38G6j61J78j94K15k39K64k93L25l63M04m48N03n68O44p38Q56j010J219j521K000
58A149k882N020j7347l1485M3219K4941k4620j8081K6612J2339k2377o004K9200
71A9684P334k8133j1525K6920J4921j9983j7490J1718J2260r233r585Q352N920
84A1160j3860r808J4137J4850j1853j8901O685J8790n46j4091J693J1124k023
97G357p633Q273J1012p454j3160O449J5791m94j2707l315P265K444k915q32N49
112A0630l579m737J746N880R27q755p625M193R560j304r895k143O097K15l304
127b094M131L967q157p101Q931J1134o097j1113K880Q248j036l351L319L90o715
$$ plain form
142 -2664 -3426 5378 8611 932 -4663 -4 5563 4642 2196 2358 1267 -770 2313 8143 7107 219
158 219 -1406 4909 8242 4912 2135 4264 3815 1403 3836 8918 5307 -3110 -1943 7352 8267 -470
174 -470 -3019 3173 3259 -2113 505 6409 1399 -7439 -2384 8431 5229 -5573 -4026 4787 3047
189 3047 -3352 -434 5458 143 -6852 -1494 7206 2183 -7857 -5886 2111 1698 -5544 -5911 -1341
204 -1341 -2440 -7878 -5750 -575 -2526 -10019 -9525 -1619 -207 -7347 -9823 -4108 -1514 -5574 -6963
219 -6963 -2179 -1745 -6792 -7208 -837 1340 -4467 -8036 -3261 1390 -1503 -5751 -3672 -119 -1808 -4693
235 -4693 -2089 1931 -924 -6045 -3124 3487 3267 -3236 -3038 3531 5032 -421 -230 5558 5896 -111
251 -111 1046 8286 8002 621 234 7658 9332 2175 844 6595 7288 1452 706 6564 6488 80 -1034
$$ packed form
142b664p62Q804L233p679n595M659N567r21k446J62j091k037L083N830j036o888
158B19j625O315L333l330k777K129m49k412K433N082l611q417J167R295R15q737
174d70k549O192Q6n372K618N904n010q838N055J0815l202j0802J547Q813j740
189C047o399K918N892n315o995N358Q700n023j0040J971P997m13p242l67M570
204a341j099n438K128N175j951p493M94P906J412p140k476N715K594m060j389
219f963M784M34n047m16O371K177n807l569M775M651k893m248K079L553j689k885
235d693K604M020k855n121K921O611k20o503J98O569J501n453J91N788L38o007
251a11J157P240k84p381l87P424J674p157j331N751O93n836p46N858p6o408j114
$$ plain form
268 -1034 4927 6485 514 -1422 3786 5786 1561 -68 3889 5741 1562 602 4671 6124 2629
283 2629 614 4583 5681 2809 1184 3413 4121 1518 559 1916 1994 -275 -1166 -248 -403 -1995 -2481
300 -2481 -2532 -2761 -3009 -3141 -3668 -4095 -3672 -3247 -3909 -3861 -2453 -2476 -3679 -3954 -1784 -1397 -3151 -3404 -1228
319 -1228 -401 -2603 -3331 -498 9 -2489 -3231 -906 -282 -2841 -4131 -1511 -790 -3347 -3995 -2370 -1348
336 -1348 -3576 -4301 -2070 -1624 -3513 -4115 -1733 -1143 -2694 -3467 -1164 -183 -1406 -1821 203 349 -272
353 -272 -440 933 1062 608 649 1147 1524 1787 1482 954 1297 1656 1685 852 443 1348 1740 891 -29 949 1557
374 1557 472 -100 1187 1748 341 -191 1465 2164 897 35 1940 3163 1174 236 2619 3535 1607
391 1607 842 3324 4134 1839 562 3348 3808 1685 389 2516 3667 1316 -274 1952 2575 157
$$ packed form
268a034N961J558n971j936N208K000m225j629L957J852m179r60M069J453l495
283B629k015L969J098k872j625K229P08k603r59J357P8k269q91R18j55j592m86
300b481n1k29k48j32n27m27M23M25o62M8J408k3j203k75K170L87j754k53K176
319a228Q27k202p28K833N07k498p42K325O24k559j290K620P21k557o48J625J022
336a348k228p25K231M46j889o02K382N90j551p73K303R81j223m15K024J46o21
353b72j68J373J29m54M1M98L77K63l05n28L43L59K9q33m09R05L92q49r20R78O08
374A557j085n72J287N61j407n32J656O99j267q62J905J223j989r38K383R16j928
391A607p65K482Q10k295j277K786M60k123j296K127J151k351j590K226O23k418
$$ plain form
407 157 -619 1217 1494 -192 -823 401 1083 -524 -944 251 634 37 -858 152 626 -142 -236 319 1065
426 1065 93 168 63 84 -25 -119 -158 -502 -63 -755 -1117 -718 -138 -1035 -1830 -1931 -692 -1112 -2120 -2096 -836
447 -836 -745 -2137 -2191 -389 -244 -1918 -1901 198 193 -1760 -1515 478 506 -1212 -1080 358 14 -1741 -1042
466 -1042 835 -109 -2335 -1678 640 135 -2213 -1591 148 -370 -2233 -1103 640 -524 -2547 -1337
482 -1337 963 -9 -2204 -1324 277 -292 -1658 -307 601 -1027 -2261 -578 676 -1047 -2664 -1125
498 -1125 295 -740 -1729 -728 365 -1564 -2176 58 1498 -1220 -2309 -279 1798 606 -729 335
514 335 1432 268 -618 1398 1675 -756 -1450 504 1811 324 -1509 -1023 189 -546 -1036 -301 43
531 43 -1483 -2335 457 2041 277 -1395 185 2774 3019 2043 1900 3460 3645 2761 4398 6380 5037
$$ packed form
407A57p76J836K77j686o31J224O82j607m20J195L83n97q95J010M74p68r4N55P46
426A065r72P5j05K1j09r4l9l44M39o92l62L99N80q97p95j01J239m20j008K4J260
447h36R1j392n4J802J45j674J7K099nj953K45J993K8j718J32J438l44j755O99
466a042J877r44k226O57K318n05k348O22J739n18j863J130J743j164k023J210
482a337K300r72k195Q80J601n69j366J351R08j628j234J683J254j723j617J539
498a125J420j035r89J001J093j929o12K234J440k718j089K030K077j192j335J064
514C35J097j164q86K016K77k431o94J954J307j487j833M86J212p35m90P35L44
531D3j526q52K792J584j764j672J580K589K45r76j43J560J85q84J637J982j343
$$ plain form
548 5037 2222 3180 6288 6746 3473 1902 3720 4865 2564 1709 2976 1944 -1437 -1243 2406 2126
564 2126 -2666 -4119 -117 2040 -941 -2314 -11 956 -1373 -849 3656 3866 -880 -1802 3926 6863
580 6863 2534 -378 3351 5469 1923 477 3900 3889 -1621 -3418 2087 3573 -2932 -6977 -3007 -243
596 -243 -4014 -6586 -4155 -3102 -7865 -8191 -2559 -1249 -7268 -9461 -3515 733 -3100 -6239 -2685 137
612 137 -1801 -2578 1386 2636 -2000 -3705 1732 5557 1132 -3069 -531 2826 1422 -944 354 972
628 972 -2354 -3440 353 2978 -1295 -5411 -2425 1882 1080 -2293 -1940 222 -671 -1512 1848 3894
644 3894 513 -2926 194 5926 4742 -142 -167 3280 4334 2540 2725 4572 2397 -489 2053 7088
660 7088 4824 -1437 -1299 4051 5352 1497 231 2590 2147 -461 1578 5075 2943 -3121 -1868 4316
$$ packed form
548E037k815R58L108M58l273j571J818J145k301q55J267j032l381J94L649k80
564B126m792j453M002K157k981j373K303R67k329N24M505K10m746r22N728K937
580F863m329k912L729K118l546j446L423j1n510j797N505J486o505m045L970K764
596b43l771k572K431J053m763l26N632J310o019k193N946M248l833l139L554K822
612A37j938p77L964J250m636j705N437L825m425m201K538L357j404k366J298O18
628I72l326j086L793K625m273m116K986M307q02l373L53K162q93q41L360K046
644C894l381l439L120N732j184m884k5L447J054j794J85J847k175k886K542N035
660G088k264o261J38N350J301l855j266K359m43k608K039L497k132o064J253O184
$$ plain form
676 4316 5230 -616 -3089 921 2323 -570 -862 2233 511 -4612 -3258 2996 2839 -3950 -5440 -110
692 -110 2221 -1745 -3160 310 -61 -3670 -1793 3696 2421 -3632 -4051 2063 4030 -364 -2336 832
708 832 1510 -1159 -349 3329 1988 -3651 -3515 3055 4244 -1920 -4222 -447 1691 -809 -1768 825
724 825 247 -3649 -2701 2583 3277 -2329 -4173 31 3482 949 -1310 42 1202 -625 -303 2885
740 2885 3175 -1769 -3402 1227 4636 1189 -2697 -536 1782 455 -760 661 1418 -1867 -2981 684
756 684 3575 80 -3930 -2056 2042 1363 -1799 -1519 379 -889 -2411 -88 1700 -1235 -5056 -2556
772 -2556 1482 228 -3946 -4201 -1147 -1201 -3832 -2810 -458 -2594 -5620 -3282 1228 -174 -4973 -4344
788 -4344 12 880 -2142 -1773 1123 116 -2140 -231 3440 1727 -2349 -1412 2751 2936 -1039 -1442
$$ packed form
676D316R14n846k473M010J402k893k92L095j722n123J354O254j57o789j490N330
692a10K331l966j415L470l71l609J877N489j275o053m19O114J967m394j972L168
708H32O78k669Q10L678j341n639J36O570J189o164k302L775K138k500r59K593
724H25n78l896R48N284O94n606j844M204L451k533k259J352J160j827L22L188
740B885K90m944j633M629L409l447l886K161K318j327j215J421P57l285j114L665
756F84K891l495m010J874M098o79l162K80J898j268j522K323J788k935l821K500
772b556M038j254m174k55L054n4k631J022K352k136l026K338M510j402m799O29
788d344M356Q68l022L69K896j007k256J909L671j713m076R37M163J85l975m03
$$ plain form
804 -1442 808 129 -1654 -708 1186 -635 -4163 -3153 1229 280 -3504 -4169 -870 -422 -1993 -2011 267
821 267 -392 -2510 -914 2766 2124 -1281 -812 2286 3440 1237 725 2441 2281 843 1485 3148 1789
838 1789 -499 -210 1649 1844 -446 -1290 -505 -247 -1301 -1538 -1019 -1209 -2468 -2829 -474 -360 -1907 -2840
856 -2840 -1364 234 -617 -1374 -368 654 217 -478 1233 1976 582 -422 1179 2200 1741 -39 494
873 494 1633 762 -73 455 994 -422 -1174 -120 869 -233 -1612 -1080 688 82 -1096 -437 446 95
891 95 -777 183 2107 1171 -245 727 2509 2018 831 1139 2748 1881 1177 1468 2783 1930 612 1561
909 1561 3045 1802 344 1214 2134 1340 311 968 1540 736 -60 605 1457 580 -447 126 784 360
927 360 -76 202 744 331 -301 439 855 488 -299 568 876 552 -107 264 446 -23 -302 405 47 -288
$$ packed form
804a442K250o79j783R46J894j821l528J010M382r49l784o65L299M48j571j8K278
821B67o59k118J596L680o42l405M69L098J154k203n12J716j60j438O42J663j359
838A789k288K89J859J95k290q44P85K58j054k37N19j90j259l61K355J14j547r33
856b840J476J598q51p57J006J022m37o95J711P43j394j004J601J021m59j780N33
873D94J139q71q35N28N39j416p52J054R89j102j379N32J768o06j178O59Q83l51
891I5q72R60J924r36j416R72J782m91j187L08J609q67p04K91J315q53j318R49
909A561J484j243j458Q70R20p94j029O57N72q04p96O65Q52q77j027N73O58m24
927C60m36K78N42m13o32P40M16l67p87Q67L08l24o59L71J82m69k79P07l58l35
$$ plain form
947 -288 -705 -332 -359 -628 -1192 -845 -662 -1242 -1287 -1206 -1299 -1669 -1271 -1604 -1314 -1182 -1143 -1567 -1557 -1197 -1053 -1203
969 -1203 -1029 -701 -803 -1179 -918 -668 -611 -789 -673 -423 -522 -944 -602 -317 -560 -819 -683 -384 -424 -612 -816
990 -816 -239 -306 -846 -655 -412 -498 -531 -515 5 71 -553 55 189 -109 -120 -254 443 497 382 539 787 638 180
1013 180 639 1014 406 332 929 1242 677 568 1077 1464 828 721 1001 1555 749 660 1293 1047 520 1094 985
1034 985 853 542 549 1132 868 519 115 503 264 82 541 671 389 228 423 581 530 294 237 687 459
1055 459 295 533 673 705 546 756 838 334 -108 29 402 200 -115 -414 -718 -582 -644 -769 -1051 -1304 -1541
1076 -1541 -1511 -1687 -1408 -1621 -1538 -1778 -1116 -1106 -1217 -1177 -694 -282 -897 -824 -206 48 -237 -356 242 543 -9
1097 -9 -574 318 572 -530 -695 -259 -58 -956 -1109 -633 -561 -1319 -2031 -905 -673 -1433 -1851 -585 -335 -1334
$$ packed form
947b88m17L73k7k69n64L47J83n80m5Q1r3l70L98l33K90J32L9m24J0L60J44j50
969a203J74L28j02l76K61K50N7j78J16K50r9m22L42K85k43k59J36K99m0j88k04
990h16N77o7n40J91K43q6l3J6N20O6o24O08J34k98j1j34O97N4j15J57K48j49m58
1013A80M59L75o08p4N97L13n65j09N09L87o36j07K80N54q06q9O33k46n27N74j09
1034I85j32l11PN83k64l49m04L88k39j82M59J30k82j61J95J58n1k36n7M50k28
1055D59j64K38J40L2j59K10Q2n04m42J37L73k02l15k99l04J36o2j25k82k53k37
1076a541L0j76K79k13Q3k40O62J0j11M0M83M12o15P3O18K54k85j19N98L01n52
1097in65Q92K54j102j65M36K01q98j53M76P2p58p12J126K32p60m18J266K50r99
$$ plain form
1117 -1334 -1270 -6 -142 -319 -837 621 1126 216 15 1057 1788 1118 900 1586 2078 825 614 1968
1135 1968 2287 482 -105 757 1350 407 -115 376 419 -683 -401 875 457 -837 -997 496 1050 36
1153 36 -594 390 1295 588 269 821 1285 300 -48 1191 1790 726 32 765 1125 884 300 640 834 176
1173 176 -434 692 1151 143 -944 -391 915 559 -1051 -677 291 357 -582 175 812 -80 -1333 -508
1191 -508 975 270 -1564 -1348 307 -37 -1047 -1086 75 -635 -2250 -1168 472 -261 -2714 -2206 190
1208 190 595 -1465 -1771 -177 -207 -1272 -580 1153 66 -1974 -1324 1436 1177 -1530 -1867 82 481
1225 481 -1036 -1132 267 -595 -2360 -1799 726 -176 -2880 -2980 -636 -35 -1961 -2459 -893 -677 -1948
1242 -1948 -1454 505 133 -2508 -2096 804 1566 -385 -1599 264 647 -57 -180 1417 788 -1337 -798
$$ packed form
1117a334O4J264j36j77n18J458N05r10k01J042P31o70k18O86M92j253k11J354
1135A968L19j805n87Q62N93r43n22M91M3j102K82J276m18j294j60J493N54j014
1153C6o30R84R05p07l19N52M64r85l48J239N99j064o94P33L60k41n84L40J94o58
1173A76o10J126M59j008j087N53J306l56j610L74R68O6r39P57O37q92j253Q25
1191e08J483p05j834K16J655l44j010l9J161p10j615J082J640p33k453N08K396
1208A90M05k060l06J594l0j065O92J733j087k040O50K760k59k707l37J949L99
1225D81j517r6J399q62j765N61K525r02k704j00K344O01j926m98J566K16j271
1242a948M94J959l72k641M12K900P62j951j214J863L83p04j23J597o29k125N39
$$ plain form
1259 -798 2029 2204 -704 -1678 561 1720 351 -430 598 573 -578 -334 1700 1785 -456 -1341 1142
1276 1142 2738 1174 -665 462 1396 709 227 1519 1971 -133 -816 1572 3155 925 -1423 -87
1292 -87 1904 1247 -57 899 1238 273 -618 1756 3367 845 -1336 757 3439 2411 404 569 2343
1309 2343 1744 578 2251 2951 658 -1357 868 3161 1798 -1597 -1115 968 570 -1025 -846 296
1325 296 -1731 -2886 -1063 828 -800 -3558 -2761 642 356 -1559 -1472 284 -306 -1392 692 2376
1341 2376 299 -1835 -556 2578 2049 -943 -669 742 641 -348 24 797 -795 -2798 -1139 954
1357 954 -56 -2919 -3140 -1067 -434 -2341 -2622 -1373 -2146 -3114 -1769 385 -551 -2797 -2094 919 1181
1374 1181 -579 -986 563 1310 340 650 2109 1784 -214 -26 2480 2716 313 -900 592 1684 573
$$ packed form
1259g98K827J75k908r74K239J159j369p81J028k5j151K44K034Q5k241q85K483
1276A142J596j564j839J127R34o87m82J292M52k104o83K388J583k230k348J336
1292h7J991o57j304R56L39r65q91K374J611k522k181K093K682j028k007J65J774
1309B343n99j166J673P00k293k015K225K293j363l395M82K083l98j595J79J142
1325B96k027j155J823J891j628k758P97L403k86j915Q7J756n90j086K084J684
1341B376k077k134J279L134n29k992K74J411j01r89L72P73j592k003J659K093
1357I54j010k863k21K073O33j907k81J249p73r68J345K154r36k246P03L013K62
1374A181j760m07J549P47r70L10J459l25j998J88K506K36k403j213J492J092j111
$$ plain form
1391 573 24 215 299 -886 -867 1046 1099 -1151 -1871 69 1547 110 -931 -26 805 78 -32 1559
1409 1559 1923 -117 -357 1694 3308 1392 -268 746 2270 1780 858 1399 1969 332 47 1741 2627
1426 2627 327 -907 361 1802 902 -470 37 699 -217 -658 562 1269 -491 -1511 136 1491
1442 1491 458 -1416 -335 912 31 -501 163 701 -344 -1667 129 1417 301 -1120 -727 744
1458 744 355 -777 -194 417 -331 -812 -138 1015 -609 -1996 -622 602 177 -968 -1052 -412 -410 -711 -366
1477 -366 209 -591 -1311 -593 634 -85 -1169 -1059 -6 175 -274 -475 27 -218 -536 -400 504 310 -687
1496 -687 -650 390 471 -80 -246 194 -50 -336 -283 488 217 -580 -624 453 681 -382 -686 165 610 -61
1516 -61 -75 311 426 -112 -435 622 933 212 -171 752 1042 236 133 436 846 179 321 955 915 181 -248
$$ packed form
1391E73n49J91Q4j185J9J913N3k250p20J940J478j437j041R05Q31p27j10J591
1409A559L64k040k40K051J614j916j660J014J524m90r22N41N70j637k85J694Q86
1426B627k300j234J268J441r00j372N07O62r16m41J220P07j760j020J647J355
1442A491j033j874J081J247q81n32O64N38j045j323J796J288j116j421L93J471
1458G44l89j132N83O11p48m81O74J153j624j387J374J224m25j145q4O40Kl01L45
1477c66N75q00p20P18J227p19j084J10J053J81m49k01N02k45l18J36R04j94r97
1496f87L7J040Q1n51j66M40k44k86N3P71k71p97m4J077K28j063l04Q51M45o71
1516f1j4L86J15n38l23J057L11p21l83R23K90q06j03L03M10o67J42O34m0p34m29
$$ plain form
1537 -248 700 1225 119 -402 100 778 -147 -335 238 290 101 -354 329 383 -179 -469 350 255 -196 -145 300
1558 300 377 -41 -197 209 393 -28 -34 23 29 -323 -226 -139 -161 -121 -351 10 -217 -430 -341 -457 -166 -323 -678 -537
1582 -537 -404 -252 -546 -661 -635 -654 -525 -632 -715 -435 -586 -885 -597 -482 -338 -537 -331 -509 -567 -470 -494 -535
1604 -535 -390 -450 -395 -273 -293 -422 -329 -451 -427 -457 -9 -292 -787 -844 -516 -606 -240 -693 -354 -176 -671 -447 -253
1627 -253 -81 -434 -220 78 44 -245 33 -48 387 -83 132 200 26 -76 -122 169 188 264 103 475 94 62
1649 62 1 195 114 -104 -150 55 244 22 -152 92 365 6 -108 97 144 166 164 564 400 420 252 192 459
1672 459 130 413 371 283 191 381 318 291 -106 280 205 169 -344 -257 -153 -38 -56 -69 -10 -203 58 77 100 78 151
1697 151 143 -247 162 185 -33 -29 109 353 -181 -32 16 38 -82 -453 -104 10 -319 -322 37 -610 -742 -464 -131
$$ packed form
1537b48R48N25j106n21N02O78r25j88N73N2j89m55O83N4n62k90Q19r5m51N1M45
1558C00P7m18j56M06J84m21oN7Ol52R7Q7k2M0k30L61k27k13Q9j16K91j57l55J41
1582e37J33J52k94j15K6j9J29j07q3K80j51k99K88J15J44j99K06j78n8R7k4m1
1604e35J45o0N5J22k0j29R3j22K4l0M48k83m95n7L28r0L66m53L39J78m95K24J94
1627b53J72l53K14K98l4k89K78q1M35m70K15O8j74j02m6K91J9P6j61L72l81l2
1649F2o1J94q1k18m6K05J89k22j74K44K73l59j14K05M7K2kM00j64K0j68o0K67
1672D59l29K83m2q8r2J90o3k7l97L86p5l6n13Q7J04J15j8j3N9j93K61J9K3k2P3
1697A51ql90M09K3k18MJ38K44n34J49M8K2j20l71L49J14l29lL59o47j32K78L33
$$ plain form
1720 -131 -491 -798 -371 -228 -8 -476 -474 60 -98 -354 -43 302 191 -215 -98 682 162 -122 -248 145 -106
1741 -106 -192 -149 208 -222 -421 -323 201 -221 -611 -527 45 56 -542 -183 265 -180 -392 -71 254 439 -362 142
1763 142 858 685 85 198 826 766 531 671 770 737 312 619 994 646 14 242 863 725 -137 7 304
1784 304 508 -81 148 852 291 -191 -217 889 739 -400 -101 356 571 251 347 380 231 256 168 782 649
1805 649 -149 -415 412 776 270 -336 124 443 -143 -171 344 463 -987 -499 397 1143 -272 -763 -323 430
1825 430 -102 -448 122 354 -449 -735 -128 320 -772 -1538 -832 -220 -387 -1424 -996 -632 -1269 -1411 -526
1844 -526 -333 -1389 -1836 -711 491 -109 -945 -606 483 -261 -450 212 609 -280 -708 421 1542 276
1862 276 -1233 -141 755 557 -571 -373 49 -896 -897 -371 556 -796 -1744 -733 481 -105 -948 -753 -44
$$ packed form
1720a31l60l07M27J43K20m68KN34j58k56L11L45j11m06J17P80n20k84j26L93k51
1741a06q6M3L57m30j99R8N24m22l90Q4N72J1n98L59M48m45k12L21L25J85q01N04
1763A42P16j73o00J13O28o0k35J40R9l3m25L07L75l48o32K28O21j38q62J44K97
1784C04K04n89K29P04n61m82k6J106j50j139K99M57K15l20R6L3j49K5q8O14j33
1805F49p98k66Q27L64n06o06M60L19n86k8N15J19j450M88Q96P46j415m91M40P53
1825D30n32l46N70K32q03k86O07M48j092p66P06O12j67j037M28L64o37j42Q85
1844e26J93j056m47J125J202o00q36L39J089p44j89O62L97q89m28J129J121j266
1862B76j509J092Q96j98j128J98M22r45jN26R27j352r48J011J214n86q43J95P09
$$ plain form
1881 -44 -685 -527 331 1027 59 -534 516 1998 1384 -111 451 1852 1838 692 1364 2061 1136 130 1150
1900 1150 2167 1545 -98 -22 1247 1087 258 -231 159 231 -665 57 1131 94 -1294 -592 991 944
1918 944 -474 -657 424 542 -2 176 1072 579 -729 165 1775 1429 -208 -753 797 1509 615 -508
1936 -508 354 561 -592 -377 779 633 -858 -1410 137 890 -855 -1564 -477 -23 -894 -948 132 -202
1954 -202 -1625 -1884 -31 326 -1237 -2299 -905 386 -594 -1058 -456 -289 -1030 -1313 397 604 -1342
1971 -1342 -1809 -602 733 -45 -1086 -532 170 -136 -671 6 521 -1139 -1332 -8 900 -502 -1582
1988 -1582 -685 301 -266 -708 -374 -140 -1073 -1214 -99 544 -621 -1729 -657 386 242 -967 -667 -14
2006 -14 -281 -905 203 727 -298 -984 6 1431 528 -425 -379 545 388 165 222 713 -362 -818 117 1389
$$ packed form
1881d4o41J58Q58O96r68n93J050J482o14j495N62J401j4j146O72O97r25j006J020
1900A150J017o22j643P6J269j60q29m89L90P2q96P22J074j037j388P02J583m7
1918I44j418j83J081J18n44J78Q96m93j308Q94J610l46j637n45J550P12q94j123
1936e08Q62K07j153K15J156j46j491n52J547P53j745p09J087M54q71n4J080l34
1954b02j423k59J853L57j563j062J394J291r80m64O02J67p41k83J710K07j946
1971a342m67J207J335p78j041N54P02l06n35O77N15j660j93J324R08j402j080
1988a582Q97R86n67m42L34K34r33j41J115O43j165j108J072J043j44j209L00O53
2006a4k67o24J108N24j025o86R90J425r03r53M6R24j57k23N7M91j075m56R35J272
$$ plain form
2026 1389 626 -816 -453 517 860 -163 -435 611 362 -258 353 1045 467 -778 -17 1050 1095 -71
2044 -71 -636 948 653 151 262 980 601 -404 145 1124 1363 -236 -340 677 1162 -29 61 1005 503
2063 503 -467 92 1181 627 -492 -265 931 1154 -156 -253 343 382 -15 -47 724 357 -565 -605 639 730
2083 730 -367 -1028 -74 116 -580 -441 211 -173 -879 -640 -177 341 -779 -1218 -467 166 -454 -844 -523
2102 -523 -118 -416 -321 292 281 -626 -893 -5 355 -203 -720 -476 108 -190 -654 -216 158 -629 -804 -215 256
2123 256 -356 -912 -671 247 -201 -429 -205 14 -118 -311 18 218 -78 -218 99 590 402 -293 -201 312
2143 312 833 154 439 919 586 110 446 808 855 158 77 889 747 -145 323 456 333 106 186 369 462
2164 462 -29 219 704 691 -33 114 735 761 77 88 1015 648 298 350 548 876 388 255 546 640 296 144
$$ packed form
2026A389p63j442L63R70L43j023k72J046k49o20O11O92n78j245P61J067M5j166
2044g1n65J584k95n02J11P18l79j005N49R79K39j599j04J017M85j191R0R44n02
2063E03r70N59J089n54j119K27J196K23j310r7N96L9l97l2P71l67r22m0J244R1
2083G30j097o61R54J90o96J39O52l84p06K39M63N18j120m39P51O33o20l90L21
2102e23M05k98R5O13j1r07k67Q88L60n58n17K44N84k98m64M38L74p87j75N89M71
2123B56o12n56K41R18m48k28K24K19j32j93L29K00k96j40L17M91j88o95R2N13
2143C12N21o79K85M80l33m76L36L62M7o97q1Q12j42q92M68J33j23k27Q0J83R3
2164D62m91K48M85j3p24J47O21K6o84J1R27l67l50N2J98L28m88j33K91R4l44j52
$$ plain form
2186 144 511 560 169 -25 155 201 -174 -233 208 49 -37 -280 93 -8 49 -102 -26 -42 -399 -342 -154 121 29
2209 29 -75 -49 162 -163 41 252 128 -141 70 14 -163 -89 -77 -245 -289 -32 -197 -277 -196 -135 -547 -608 -35
2232 -35 -408 -444 -510 -179 -363 -577 -474 12 -270 -383 -328 -372 -263 -1 -187 -179 -146 -273 -204 193 242 -238 -179 398
2256 398 -49 -270 -25 -80 -328 -128 -197 -18 -463 -445 -434 -467 -518 -578 -428 -213 -238 -187 -404 -15 66 4 -56 -67
2280 -67 54 321 194 181 209 286 431 182 376 402 425 311 74 333 464 206 237 61 265 492 193 -30
2302 -30 339 -32 134 -102 567 295 58 113 -137 275 171 67 374 397 241 206 -228 -67 39 -154 134
2323 134 -142 220 75 99 70 -40 -203 -2 51 139 -198 -153 157 -110 -350 -207 99 157 -322 -366 -155 24
2345 24 -283 -344 -234 -151 -387 -481 -40 -296 -485 -528 -564 -402 -588 -733 -583 -149 -316 -560 -129 -219 -282 -430 -14
$$ packed form
2186A44L67M9l91j94J80M6l75n9M41j59q6k43L73j01N7j51P6j6l57N7J88K75r2
2209B9j04K6K11l25K04K11j24k69K11n6j77P4J2j68m4K57j65q0Q1O1m12o1N73
2232c5l73l6o6L31j84k14J03M86k82j13N5m4J09K62j86QL3j27O9L97M9m80N9N77
2256C98m47k21K45n5k48K00o9J79m45J8J1l3n1o0J50K15k5N1k17L89Q1o2o0j1
2280f7J21K67j27j3K8P7J45k49J94K6K3j14k37K59J31k58L1j76K04K27k99k23
2302c0L69l71J66k36O69k72k37N5k50M12j04j04L07K3j56l5m34J61J06j93K88
2323A34k76L62j45K4k9j10j63K01N3Q8l37M5L10k67k40J43L06N8m79m4K11J79
2345B4l07o1J10Q3k36r4M41k56j89m3l6J62j86j45J50M34j67k44M31r0o3j48M16
$$ plain form
2368 -14 7 139 -52 403 132 51 124 -150 356 -24 -359 -87 517 310 102 18 127 -86 -216 -29 206 -18
2390 -18 -454 63 9 199 27 51 122 147 181 718 541 541 221 684 820 356 364 622 595 644 622 655 605 442 96
2415 96 344 303 -154 -357 124 430 66 -102 -324 55 -69 -331 -323 84 -608 -328 -423 490 134 -634 -206 242
2437 242 217 -97 28 309 -164 -287 -4 401 124 -219 -300 461 193 -124 -199 251 -190 -239 -334 63 -378 -933
2459 -933 -100 161 186 -418 -604 -46 99 -284 -319 188 71 -476 -255 618 58 -830 -545 578 443 -253
2479 -253 -515 79 205 -300 -44 439 412 -330 -163 794 646 -359 -420 345 242 75 -16 359 392 -404 -290
2500 -290 843 559 -425 -466 528 503 -216 -344 141 71 -386 -555 244 118 -825 -846 372 782 -492 -625
2520 -625 55 729 338 -286 259 651 -17 -69 763 1358 200 -238 201 873 518 -183 272 676 149 -11
$$ packed form
2368a4K1J32j91M55k71q1P3k74N06l80l35K72O04k07k08q4J09k13j30J87K35k24
2390a8m36N17n4J90j72K4P1K5L4N37j77%l20M63J36m64QK58k7M9k2L3n0j63l46
2415I6K48m1m57k03M81L06l64j68k22L79j24k62QM07o92K80r5R13l56p68M28M48
2437B42k5l14J25K81m73j23K83M05k77l43q1P61k68l17p5M50m41m9r5L97m41n55
2459i33Q33K61K5o04j86N58J45l83l5N07j17n47K21Q73n60q88K85J123j35o96
2479b53k62N94J26n05K56M83k7p42J67R57j48j005o1P65j03j67r1L75L3p96J14
2500b90J133k84r84m1R94k5p19j28M85p0m57j69P99j26r43k1J218M10j274j33
2520f25O80O74l91o24N45L92o68n2Q32N95j158m38M39O72l55p01M55M04n27j60
$$ plain form
2540 -11 831 638 -251 -756 274 565 215 -346 -365 -30 158 -94 90 387 -348 -528 78 756 -299 -780
2560 -780 -129 431 295 -18 322 533 -221 -376 470 729 170 -504 57 915 327 -298 -191 301 -148 -292
2580 -292 90 152 -243 -1106 -202 683 395 -1002 -757 84 -196 -429 -470 -30 -415 -1287 -426 196 -117 -1104
2600 -1104 -1147 -116 132 -926 -835 -199 -652 -809 -408 314 -53 -918 -887 345 343 -560 -413 74 108 -483 -47
2621 -47 484 98 -836 -247 481 447 -493 -669 198 643 -221 -560 234 -58 -542 -500 354 179 -488 -628 404
2642 404 598 -15 -333 219 371 -254 111 514 559 68 -127 862 1198 267 -7 343 983 483 416 744 1018
2663 1018 254 363 660 1174 162 -307 680 706 773 -20 -9 308 55 80 715 734 228 -469 738 618 336
2684 336 87 335 553 433 11 520 821 251 22 415 926 422 -325 70 716 422 -29 -117 189 66
$$ packed form
2540a1Q42j93q89n05J030K91l50n61j9L35J88k52J84K97p35j80O06O78j055m81
2560g80O51N60j36l13L40K11p54j55Q46K59n59o74N61Q58n88o25J07M92m49j44
2580b92L82O2l95q63R04Q85k88j397K45Q41k80k33m1M40l85q72Q61O22l13r87
2600a104m3J031K48j058R1O36m53j57M01P22l67q65L1J232kr03J47M87L4n91M36
2621d7N31l86r34N89P28l4r40j76Q67M45q64l39P94k92m84M2Q54j75o67j40J032
2642D04J94o13l18N52J52o25L65M03M5m91j95R89L36r31k74L50O40n00o7L28K74
2663A018p64J09K97N14j012m69R87K6O7p93J1L17k53K5O35J9n06o97J207j20k82
2684C36k49K48K18j20m22N09L01n70k29L93N11n04p47L95O46k94m51q8L06j23
$$ plain form
2704 66 -179 137 181 -289 -548 -127 299 -163 -245 -421 82 -198 -561 -223 -230 -342 -857 -803 -250 229 -694 -455
2726 -455 190 17 -782 -278 -197 -166 -474 -346 187 -107 -606 -434 -295 235 -432 -800 -333 -410 -557 -592 26
2747 26 -683 -844 -350 -12 -96 -552 -823 -232 -358 -525 -844 -104 20 -213 -251 259 282 -210 -449 168 473
2768 473 -29 -234 -210 194 70 161 224 249 -47 -48 388 345 -286 -82 245 232 -38 93 183 299 -77 -143 387
2791 387 325 -137 188 358 474 292 -110 77 149 -24 180 212 680 490 -2 104 419 57 -10 -8 275 112
2813 112 -21 159 167 -186 -322 -19 110 -399 -350 -83 -97 -218 -568 -168 -427 -333 -333 -559 -63 -251 -397 -565
2835 -565 -111 28 -137 -478 -310 -76 -338 -114 -116 130 -177 5 -264 -230 -336 -176 -253 -328 -347 -304 -141 -361
2857 -361 -89 -340 23 -482 -362 -167 154 -189 -111 -189 32 -208 -356 -110 -289 -83 -247 -77 90 70 132
$$ packed form
2704F6k45L16M4m70k59M21M26m62q2j76N03k80l63L38pj12n15N4N53M79r23K39
2726d55O45j73p99N04Q1L1l08J28N33k94m99J72J39N30o67l68M67p7j47l5O18
2747B6p09j61M94L38q4m56k71N91j26j67l19P40J24k33l8N10K3m92k39O17L05
2768D73n02k05K4M04j24R1O3K5k96jM36m3o31K04L27j3k70J31R0J16l76o6N30
2791C87o2m62L25J70J16j82m02J87P2j73K04L2M68j90m92J06L15l62o7KK83j63
2813A12j33J80Ql53j36L03J29n09M9K67j4j21l50M00k59R4%k26M96j88j46j68
2835e65M54J39j65l41J68K34k62K24kK46l07J82k69L4j06J60p7p5j9M3J63k20
2857c61K72k51L63n05J20J95L21l43P8p8K21k40j48K46j79K06j64J70J67k0O2
$$ plain form
2878 132 -248 -76 74 -118 -86 90 357 97 158 169 12 301 -21 -40 -144 10 235 338 300 -203 262 -15
2900 -15 284 166 76 -149 -2 -48 165 197 -38 76 -280 389 62 74 228 312 -134 173 -69 149 127 335
2922 335 199 487 303 105 235 314 325 40 127 192 375 -32 444 574 333 370 217 207 254 363 -90 7 497
2945 497 113 172 287 36 192 119 64 167 -147 158 225 148 68 122 169 150 117 241 317 348 -8 -31 -64 239 -80
2970 -80 -142 -70 -32 299 -199 63 289 -4 -213 -368 119 -158 -293 -365 -166 -311 -552 -43 -473 -371 -409 -248
2992 -248 -389 -588 -592 -322 -338 -139 -458 -129 -141 -331 -396 -273 -124 -233 -366 -155 96 154 -612 112 174 262 -247
3015 -247 -289 217 -273 -557 -316 -103 256 -105 -180 235 52 -58 -472 103 -125 -226 -35 333 45 133 -120
3036 -120 383 362 260 121 205 290 281 323 319 608 344 416 455 588 173 407 260 275 293 322 466 278 174 60
$$ packed form
2878A32l80J72J50j92L2J76K67k60O1J1j57K89l22j9j04J54K25J03l8n03M65k77
2900a5K99j18r0k25J47m6K13L2k35J14l56O69l27J2J54Q4m46L07k42K18k2K08
2922C35j36K88j84j98J30P9J1k85Q7O5J83m07M76J30k41L7j53j0M7J09m53R7M90
2945D97l84N9J15k51J56p3n5J03l14L05O7p7q0N4M7j9l3J24P6L1l56k3l3L03l19
2970h0o2P2L8L31m98K62K26k93k09j55M87k77j35p2J99j45k41N09m30J02l8J61
2992b48j41j99mK70j6J99l19L29j2j90o5J23J49j09j33K11K51N8p66P24O2Q8n09
3015b47m2N06m90k84K41K13L59l61p5M15j83j10m14N75k28j01J91L68k88Q8k53
3036a20N03k1j02j39Q4Q5rM2mK89k64P2L9J33m15K34j47J5J8K9J44j88j04j14
$$ plain form
3060 60 218 47 13 -76 -132 -78 234 -243 -612 7 -110 -327 105 227 82 -294 -233 97 -247 -82 -205 265
3082 265 154 -413 -199 316 -444 -497 -52 279 -74 -500 -150 -10 164 -609 -145 -195 -588 -744 -294 -259 -508
3103 -508 -861 -540 -167 -241 -983 -738 -105 -499 -504 -317 1 -382 -675 -162 257 -48 6 -212 158 333 -53
3124 -53 143 503 -96 -156 -29 802 346 -311 -103 537 365 -117 336 431 -35 -233 194 567 282 -332 129
3145 129 294 487 167 -50 448 170 -215 316 471 405 -60 64 835 702 -91 176 566 594 422 453 550
3166 550 373 -44 180 917 948 155 -52 488 688 241 -117 109 62 -184 212 380 135 -117 -283 216 351
3187 351 -115 -565 -359 52 -191 -292 9 62 -339 -380 342 140 -306 -593 296 173 -107 -355 113 246 45
3208 45 -72 61 435 -170 -647 -176 306 -2 -510 -335 -26 -251 -502 -314 1 -618 -813 -133 -22 -388
$$ packed form
3060F0J58j71l4q9n6N4L12m77l69O19j17k17M32J22j45l76O1L30l44J65j23M70
3082B65j11n67K14N15p60n3M45L31l53m26L50J40J74p73M64n0l93j56M50L5k49
3103e08l53L21L73p4p42K45O33l94nJ87L18l83k93N13M19l05N4k18L70J75l86
3124e3J96L60n99o0J27Q31m56o57K08O40j72m82M53R5m66j98M27L73k85o14M61
3145A29J65J93l20k17M98k78l85N31J55o6m65J24P71j33p93K67L90K8j72L1R7
3166E50j77m17K24P37L1p93k07N40K00m47l58K26m7k46L96J68k45k52j66M99J35
3187C51m66m50K06M11k43j01L01N3m01m1P22k02m46k87Q89j23k80k48M68J33k01
3208D5j17J33L74o05m77M71M82l08n08J75L09k25k51J88L15o19j95O80J11l66
$$ plain form
3228 -388 -834 -215 -229 -279 -503 -295 -3 -637 -577 -108 254 -417 -563 -224 216 113 -426 36 294 -211 -122
3249 -122 -127 88 -182 -336 -85 240 -221 -595 -335 162 -37 -57 -125 23 -171 -297 101 329 272 -320 -194 569
3271 569 406 -89 -112 258 -47 32 315 217 -116 -282 143 605 315 94 -177 121 348 219 138 407 20
3292 20 20 -71 699 423 -171 -214 360 473 -239 91 228 223 -369 -39 601 3 -178 -182 394 445 -153 -329 228
3315 228 373 -251 -203 258 29 -187 -35 259 407 -248 -319 -102 404 -250 -278 22 73 -307 -33 330 7
3336 7 -351 -284 26 80 -182 -245 2 239 -376 -146 150 171 -568 -784 66 -20 -96 -710 -153 -136 -31 -334 278
3359 278 125 -507 -561 -90 -38 -316 -613 -97 191 -327 -578 -462 13 -422 -316 -226 34 -165 -476 -110 203
3380 203 -36 -257 -155 -62 -87 15 -135 146 -319 -61 169 249 78 -266 39 520 99 -84 181 300 -30
$$ packed form
3228c88m46O19j4n0k24K08K92o34O0M69L62o71j46L39M40j03n39M62K58n05Q9
3249a22nK15k70j54K51L25m61l74K60M97j99k0o8J48j94j26L98K28n7n92J26P63
3271E69j63m95k3L70l05P9K83r8l33j66M25M62k90k21k71K98K27j29q1K69l87
3292B0%r1P70k76n94m3N74J13p12L30J37nn92L30O40n98j81mN76N1n98j76N57
3315B28J45o24M8M61k29k16J52K94J48o55p1K17N06o54k8L00N1l80K74L63l23
3336Gl58O7L10N4k62o3K47K37o15K30K96K1p39k16Q50q6p6o14N57J7J05l03O12
3359B78j53o32n4M71N2k78k97N16K88n18k51J16M75m35J06R0K60j99l11L66L13
3380B03k39k21J02R3k5J02j50K81m65K58K30Q0j71l44L05M81m21j83K65J19l30
$$ plain form
3401 -30 -215 278 377 503 21 -74 557 328 395 295 418 563 15 806 396 335 486 162 466 322 306 406
3423 406 355 413 199 423 173 407 159 173 735 250 223 267 359 218 320 269 403 612 224 243 489 301 64
3446 64 352 397 166 397 281 -181 120 50 67 -54 43 -197 -83 -62 64 -206 -159 -469 -36 -163 -537 -285
3468 -285 -244 -395 -270 -266 -189 -205 -215 -1 -156 -287 -387 -158 -372 -164 -338 -261 -239 -170 -351 -432 -109 -72 -189 11
3492 11 -133 -44 -361 -63 -93 -241 -249 -46 -256 -149 -114 -220 -20 -284 -159 99 191 -119 313 -1 181 180 55
3515 55 26 233 245 -4 269 266 161 110 2 250 214 91 -82 285 286 18 137 236 118 -1 -52 292 26 53
3539 53 408 142 174 85 145 76 255 80 12 239 81 15 125 298 19 -180 280 315 236 142 198 218 -147 -94
3563 -94 221 135 273 -164 46 234 -44 25 310 -417 -72 34 -164 10 -151 -225 -64 94 -401 -226 -463
$$ packed form
3401c0j85M93R9J26m82r5O31k29O7j00J23J45n48P91m10o1J51l24L04j44j6J00
3423D06n1N8k14K24k50K34k48J4N62m85k7M4R2j41J02n1J34K09l88J9K46j88k37
3446F4K88M5k31K31j16m62L01p0J7j21R7k40J14K1J26k70M7l10M33j27l74K52
3468b85M1j51J25MP7j6j0K14j55j31j00K29k14K08j74P7K2O9j81q1L23L7j17K00
3492A1j44Q9l17K98l0j48qK03k10J07L5j06K00k64J25K58R2l10M32l14J82jj25
3515E5k9K07J2k49K73lj05n1j08K48l6j23j73L67Jk68J19R9j18j19n1L44k66K7
3539E3L55k66L2q9O0o9J79j75o8K27j58o6J10J73k79j99M60L5p9r4N6K0l65N3
3563i4L15q6J38m37K10J88k78O9K85p27L45J06j98J74j61p4J61J58m95J75k37
$$ plain form
3584 -463 -374 -174 -93 -238 -328 -378 -280 -64 -171 140 -117 -71 -149 -84 128 -214 233 10 179 -65 7 224 -30
3607 -30 -175 -195 197 -98 140 -151 -149 -384 -192 -23 -100 -315 -392 -206 -3 -154 -258 46 -184 68 -378 -199
3629 -199 -4 50 -142 37 103 76 -49 273 103 350 40 299 191 -9 101 254 275 349 -498 117 92 2
3651 2 -171 -220 -216 -51 -293 17 198 258 -27 -95 66 -215 -248 153 186 101 146 298 588 145 188 353 567 96
3675 96 301 322 367 181 75 189 503 74 -106 162 288 76 -474 -65 241 333 -32 -7 182 130 -124 -139
3697 -139 187 176 -79 24 219 159 -78 160 -194 -74 -420 -94 -31 83 -89 -132 -127 -183 83 63 289 -42 -310
3720 -310 -164 -9 -123 -283 -175 -135 81 -159 -253 31 -143 -391 -226 -39 -255 12 -440 -13 -21 -229 -254 -146
3742 -146 -45 -531 -46 73 225 -57 -263 -66 20 -269 -383 293 85 -322 -341 238 133 -235 -191 148 293
$$ packed form
3584d63Q9K00Q1j45r0n0R8K16j07L11k57M6p8O5K12l42M47k23J69k44P2K17k54
3607c0j45k0L92k95K38k91Kk35J92J69p7k15p7J86K03j51j04L04k30K52m46J79
3629a99J95N4j92J79O6k7j25L22j70K47l10K59j08k00J10J53K1P4q47O15k5r0
3651Bj73m9MJ65k42L10J81O0k85o8J61k81l3M01L3q5M5J52K90m43M3J65K14m71
3675I6K05K1M5j86j06J14L14m29j80K68J26k12n50M09L06R2l65K5J89n2k54j5
3697a39L26j1k55J03J95o0k37K38l54J20l46L26O3J14j72m3Nn6K66k0K26l31k68
3720c10J46J55j14j60J08M0K16k40r4K84j74k48J65J87k16K67m52M27qk08k5J08
3742a46J01m86M85J19J52k82k06J97Q6k89j14O76k08m07j9N79j05l68M4L39J45
$$ plain form
3763 293 78 318 133 74 -18 303 457 319 -25 0 333 183 -1 162 122 346 128 -48 272 44 282
3784 282 84 56 399 107 -143 369 147 209 -37 176 466 179 -72 257 711 76 59 -68 398 190 174
3805 174 303 140 112 156 36 266 209 -236 22 283 391 -332 -235 -92 344 -116 167 343 -319 -252 -283 -136
3827 -136 -94 -500 -232 -62 -25 -354 -394 -93 -208 -282 71 -76 -95 -345 -396 188 83 -164 -372 -95 36 -224
3849 -224 -239 -208 -45 -251 -83 185 -107 -444 -664 -94 -153 -393 -403 70 -166 -384 -242 62 5 -133 -325 -85
3871 -85 51 -87 -254 -73 -172 -106 -481 -158 15 -327 57 -2 79 -18 -158 -135 81 144 342 284 112 -86 10
3894 10 463 604 125 -216 52 409 306 -269 185 214 121 31 442 271 12 -25 595 137 256 -8 119 308
3916 308 458 124 441 428 -218 439 331 781 271 100 214 143 86 159 34 -6 335 -115 222 373 -38 -222
$$ packed form
3763B93k15K40j85n9r2L21J54j38l44K5L33j50j84J63m0K24k18j76L20k28K38
3784B82j98k8L43k92k50N12k22O2k46K13K90k87k51L29M54o35j7j27M66k08j6
3805A74J29j63k8M4j20K30n7m45K58K61J08p23R7J43M36m60K83J76o62O7l1J47
3827a36M2m06K68J70L7l29m0L01j15p4L53j47j9k50n1N84j05k47k08K77J31k60
3849b24j5L1J63k06J68K68k92l37k20N70n9k40j0M73k36k18J42L04n7j38j92K40
3871h5J36j38j67J81r9O6l75L23J73l42L84n9Q1r7j40K3K16O3J98n8j72j98R6
3894A0M53J41m79l41K68L57j03n75M54K9r3r0M11j71k59l7O20m58J19k64J27J89
3916C08J50l34L17j3o46O57j08M50n10j71J14p1n7P3j25m0L41m50L37J51m11j84
$$ plain form
3938 -222 -370 211 64 -241 68 20 -30 -32 -99 25 33 -40 -95 196 29 -197 -436 -161 191 -63 -227 267 226
3961 226 -181 -122 194 -152 -222 -406 33 -172 -169 -323 -366 -195 -169 -397 -211 -336 -116 -468 73 -66 -548 -341
3983 -341 -381 -116 -526 -154 -62 -290 -213 -239 127 181 -342 -292 -2 -7 25 -220 -153 171 -341 -156 146 43 -99
4006 -99 83 61 -74 -242 5 -63 3 19 96 23 54 -131 -176 78 293 47 -196 22 -21 -212 -63 455 198
4029 198 208 98 181 251 179 177 294 146 156 528 292 274 326 -103 15 130 156 86 294 372 204 -52 182 151
4053 151 232 72 -28 279 128 151 167 324 251 63 148 -36 -20 -173 262 4 -34 -328 197 238 84 -110 73
4076 73 184 -355 -74 -88 -111 178 57 102 -24 17 -258 133 -127 -215 -192 -188 -30 -306 -349 -362 -89 -95 -207 -204 -445
4101 -445 -407 -419 -111 58 111 -252 -65 -34 26 121 -215 -113 -316 263 -128 -41 -273 -249 -147 -106 96 -65 -288
$$ packed form
3938b22j48N81j47l05L09m8n0ko7J24Qp3n5K91j67k26k39K75L52k54j64M94m1
3961B26m07N9L16l46p0j84M39k05Lj54m3J71K6k28J86j25K20l52N41j39m82K07
3983c41m0K65m10L72R2k28P7k6L66N4n23N0K90nL2k45O7L24n12J85L02j03j42
4006i9J82k2j35j68K47o8O6J6P7p3L1j85m5K54K15k46k43K18m3j91J49N18k57
4029A98J0j10Q3P0p2kJ17j48J0L72k36j8N2m29J18J15K6p0K08P8j68k56K34l1
4053A51Q1j60j00L07j51K3J6J57p3j88Q5j84J6j53M35k58l8k94N25M1j54j94J83
4076G3J11n39K81j4k3K89j21M5j26M1k75L91k60q8K3MJ58k76m3j3K73oj12Lk41
4101d45L8j2L08J69N3l63J87L1O0R5l36J02k03N79l91Q7k32K4J02M1K02j61k23
$$ plain form
4124 -288 -138 -116 -154 -129 -4 150 119 -197 105 -316 -164 -297 -36 52 -170 -52 58 123 -79 -352 -122 137
4146 137 -200 35 -205 89 -47 27 150 363 238 -18 -168 247 -73 322 469 227 222 290 225 221 176 31 200
4169 200 155 212 -146 193 221 54 440 79 373 6 454 211 29 243 -100 381 142 338 219 218 217 130 382
4192 382 244 83 251 15 77 144 -334 -317 129 111 -37 126 72 143 -63 91 -25 17 -38 -313 -142 199 -67
4215 -67 -273 -528 -249 16 61 -353 -95 -156 -264 68 -170 84 -283 -275 -311 -176 -320 42 -281 -593 -301 -135
4237 -135 -195 117 -256 -14 -265 257 84 -25 186 -213 13 -116 21 15 -156 -241 77 -127 -254 -191 -328 -282
4259 -282 -216 -79 -320 -21 -194 -251 250 -118 -257 15 -88 212 141 -4 19 266 -151 129 74 183 180 43
4281 43 275 363 189 -149 82 79 296 -221 68 237 42 -45 -29 132 -180 -56 35 -200 189 -128 98 259
$$ packed form
4124b88J50K2l8K5J25J54l1l16L02m21J52j33K61Q8k22J18J10O5k02k73K30K59
4146A37l37K35k40K94j36P4J23K13j25k56j50M15l20L95J47k42nO8o5mm5j45J69
4169B00m5N7l58L39K8j67L86l61K94l67M48k43j82K14l43M81k39J96j19jjq7K52
4192C82j38j61J68k36O2O7m78J7M46j8j48J63n4P1k06J54j16M2n5k75J71L41k66
4215f7k06k55K79K65M5m14K58o1j08L32k38K54l67Ql6J35j44L62l23l12K92J66
4237a35o0L12l73K42k51N22j73j09K11l99K26j29J37oj71q5L18k04j27O3j37M6
4259b82O6J37k41K99j73n7N01l68j39K72j03L00p1j45K3K47m17K80n5J09lj37
4281D3K32Q8j74l38K31lK17n17K89J69j95q7J6J61l12J24R1k35L89l17K26J61
$$ plain form
4303 259 -88 -122 340 301 114 216 340 68 20 41 352 89 19 225 462 -117 -79 2 -160 36 145 82 3
4326 3 256 -118 76 52 143 174 -229 -280 32 73 -78 -219 -14 -219 -35 -12 -390 -238 -324 -103 146 -6 -250
4349 -250 -312 74 -183 -208 -191 -134 -27 -325 -272 94 -42 18 -84 57 174 4 105 -300 -28 -275 144 -223
4371 -223 -28 -267 -305 -149 -322 -204 -347 -52 -75 -96 93 85 -362 -45 -422 31 76 -157 -17 97 77 46 30
4394 30 38 404 127 45 477 47 127 233 230 386 305 102 27 357 22 111 -53 324 -498 -68 58 375 -50
4417 -50 -186 59 191 -43 -179 60 122 -200 -53 291 129 -59 -228 97 229 282 131 90 288 -78 309
4438 309 604 487 -72 -225 235 420 -152 -649 240 -194 -173 -186 -264 144 -132 -417 51 86 -410 -480 8 -336
4460 -336 -20 -210 -183 -134 -224 -323 -184 -149 -97 -402 -110 49 27 -56 108 116 -149 -75 -147 -59 -255 -437 -147 -194 109
$$ packed form
4303B59l47l4M62l9j87J02J24k72m8K1L11k63p0K06K37n79L8Q1j62J96J09o3p9
4326CK53l74J94k4R1L1m03n1L12M1j51j41K05k05J84K3l78J52q6K21K49j52k44
4349b50o2L86k57k5J7N7J07k98N3L66j36O0j02J41J17j70J01m05K72k47M19l67
4371b23J95k39l8J56j73J18j43K95k3k1J89qm47L17l77M53M5k33J40J14k0l1j6
4394C0QL66k77q2M32m30Q0J06lJ56q1k03p5L30l35Q9j64L77q22M30J26L17m25
4417e0j36K45J32k34j36K39O2l22J47L44j62j88j69L25J32N3j51m1J98l66L87
4438C09K95j17n59j53M60J85n72m97Q89m34K1j3p8M08k76k85M68L5m96p0M88l44
4460c36L16j90K7M9r0r9J39L5N2l05K92J59k2q3J64Qk65P4p2Q8j96j82K90m7L03
$$ plain form
4485 109 -301 -366 19 -328 -214 -128 -140 -211 -342 25 319 -13 -330 -211 384 136 -312 -131 163 -188 -8
4506 -8 319 301 -61 -126 30 294 240 -350 -9 158 168 -239 -174 325 50 -271 155 391 69 -521 -62 231
4528 231 -74 87 -233 139 -261 -149 -28 230 430 72 -156 532 379 144 42 192 -7 -176 198 329
4548 329 595 -84 -120 201 260 -115 -22 239 148 -215 7 44 38 -66 -221 255 109 -245 134 -27 45 -136 2
4571 2 3 64 176 28 74 180 -210 -134 -160 283 -156 -48 -144 47 -224 -243 -75 -368 -135 -239 -200 65 -319 -243
4595 -243 -193 -179 -291 -371 -312 -65 -70 -184 -35 52 -243 -160 -123 360 119 53 26 -240 -199 -234 -40 -86 -416 -254 110
4620 110 34 -264 -473 104 155 -227 351 -212 -85 -3 -57 -222 100 274 -183 354 -94 -13 52 48 8 144 79
4643 79 108 291 13 -136 -13 73 96 381 111 149 -101 169 331 -63 167 253 82 131 117 -211 -76 30 260
$$ packed form
4485A09m10o5L85l47J14Q6j2p1j31L67K94l32l17J19N95k48m48J81K94l51J80
4506hL27j8l62o5J56K64n4n90L41J67J0m07O5M99k75l21M26K36l22n90M59K93
4528B31l05J61l20L72m00J12J21K58K00l58k28O88j53k35j02J50j99j69L74J31
4548C29K66o79l6L21N9l75R3K61r1l63K22L7oj04j55M76j46l54L79j61P2j81J38
4571BJO1J12j48M6J06l90P6k6M43m39J08r6J91k71j9J68k93K33j04L9K65l84P6
4595b43N0J4j12q0N9K47nj14J49Q7k95Q3L7M83k41o6k7k66M1l5J94m6l30J62L64
4620A10p6k98k09N77N1l82N78n63J27Q2n4j65L22J74m57N37m48Q1O5mm0J36o5
4643G9K9J83k78j49J23Q6K3K85k70L8k50K70J62l94K30Q6j71M9j4l28J35J06K30
$$ plain form
4666 260 311 210 229 182 34 28 566 104 126 282 350 46 151 -80 88 280 179 -28 1 47 -19 166 253 -136
4690 -136 -181 5 62 85 60 127 181 -250 -25 -43 -157 145 -73 -457 -89 182 -133 19 -243 177 47 -215
4712 -215 -90 23 -270 -28 -283 -146 -168 -134 49 -125 -226 -45 33 51 -416 -149 -8 -10 -258 -238 -293 -141 -97
4735 -97 -468 -258 57 26 -456 -265 -276 -261 -149 -321 316 -253 -243 -69 30 132 -104 -16 112 340 130 73 -60
4758 -60 -132 303 325 5 240 -83 402 34 -21 -27 122 72 163 197 86 62 21 -96 -143 -28 0 56 -101 217 159
4783 159 158 209 320 94 120 107 113 275 274 69 336 -2 375 391 362 333 191 393 247 -223 503 355 253 97
4807 97 43 -76 128 -129 114 120 6 117 154 -137 -40 37 -131 -115 -21 262 74 86 82 68 -268 -9 -76 -81 -198
4832 -198 -246 -100 74 -207 21 -339 -290 -137 57 -299 -164 -66 -349 -178 -71 49 -362 -403 20 -216 -71
$$ packed form
4666B60N1j01J9m7j48oN38m62K2J56O8l04J05k31J68J92j01k07K9M6o6J85Q7l89
4690a36m5J86N7K3k5O7N4m31K25j8j14L02k18l84L68K71l15J52k62M20j30k62
4712b15J25J13k93K42k55J37k2L4J83j74j01J81P8J8m67K67J41kk48K0n5J52M4
4735i7l71K10L15l1m82J91j1J5J12j72O37n69J0J74R9J02k36Q8J28K28k10n7j33
4758f0p2M35K2l20K35l23M85l68n5oJ49n0R1L4j11k4m1j17m7J15K8N6j57L18n8
4783A59jN1J11k26K6j3OJ62jk05K67l38L77J6k9k9j42K02j46m70P26j48j02j56
4807I7n4j19K04k57K43Oj14J11L7k91R7P7j68J6R4K83j88J2mj4l36K59o7nj17
4832a98m8J46J74k81K28l60M9J53J94l56J35R8k83J71J07J20m11m1M23k36J45
$$ plain form
4853 -71 -119 -320 -283 -469 -122 17 -261 -308 -92 -324 -162 -493 -287 -199 -319 -421 -25 -157 -476 -276 241 -59
4875 -59 125 -148 -139 94 -210 -179 -264 218 -10 116 98 24 69 -170 133 197 113 61 -157 -135 -9 56 -242 -48
4899 -48 -78 -127 3 -14 347 -235 -23 221 208 173 264 22 187 -177 16 184 294 292 11 176 300 82 150
4922 150 -80 -66 185 212 -6 -2 90 25 149 26 -365 -132 52 28 -95 -3 173 59 155 73 173 371 31
4945 31 -59 72 398 -50 91 190 334 159 -10 -4 48 223 -48 -48 58 -182 -222 99 -51 -97 -239 -423 -118
4968 -118 -364 -51 32 -66 -84 -63 -85 13 -5 -150 182 -19 198 -142 211 -242 -127 -225 -5 2 -2 -57 252 111
4992 111 -50 -447 -124 -110 -291 -235 32 -4 -323 -340 -172 204 1 -254 -23 -33 -357 -251 -237 33 -105 -100 -43
5015 -43 -239 -366 -66 -307 180 -95 48 110 -233 -98 225 97 64 -157 -33 -156 123 52 9 16 -286 68
$$ packed form
4853g1m8k01L7j86L47J39k78m7K16k32J62l31K06Q8j20j02L96j32l19K00N17l00
4875e9J84k73RK33l04L1q5M82k28J26j8p4M5k39L03O4q4n2k18K2J26O5k98J94
4899d8l0m9J30j7L61n82K12K44j3l5R1k42J65l64J93J68J10kk81J65J24k18O8
4922A50k30J4K51K7k18MR2o5J24j23l91K33J84k4j23R2J76j14R6q2J00J98l40
4945C1r0J31L26m48J41R9J44j75j69ON2J75k71%J06k40m0L21j50m6j42j84L05
4968a18k46L13Q3r8j8K1k2R8j8j45L32k01K17l40L53m53J15r8K20Pmn5L09j41
4992A11j61l97L23J4j81N6K67l6l19j7J68L76k03k55K31j0l24J06J4K70j38NN7
5015d3j96j27L00k41M87k75J43O2l43J35L23j28l3k21J24j23K79p1m3Pl02L54
$$ plain form
5037 68 -144 413 261 43 235 186 275 319 64 182 419 -64 387 406 249 -133 -32 134 155 165 94 -19 -192
5060 -192 111 133 205 52 270 300 121 155 240 -23 91 -30 52 9 -129 163 -18 -84 -41 45 66 -597 104 271
5084 271 138 -135 143 60 -126 199 40 110 108 -175 -172 -142 82 -190 -47 -4 62 90 -239 132 -40 -394 -111
5107 -111 -53 -253 -216 -63 9 -48 -152 -191 56 -42 115 268 217 73 -239 -110 -66 100 -90 -125 -6 4 -101
5130 -101 -52 193 149 -31 -154 31 -167 34 -22 -255 105 -119 -179 115 -26 -307 18 120 90 -333 -222 259
5152 259 220 17 -379 -150 66 38 51 1 -165 -179 300 55 234 154 141 346 474 -241 17 -39 -72 210 84
5175 84 155 319 -159 -117 -109 316 -13 51 46 69 -118 67 235 209 7 -301 159 448 129 -42 107 133 103 111 157
5200 157 328 24 -147 86 333 122 -423 -211 219 112 -266 -221 -115 113 -159 -130 34 -209 -344 -160 88
$$ packed form
5037F8k12N57j52k18J92m9Q9M4k55J18K37m83M51J9j57l82J01J66K1J0p1j13j73
5060a92L03K2P2j53K18L0j79L4Q5k63J14j21Q2m3j38K92j81o6M3Q6K1o63P01J67
5084B71j33k73K78q3j86L25j59P0kk83LL0K24k72J43M3O6K8l29L71j72l54K83
5107a11N8k00L7J53P2n7j04l9K47r8J57J53n1j44l12J29M4J66j90l5J19J0j05
5130a01M9K45m4j80j23J85j98K01n6k33L60k24o0K94j41k81L25J02l0m23J11M81
5152B59l9k03l96K29K16k8J3n0j66j4M79k45J79q0j3K05J28p15K58n6l3K82j26
5175H4P1J64m78M2QM25l29O4nK3j87J85J68k6k02l08M60K89l19j71J49K6l0QM6
5200A57J71l04j71K33K47k11n45K12M30j07l78M5J06K28k72K9J64k43j35J84K48
$$ plain form
5221 88 -255 -258 -29 -109 -117 -47 -77 52 53 191 6 130 -171 -301 102 -290 140 -103 -16 -116 -109 -301 -153 -86 -139
5246 -139 -236 -150 -138 -1 -77 -162 -149 -69 -476 -295 -253 -176 -113 -13 2 7 -19 -553 196 31 102 -96 129 184 389
5271 389 -37 396 168 38 -39 89 311 -123 9 -61 132 37 -168 -197 217 127 -62 -137 181 -146 81 73 176
5294 176 -114 -270 -5 189 26 39 -105 100 351 89 140 211 312 44 -51 100 212 196 278 99 61 107 87
5317 87 -104 218 -111 -328 -69 13 -178 -239 -54 53 -103 -121 -8 -89 -183 -108 318 -210 -294 24 -264 -168 -202
5340 -202 -232 -114 55 -225 -25 51 17 -166 -311 -12 -159 -175 25 48 -55 -182 53 -110 -33 160 47 -326
5362 -326 -253 -146 -172 -27 -281 80 -115 -157 90 -240 -113 57 42 123 183 68 215 125 -8 52 22 -20 -30 -252
5386 -252 179 -199 -45 205 381 -73 -248 80 180 59 440 479 -79 63 255 68 -9 -195 408 227 -160
$$ packed form
5221H8l43lK29q0qP0l0J29JJ38j85J24l01j30M03l92M30k43Q7j00Pj92J48O7n3
5246a39r7Q6J2J37p6q5J3Q0m07J81M2P7O3J00J5Nk6n34P49j65P1j98K25N5K05
5271C89m26M33k28j30p7J28K22m34J32p0J93r5k05k9M14r0j89p5L18l27K27qJ03
5294A76k90j56K65J94j63J3j44K05K51k62N1P1J01k68r5J51J12j6Q2j79l8M6k0
5317H7j91L22l29k17K59Q2j91o1J85J07j56j8J13q1r4P5M26n28q4L18k88R6l4
5340b02l0J18J69k80K00P6l4j83j45K99j47j6K00K3j03j27K35j63P7J93j13l73
5362c26P3J07k6J45k54L61j95m2K47l30J27J70j5Q1O0j15J47r0j33O0l0m2j0k22
5386b52M31l78J54K50J76m54j75L28J00j21L81L9n58J42J92j87p7j86O03j81l87
$$ plain form
5407 -160 197 -182 252 -144 260 83 410 -23 333 -52 305 191 31 27 139 352 274 22 137 86 -209
5428 -209 78 113 294 469 428 103 52 305 -86 -102 162 -7 -162 -103 7 -146 -8 12 112 -287 -6 75
5450 75 11 110 -83 -116 156 -73 222 -157 172 -82 -46 124 62 -78 -292 -31 -135 340 -347 -140 -100 -526
5472 -526 -61 -312 158 111 25 -180 -85 -15 -73 215 -53 -329 200 212 -367 -57 -51 -220 -131 343 -242 -112 -133
5495 -133 7 -275 -225 -116 10 -89 -65 -255 -139 67 -169 -217 -97 -375 -92 -29 276 177 9 -29 206 43
5517 43 -144 -300 -2 43 53 -84 277 18 322 175 185 207 34 210 171 242 -153 -172 244 -27 -92 350 122
5540 122 -47 55 166 54 102 160 316 52 372 511 308 248 189 58 340 138 257 243 217 306 276 -35 -44
5563 -44 136 98 -58 22 191 25 -74 -3 126 -128 -38 -47 79 108 -61 -250 7 18 -297 27 275 -181 176
$$ packed form
5407a60L57l79M34l96M04j77L27m33L56l85L57j14j60mJ12K13p8k52J15n1k95
5428b09K87L5J81J75m1l25n1K53l91j6K64j69j55N9J10j53J38K0J00l99K81Q1
5450G5o4R9j93l3K72k29K95l79L29k54L6J70o2j40k14K61j04M75o87K07M0m26
5472e26M65k51M70m7q6k05R5P0n8K88k68k76N29J2n79L10Oj69Q9M74n85J30k1
5495a33J40k82N0J09J26r9K4j90J16K06k36m8J20k78K83O3L05r9j68l8K35j63
5517D3j87j56K98M5J0j37L61k59L04j47J0K2j73J76l9P1l95j9M16k71o5M42k28
5540A22j69J02J11j12M8N8J56k64L20J39k03o0n9j31K82k02J19j4k6Q9l0l11r
5563d4J80l8j56Q0J69j66r9P1J29k54R0rJ26K9j69j89K57J1l15L24K48m56L57
$$ plain form
5586 176 -122 108 -153 -329 41 -52 -99 -213 -167 -78 -266 -259 -158 73 -27 -139 173 -401 -367 -451 -357 -252 -122
5609 -122 -323 -169 45 -354 -230 59 -205 -174 -312 -169 126 -253 46 -180 -24 132 -498 190 -131 -216 -290
5630 -290 -238 -89 233 -63 -28 -120 63 163 -287 85 126 -36 181 -146 51 -114 40 -70 49 31 111 -228
5652 -228 37 12 94 221 215 -85 -29 57 126 -45 203 85 126 -227 84 141 -5 -46 -89 -71 209 255 203 265 123
5677 123 317 -56 134 56 -106 -125 69 186 8 -494 -74 48 -7 43 7 78 -226 29 154 216 -166 -105 332
5700 332 125 -62 173 -276 -73 121 -67 88 -47 -142 -194 204 305 86 -8 43 -83 11 -156 39 70 85
5722 85 -152 241 263 -166 -304 -212 129 124 -148 -98 -134 -155 -5 -88 27 32 -184 16 131 64 -153 -20 200 192 35
5747 35 -35 -101 -20 -347 192 8 9 -242 -136 6 -86 -29 -179 -40 97 -159 -125 -282 -498 -204 78 22 91 -249
$$ packed form
5586A76k98K30k61j76L70r3m7j14M6Q9j88PJ01K31j00j12L12n74L4q4R4J05J30
5609a22k01J54K14l99J24K89k64L1j38J43K95l79K99k26J56J56o30O88l21q5p4
5630b90N2J49L22k96L5r2J83J00m50L72M1j62K17l27J97j65J54j10J19j8Q0l39
5652b28K65k5Q2J27ol00N6Q6O9j71K48j18M1l53L11N7j46m1m3J8K80M6n2O2j42
5677A23J94l73J90p8j62j9J94J17j78n02M20J22n5N0l6P1l04K55J25O2l82O1M37
5700C32k07j87K35m49K03J94j88J55j35r5n2L98J01k19r4N1j26R4j67J95L1J5
5722H5k37L93K2m29j38R2L41nk72N0l6k1J50q3J15Nk16K00J15o7k17J33K20qj57
5747C5p0o6Q1l27N39j84Jk51J06J42r2N7j50J39J37k56L4j57k16K94K82n6O9l40
$$ plain form
5771 -249 -213 91 -149 64 108 21 -30 -179 -116 136 570 40 -110 187 116 -37 157 159 135 -240 -41 273 129
5794 129 104 -182 257 -85 -284 18 -48 -9 19 -55 269 61 -56 154 -127 44 -152 87 321 342 258 40
5816 40 357 199 111 -53 279 291 45 346 -27 -23 239 251 307 58 -255 -89 230 -168 -82 -47 -43 -193 -230 -388
5840 -388 -200 -138 -251 73 -157 207 72 12 223 -222 34 -11 -88 -85 -154 80 151 -33 -39 -1 326 -237 -211 156
$$ packed form
5771b49L6L04k40K13M4q7n1j49O3K52M34n30j50K97p1j53J94Kk4l75J99L14j44
5794A29k5k86M39l42j99L02o6L9K8p4L24k08j17K10k81J71j96K39K34K1q4k18
5816D0L17j58q8j64L32J2k46L01l73MK62J2N6k49l13J66L19l98Q6L5Mj50l7j58
5840c88J88O2j13L24k30L64j35o0K11m45K56m5p7Lo9K34P1j84oL8L27n63K6L67
$$ [...]
8191A53
##END NTUPLES=NMR FID
##END=
