##TITLE=1H_SA_26.117
 CDCl3, 8 sc, 
 28.5.2019
##JCAMPDX= 6.0         $$ Bruker NMR JCAMP-DX V2.0
##DATA TYPE= NMR FID
##DATA CLASS= NTUPLES
##ORIGIN= UXNMR, Bruker Analytische Messtechnik GmbH
##OWNER= root
$$ XWIN-NMR		Version 3.5
$$ Wed May 29 13:52:33 2019 Russian Standard Time (UT+4h)  she@DPX200
##.OBSERVE FREQUENCY= 200.13155
##.OBSERVE NUCLEUS= ^1H
##.DELAY= (6, 6)
##.ACQUISITION MODE= SIMULTANEOUS
##.ACQUISITION SCHEME= undefined
##.AVERAGES= 8
##.DIGITISER RES= 18
##SPECTROMETER/DATA SYSTEM= spect
##.PULSE SEQUENCE= zg30
##.SOLVENT NAME= CDCl3
##.SHIFT REFERENCE= (INTERNAL, CDCl3, 0, 15.7039)
##AUDIT TRAIL= $$ (NUMBER, WHEN, WHO, WHERE, WHAT)
$$ ##TITLE= Audit trail, XWIN-NMR		Version 3.5
$$ ##JCAMPDX= 5.01
$$ ##ORIGIN= Bruker BioSpin GmbH
$$ ##OWNER= she
$$ F:/spectra/data/she/nmr/H-F/1/audita.txt
$$ ##AUDIT TRAIL=  $$ (NUMBER, WHEN, WHO, WHERE, WHAT)
(   1,<2019-05-29 13:51:28.82 +0400>,<she>,<DPX200>,
      <created by zg, POWCHK disabled, PULCHK disabled
       configuration hash MD5:
       00 E9 B6 7A A2 85 ED C7 34 08 36 98 17 FE 4E 26
       data hash MD5: 16K
       7C F1 80 AC A1 40 79 67 F6 59 AB 6A 80 78 78 37>)
$$ ##END=
$$ 
$$ hash MD5
$$ E6 27 BD D4 3B 6B A5 4E 23 D5 9A 39 6A DD 43 99
##$RELAX= 
##$RELAX= 
##$RELAX= 
##$RELAX= 
##$RELAX= 
##$RELAX= 
$$ Bruker specific parameters
$$ --------------------------
##$DU= <F:/spectra>
##$EXPNO= 1
##$NAME= <H-F>
##$PROCNO= 1
##$TYPE= <nmr>
##$USER= <she>
##$AMP= (0..31)
100 100 100 100 100 100 100 100 100 100 100 100 100 100 100 100 100 100 
100 100 100 100 100 100 100 100 100 100 100 100 100 100 
##$AQSEQ= 0
##$AQ_mod= 1
##$AUNM= <au_zg>
##$AUTOPOS= <>
##$BF1= 200.13
##$BF2= 200.13
##$BF3= 200.13
##$BF4= 200.13
##$BF5= 200.13
##$BF6= 200.13
##$BF7= 200.13
##$BF8= 200.13
##$BYTORDA= 1
##$CFDGTYP= 0
##$CFRGTYP= 5
##$CHEMSTR= <none>
##$CNST= (0..31)
1 1 145 1 1 1 1 1 1 1 1 1 1 1 1 1 1 1 1 1 1 1 1 1 1 1 1 1 1 1 1 1 
##$CPDPRG= <>
##$CPDPRG1= <>
##$CPDPRG2= <>
##$CPDPRG3= <>
##$CPDPRG4= <mlev>
##$CPDPRG5= <mlev>
##$CPDPRG6= <mlev>
##$CPDPRG7= <mlev>
##$CPDPRG8= <mlev>
##$CPDPRGB= <>
##$CPDPRGT= <>
##$D= (0..31)
0 1.2 0 0 0 0 0 0 0 0 0 0.03 0 0 0 0 0 0 0 0 0 0 0 0 0 0 0 0 0 0 0 0 
##$DATE= 1559123488
##$DBL= (0..7)
120 120 120 120 120 120 120 120 
##$DBP= (0..7)
150 150 150 150 150 150 150 150 
##$DBP07= 0
##$DBPNAM0= <>
##$DBPNAM1= <>
##$DBPNAM2= <>
##$DBPNAM3= <>
##$DBPNAM4= <>
##$DBPNAM5= <>
##$DBPNAM6= <>
##$DBPNAM7= <>
##$DBPOAL= (0..7)
0.5 0.5 0.5 0.5 0.5 0.5 0.5 0.5 
##$DBPOFFS= (0..7)
0 0 0 0 0 0 0 0 
##$DE= 6
##$DECBNUC= <off>
##$DECIM= 24
##$DECNUC= <off>
##$DECSTAT= 4
##$DIGMOD= 1
##$DIGTYP= 9
##$DL= (0..7)
0 120 120 120 120 120 120 120 
##$DP= (0..7)
150 150 150 150 150 150 150 150 
##$DP07= 0
##$DPNAME0= <>
##$DPNAME1= <>
##$DPNAME2= <>
##$DPNAME3= <>
##$DPNAME4= <>
##$DPNAME5= <>
##$DPNAME6= <>
##$DPNAME7= <>
##$DPOAL= (0..7)
0.5 0.5 0.5 0.5 0.5 0.5 0.5 0.5 
##$DPOFFS= (0..7)
0 0 0 0 0 0 0 0 
##$DQDMODE= 0
##$DR= 18
##$DS= 0
##$DSLIST= <SSSSSSSSSSSSSSS>
##$DSPFIRM= 0
$$ [...]
##$SUBNAM2= <"">
##$SUBNAM3= <"">
##$SUBNAM4= <"">
##$SUBNAM5= <"">
##$SUBNAM6= <"">
##$SUBNAM7= <"">
##$SUBNAM8= <"">
##$SUBNAM9= <"">
##$SW= 24.9336996594482
##$SWIBOX= (0..15)
0 0 2 0 0 0 0 0 0 0 0 0 0 0 0 0 
##$SW_h= 4990.01996007984
##$TD= 16384
##$TD0= 1
##$TE= 0
##$TE2= 300
##$TE3= 300
##$TEG= 300
##$TL= (0..7)
0 120 120 120 120 120 120 120 
##$TP= (0..7)
150 150 150 150 150 150 150 150 
##$TP07= 0
##$TPNAME0= <>
##$TPNAME1= <>
##$TPNAME2= <>
##$TPNAME3= <>
##$TPNAME4= <>
##$TPNAME5= <>
##$TPNAME6= <>
##$TPNAME7= <>
##$TPOAL= (0..7)
0.5 0.5 0.5 0.5 0.5 0.5 0.5 0.5 
##$TPOFFS= (0..7)
0 0 0 0 0 0 0 0 
##$TUNHIN= 0
##$TUNHOUT= 0
##$TUNXOUT= 0
##$USERA1= <user>
##$USERA2= <user>
##$USERA3= <user>
##$USERA4= <user>
##$USERA5= <user>
##$V9= 5
##$VALIST= <valist>
##$VCLIST= <CCCCCCCCCCCCCCC>
##$VD= 0
##$VDLIST= <DDDDDDDDDDDDDDD>
##$VPLIST= <PPPPPPPPPPPPPPP>
##$VTLIST= <TTTTTTTTTTTTTTT>
##$WBST= 1024
##$WBSW= 4
##$XGAIN= (0..3)
0 0 0 0 
##$XL= 0
##$YL= 0
##$YMAX_a= 497030
##$YMIN_a= -606863
##$ZGOPTNS= <>
##$ZL1= 120
##$ZL2= 120
##$ZL3= 120
##$ZL4= 120
##$ABSF1= 10
##$ABSF2= 0
##$ABSG= 5
##$ABSL= 3
##$ALPHA= 0
##$AQORDER= 0
##$ASSFAC= 0
##$ASSFACI= 0
##$ASSFACX= 0
##$ASSWID= 0
##$AUNMP= <proc_1d>
##$AZFE= 0.1
##$AZFW= 0.1
##$BCFW= 1
##$BC_mod= 2
##$BYTORDP= 1
##$COROFFS= 0
##$CY= 11.3945322036743
##$DATMOD= 1
##$DC= 2
##$DFILT= <>
##$DTYPP= 0
##$F1P= 18.9103706918063
##$F2P= -1.10871071338519
##$FCOR= 0.5
##$FTSIZE= 0
##$FT_mod= 4
##$GAMMA= 1
##$GB= 0.15
##$INTBC= 1
##$INTSCL= 1
##$ISEN= 128
##$LB= 0.24
##$LEV0= 0
##$LPBIN= 0
##$MAXI= 10000
##$MC2= 0
##$MEAN= 0
##$ME_mod= 0
##$MI= 1.114404
##$NCOEF= 0
##$NC_proc= 0
##$NLEV= 6
##$NOISF1= 3.799351
##$NOISF2= 2.8
##$NSP= 1
##$NTH_PI= 0
##$NZP= 0
##$OFFSET= 15.70392
##$PC= 1
##$PHC0= -8500.058
##$PHC1= 18.60025
##$PH_mod= 1
##$PKNL= yes
##$PPARMOD= 0
##$PSCAL= 0
##$PSIGN= 0
##$REVERSE= no
##$SF= 200.130013532006
##$SI= 16384
##$SIGF1= 3
##$SIGF2= 2
##$SINO= 400
##$SIOLD= 16384
##$SREGLST= <1H.CDCl3>
##$SSB= 0
##$STSI= 0
##$STSR= 0
##$SW_p= 3612.71676300578
##$SYMM= 0
##$S_DEV= 0
##$TDeff= 0
##$TDoff= 0
##$TI= <>
##$TILT= no
##$TM1= 0
##$TM2= 0
##$TOPLEV= 0
##$USERP1= <user>
##$USERP2= <user>
##$USERP3= <user>
##$USERP4= <user>
##$USERP5= <user>
##$WDW= 1
##$XDIM= 8192
##$YMAX_p= 0
##$YMIN_p= 0
$$ End of Bruker specific parameters
$$ ---------------------------------
##NTUPLES= NMR FID
##VAR_NAME=  TIME,          FID/REAL,        FID/IMAG
##SYMBOL=    X,             R,               I
##VAR_TYPE=  INDEPENDENT,   DEPENDENT,       DEPENDENT
##VAR_FORM=  AFFN,          ASDF,            ASDF
##VAR_DIM=   8192,          8192,            8192
##UNITS=     SECONDS,       ARBITRARY UNITS, ARBITRARY UNITS
##FACTOR=    0.0002004,     1,               1
##FIRST=     0,             0,               0
##LAST=      1.6414764,     0,               0
##MIN=       0,             -606863,         0
##MAX=       1.6414764,     497030,          0
$$ Real data points
##PAGE= N=1
##DATA TABLE= (X++(R..R)), XYDATA
0@%%%%Qj6J6k4M0n4O2p2R6j20J44j68K00k48K96l44M04m77N54o39P38q50R72j106
28e88J256j424J607j805K026k272K539k831L152l505L895m319M783n298N866o494
44c412P192p974Q851r840J0968j2273J3799j5603J7786k0494K3945k8521L4923
57A9347m4585O1014r6091K92625l69152m15443R17076J32239p93726q4770Q11092
68D29626r5140p13228J60739O71175k75679n67632L00619M91243l51076l81016
78c30369L44561L00059l58126k14001L31535J62799l15505j17621K73048R7424
88A73804k41111p7479K04770O9462j91484o1747J89036O6715k04176p0629K24075
99H1236P7244k46931p0562K67828N2321k87846j4471L09653l2132l29168Q6406
$$ plain form
0 0 0 0 0 0 8 -8 8 -16 24 -30 32 -40 56 -64 80 -88 112 -136 160 -184 220 -257 297 -342 396 -454 518 -588
28 -588 668 -756 851 -954 1072 -1200 1339 -1492 1660 -1845 2050 -2269 2514 -2784 3082 -3412
44 -3412 3780 -4194 4657 -5183 5785 -6488 7311 -8292 9494 -11000 12945 -15576 19347
57 19347 -25238 35776 -60315 232310 -136842 -552285 364791 497030 -296696 -381466 429626
68 429626 334486 -378742 -218003 453172 177493 -390139 -89520 401723 50647 -330369
78 -330369 14192 314251 -43875 -257876 73659 236458 -79047 -196668 76380 173804
88 173804 -67307 -144786 59984 129446 -62038 -123785 65251 131966 -72210 -142839 81236
99 81236 158480 -88451 -159013 108815 161136 -126710 -141181 168472 136340 -192828 -106422
110a06422L43743j38466l44179J92618L27788k44426k92493K96859K42414l46777
120f9341j85606L87567J23925m12596o1298M16270n218m04187O9220L74970j33675
131A00031l42003J86797L03654k26701k64418K46290K19618k53890j72200K50273
141D7451J23887k43488q1334K35608M9023k25971k8599K13761K0160j97452j5742
152a02696J83901J4175j73676j0361J73671P977j80883m028J95351L00k07656
163a03925P750K17381k1587k22281M6139K23724p7948k24443J13900K20526j50419
174B8817k12798J81908J97094k10032j71815K34017J34816k56431r4256K74246
184A05566N1666k85646j0442K86199k8761k76507O7017K56358j03058k30232J35641
$$ plain form
110 -106422 237321 98855 -245324 -52706 275082 30656 -261837 35022 277436 -69341
120 -69341 -254947 132620 256545 -156051 -217349 198921 193703 -210484 -141264 233706 100031
131 100031 -241972 -55175 248479 21778 -242640 3650 223268 -30622 -202822 47451
141 47451 171338 -72150 -153484 82124 131147 -94824 -123423 90338 110498 -86954 -102696
152 -102696 81205 95380 -78296 -88657 85014 92991 -87892 -91920 103431 103731 -103925
163 -103925 -96175 121206 99619 -122662 -76523 147201 69253 -155190 -41290 179236 28817
174 28817 -183981 -2073 195021 -15011 -186826 47191 182007 -74424 -168680 105566
184 105566 157232 -128414 -138856 147343 118582 -157925 -90908 165450 62392 -167840 -32199
195c2199K02714j62046j74646J80716J47150j89227j18801J91561R0661j88668
205e2785o2652J84822L8663j79696j9272J74976P409j67959J571J59938q104j51029
217g4118J5319J45931k4179j44220L4542J46021m5080j49404N6214J51155o8926
228D3255j49798Q3941J43652j02110j35261J21457J23262j41904j09581J58756
238C5669R2462j72451p1804J81909M6379j88936j9582J92883r904j93220L7419
249f9176J89291o3281j80189Q6071J64776j05725j46883J23914J26007j37820
259a3015j04924J47610Q4297j53901o5581J57222M6975j55916k9645J54518J2304
270G9944j51592L064J48817j5689j44972K7020J41363l6227j36614M5741J31183
$$ plain form
195 -32199 170515 8469 -166177 14539 161689 -27538 -146339 45222 135883 -52785
205 -52785 -115437 69385 108048 -71648 -90920 84056 91465 -76494 -74923 85015 76911 -74118
217 -74118 -58799 87132 62953 -81267 -46725 99296 54216 -95188 -38974 112181 43255
228 43255 -106543 -22602 121050 18940 -116321 5136 128398 -13506 -123087 35669
238 35669 128131 -44320 -116124 65785 112164 -76772 -96354 96529 86625 -106595 -69176
249 -69176 120115 56834 -123355 -37284 127492 21767 -125116 -1202 124805 -13015
259 -13015 -117939 29671 113968 -39933 -105514 51708 98683 -57233 -86878 67640 79944
270 79944 -71648 -68584 80233 64544 -80428 -53408 87955 51728 -84886 -39145 92038
281I2038n4415j26140O4517J22602p4506j18972Q5961J14326r7294j07798J09066
292I385R8867j20114q7032J30723P3659j41197n8379J49003M1369j53850k4745
303h2311J56793O161j56674J1555J53807l1173j49065M9437J41155o5977j32048
314i8340Q1278J18923r4682j05038J04978Q9633j13469p3646J19313N8590j22773
325c5233m4206J25049K9669j25361j5235J24919K679j23098R989J21500k2867
336D7805j17704L5147J13984m6517j08741N8059J02288o8361r5521P7427Q8737
347H6603q6610q0697R5685P1561j03663o2630J11116N0830j17880l8272J22854
358D8897K4990j25864j2064J26997k371j26929J5764J24819k9153j21046M1712
$$ plain form
281 92038 37623 -88517 -24000 98602 24096 -94876 -8915 105411 8117 -99681 9385
292 9385 108252 -11862 -98894 31829 105488 -35709 -94088 54915 96284 -57566 -82311
303 -82311 74482 80643 -76031 -64476 89331 58158 -90907 -41470 99685 33708 -98340
314 -98340 -17062 101861 7179 -97859 7119 96752 -16717 -90363 28950 87540 -35233
325 -35233 -79439 45610 75279 -50082 -65317 59602 62281 -60817 -50828 70672 47805
336 47805 -69899 -34752 79232 32715 -76026 -17967 84321 15960 -79561 -2134 86603
347 86603 -7 -80704 14981 86542 -17121 -79751 31365 82195 -35685 -73957 48897
358 48897 73887 -51977 -64041 62956 60585 -66344 -50580 74239 45086 -75960 -34248
369c4248J16120n3790j10478O5352J02928p5786r3929Q5229Q4307r3441p2803
380h0539R9593O1178j04461m9039J07905L7178j08956k5529J10221J4347j10826
391d8928l245J10600q528j08698J9784J06777l1616j02775M2586R6450n2533r0507
403g0633O2280Q3324p1636p5081P9311O5837q6541n6764R2962M6298r8471l5083
415f4197J02665K3090j06101j1157J07469j439j07104J4031J05211k5162j02314
426f5008L6527R7078m6496r1703N6088Q5521o3890p8591P1606P1213p8749o2790
438f9194Q4832N3751q9393m4337R4034L4475r6929k4617R8287J5108r8419n970
450d8372R8685l527r7780J2686R6479k2931r4029L2789R0469m2110q6017N0991
$$ plain form
369 -34248 81872 28082 -82396 -17044 85884 10098 -83831 1398 85705 -7736 -80539
380 -80539 19054 80232 -24229 -73268 34637 71815 -37141 -62670 47551 61898 -48928
391 -48928 -52173 58427 49899 -58799 -39015 67762 36146 -66629 -24043 72407 19874 -70633
403 -70633 -8353 74971 3335 -71746 7565 73402 -13139 -69903 23059 69357 -29114 -64197
415 -64197 38468 61558 -44543 -55700 51769 50330 -56774 -42743 62468 37306 -65008
426 -65008 -28481 68597 22101 -69602 -13514 72007 8117 -70474 1132 72345 -6404 -69194
438 -69194 15638 69389 -20004 -64341 29693 64168 -32761 -57378 40909 56017 -42402 -48372
450 -48372 50313 46786 -50994 -38308 58171 35240 -58789 -26000 64469 22359 -63658 -12667
462a2667Q0334o0247p3206O7670O4624p4929n5621Q0869M6283q5960l6862Q8926
474B9214K6824r1756j5698R2738M554r2902O811R1730j7354q9742K7616Q6534
486E8569l7308q0740M5731P4991n3644o8110O1231O1562o7246n4568P3419M7564
498F1451p7591l9499Q0981L1744q4006k2318Q7067J3000q8773l861Q9544m451
510D3288q9250J2427Q7994k0454q5964K9305Q1865l7999p9123M6292P4998n4507
522H872p0634O0951O3981o7301n6701P1718M7615p6774l8437Q0544K9331q3816
534c0651k0713Q5269J2394q4900l517Q3618n336q0567J5916P8222k4880p4229
546d9374L4181P1441m0639o4076M6077N8215n0254m9340N6283M2241o1107l3738
$$ plain form
462 -12667 67667 7420 -65786 1884 66508 -8421 -64042 16827 63110 -22850 -59712 29214
474 29214 56038 -35718 -51416 41322 45876 -47026 -40215 51515 34161 -55581 -27965 58569
486 58569 21261 -59479 -13748 61243 7599 -60511 720 62282 -4964 -59532 13887 61451
498 61451 -16140 -55639 25342 57086 -26920 -49238 37829 50829 -37944 -41805 47739 43288
510 43288 -45962 -33535 54459 34005 -51959 -22654 59211 21212 -57911 -11619 63379 8872
522 8872 -61762 -811 63170 -4131 -60832 10886 58501 -18273 -56710 23834 53165 -30651
534 -30651 -51364 33905 46299 -38601 -42118 41500 36164 -44403 -28487 49735 24855 -49374
546 -49374 -15193 56248 15609 -48467 -2390 55825 5571 -43769 12514 54755 -6352 -40090
558d0090O5687K7775o7994k1932O9823J4250o9516o086O9295l546o9942J1896
570b0380O9224k1073o9803K6785O7190l4066o4314L9425N7576m7454n3394N4624
582D340M7562o3131m3613O8328L7708p2939l1268P4915K2513p6689j2127P9686
594C5285K766q1447P102Q3182j3094q1767K0757P9257k5922p3483L5605O9360
606E7601m3082o3893N2315O1344n7163n6175O1963N1288o3631m2658O4964L3936
618E6809o8252k4668P1582J7577p4702j3282P4454P566p3980k742O9444n968o8182
631c4344J3918O5209k3997o5447K9427O2660l4495o0395L6656N3551m1379m6677
643d5313M5856L9357n2805l3387N8729K9333o2646k4022O3468J8239o2409q725
$$ plain form
558 -40090 25597 53372 -14622 -36554 33269 47519 -21997 -28083 41212 37666 -32276 -20380
570 -20380 48844 27771 -42032 -15247 51943 17877 -46437 -7012 50564 3110 -50284 4340
582 4340 51902 -11229 -54842 13486 51194 -21745 -53013 21902 44415 -32274 -44401 35285
594 35285 38051 -43396 -36294 46888 33794 -47973 -27216 52041 26119 -47364 -11759 57601
606 57601 14519 -49374 2941 64285 7122 -49053 12910 64198 567 -42091 22873 56809
618 56809 -11443 -36111 35471 53048 -21654 -34936 39518 47084 -26896 -29638 39806 33838 -34344
631 -34344 -20426 44783 20786 -44661 -15234 47426 12931 -47464 -10808 42743 1364 -45313
643 -45313 543 39900 -12905 -46292 12437 41770 -20876 -44898 18570 36809 -25600 -34325
655c4325O2334j089o1093J1906O2582j8520o2265K4741O0198k7827n4411L3414
667d355M8022l9912m0581M7994L5583n4518l1698N8925K7059o0012k0845N8629
679B4291J1535n8204j918N8043p223n9883J2453O0951j7262n9565J9583N5389
691C8190k4827n0289L0973M4575l8121m2296M5256L9674m8641l8239N0431L3738
703D0424n0112k8013N2279J9962n5428j3384O0896Q455o4491n433O6588J616o5409
716c2050L785O3231j1998o0920K1142O0256k9944o0210L5914N9250l9996n6162
728d7702M2872N0075m7304m3129N3845L4672o0758k8976O6287K3274o9059j7609
740d3512O7575J0297o4530j786O1703q269o0298J6405N9368k2371n7613K5426
$$ plain form
655 -34325 28009 26920 -34173 -22267 40315 21795 -40470 -15729 44469 16642 -37769 -4355
667 -4355 43667 3755 -36826 11168 46751 -7767 -39465 19460 46519 -13493 -34338 24291
679 24291 35826 -22378 -24296 33747 26524 -33359 -20906 40045 22783 -36782 -17199 38190
691 38190 13363 -36926 -5953 38622 501 -41795 3461 43135 -5506 -43745 6686 40424
703 40424 -9688 -37701 14578 34540 -20888 -34272 26624 35079 -29412 -34845 31743 33359 -32050
716 -32050 -28265 34966 22968 -37952 -16810 43446 13502 -46708 -10794 48456 8460 -47702
728 -47702 -4830 45245 -2059 -45188 8657 43329 -17429 -46405 19882 43156 -25903 -43512
740 -43512 24063 34360 -30170 -31956 29747 21478 -38820 -22415 36953 14582 -43031 -17605
752a7605N3113k7335m6920L0546L9123l4929l2079L8882K7723m2384k4382M2676
764F429K2418m0388j8756L8122J4078l7519q024L9274L088m1456Q2M4793k634
777A9507m4271N184M3361r324m0708J6205L9028k3827l7265L0796L6864l5936
789c86l5359L9890L1493m3388k4448M7370J6283n2268q189N7330K42o0369O229
802b5570N9374j2536n7134J9936N1998k8374m7728L5575M3548m2625l9946M5841
814B359L5592m7997k9617M7776K2667m8479j5406M9455R392n0431m717N0372K928
827B3894m8854n61M6529r05m3205M759M2520p668m1684J1249M3915j2472m4356
840b6839J4916M5182j6770m2828K0987M1136k5834l8258L1522L7080l7317l5104
$$ plain form
752 -17605 35508 8173 -38747 -8201 30922 -4007 -36086 2796 30519 -11865 -36247 6429
764 6429 28847 -11541 -30297 7825 21903 -15616 -23640 15634 18722 -22734 -22652 22141 19507
777 19507 -24764 -19580 23781 14457 -26251 -10046 28982 5155 -32110 -1314 35550 -386
789 -386 -35745 4145 35638 -7750 -32198 15172 31455 -20813 -29002 28328 28570 -31799 -25570
802 -25570 33804 21268 -35866 -15930 36068 7694 -40034 -4459 39089 -3536 -43482 2359
814 2359 37951 -10046 -39663 8113 30780 -17699 -33105 16350 25742 -24689 -29406 20966 23894
827 23894 -24960 -25521 21008 20103 -23102 -18343 24177 16509 -25175 -13926 29989 17517 -26839
840 -26839 -11923 33259 16489 -26339 -5352 35784 9950 -28308 3214 40294 2977 -32127
852c2127M2063L1294m5025k6798M7759J9114n0943j1442N2644K217n4757M860
864b1141N3302j1850n1904J7808M6378k4749m1308L0553L4998l6687k9796M0008
876E612K3913m1991j8596M1699J2391m0977o162M0236O39l8675M238L7757p184
889A2900l5387R811L3715j1048l0502J3077K9395j4879k7468J6900K7982j8567
901E929k7725K0840K8474k3444k7521K5830K6270k9268k3999L2991K1031l7880
913h472j8431M1509J4687m5039j0689M6822M423m9134J873M9042r449m9140J5782
926a6216M7782k3069m5225K8514M0846l4154l5292L8180K8683m1335k1993M3626
938A0347J6007m4458r779M4010N045m2219L3M0646m795l7886R276L5983j2270
$$ plain form
852 -32127 9936 41230 -3795 -30593 17166 36280 -14663 -26105 26539 28756 -26001 -21141
864 -21141 32161 20311 -31593 -13785 32593 7844 -33464 -2911 32087 -4600 -34396 5612
876 5612 29525 -12466 -31062 10637 23028 -17949 -24111 16125 16764 -21911 -17673 20084 12900
889 12900 -22487 -12676 21039 9991 -20511 -7434 21961 7082 -20386 -3486 24496 5929
901 5929 -21796 -956 27518 4074 -23447 2383 28653 -615 -24614 8377 29408 -8472
913 -8472 -26903 14606 29293 -15746 -26435 20387 24810 -24324 -22451 26591 17142 -31998 -16216
926 -16216 31566 8497 -36728 -8214 32632 -1522 -36814 1366 30049 -11286 -33279 10347
938 10347 26354 -18104 -27883 16127 21172 -21047 -21014 19632 14837 -23049 -13773 22210 9940
951I940l2086J3922L0390j5413k7619J7264K5424j7860k3992J9131K3058k0224
963A935k2319K2010K1707k4005k1400K6634J9251k9290j7615L1829J4966l5210
975a1507j1645L7647P216l9759l368M0899j726m1891O577M1952j2761m1012J8753
988a0625L8785k4478l5669K9169L1637l3537k6380L6980K0672l8754j4902M0156
1000A3054R150l9568l680L9208j137l7249N497L6030r466l3161J2499L1267j5430
1013G014k7726J7886K4612j9171k1850J9967J9617k0892j7788K1903J5841k2699
1025c286j4773K3988J2809k5289j1797K7029R489k9041p319L0381M277l2021j336
1038a6889L3127k729l3173N964L3125r787l3091J4080L2104j8306l0435K2858
$$ plain form
951 9940 -22146 -8224 22166 6753 -20866 -3602 21822 3962 -20030 -899 22159 1935
963 1935 -20384 1626 23333 -672 -22072 4562 23813 -5477 -23092 8737 23703 -11507
975 -11507 -23152 14495 21711 -18048 -21416 19483 17757 -24134 -17557 24395 11634 -29378 -10625
988 -10625 28160 3682 -31987 -2818 28819 -4718 -31098 5882 26554 -12200 -27102 13054
1000 13054 22204 -17364 -21044 18164 17027 -20222 -14725 21305 11839 -21322 -8823 22444 7014
1013 7014 -20712 -2826 21786 2615 -19235 732 20349 -543 -18331 3572 19413 -3286
1025 -3286 -18059 5929 18738 -6551 -18348 8681 18170 -10871 -18190 12191 16468 -15553 -16889
1038 -16889 16238 13509 -19664 -13700 19425 9638 -23453 -9373 22731 4425 -26010 -3152
1050c152K8024k6568k5149L0454K1654l3274j6739L5117J3063l6763p373L6612
1062A5906L428l6269J192L5435m999l3898Q879L2439j2951k9729J5275K7561j7869
1075D400k5037J9887K1811k1305j9715K2748J6358k3503j4029K3708J1649k4396
1087g424j0042K4747P715k5273o037K5806L522k6687m81K6949k072k6975M867
1100a1385K6982p778k5991J0935K5138j3146k4386J6825K3292j9638k0631K2385
1112B602J8718k4795j5633K7400J2148k9057p996K9948M660l1243m3L0973l530
1125A4152l0382O451K8851j0043k8009J2910K6332j6398k4378J8590K1922k1501
1137a503j9737K2895J6334k4439j3295K5167J0511k6321p888K6815N172k6597
$$ plain form
1050 -3152 24872 -1696 -26845 3609 25263 -8011 -24750 10367 23430 -13333 -20706 15906
1062 15906 19334 -16935 -15743 19692 14693 -19205 -10326 22113 9162 -20567 -5292 22269 4400
1075 4400 -20637 -750 21061 -244 -19959 2789 19147 -4356 -18385 5323 16972 -7424
1087 -7424 -17466 7281 14996 -10277 -16314 9492 13014 -13673 -14154 12795 10723 -16252 -11385
1100 -11385 15597 7819 -18172 -7237 17901 4755 -19631 -2806 20486 848 -19783 2602
1112 2602 21320 -3475 -19108 8292 20440 -8617 -16613 13335 17995 -13248 -13291 17682 14152
1125 14152 -16230 -9779 19072 9029 -18980 -6070 20262 3864 -20514 -1924 19998 -1503
1137 -1503 -21240 1655 17989 -6450 -19745 5422 15933 -10388 -18276 8539 13711 -12886
1149a2886l380K6781J371k6674J773K6477m220k5683P524K5308r826k3573J1746
1162e262K3576j3692k1803J6074K0100j7483j8168J9840J6479k1490j4769K3869
1174G271J2406k4871j0435K6067O918k6347l943K6495O10k7426K541K7176n975
1187A0487k6835P910K5485j0747k3885J2963K1444j6101j9613J8604J7913k1239
1199c614j5638K2277J3429k3174j0109K3093O930k3660l305K4193M80k3934J881
1212a1151K4373m361k2670N998K1358p936j9747J1107J8187j3607j6333J5517
1224G35J5523j6444j4217J7048J1984j7572r546J9410O100k0050m670K2378K405
1237A3084k2783j081K2860r96k2249L638K1510p198k0909J0785K0329j3033k0612
$$ plain form
1149 -12886 -16266 10515 11886 -14788 -13015 13462 9242 -16441 -8917 16391 6565 -17008 -5262
1162 -5262 18314 4622 -17181 -1107 18993 1510 -16658 3182 19661 -1829 -16598 7271
1174 7271 19677 -5194 -15629 10438 17356 -8991 -12934 13561 14171 -13255 -10714 16462 10487
1187 10487 -16348 -8438 17047 6300 -17585 -4622 16822 721 -18892 -288 17625 -3614
1199 -3614 -19252 3025 16454 -6720 -16829 6264 13194 -10466 -13771 10422 10902 -13032 -11151
1212 -11151 13222 8861 -13809 -7811 13547 5611 -14136 -3029 15158 1551 -14782 735
1224 735 16258 -186 -14403 2645 14629 -2943 -12489 6921 13021 -7029 -11699 10679 13084
1237 13084 -9699 -10780 12080 11084 -11165 -7527 13983 6785 -14124 -3339 16990 3957 -16655
1250a6655J4945K0042j6742j7784J7990J5344k0241j2828K2781J0203k5528q534
1262a7007K7094O821k7886m774K7716P26k6829K840K6147o692k5891R189K5838
1275A7292j1078k5639J2689K2973j3608k0890J5685J8099j8086j6020K0473J4595
1287A6485k1544j3775K1562J2127k0827r193K0031O578k0200l545K1367J636k2440
1300a1738l52K2758n72k1213J035J9764l466j8195O876J6871r392j7383J1887
1313c120J6607j2678j5733J2993J3221j3331j0437J4903P217j7262m718J9079
1325F741L251k0326j575J9951l36j8506L861J7461q303j6055J2446J5298j3945
1338c7j5000J5891J3516j5781j0786J6708P844j8193m458K0518K317k2663o9K2116
$$ plain form
1250 -16655 -1710 18332 1590 -16194 1796 17140 -3101 -15929 6852 17055 -8473 -17007
1262 -17007 10087 16908 -10978 -15752 11964 12690 -14139 -11299 14848 8156 -17735 -8546 17292
1275 17292 6214 -19425 -6736 16237 2629 -18261 -2576 15523 -2563 -18583 1890 16485
1287 16485 -5059 -18834 2728 14855 -5972 -15165 4866 11444 -8756 -12301 9066 10702 -11738
1300 -11738 -12090 10668 10096 -11117 -10082 9682 6216 -11979 -5103 11768 2376 -15007 -3120
1313 -3120 13487 809 -14924 -1931 11290 -2041 -12478 2425 9642 -7620 -12338 6741
1325 6741 9992 -10334 -11909 8042 7706 -10800 -6939 10522 2219 -13836 -1390 13908 -37
1338 -37 -15037 854 14370 -1411 -12197 4511 12355 -5838 -10296 10222 12539 -10124 -10193 11923
1352A1923n59k1272J976J9702n321j8013Q158J6827j0621j7735J1728J7875j2293
1365B375j8170J1800J6866j3387j4720J4429J2067j7202j1199J9403J0564k0357
1377g531j1132K1363R979k0448p850K0425N247k1645j427K3540j37k4838K172
1390a2282K6198l051k4678O363K2218q331j9788J2841J8659j5539j6640J7068
1402C038J6295j7383j4192J7005J1075j7156o872J7613L324j9119j136J9694j031
1415A1155j8823Q98J6515k820j4749M446J1567o721j1524Q311J0797r031j2004
1428a1983Q867J0382q813r366Q953P008j0376n027J2057M425j3780l823J4744
1441C268L675j4210k359J4420N82j3991L050J5168n402j5902P894J7384r252j6014
$$ plain form
1352 11923 11364 -9908 -7932 11770 6449 -11564 -3406 13421 2800 -14935 -3207 14668 2375
1365 2375 -15795 -3995 12871 -516 -15236 -807 11260 -5942 -17141 2262 12826 -7531
1377 -7531 -18663 2700 12679 -7769 -15619 4806 10053 -11592 -13019 10521 10384 -14454 -12282
1390 -12282 13916 10865 -13813 -7450 14768 6437 -13351 -510 18149 2610 -14030 3038
1402 3038 19333 1950 -12242 4763 15838 -1318 -8190 9423 12747 -6372 -7508 12186 11155
1415 11155 -7668 -6770 9745 6925 -7824 -3378 8189 1468 -10056 -1745 9052 21 -11983
1428 -11983 -3116 7266 -1547 -10913 -1960 5048 -5328 -10355 1702 6127 -7653 -11476 3268
1441 3268 6943 -7267 -9626 4794 5376 -8615 -5565 9603 4201 -11701 -3807 13577 4325 -11689
1455a1689J0991J4783j2733j1773J5478R541j7907p266J9838N729k1256l873K0760
1468A0623J975k0309Q78J9326m778j8938P232J8957j0074j8539J0886J6431j1275
1481B395j4982J1963J1791j3246r940J4114R266j5499q756J5367Q086j4844p483
1494a1768J4976N453j4413m053J5392K638j5892j387J6804J378j7250n47J7624
1507H955r43j6642L020J6396m867j7094Q440J6790r750j6470J1578J4781j2800
1520A394j2717J3879J0465j6052p723J7345N543j8472l450J8123J252j8349J280
1533g482J6382l481j5671N667J4528q221j3360R636J1815j1014j0228J1566P274
1546G411j1113o126J1541M788j2085l402J2836J969j2317j481J2417O34j2059
$$ plain form
1455 -11689 -698 14085 1352 -10421 5057 14598 -3309 -10575 9263 14992 -6264 -10137 10623
1468 10623 12598 -7711 -6833 12493 7715 -11223 -3991 14966 4892 -13647 -2761 13670 2395
1481 2395 -12587 -624 11167 -2079 -12019 2095 11361 -4138 -12894 2473 10559 -4285 -11768
1494 -11768 3208 8661 -5752 -9805 5587 8225 -7667 -9054 7750 9128 -8122 -8669 8955
1507 8955 8012 -8630 -5610 10786 5919 -11175 -2735 14055 4305 -12165 -587 14194 1394
1520 1394 -11323 2556 13021 -3031 -10754 6591 12134 -6338 -9788 8335 9587 -8762 -7482
1533 -7482 8900 5419 -10252 -4585 9943 1722 -11638 -2002 9813 -1201 -11429 137 7411
1546 7411 -3702 -9828 1713 6501 -5584 -8986 3850 5819 -6498 -7979 4438 5072 -6987
1559f987R83J2003k192j1852L575J2090m299j1939N086J2303n949j1896P345J1625
1573I896q971j0918J0933J0678j2689r725J4066Q529j5335p122J6326M831j6875
1586f376k970J7556L05j8361J623J8299l898j8028N920J6632p636j5656R515J3774
1600A0699j0918j3163J3070J1165j3830r457J4123P593j4281n401J4185L758j3907
1613f364k375J4509N80j3327L44J3070j095j2525K782J1935k966j2011M424J1398
1627H379m952j1068O056J0652o994r691P794R498q886q766R611P636j0864o764
1641h359J2229M989j3235l807J4016K265j4587q48J4667j356j4899L045J4628
1654H748n668j3237O666J2921q703j1624J0098J0369j1448r200J2880P311j3656
$$ plain form
1559 -6987 -6004 5999 3807 -8045 -4470 7620 3321 -8618 -3532 8771 2822 -9074 -1729 9896
1573 9896 925 -9993 940 11618 -1071 -10796 3270 11799 -3536 -10658 5668 10499 -6376
1586 -6376 -9346 8210 8515 -9846 -8223 10076 6178 -11850 -5930 10702 3066 -12590 -3075 10699
1600 10699 -219 -13382 -312 10853 -2977 -12434 1689 9282 -4999 -10400 3785 7543 -6364
1613 -6364 -8739 5770 6350 -6977 -6633 6437 5342 -7183 -4401 7534 4568 -7443 -3019 8379
1627 8379 3427 -7641 -1585 9067 2073 -7618 176 9674 788 -7978 1633 9269 -1595 -8359
1641 -8359 3870 8859 -4376 -8183 5833 8098 -6489 -7337 7330 5974 -8925 -5880 8748
1654 8748 3080 -10157 -3491 9430 727 -10897 -799 9570 -1878 -11078 1802 9113 -4543
1667d543n612J4263L555j3940k086J4236J64j3659J585J3006k543j2166L273J2456
1681G989m851j1030N514J0523o327r852P264R279q014q442Q678P622r343o662
1695g652R767N727j0371m830J0310M304j1507k771J1601J956j2410o97J2380o00
1709E207j2739K140J2746l943j2255N054J2048o885j1059Q205R690r064r069J0709
1723G85P907j1620o462J2287N209j3032l142J3476J319j3193K66J3099j900j2211
1737g212L134J1923m277j0559N314R954n902r328O782Q775p859p630Q501O792
1751H408q879n846R433M644r903l494R794K670r496k295J0127J049j0246p22J0536
1766E780r66j0563J989J0603l400j0394M035J0339o271r196O795Q655p751p792
$$ plain form
1667 -4543 -10155 4108 7663 -6277 -8363 5873 6037 -7622 -6037 6969 4426 -7740 -4467 7989
1681 7989 3138 -7892 -2378 8145 1818 -8034 -770 8509 495 -7947 731 8353 -990 -7652
1695 -7652 2115 7842 -2529 -7359 2951 7255 -4252 -7023 4578 6534 -5876 -6573 5807 5207
1709 5207 -7532 -5392 7354 3411 -8844 -3790 8258 1373 -9686 -1481 8209 -855 -9924 785
1723 785 8692 -2928 -9390 2897 8106 -4926 -8068 5408 6727 -6466 -6200 6899 4999 -7212
1737 -7212 -4078 7845 3568 -6991 -1677 8277 2375 -6953 -171 8604 745 -6885 1616 8408
1751 8408 -471 -6317 3116 7760 -2143 -5637 4157 6827 -2669 -4964 5163 6212 -4034 -4756 5780
1766 5780 4814 -5749 -3760 6843 3443 -6951 -2916 7423 1152 -8044 -1249 7406 -345 -8137
1780h137Q612O657r316n798J0229M562j0910l337J1855J971j1731l37J2115j279
1794E156j1833L003J1704m643j0740N942J0645o828r591P564Q661q363p581R551
1808B647O386j0111n004J0060N211j1608l559J1285J926j0990j606J1173l86j0918
1822e494J086J0563j880j1073K697J0132l035j0305L912R389n105r116O296Q387
1836F454p140q238Q200O987q026o407Q721N251q857m520J0065L476j0416k181
1850f631J0766J805j0650q47J0987p08j0079K233R667l921q893N402Q374o114
1864A391p806P002O484o620n820P247L974q175k881Q739J637r020j385R294K54
1879D315q949Q24Q424k659p996L915P649n251p144N336P179n520o443O214N450
$$ plain form
1780 -8137 475 7132 -2184 -7982 2247 6809 -4101 -7438 4417 6388 -5343 -5680 6435 5156
1794 5156 -6677 -3674 8030 3387 -7353 -1411 9234 2406 -7185 379 9040 677 -6904 2647
1808 2647 9033 -1078 -6082 3978 9189 -2419 -5978 5307 7233 -3757 -5363 5810 5424 -5494
1822 -5494 -4408 6155 4275 -6798 -4101 6031 2996 -7309 -3397 5992 887 -8229 -1933 6454
1836 6454 -686 -8924 -724 6263 -1763 -8170 551 5802 -3055 -7575 2490 5966 -4450 -6631
1850 -6631 4135 5940 -4710 -5557 5430 4722 -5357 -3124 6543 2622 -6271 -869 7505 1391
1864 1391 -6415 587 7071 451 -5369 1878 5852 -2323 -5204 3535 5172 -3848 -5233 4061 4315
1879 4315 -4634 -3810 4614 1955 -6041 -2126 5523 272 -6872 -1536 5643 123 -6320 -106 5344
1894E344o471m694P855L500q717k382R164K585r456j805R113J087r242K81R376
1909E538j720j0051L217J0048l722j0478L814J0364m691r529N782Q435p198p912
1923h103Q046P344r872o970J0095O498j0242n558J0215M252j0851k143J0714J086
1937D511j1442m68J2312p27j1307J413J0590j888r509L861Q829n141q344O656
1951f54P737n614p703O221O953o005n136O224M039o820l152P782K699q105k507
1966d041P690K392p529j099O109l14o240J395O404k703o595K434O725l000o354
1981d726L233M720m195l957N548K591o003l063P170K125p056j726O850P06o326
1996d109Q74O182k372o604M077P309m908p068N446O409n464m800O494L392p380
$$ plain form
1894 5344 -1127 -5821 2034 5534 -3183 -5565 3599 6184 -3272 -5077 4036 5123 -4119 -3838 5538
1909 5538 3818 -6233 -3016 7032 3310 -7168 -3354 7010 2319 -7210 -1428 7007 -191 -8103
1923 -8103 -57 7287 -2585 -9555 540 7038 -3204 -8762 1453 5705 -5146 -7289 3425 4511
1937 4511 -6931 -7399 4913 4186 -7121 -5708 4882 2994 -6515 -2654 6175 1034 -7310 -654
1951 -654 7083 1469 -6234 -13 6940 935 -4201 2023 6062 -758 -3910 3872 6571 -1534 -4041
1966 -4041 3649 6041 -1488 -2587 3522 3208 -3032 -1637 4767 2064 -4531 -2097 4628 1628 -4726
1981 -4726 -1493 3227 -968 -4925 623 3214 -2789 -5852 1318 3443 -3613 -5339 1511 2217 -4109
1996 -4109 -3235 2947 575 -6029 -1952 5357 449 -6619 -1173 5236 -228 -5028 1466 4858 -2522
2011b522k487Q975K341r253k125R071J856q452p20Q484q02p910J601R304l279
2026D082r163L087R091l336q781L418P850m107p003N497O402o551p087P567O665
2041G631p338p224P368N909p236n060P850L324q380k923R798J946r880k095R943
2056C633J134r107l03Q221p79q347K707Q432l731q411M111Q008m251o920M480
2071a123N364m874l818N859K693o460k240O895K004o382j885N611P19m746M44
2086a939M756j711n150K834N310l096n370L302L962k908l160L488K035m416j665
2101c728M895J731n891j535O203Q66n415o25N615r85n590K116O160k870o951L537
2117b467O700l225o467L986N574m929m645O060M491p098m065P748M273q349l491
$$ plain form
2011 -2522 -5009 3966 6307 -2946 -5071 4000 5856 -2596 -3316 5168 4366 -3544 -1943 7361 4082
2026 4082 -5081 -1994 7097 3761 -5020 -1602 6248 2141 -4862 635 7037 486 -6601 966 7631
2041 7631 293 -6931 437 6346 -890 -5950 1900 5224 -3156 -6079 3719 5665 -4215 -6310 3633
2056 3633 4767 -4340 -4643 3578 2799 -5548 -2841 5591 1860 -6551 -2440 5568 1317 -5603 -1123
2071 -1123 4241 -633 -4451 1408 4101 -2359 -4599 2296 4300 -2082 -3967 1644 2363 -2383 -1939
2086 -1939 2817 1106 -4044 -1210 4100 1004 -4366 -1064 2898 -10 -3170 318 2353 -2063 -3728
2101 -3728 1167 2898 -2993 -4528 1675 2541 -2874 -3499 2116 1131 -4459 -2343 3817 947 -6004 -2467
2117 -2467 4233 1008 -5459 -1473 4101 -828 -5473 587 5078 -2020 -6085 1663 5936 -2413 -5904
2132e904Q741K396q730p87Q554j11q694J112Q726j593q914J599Q565k111q005
2147e156L296P030m527o480M747O892n993o220N895N240n428n210N773L950o001
2162b192l112O566K296p078j927O730K073o648j551O693N47o320O41O650j679
2177A689o581K238O558k380n890K808N930l310m727L691M510m783l713N898L132
2192E070o152k643O351J995o633n22N935j76o307J194O272k354o107K490N907
2207D320l405n100L253M946m573m065N433K871n722k895O341J491o070j296O165
2222A694K88n701J59N916j168n517J647N753j983n707K192O076k680n407L356
2237a082M982l523m336M240M293m642m322N252M013n134l245N475K686n888k184
$$ plain form
2132 -5904 2837 5233 -3497 -4284 4270 4159 -4535 -3423 5303 3710 -5204 -3605 4960 2849 -5156
2147 -5156 -1860 5170 643 -5837 -1090 5802 -191 -6411 -516 4724 -704 -5914 -141 3809 -2192
2162 -2192 -5304 1262 3558 -3520 -5447 1283 3356 -3292 -4843 1850 2397 -3923 -3282 3368 1689
2177 1689 -4892 -2654 3904 1524 -4366 -1558 4372 1062 -3665 26 4536 -247 -3960 1938 5070
2192 5070 -1082 -3725 2626 4621 -2012 -2534 3401 3225 -3082 -1888 4384 2030 -4077 -1587 4320
2207 4320 915 -4185 -932 4014 -559 -4624 809 3680 -2042 -4937 1404 2895 -3175 -4471 1694
2222 1694 1982 -3719 -3560 2356 1188 -4329 -2682 3071 1088 -4619 -2427 3649 969 -4438 -1082
2237 -1082 3900 377 -3959 281 4574 -68 -4390 862 4875 -259 -3504 1971 4657 -1231 -3415
2252c415O637J374o500j129O688P54p354L94P260j317p305K456O340l036o402
2267d555L614O157m503n686M572M857n318m358O120L081o233k236O234J856o674
2282c072q53O041M97o263J225N417j288m980J692N011k259m619K733M777l090
2297I69l980L223L778l037l632M268K868l826k749M302K361m355j997M790J617
2312D600n156r50M933M53n033m4N458r97n535J257N437k084n609K505N292l725
2328H02m809M062M285m980l737N134L059n824k084N826J663o475o29O425m80o283
2344d045J171O511j884n564K241N703l108m737L405M681l885l898M480K968l756
2359B83k724M230K415m491k013M780J935m785j474M613J214m815r26M839K53m974
$$ plain form
2252 -3415 3222 4596 -1904 -3033 3655 4409 -2945 -2551 4709 3392 -3913 -1457 4883 1847 -4555
2267 -4555 -941 5216 713 -4973 -401 4456 -862 -5220 900 3981 -2252 -4488 1746 3602 -3072
2282 -3072 -3925 2116 2613 -3650 -2425 2992 1704 -3276 -1584 3427 1168 -3451 -718 4059 969
2297 969 -3011 212 3990 953 -2679 1589 4457 631 -2118 2184 4545 190 -1807 2983 4600
2312 4600 -556 -1506 3427 3880 -1153 -1197 4261 3264 -2271 -1014 4423 2339 -3270 -765 4527 802
2328 802 -4007 55 4340 -640 -4377 757 3816 -2008 -4092 1734 3397 -3078 -3707 2718 2238 -4045
2344 -4045 -2874 3637 1753 -3811 -1570 4133 1025 -3712 -307 4374 489 -3409 1071 4039 283
2359 283 -2441 1789 4204 -287 -2300 2480 4415 -370 -1844 2769 3983 -832 -1758 3081 3334 -1640
2375a640j45N090l01n381P83N068j617m941J653N065k682n056L345M436l833m182
2391d338M594L102m688k891N087K305n602j618N946P56o068Q8O247j181n686J938
2407b009N699k417n031L580M084l778l453L958L195m090k290M038K110m265j497
2422b166M101J189m209o53M060J63m199K11M055l64m251M26M238j238l845J405
2438a077L825j609m174J935M077k204m068K964L567l606l557M225L212m880k154
2453c524M834J613n364j418N875N62n716J46O195r93o041J675N856k101n497K708
2469a190N250l634m540M332L865m811l220M794K911n251j795M539J966m847j183
2484b814M447Q74m961k76N245m61n012Q66M115n43m078Q33M076j685l730J769
$$ plain form
2375 -1640 -1785 3305 3004 -2377 -1594 3474 1857 -3084 -1431 3634 952 -4104 -759 3677 -156 -4338
2391 -4338 256 3358 -1330 -4221 866 3171 -2431 -4049 1897 2653 -3415 -3327 2920 1739 -3947 -2009
2407 -2009 3690 1273 -3758 -178 3906 128 -3325 633 3828 -262 -2552 1486 3596 -669 -2166
2422 -2166 1935 3124 -1085 -1738 2322 2485 -1714 -1503 2552 2188 -2063 -1637 2601 1363 -2482 -1077
2438 -1077 2748 1139 -3035 -1100 2977 773 -3295 -331 3236 -370 -3927 298 3510 -1370 -3524
2453 -3524 1310 2923 -2441 -3859 2016 2578 -3138 -2992 3203 2210 -3831 -2156 3700 1599 -3898 -1190
2469 -1190 4060 426 -4114 218 4083 -728 -3948 846 3757 -1494 -3289 1250 3216 -1631 -2814
2484 -2814 1633 2507 -2454 -2730 2515 2054 -2958 -2092 2023 1480 -2598 -1765 2311 626 -3104 -1335
2500a335L879j697m271K035M313k755l544K921L032l011k789L750K559m234k099
2515c246M491J732m518r41M071M34m150K95M405r14m349J393M503k037m374K649
2531e56L523k887k851L634J862l992j404L841J232m223o65M083J03l849P23L187
2547A761j428l086J716L750k697l442K365L688l104k780K908K192l040k392M062
2562D73J986m192j770M164J801m175j322L794J263m225m39M842k4n135M1N823
2578B905k64n774O82N481r13m900K041M740k736m450K994N220l841m687L746M463
2594D707m269l337M222K941n025k035N333J242m877j885N508J017m954o65L842
2609A765N02m300O04L901j416m050J579L561j678l068J147K743j316k284J972
$$ plain form
2500 -1335 2544 847 -3424 -1389 2924 169 -3375 -454 2578 -433 -3222 528 3087 -1147 -3246
2515 -3246 1245 2977 -1541 -2482 1589 2023 -2127 -1832 2573 1659 -2690 -1297 3206 1169 -3205 -556
2531 -556 2967 80 -2771 863 2725 -1267 -2671 1170 2402 -1821 -2486 1597 1700 -2149 -1426 1761
2547 1761 333 -2753 -1037 2713 16 -3426 -1061 2627 -477 -3257 -349 1843 -1197 -3589 473
2562 473 2459 -1733 -3503 661 2462 -1713 -3035 759 2022 -2203 -2642 2200 2176 -2959 -2918 2905
2578 2905 2641 -3133 -2451 3030 2117 -2783 -742 3998 1262 -3188 -194 5026 1185 -3502 244 4707
2594 4707 438 -2899 1323 4264 -761 -2796 2537 3779 -1098 -2983 2525 3542 -1412 -2077 1765
2609 1765 2267 -2033 -1429 2472 1056 -2994 -1415 2146 468 -2600 -1453 1290 -26 -2310 -338
2624c38J517k251j594K690J565k760j606K740R41j579o88J669M41k175P00K523
2640A795j365k281J000K522o21k188J394J587j951j544L232O43l101r82L177J154
2656B471k920r98L221l78l209J432L105j776l992J990M186k260l649K026K959
2671B208k557k075K575K798m486k419M517K161m442j955M424J875m187j520M644
2686A561L71m831M64N020p53m886M27N053l23m525M79M160j248l532J649L922
2702C008k373m538K878M179k580l744K509L144k762k231L023J968l442k044L437
2717D32J948l624k128L804J344l101j155L485n4l347L20L719r87l478J044L279
2733A501o18k814R69K122j309j870K170J840k665j560K567J602k684l26K167j31
$$ plain form
2624 -338 1179 -1072 -2666 24 1589 -1171 -2777 -37 904 -675 -1363 306 747 -1428 -728 1795
2640 1795 430 -1851 -851 1671 1050 -1138 256 1843 -108 -1652 1580 2223 -878 -1860 1317 2471
2656 2471 -449 -1447 1774 1396 -1813 -381 2724 948 -3044 -1054 3132 872 -2777 -751 2208
2671 2208 -349 -2424 151 2949 -1537 -3956 561 2722 -1720 -3675 749 2624 -1563 -3083 1561
2686 1561 1932 -2899 -2435 2585 1832 -3054 -2627 2426 2103 -2422 -1943 2217 969 -2563 -914 3008
2702 3008 635 -3903 -1025 3154 574 -3170 -661 2483 -279 -2510 513 2481 -961 -3005 432
2717 432 2380 -1244 -3372 432 1776 -1325 -2480 1005 951 -2396 -2076 1643 656 -2822 -1778 1501
2733 1501 883 -1931 -962 1160 -149 -2019 151 1991 -674 -2234 333 1935 -749 -1075 1092 961
2749I61j721O78K098j251k480J381K711j371k317J596J709j820j091J897J178
2764B158l061p60K728Q72k864q00K827L11k860kL036o62l436R95L459j018l461
2781b538P69L609j014l749J681L249k420k663L241K820l555k810L707K709l283
2796b47k547L444K033l581j345M444O62m242m08M257N99m311j77M386r5m273R16
2813d85L693j551l221J692L376j918l397J946L121k141k509J712K406k446j915
2828a637K508J482k582j664K778J116k568q47K051L18k344J15K236K91k965K59
2844a453K914m82k531L78K715j247j952J697J737k196j336K358J475k314j227
2859a464K583O26k269n14K679j21k565M64K840o98l106J289K759j795k234J889
$$ plain form
2749 961 -760 -82 2016 765 -1715 -334 2377 1006 -1311 285 1994 174 -917 980 2158
2764 2158 -903 -1663 1065 1937 -927 -1727 1100 1411 -1449 -1451 1585 923 -2513 -1518 1941 923 -2538
2781 -2538 -1769 1840 826 -2923 -1242 2007 -413 -3076 165 2985 -570 -3380 327 3036 -247
2796 -247 -2794 650 2683 -898 -2243 2201 2863 -1379 -1787 2470 3069 -1242 -1419 2967 2872 -1401 -485
2813 -485 3208 1657 -1564 128 3504 1586 -1811 135 3256 1115 -1394 318 2724 278 -1637
2828 -1637 871 2353 -229 -1893 885 2001 -567 -1414 637 955 -1389 -1274 962 1253 -1712 -1453
2844 -1453 1461 979 -1552 -1174 1541 294 -1658 39 1776 -420 -1756 602 2077 -237 -1464
2859 -1464 1119 1745 -524 -1038 1641 1520 -1045 -581 2259 1561 -1545 -256 2503 708 -1526 363
2875C63K039k345j707K607J416k681j402K620J117k795j366K583Q85l124J55K819
2891A184K05l453L13L104p71k755L24L073j022k759J219K526j430k484J841K456
2907A571j837k573K208K352k254k037K620J929k567j518L228J069l355j033L770
2922A573R6k680q0K930n57k831Q25L166j082k897J253K791j744k730K542J736
2938B311k231k000K580J229k368j258K461R78k502r82K907J78k749j19K581m30
2954E86k323L83K588q39k318J143K023j154j962J728J294j270j612J711J489j959
2970d92j345K262J281k446o74K688K81k554m21K870L76l152N56K184j59k989R46
2987g88K706j210k319J274K302j886j780J462K277k398j427J987J391k723j130
$$ plain form
2875 363 2402 57 -1650 957 2373 -308 -1710 910 2027 -768 -2134 449 1334 -1790 -1635 1184
2891 1184 1389 -2064 -1751 1353 582 -2173 -1849 1224 202 -2557 -1338 1188 -242 -2726 -885 1571
2907 1571 -266 -2839 -631 1721 -533 -2570 50 1979 -588 -2106 1122 2191 -1164 -2197 1573
2922 1573 1669 -1011 -1091 1839 1282 -1549 -724 2442 1360 -1537 -284 2507 763 -1967 575 2311
2938 2311 80 -1920 660 1889 -479 -1737 724 1702 -800 -1782 1125 1303 -1446 -1565 1016 586
2954 586 -1737 -1354 1234 395 -1923 -780 1243 89 -1873 -145 1149 -121 -1733 -22 1467 -492
2970 -492 -1837 425 1706 -740 -1414 1274 1555 -999 -1420 1450 1826 -1326 -770 1414 1255 -1734 -788
2987 -788 1918 708 -1611 -337 1965 79 -1701 -239 2038 -360 -1787 200 1591 -1132 -2262
3002b262K918O75k950o29L201J79l045J00K760o40k651P65K900j328k215J041
3018a181K439j163k627K022J949k034j561J866J516j658j486K490O57j918r26
3033a615K044P62k114o58K632L31k780j12K890l60k578M73K594p69k508R95K071
3050A298r50k235J563K058k170j667K066J157k153j045K103J278k640o84L036
3065A015p8k693P2K489l91k464J055J874n09k151J198J706r55k400K003J269j348
3082c08j324J671J302k100n98K202Q53k444n37K387L02k376K4K366j51k333K08
3099h56K429m91k366Q61K286j278j840P48K054j695j722K192J460k427j487K470
3115C38J164k427j355K404J123k371q99K514L59k413k73K700K0k844N27K615o30
$$ plain form
3002 -2262 656 1331 -1619 -2248 953 1132 -1913 -1813 947 307 -2344 -1579 1321 -7 -2222 -1181
3018 -1181 1258 95 -2532 -510 1439 -595 -2156 -290 1226 -432 -1918 572 1229 -689 -1615
3033 -1615 429 1191 -923 -1581 1051 1382 -1398 -1510 1380 1020 -1558 -1085 1509 740 -1768 -773 1298
3050 1298 348 -1887 -324 1734 -436 -2103 -37 1120 -1033 -2078 25 1303 -1337 -2021 1015
3065 1015 937 -1756 -1684 805 414 -2050 -995 879 370 -1781 -583 1123 168 -2232 -229 1040 -308
3082 -308 -1632 39 1341 -759 -1357 845 1698 -746 -1283 1104 1406 -970 -946 1420 1269 -1064 -856
3099 -856 1573 1082 -1284 -423 1863 585 -1255 -507 1547 -148 -1870 322 1782 -645 -2132 338
3115 338 1502 -925 -2280 124 1247 -1124 -2023 491 850 -1563 -1836 864 884 -1960 -1433 1182 552
3132E52k355Q48K595j376k333J312K523j570k252K374J672j686j906K151J500
3147B049k033j352K641Q61k715l22K064N03k298l04K332Q1k136J97K252r98j845
3164a023N30K162j104j976R86J646j580j218J410Q06j705n76J617N52j861m98
3180a832J694L04j330m33J403N83k166N63J568o64j741J076J716j070j484J618
3196a95R56j630m80J689N25j592n55J888P18k086m19K007K59j745P4K254q02k269
3214a403J372J983j195k405J426J833j048k129J372J876j875j810K195J733k405
3229d80j669K556J329k843r65K489N81k603k35K501K87k954q4K809K15k465L5
3246a496K202m04k094P46K395j103k429J029K466j015k593J024K706j159j994
$$ plain form
3132 552 -1803 -955 1640 264 -2069 -757 1766 196 -2056 318 1990 304 -1602 549 2049
3147 2049 16 -1336 1305 2166 -549 -871 1193 1696 -602 -906 1426 1507 -629 -432 1820 822 -1023
3164 -1023 -493 1669 565 -1411 -425 1221 -359 -1577 -167 639 -1066 -1642 -25 527 -1334 -1832
3180 -1832 -138 166 -1164 -1597 -194 389 -1777 -1214 354 -310 -2051 -975 741 -329 -1813 -195
3196 -195 761 -869 -1349 340 865 -727 -1282 606 1324 -762 -1181 826 1085 -660 -586 1668 866 -1403
3214 -1403 -31 1952 757 -1648 -222 1611 563 -1566 -194 1682 -193 -2003 192 1925 -480
3229 -480 -2149 407 1736 -1107 -2072 417 998 -1605 -1840 661 948 -2006 -2090 719 934 -1531 -1496
3246 -1496 706 302 -1792 -1046 1349 246 -2183 -1154 1312 297 -2296 -1272 1434 275 -1719
3261a719J696J366j603j546K288J221j993j336J990J278k244p14K142K33j877
3276h18J88J840n24k112N90K022n64j646O47J006r16n25Q96O99j451k68J316L63
3294G43j209n07J401o4j109O3J449o04j394J001J289p45r45M40J033j075m33J296
3312F30M28j656m18J972L83j959l48J894P11k026k63J724k43j774M30K139m97
3329A127k527M68K470o65k215R38J987j377k118J713K079k381k204K459K037k591
3345h00j533K439R34k042q38K134Q71l098k60L093K92k706k41K510K26k201K27
3362i93K059m00k315J148J904j056j507M41K423o67j907L11J742q49j292J190
3378B32J317j464j303J585J359j530j122J048Q95j272o04J533p4j619J87J511
$$ plain form
3261 -1719 -23 1343 -260 -1806 482 1703 -290 -1626 364 1642 -602 -1316 826 1059 -818
3276 -818 -630 1210 686 -1426 -836 1186 622 -1024 -377 629 -287 -812 84 783 -668 -936 380 743
3294 743 -466 -973 428 364 -745 -682 767 163 -1231 -230 1059 314 -631 -191 842 -233 -666 630
3312 630 1058 -598 -1016 956 1339 -620 -968 926 1637 -389 -652 1072 829 -945 -515 1624 1127
3329 1127 -1400 -932 1538 873 -1342 -404 1583 206 -1912 -199 1880 -501 -2705 -246 1791 -800
3345 -800 -2333 106 1040 -1002 -1840 294 1165 -1933 -2193 900 1192 -1514 -1755 755 981 -1220 -993
3362 -993 1066 666 -1649 -501 1403 347 -1160 -719 1704 1037 -870 -559 1183 334 -958 232
3378 232 1549 85 -1218 367 1726 196 -926 122 1017 -255 -859 674 600 -1019 -832 679
3394F79j3j629q0J094m0p08L34Q29r46p25J051Q22j493k70J322R1j439K83J144
3413C06m76j501Q65J650o54j205K40J815q76j184J025Q40r83o60J297Q38j872
3430e35n04K006K48j318p76J139O44r73j3J339l62j812K86J788j15j860J50J894
3448A226n34k022Q13J748j082j881J370J700r46k503J303J979j290j673J563J225
3464I96j747j097J981J115k141p00J723Q63k200q4J888K53k002J02K030j68j656
3481h44L23J724n57j755O66J385m48j000M69R16n39j026Q91P47j185l18J063L48
3499H60r31p01R08N16j088k9Q92j17j318L2J377m24r61L71Q18j040l58P98R70
3518E75j042j102R30O15n04r11Q51Q29j589K25J064R5j119N1J344m15j276M82
$$ plain form
3394 679 666 -963 -1043 51 11 -697 -363 466 -480 -1205 -154 668 -825 -1095 227 318 -1121 -838 306
3413 306 -170 -1671 -806 844 190 -1015 -775 1040 164 -1020 5 845 -138 -798 499 1337 -535
3430 -535 -1039 967 1215 -103 -879 260 904 -69 -82 1257 895 -917 -631 1157 1042 -818 -668 1226
3448 1226 692 -1330 -517 1231 149 -1732 -362 1338 392 -2111 -808 1171 -119 -1792 -229 996
3464 996 -751 -1848 133 1248 -893 -1593 130 993 -1207 -1291 597 850 -1152 -1050 980 812 -844
3481 -844 -521 1203 646 -1109 -443 942 494 -506 -37 879 340 -686 205 952 -233 -551 512 860
3499 860 -71 -772 136 652 -436 -465 427 310 -1008 -976 401 -23 -984 -613 205 -835 -1193 -395 575
3518 575 -467 -1569 -639 -24 -528 -1439 -588 241 -1348 -1123 -59 36 -1083 -1032 312 -103 -1379 -897
3536h97J346n31j059J099R24j051j320J294J581j566j405J726P71j369o83J585
3552D45L15j446q2J394l5j420p0J606N9j774j25K003n51j465M70J530q80j362
3570a388O87J393q86j261Q69J219r35r88R42R51r23j121J449P95j463m74J267
3587A33N28j042l99J354J14j358j12J909m56j481N43J080n63r47N50J180r94p09
3605f70Q75P75r73q33J277N41j073m48J036L89j410NJ362m44j351M47J157o95
3623c3q68O03O41m78p75O88O43o86p44J141J70n37n74Q84P87j399o9J049L24j292
3643e25K3Q38j5j039M33J207o8j501N79J016l09j346M50J211q02j094J242J104
3661A404r82j460J723N81j598m13J672J79j396m11J066N20j730J00J263J56j885
$$ plain form
3536 -897 449 -82 -1141 -42 882 -169 -1489 -195 1386 -180 -1585 141 912 -457 -1140 445
3552 445 760 -686 -768 626 591 -829 -899 707 766 -1008 -1133 870 319 -1146 -676 854 -26 -1388
3570 -1388 -701 692 -194 -1455 -586 633 -302 -1290 -348 603 -320 -1441 8 803 -660 -1134 133
3587 133 661 -381 -780 574 688 -670 -782 1127 671 -810 -267 813 250 -697 -147 1033 39 -670
3605 -670 205 980 7 -826 451 992 -81 -529 507 896 -514 -509 853 409 -942 -495 662 -33
3623 -33 -901 -298 343 -135 -910 -222 421 -265 -1009 132 302 -235 -809 75 862 -537 -606 443 767 -525
3643 -525 -502 336 321 -718 -285 922 854 -647 -68 948 639 -707 -257 954 152 -942 300 1404
3661 1404 422 -1038 685 1266 -332 -745 927 1106 -290 -701 365 885 -845 -745 518 674 -1211
3678a211N29J462n83j364O60J075n39j395O80J005l42j154J169M49r22m97J135
3695A57N63j268r1P08N24j268k1J066M57j135l32J370l03q51j86J418k97r15K54
3714a50Q57p2j208O55R47o24p65P01O17j159n17J269L95j072m75P95N51j117m65
3733h37J169n1j108j16J664o26j136N45R33n27j097J086M59o99p61R40O98j051
3751e15m88J261M08j416l15J537K20j458L1J378j39j184N77O56j56j289O55J386
3769A149n77p82L54J013q52p28O99J083j198p63J399N14j141j139J392L85r31
3786a23p41J598p2j370k30J713j03j629L24J120j76j223j01J433k33j479Q94R89
3804E91j014p87P05J167q18q94Q24Q41j018p23J236N22j079o82J401K26r15j25
$$ plain form
3678 -1211 -682 780 197 -1167 -507 568 29 -1366 -686 319 -23 -1177 -8 441 -481 -978 157
3695 157 720 -548 -639 69 593 -675 -696 370 827 -308 -640 730 427 -424 -610 808 511 -404 -150
3714 -150 707 635 -573 82 1029 405 -360 341 958 -201 -718 551 946 -126 -601 194 745 -372 -837
3733 -837 332 281 -827 -943 721 95 -1041 -496 437 -90 -1187 -101 358 -341 -1102 -162 536 -515
3751 -515 -1003 258 666 -750 -1065 472 692 -766 -735 643 504 -680 -103 553 397 -892 -237 1149
3769 1149 572 -210 144 1157 305 -423 276 1359 161 -602 797 1311 170 -969 423 808 -123
3786 -123 -864 734 662 -708 -938 775 672 -957 -633 487 311 -912 -1013 420 187 -1292 -398 591
3804 591 -423 -1210 -505 662 -156 -1050 -226 615 -403 -1126 110 632 -447 -1129 272 498 -417 -542
3822e42J196K03r40k33J117j44j147L41R04l96p99L89O88m99n19P83J9n97p6M03
3842A51M51j138L40P55l43q53K32R81l97p27JJ051n44p84K40R43n77m21N66L95
3862C22l93m27P88M05j061m59J215M31j255J98Q98r1o85r0J156j55j259K43J444
3881A225k19j608L41J465q74r29M68J235j276p99J408N28j048p75J006O70j053
3898b35p17R98O25j429n12J519M29j432l42J609K9j139K7Q44j18r79M12J230l87
3917D32j355M26J216j46j332O31P80l17r65P89Q88q39n38O72O81o01o71M68O56
3936H75o70j34P10k84n25L01N48k58m67KM99K7n57K2L54n81j20L20M09o38m24
3957e91P78O6n95j12N11l37n23M55P86q59o94O86O72m46p93Q28L87n71n95J020
$$ plain form
3822 -542 654 857 -83 -316 801 657 -490 -149 755 359 -440 -51 637 138 -381 402 421 -176 -252 151
3842 151 602 -536 -196 559 216 -637 -405 576 179 -548 -547 504 -40 -824 -584 359 -218 -639 -73 322
3862 322 -71 -498 290 695 -366 -825 390 821 -434 -236 662 571 -114 -204 952 797 -462 -219 1225
3881 1225 1006 -602 -261 1204 330 -599 -131 1104 -172 -971 437 965 -83 -858 148 818 -235
3898 -235 -952 46 671 -758 -1270 249 678 -754 -1096 513 542 -597 -570 274 156 -823 -411 819 432
3917 432 -923 -497 719 573 -759 -128 652 335 -630 159 1047 208 -330 342 1023 422 -249 219 875
3936 875 205 71 781 497 -28 273 821 563 96 98 597 624 67 89 443 -138 -258 62 471 -167 -591
3957 -591 187 253 -342 -454 57 -280 -803 -348 438 -421 -1115 -429 243 -203 -996 -168 219 -352 -947 73
3977G3L30j006l96J321K41r24k39R56J75q98m45J613nj723M70J188J71j318J64
3996b52J247j39j372L64J398o20j397J118J293j272j468J040J262q69j224O43
4012b48J084j198n79J186O96j413q80J896J04j252o14J323L22r97k29J143j56
4029A88j021O7J262k38j260N0J063K1r54K48R44n91m52O36O14l97q43N67L07p7
4049A34k53K55M76q75JM43M71p12k12O34j96k76j53O21j94m30O45o7n52j78N01
4070H3K86r22j36P62k86j75k14M32%q03M15R72o26q97L19R11p50m31P85K83n47
4091e39k90J021J76p04m84P46M18o08m88Q62M19q60l60J491J05j516j2J149N10
4110A036j344j13Q63J15r67K43R85n79q46K97J368o78j018L44R53l97j318N60
$$ plain form
3977 73 403 -603 -999 322 563 -361 -600 356 531 -367 -812 801 796 -927 -457 731 902 -416 -252
3996 -252 995 856 -516 -152 1246 626 -771 347 1640 368 -1100 -60 1202 333 -891 -248
4012 -248 836 -362 -941 245 941 -472 -1352 544 648 -604 -1218 105 427 -570 -799 344 188
4029 188 -833 -766 496 258 -1002 -952 111 132 -822 -574 370 -221 -673 -37 577 180 -663 -96 211 134
4049 134 -119 136 612 -263 -262 181 652 -60 -272 362 166 -110 -263 358 164 -266 379 312 -240 -418 83
4070 83 369 -553 -689 73 -213 -388 -602 -170 -170 -973 -558 414 -212 -1109 -790 121 -629 -1060 -275 8 -539
4091 -539 -829 192 368 -336 -820 -74 344 -264 -752 110 529 -331 -691 800 905 -611 -623 526 1036
4110 1036 -308 -421 442 557 -410 -167 818 239 -607 -310 1058 380 -638 -294 659 262 -1056 -496
4128d96J396o09j354Q73P40o19o66P11Q59j247m23J053K32q20l46J083k03r27
4146g63L12J052m52o71k24Q23K73n50L39J78l01m39M39O05n54j39O26l77k07m20
4166d50O10O5l72J82O30j33q38M60L22j40l17j53N77n38j22L02J60l81m21J009
4186D52O3p62O5L58k07o38J26J005j7j095K28P32j2j212O39P64m29o78J95J182
4206G59j084l25O52O25m67n29M87O46o24l42L19O15r75R1O35M37p01n20R03K99
4226I01r88J3O86j9o14JP64n02n68K91O79j67o58J48N68j15p37K56J79r1o30M93
4248a10M31n74m93R35q6o51o1O72O3m80L42L12j21o83L17L73r1m18N3M40k7n48
4270d05O85K81o13j22O71K43o58j91N21K20q01K80M63m3l71R5J61J80o74L21N72
$$ plain form
4128 -496 900 291 -1063 -190 550 -69 -735 -24 835 -412 -835 218 450 -370 -716 367 164 -763
4146 -763 -451 601 149 -522 -746 77 350 -200 139 317 16 -423 16 621 67 -72 554 177 -30 -450
4166 -450 160 225 -147 35 665 532 -306 154 476 336 19 -134 443 -95 -217 85 245 -136 -557 452
4186 452 515 -247 -182 176 -31 -669 -543 462 445 -650 -422 310 298 -914 -275 489 60 -618 -423 759
4206 759 -325 -650 2 627 160 -369 118 764 140 -202 117 732 -243 -152 483 920 219 -301 602 901
4226 901 -87 -74 612 593 -21 -20 744 242 -326 -35 644 477 -181 -33 535 420 -317 -61 118 27 -603 -110
4248 -110 321 -253 -746 189 103 -548 -609 63 126 -354 -12 300 179 -504 -187 186 95 -323 -270 170 143 -405
4270 -405 280 561 -52 -174 497 740 82 -109 412 632 -169 111 574 531 160 255 416 596 -78 243 815
4291H15m84n24L67J36j55o59N47L49p19j47O93N2o36m50R80j18m73j4N08K78q37
4312d91n0M21Q1m64j31Q19J36j023K7J246p36n17N30Q14m21p62P71P34p80l82
4332a78P43J79n71m82R18J10q67o7Q46k58o25L85L64j71m89K11L03k32p91M54
4352b18O53k90r41P68K68n62k14N58J41o00n6L31K33m36j17M33L37j048L82L55
4372b3j5j68q5M11J58o45J39P01m16m99L25N91k52m20J64K75k72k35R90m22m17
4393a15n8P55k46k96m79Q91j09o42o3O34m2m82N6N81k47l98L10M10q16k56M92
4414a20L74n51k05L27M60o40p3O99N2n89j46L61N01r04R7R36m54m98K70P22j09
4435E10o96K24N44l16m73L84N53o92p73J214L39q61j57L79K76p45k78P75L34o95
$$ plain form
4291 815 331 -193 174 310 155 -504 43 392 -327 -474 219 271 -365 -815 165 47 -426 -440 68 346 -491
4312 -491 -541 -120 -39 -503 -634 185 321 -702 -675 571 -165 -682 -152 662 241 -521 250 984 204 -178
4332 -178 565 744 173 -309 609 719 -148 -215 631 373 -252 133 497 326 -163 48 351 119 -672 -218
4352 -218 435 145 -796 -28 240 -322 -536 22 163 -437 -493 -162 71 -365 -482 -49 288 -760 -378 -23
4372 -23 -38 -206 -291 120 278 -367 -228 473 57 -442 -117 474 222 -198 -34 241 -31 -266 724 302 -115
4393 -115 -173 582 336 40 -439 452 343 -299 -362 272 230 -252 -196 385 138 -260 50 460 -356 -612 -120
4414 -120 254 -297 -502 -175 285 -355 -428 271 323 -266 -412 -51 450 -454 -357 579 125 -373 -103 619 510
4435 510 -186 38 582 266 -207 177 730 38 -735 479 818 -43 -200 179 455 -290 -568 207 541 -154
4455a54k32N98L37o27l02N35J63o88K44M93m81l72N05J48k38n52O26K30j59l80
4475c06J45M03j95k28L87J85m74m3J07M60j080N69K02k9j10K0O10k77m42k6O67
4496E45n33j20K57K19j98k29M07L04q07r9O57k25Mo09P82O9o35J43L60k51n35
4517d94K9R71o33l27j63R44k79p47O29L03l26m98P66J51q49N1L21L53q16p6R04
4538B14J74q07p2Q55k03q67K60Q70K28j018J95P58n34n32K26R53m75o18L15O90
4558F12n76m87M58O52j00q12O14K20o63j18N37K83r11j70N79m3j10m14M20K19
4578A90o39j03P59%n03l70O82k1m36k55Q05l15l69M98K42n84l5J54L45k73n0K53
4600b5J3k73J4J05j87N5l9L35J20M2l81N57n58K73R7Ll61L83K88j10k30n28Q30
$$ plain form
4455 -154 -386 212 549 -78 -380 155 318 -370 -126 367 -114 -486 19 167 -71 -623 3 233 74 -306
4475 -306 -161 242 47 -181 206 391 -83 -126 -19 441 -639 -70 132 103 -7 13 623 346 -96 -122 545
4496 545 12 -108 149 368 170 -59 348 652 -155 -254 403 178 182 -427 355 424 -211 -68 292 41 -494
4517 -494 -465 506 -127 -454 -617 327 48 -699 -70 233 -93 -591 175 326 -523 -472 -151 202 -614 -690 214
4538 214 388 -419 -491 364 161 -706 -446 424 652 -366 -171 587 53 -479 -253 700 225 -393 -78 612
4558 612 36 -451 7 659 559 -253 361 581 -82 -200 337 620 -291 -461 118 75 -35 -449 -29 190
4578 190 -449 -552 207 207 -296 -666 16 -5 -441 -696 109 -206 -575 -77 165 -419 -454 -300 45 -228 -278 -25
4600 -25 -12 -285 -271 -166 -353 -298 -337 -2 118 160 -221 336 -222 51 148 151 -210 173 461 351 121 -407 423
4623D23k78k76J53N4K10m60p1L57r4r06O94O67n81l47R9M62l23l53L96K82o47
4644e39p1N97M32o07n19P87K93j012L66O47j40p30J71P07k17o02K33M99K11r41
4664d35L86R12m95p25M46M06k55n80J94N32k61j52K14L7j3n05K72O88q90p5K94
4685eK23l41k85L52L80o26P0L97J95o41p2M61J72p77J72K33O6m71K86L32m07M4
4707b42j04M02j87q0M0L88k04q6K82j32l18M00j54N13k10k68K19k36J79L01j02
4728D01k39k82O39j35j75k61K19L66n27mK68j11l26K33L02k83j67j73L02J83p31
4749e01q5N19O1o67O76M03o69o22O13O01k66q19N36N66o52oN18M10q74o8O13J63
4771D50p39l26O19O60n37j91O05j35m73J91P93m02o47M19L37p1n06k49O31l8l22
$$ plain form
4623 423 145 -131 22 76 286 -174 -245 112 18 -888 -194 473 -108 -455 -356 106 -217 -570 -174 108 -539
4644 -539 -610 -13 419 -188 -707 80 373 -639 -273 374 234 -496 -325 382 165 -437 -204 295 506 -435
4664 -435 -49 863 368 -357 89 495 240 -340 -146 386 125 -27 187 224 211 -294 -22 666 -224 -299 -5
4685 -5 218 -123 -408 -56 324 -302 -232 165 360 -281 -353 108 280 -497 -325 -92 -26 -497 -211 121 -286 -242
4707 -242 -346 56 -131 -211 -171 217 13 -73 209 77 -241 159 5 518 308 40 259 23 202 503 401
4728 401 162 -120 519 384 209 -52 167 533 6 2 270 159 -167 66 368 85 -82 -255 47 230 -501
4749 -501 -586 -67 -6 -673 3 406 -263 -885 -272 329 63 -756 -220 346 -306 -312 206 616 -258 -326 287 450
4771 450 -289 -615 4 664 127 -64 541 406 -67 124 917 515 -132 287 624 553 47 -202 429 391 69
4792F9n2M72l63m81M40M18l14m76K97M19q24J29M32j29n21L17L36l0n40M3M55
4813I7M6l15k60N06n27J8L10M91k51k38J11ml11NN36o2o01O83L38m23N1J06J91
4836D97j3m51K44K55l17k13K29O27p61k19N44J52l59k01P6L45m65n0j5N07n17
4857a05l61Q96k69l37j83K62K2m51k0O65k88m93K20M75j35m28J3O79k22l64J04
4878c20M48l92j64K17N27l98k05O48P8q88K53N47K7l92n6M37l6n45J97L80j42
4899B21j51l74O48O0o80J82K63k4n07M03M08k10j45k28L72j79m03M72l12j84J80
4920a88L81k98k22J88J86j90k05J7M07l00k10L38M27r7n56N5J11J98m45M44J50
4941A91l61k89N12q9j25k09L79K05m42J10O86n45l05J91N18k67n21L39L27o30
$$ plain form
4792 69 17 489 126 -355 85 503 189 -287 10 429 -395 -266 166 37 -484 -167 169 139 -401 -358 97
4813 97 143 -172 -432 74 -453 -435 -125 366 115 -123 -12 -16 -327 -322 214 152 -449 234 572 149 200 306 497
4836 497 484 33 277 532 215 2 231 858 97 -122 422 574 215 14 90 435 -30 -80 -95 412 -105
4857 -105 -466 430 161 -176 -359 -97 -75 -526 -546 119 -169 -662 -442 33 -102 -530 -517 162 -60 -424 -320
4878 -320 128 -264 -428 -211 316 -82 -287 361 439 -449 -196 351 378 -14 -70 367 331 -214 -17 363 221
4899 221 70 -304 344 404 -276 -94 169 145 -362 41 449 239 94 -134 238 59 -344 128 -184 -368 -188
4920 -188 193 -105 -327 -139 47 -143 -348 -331 76 -224 -434 -96 331 234 -322 -267 -156 42 -403 41 191
4941 191 -170 -459 53 -36 -161 -370 9 214 -228 -118 568 23 -282 -91 427 160 -361 -22 305 -325
4961c25K19J63N6o61M67P5J96k62j56M71o3k18m47N29k19j30J98R5o7l57M05J43
4983A12n2l00J46J68r9j85K95J91l01k73n2M17k37k92M86P7j03l25N24q2j31k89
5005c05J61M65k18M6L5l38J92l01M43l46j4L63P9k15k27J48M71p14J33j01J01
5026a42K63j08p6J22J4k9Q7J61o49M55Q4j9k68j8J16j04J20o0J39j80j57L21j8
5049E4m45L83j56L78k33l11L78J41l48J02M08J15n40J09K72J59l70o1L85j8j58
5070B44k7K97k58o54Q00N0l40m38N47Q4o43J68J74M79j81m36K06J85p12O9M29
5091D3J47o61M71K08J3l34m37O05m4m84J57M32l03P2K3M11m28j6KL23q9l28M57
5114B40l30J12j18M02Qk64J8J41J34m66M43R7mn60N71j58M0k16l52L75k33K37
$$ plain form
4961 -325 -106 57 113 -548 -81 -6 190 -72 -228 243 180 -38 -485 44 -175 -305 -107 -12 -79 -436 -31 112
4983 112 60 -240 -94 74 -25 -210 85 276 -25 -298 -350 67 -170 -462 24 101 -2 -327 197 115 -16 -305
5005 -305 -144 321 103 149 184 -154 38 -263 180 -166 -180 183 262 47 -180 -32 439 -275 -142 -243 -142
5026 -142 121 13 -63 59 73 44 131 292 -357 98 182 163 -105 -123 -7 -111 9 -51 88 -92 -249 72 54
5049 54 -391 -8 -164 214 -19 -330 48 189 -159 -57 351 466 -74 35 307 466 96 35 420 402 244
5070 244 217 514 256 -398 402 452 112 -326 221 305 -338 -170 4 483 302 -134 72 257 -455 -386 43
5091 43 190 -471 0 208 221 -113 -550 55 11 -473 -316 116 -187 -115 -92 319 -109 -125 -123 200 111 -217 240
5114 240 -90 22 -96 306 314 50 68 209 343 -123 320 417 413 -147 424 266 306 90 -262 113 -120 117
5136A17l87M70l99j38K4M78m86L75l9j11l10j5K39P8j02L5L51m49k29L0M97m03
5158c74n2J86N07o49p3N63lj29j93K97P2n05L15J08Q8j02K34l07K12j08r1N35
5180E31n29l34L88M16m10k12N04l80J11m21L31K17k21j11O2R9j78j70Q1J11j14
5201b29j42L46J21p26L14J68L61l04m61M56L50n17L8M37k41l52L40K65r0k42k40
5222c48N98k21j13k49L20m5j73K51K53J95n42J52J81r8l43N14k49P1k12L9p8P0
5244b7N4j34M51m80p6M20l26J31p2k0j50R1L1j43p5o0L94j76L9KK84j38l01L23
5268D2kJ58l45K17K85l65k16K10o6mJ80K45R7q30K10L19J01l9j07N53k77l45o0
5291c9M00K17o25MN00l01k93K16J48j25m72L73L95o97k10P29o6q8l27N22L4j73
$$ plain form
5136 117 -270 200 -199 -337 -313 165 -321 54 15 -96 -406 -421 -182 -104 -206 -171 180 -269 -498 -468 29 -374
5158 -374 -426 -240 267 -382 -455 108 105 -24 -217 80 152 -353 -38 70 158 56 290 -17 195 87 -4 531
5180 531 2 -332 56 472 62 -150 354 -26 85 -336 -5 212 -9 -120 -58 41 -137 -307 -226 -115 -229
5201 -229 -371 -25 96 -630 -316 -148 213 -91 -552 -96 254 -263 -225 212 -29 -381 -41 224 134 -108 -348
5222 -348 250 29 -84 -333 -13 -58 -231 20 273 468 -74 78 259 161 -182 332 83 154 -58 -19 -97 -27
5244 -27 27 -107 344 -136 -212 208 -118 13 -59 -79 -229 -138 -107 -250 -325 -385 9 -167 -128 -126 158 20 -281 42
5268 42 40 198 -147 70 355 -10 -226 -16 -82 -86 94 339 436 -394 -184 135 236 197 90 643 366 21 -39
5291 -39 361 578 -47 -43 457 156 -137 79 227 102 -370 3 398 -299 -509 220 154 66 -261 261 295 122
5313A22n99M43N1j70j96M98n0k83k85N72J59l12k85M84J97o44J43N03j61j07l18
5334b38L15q4l26M00m4L19l74j67K81K09o35N31K58k64m16K53Q9Q5m1P1k6l99
5356b03L82p9k21K08p6KJ36N5l68N0j82J56j89L85k59l26O85p4m08K39K59j23
5378D9n70N18j09L2j79K98J31j84Q6q8K89k97p1M00l3k13j84O82k65j98l27O67
5400D34j65k12j97L67K3r5l50N22r1l56j03N13l14l47J8L95r7k37k00K27K32l65
5422c98P5M56k44j73L2L38l21j23K6M07M5n28K41K09r6l18N33J27j74k42L59k24
5444Gk50O3K31K98o67J71J22L87n17M3M69m53J57J1K94j76l79K01K38N5j59j06
5466D0J27l38q9P19l08l11k0J49P3q6J6K25k84J32l9j00K00J12k67K5m6k34K35
$$ plain form
5313 122 -477 -34 17 -153 -349 149 99 -184 -469 103 262 -50 -335 149 346 -298 -155 348 187 80 -238
5334 -238 77 -7 -333 67 23 342 -32 -199 82 291 -344 187 445 181 -235 18 107 192 151 222 196 -203
5356 -203 179 100 -121 87 11 13 149 204 -164 -114 -296 -140 -329 56 -203 -529 156 82 -326 -87 172 49
5378 49 -521 -3 -112 -80 -259 39 170 -14 72 -16 273 -24 -95 305 272 59 -125 557 292 94 -233 434
5400 434 269 57 -140 227 250 155 -195 327 236 -120 -223 290 -24 -371 -353 42 -55 -292 -492 -265 -33 -398
5422 -398 -323 133 -111 -284 -252 86 -235 -358 -332 75 120 -408 -167 42 -54 -372 161 288 114 -128 231 7
5444 7 -243 -180 51 349 -318 -147 -25 362 -155 -112 357 -96 61 72 366 190 -189 12 250 305 146 40
5466 40 167 -171 -260 459 151 -160 -180 -31 42 -44 -28 197 -87 45 6 -94 106 218 -49 -24 -70 -304 -69
5489f9RO3j11J3J97l82J15K24m21K49j84N69n63oR1K62p5l76M92m9j83q8L02J57
5513B36l87j06K21L51n57kL52j0k51j78J80K07o7j54O0K81l48L5K62k7j15l27
5535c44L99k6j73Q1J41j22l87M55j70j9Q0o2J80j73k50J35J33j11O6k08K26j14
5557b63j77N02q9R9l27L57J63l96L51j88J91k32K29q6J3l10J08M48r1k48qj45
5579i9K49p8j25K76j65J44k43L9R9j61m1r9J03K88k84N7j47J24lk59q1L01j9j06
5603b30L5j80O19j49n02L72j33l67K41L17J4k53K35q3L64m06J42J06J63l56P7
5624B6J95l20o6O56rl84p1J31K00l34K09j87L8J39j21q3K01k05J77j65J54o76
5646d95N65j85K64n01N52l28J3l32K34M57l32j89Q7J6j04m1j54M05j85J56j2J89
$$ plain form
5489 -69 -60 3 -108 -95 102 -280 -165 59 -362 -113 -297 272 -291 -297 -206 56 -19 -395 97 48 -135 -223 79 236
5513 236 -151 -257 -36 315 -242 -244 108 98 -153 -331 -151 56 -11 -165 -105 176 -172 -137 125 98 -17 -344
5535 -344 55 29 -144 -63 78 -44 -431 24 -146 -165 -85 -147 33 -140 -390 -255 -122 -233 -167 -375 -149 -263
5557 -263 -440 62 -27 72 -255 102 265 -131 220 32 223 -9 220 134 147 -163 -55 393 302 54 46 -99
5579 -99 150 72 -53 223 58 202 -41 -2 97 -64 -105 -204 -101 187 -97 -40 -187 -63 -66 -325 -406 -105 -124 -230
5603 -230 -195 -375 244 95 -407 -35 -168 -535 -294 23 37 -216 19 -64 300 -106 36 142 305 -51 26
5624 26 221 -99 -165 491 482 98 27 158 358 24 233 46 84 223 102 19 220 15 192 27 181 -495
5646 -495 70 -115 149 -352 200 -128 -115 -447 -213 244 -88 -277 -190 -174 -278 -319 -473 -68 -253 -97 -109 80
5668H0l18L28mk85n9Q5L52J79k74P0J11k31p5L29J5k08oL6K11j03j66K19O7m76
5692a23J59R9k8k3j73j22M13j82j8QK17j82j61L7M3q0J27l92K36n0M19l05m71
5715e52K05K02m1J06j02J40R3k30q2J29K42k21o0L06L04l95j68L30p0k63J67P9
5737A19j5m76L65J90k00k1j31M22l29Q0JL54n11j69M26L9j87O2mj29j04n3L96
5760A25k32qj09K38j37l2J68R3K4m32j73L65J46l60O3K40L1j34j84K29j45j41
5782c65L43j82j44N8K48J26lk64K20m7N6P5l13J0L38l45j7JL2K1K09Q9k76L09
5806A79m17K63jr2r5J03K07j54j80L02j07K14m45K49p4K39j56k88K00J54l06m39
5828f44P97j14j14P3K7j69j5J00J04J65m51K58K04q3n71N79L0R5l06n8K12j06
$$ plain form
5668 80 -238 90 86 -199 -258 -173 179 358 84 154 265 34 -41 288 303 95 89 125 336 233 67 286 353 -123
5692 -123 36 135 107 84 -89 -211 202 20 2 10 227 45 -116 -79 -36 -116 11 -381 -145 -195 224 -81 -552
5715 -552 -347 -145 -186 -80 -182 -42 51 -179 -261 -132 110 -111 -171 135 439 44 -124 206 136 -127 40 119
5737 119 104 -372 -7 183 -17 -38 -169 253 -76 4 5 359 -152 -321 105 144 -43 19 15 -114 -218 -271 125
5760 125 -107 -115 -224 14 -123 -155 13 106 130 -302 -475 -110 36 -324 -261 -21 10 -124 -308 -79 -224 -365
5782 -365 -22 -204 -348 -290 -42 84 81 -183 37 -10 46 121 -192 -182 156 -189 -206 -205 -173 -152 57 146 -130 179
5806 179 -238 25 24 -68 -163 -60 147 -7 -187 115 8 222 -223 26 -48 191 35 -253 -53 101 -205 -644
5828 -644 153 39 -75 -2 25 -144 -159 -59 45 210 -241 17 221 138 -433 146 176 271 -35 -93 119 13
5850A3K72k41Q7k08R6j21M77k24j88oL57J6n09J21J70j13L8P0J44m09j51M15J11
5873B17l8n02J36J42n0M0K00K63m49J35n1J26m36K25K09o2R2n02O21j87j32K75
5895B72l3l84l5j33M32K08m32J75L2m78K38J26J10J82N6l5k98o1J12L32l65n1
5917c0q9Q8J26k66K86mj36j7J36K93m17J94k27j10R4n6K42j72j68p0N14r0l41
5940b20oK16k52j3L32ll16J17K01r5J35k99M78j67k83L32J98j75j98j05J61k0
5962A8j27p0J09j77k3K22L00q8k90J57J52j19n0J4J81k16j04k35L15q6j90K05
5984a02L01n28J63M38Q2m21j66%J88j17m8R5k8j18R7M81j71j35J1r6K28k34K30
6007A50l2j00k33O0K73p7k6J4J00m18L34j07P0k12K41mL29k76k2K50m97P8L66
$$ plain form
5850 13 285 44 131 -77 19 -102 375 151 -37 -43 314 330 -179 -58 112 -1 37 107 251 -158 -309 106 217
5873 217 179 -323 -187 -45 -95 -55 145 408 -41 94 43 169 -267 -42 167 105 197 -305 316 129 -3 272
5895 272 239 -145 -180 -313 119 327 -105 70 102 -376 -138 -12 98 280 336 301 3 -58 54 386 21 -30
5917 -30 -119 -31 95 -171 115 111 -25 -42 94 387 -30 164 -63 -173 -79 -135 107 -65 -233 -303 211 121 -220
5940 -220 -226 -10 -262 -275 57 54 -262 -145 56 -39 96 -203 275 108 -175 157 355 180 -18 -123 38 18
5962 18 -109 -179 -70 -247 -270 -48 252 164 -126 31 183 64 14 28 209 -7 -111 -346 -31 -117 -307 -102
5984 -102 199 -329 -166 272 354 -67 -233 -233 -45 -162 -210 -115 -143 -261 -164 317 146 11 22 -74 154 -80 150
6007 150 118 18 -215 -155 118 41 15 29 129 -289 45 -62 8 -204 37 33 362 86 64 314 -183 -105 261
6030B61j45m26L26n8j10M1J78RJ00J67k86rM7Q1k67J27l15J63PL25l0m97r3N94
6054A90k46l17M78P9k16k46J90K4MK58P6k41k69o1L17J02k88j94N77k18j31p6
6076b08M50J52o76K23K27J38l04j02j12N05l11L34j03k08k32K57l6j94K44K44
6096B88k89j48K50j03lo8j19K1J4J78l94N3J21N6k9K29k27J83k3J4j96L2M9J93
6120H2l34q5K77N5J88m0O7j92oj15K16M61n89K49J1l86J44N31n84J13L06k89j87
6143a07J91k44N4J45j02j88j8M55m53K73O3j01m55L39jJ89k21K4K38j61j71J05
6165a46J43J0j42K91k60M0l25O41k05j4K8L0m3j97m5L82J63m0l51L64J88l76N6
6188A92K02O1j60n1p9R3m72J53K28q5J0r6M14j09k45m5M22o3k23r1r0kL5k05K90
$$ plain form
6030 261 116 -310 16 -42 -152 -111 67 76 176 343 57 48 95 176 -91 36 -279 -116 -109 216 186 -311 -404 190
6054 190 -56 -373 105 184 -32 -278 -88 -64 -60 198 274 33 -236 -297 20 122 -166 -360 217 -1 -132 -208
6076 -208 242 394 -282 -59 168 306 2 -100 -212 293 -18 316 213 5 -227 30 -6 -200 44 288
6096 288 -1 -149 101 -2 -5 -73 -192 -171 -157 21 -373 -320 -199 -143 -172 57 -170 13 -10 4 -192 -160 -111 82
6120 82 -252 -337 -60 -5 183 143 210 18 12 -103 113 574 -15 234 245 -141 3 534 -50 63 369 80 -107
6143 -107 84 -160 -106 39 -63 -251 -269 186 -267 6 69 -32 -487 -148 -149 40 -181 -157 81 -80 -251 -146
6165 -146 -3 7 -135 156 -104 -64 -389 252 47 33 61 91 48 -149 -194 188 351 311 -40 324 512 136 192
6188 192 394 455 295 244 165 258 -214 -61 167 82 92 -4 410 301 56 11 433 370 147 56 -34 -36 -1 -206 84
6213H4j94n7K48J72l57K7M96n19J55m64M84l27L40j30m9K24O8j39J9K8o8J84k68
6236d3J12K78k67J58j31R2k66j2K82N0j35J93n03L31M3rj20j78P3K43k46L39k41
6259D3q1j83J78K04j94J43k96K90r3k46K11K04J23l92K08O3l15j77J64K45q0Q
6281B7q6J25j28m9k39J12o2J93K12l65L70m5J56l95J58k71O23k81j76p5j41K97
6303d0L3oK76J17m48K15k09j55L92P7k28J67j17L08o13J81N9J85l60J99J01k27
6325i3K59q6j05J57J43n74L34k23J81j1j78J63j05K10O9q8k9l16K64K15K9l22
6347a06km1J70LM0p2k19L34q4j54k65P07k77J41l60K76J51q9j60p5J1M32r9j37
6371A25k58j41K46K26j78q4K14k65r4K47m5j24R7r9J91K52n41M79k37l73L41j7
$$ plain form
6213 84 -110 -167 81 253 -104 -77 419 -100 55 -409 75 -252 88 -42 -91 133 201 62 81 109 41 225 -43
6236 -43 69 347 80 238 107 199 -67 -79 203 253 118 311 -192 139 182 173 53 -125 -52 191 -55 284 43
6259 43 -38 -221 -43 161 -33 110 -186 104 11 -235 -24 180 303 -89 119 182 -133 -310 -146 99 19 27
6281 27 -59 66 -62 -111 -350 -238 -300 -107 105 -260 110 65 221 -174 -16 -287 336 55 -121 -196 -337 -40
6303 -40 -7 -13 263 380 -68 147 -62 -217 175 252 24 191 74 382 -231 -50 9 194 -166 33 134 -93
6325 -93 166 80 -25 132 275 -299 35 -188 -7 -18 -196 -33 -138 72 141 53 24 -292 -28 187 216 -106
6347 -106 -108 -149 21 24 64 -8 -227 107 23 -131 -396 311 34 175 -185 91 242 153 -7 -82 -71 361 262 125
6371 125 -133 -274 -28 198 20 -64 150 -115 -209 38 -7 -131 -34 -133 58 310 -231 248 11 -362 -21 -38
6393c8JM55o48K34J34j63j63j15L31r2l02K87LJ57k28M4M4O9j43L88j17J3J16
6416B67k07R2JJ42k50K73p6l06J66R1l09L02rj86K58k34J41j88L49l31J13j44
6438d5J73n3l91J65j57J51K36j67m31M76k11J82k07L31r0q8J06J29k27P0j84J80
6460e2rK1P4K04j61n1j07J54K50m22K57kM5L8j77J24j26p4J45j69J61J4J05j31
6484A11n02L88M12k07l75J85L3k94J56J5L73o37J14K29K48l4k69o2K86pj27l69
6506c33L32l8j12R0N6l27M02L12k95r7KJ54m3k74J07L73Ll59M14m38L32r4l17
6529a50O0N5R5K11o5j55k40M18k79J49r0J43j24l0j2N6L0l6j24K01k59L48j67
6552C5j68J32OJ3jk45K31P6l55M45j9j24l93N22r3n7k25K74J47m86K59L0K34K1
$$ plain form
6393 -38 -37 418 -230 4 138 -25 -188 -303 28 -64 -366 -79 -76 81 -147 -103 -59 10 -133 255 138 151 267
6416 267 60 152 153 295 45 318 242 -64 102 193 -116 186 177 -9 249 15 156 -32 317 -14 99 -45
6438 -45 128 75 -316 -151 -308 -157 79 -88 -519 -43 -254 -72 -279 52 -38 -126 -20 109 -118 -48 -232 -52
6460 -52 -61 -40 34 238 77 26 -81 73 323 -99 158 156 201 239 62 186 60 -14 131 -38 123 137 242 111
6484 111 -391 -3 409 202 -173 12 45 -249 -93 -78 295 -342 -228 1 249 215 -54 -116 170 163 36 -333
6506 -333 -1 -39 -151 -61 -5 -332 70 382 87 -10 -8 146 103 -171 -64 309 312 -47 367 -71 261 167 -150
6529 -150 -90 -35 60 271 206 51 -189 229 -50 99 9 152 28 -2 -14 42 72 36 -88 113 -146 202 35
6552 35 -133 -1 5 18 17 -228 3 79 -276 169 150 26 -367 155 62 5 -220 54 201 -285 -26 4 238 259
6576B59k32K31l1j69L9N9j2o1Q8m41L30p4j14k12L78R1K3L6m0k09J61j58o3r1
6600b12J16K78k67OL05k43J02j66k88L06N5o0J5J90m58P5j57M87k59N9L41l93
6622a68K93K5l01K78J43m41j24N27m9l09L22j68J33m86M16Q9p2j69j18K56j77
6643a00m2J05R8O1l1K57j45l95M76k29j42L81l11Mj31J42k6K36L7k93J80k78J16
6666c0J83k37m9k00M64m03K68Qj9o9J32n16M10o2J05L64n78K02K23k52k22L13
6688C5K81k98j43m64M76L24%k27q6K75K0j12l19Q6K7k7J19L1j40L73m72L89q9
6711E9J96j55o5r9n9J23j67N1K18m21L22k52J79J6Q2K14m62L72j36j02L69j52
6733A31j78J87J94l33j54N47l87J51j3j27J50N8k79O8L10m48N36k33j83N9J59
$$ plain form
6576 259 27 258 227 58 97 156 144 83 171 -270 60 -14 -128 -340 38 129 152 188 148 -61 100 -58 -121 -212
6600 -212 -96 182 -85 -79 226 -17 85 -81 -369 -63 -8 -68 -53 137 -321 -246 -403 84 -175 -116 225 -168
6622 -168 125 150 -151 127 270 -171 -295 232 183 -126 196 28 161 -325 91 180 108 -61 -179 77 -100
6643 -100 -142 -37 61 122 91 348 203 -192 284 55 -87 294 -17 -13 -144 -2 -28 208 245 -48 132 -146 -30
6666 -30 153 -84 -133 -333 131 -272 -4 4 -15 -84 48 -468 -58 -120 -15 349 -229 -27 196 -56 -278 35
6688 35 316 18 -125 -589 -113 211 211 -16 -102 173 193 81 -238 -152 -125 -152 -33 -2 -142 231 -241 148 59
6711 59 255 100 35 -64 -123 0 -167 -116 102 -319 3 -249 -70 -54 28 242 -220 152 16 -86 283 131
6733 131 -47 140 334 1 -153 394 7 158 145 18 168 226 -53 15 325 -123 413 180 -3 56 215
6754B15j21j77J64L11m61p5l6J54K03o7k58K27r8J41k37Q7l8k14L98J2k69P1J9
6777d9j8q4LJ13Q4O8q8J8J94l53p4J39k36P1L23j03J59Kq6R7K1k6kj54j71K97
6803A45r7m9j95K71r0q1M31m01L06l1j28j7j01K27j63J14J61m03J35P1R4j93P
6826A3K36qk38r2J1J40o9J22J18j73j87j6j2L29k14J22j38l15Q7M47N3m47r9O51
6850C21m28k18J68K86k24K49J47o51L28M8q1J21L2m18P2j0J87K15r2J23j65r7
6872h7r4J58j28O2M8K66l28L2r6L20j86K88J49l94j15J08J25jj67n5J16J46k70
6895a03J51j44k16J80K13J47k29J31j73j8j38K22J12k57M9J93k9j80L09J6k94
6916e8O1o0J24J53l1k34n4L34m3q9k10L66j51l24M07k9l8j24N1J55m50M09l74
$$ plain form
6754 215 94 -83 81 392 -69 -144 -180 -26 177 110 -148 79 -19 122 -115 -28 -66 -280 118 130 -139 -68 -49
6777 -49 -67 -151 -148 -35 49 117 29 47 241 -112 -186 -47 -283 -212 111 8 167 169 83 180 201 175 173 19 -152 145
6803 145 48 -1 -196 75 -15 -96 335 -66 240 209 81 64 -37 190 27 141 302 -101 34 105 199 6 13
6826 13 249 241 3 -89 -78 62 -7 115 233 60 -127 -143 -155 174 -40 82 -56 -371 -284 163 216 -231 -330 321
6850 321 -107 -325 -157 129 -95 154 301 -350 -22 26 -55 66 98 -320 -248 -258 -71 144 52 175 10 -87
6872 -87 -181 -23 -151 -89 -41 225 -103 -71 -167 153 -33 255 404 10 -105 3 128 127 -40 -95 21 167 -103
6895 -103 48 -96 -312 -132 81 228 -1 130 -43 -61 -199 23 135 -122 -73 120 91 -89 220 236 -58
6916 -58 3 -57 67 220 189 -45 -99 235 192 103 -107 259 108 -216 191 162 124 0 51 206 -244 165 -209
6939b09K90j0r9RJ25q3o6J33J76k26n5O9j62J09J00p1ll3l9m3K72m09K52J09j90
6964e4m2K80q0k43L24m08J12J09J25q0k4K02l37K81j06P2j19K69j48o4J00j4m3
6987A12j62o8J13j89M90m03L10k88k49N82j14J09k07N7N3j48L1J3j29L63k90K90
7009B76l08Q7l41P40n19K35M3l3l00J47L5N7n3p9KL25j98k09K91l8j24J38l3j30
7033A1L7K93J48m17j38L70k38J63l86K54l03L95l7j41K20k37P3k82M54m54K01
7054a4m3%J34N3l94L64j88q3N65k03m83L92l82L14j08Q0J81l15L04j28k09K75
7076A12O5n13M34k56K22L0N7n48L14L39j54J39p8l96L28j51K74l70J8J9J59n0
7098fJ36Q2j27K70m39K67lj59Q7m69K53K60r6q9kJ2J57l30L02q9R8k02K00j01
$$ plain form
6939 -209 81 71 -28 -19 106 23 -43 90 266 40 -15 54 -108 1 101 30 27 -6 -45 -88 184 -225 27 136 -54
6964 -54 -96 184 104 -139 185 -223 -111 -2 123 43 19 221 -116 165 59 131 12 281 133 69 169 155 112
6987 112 -50 -118 -5 -194 296 -107 203 -85 -334 248 134 243 36 93 146 -2 29 42 -87 276 -14 276
7009 276 -32 55 -286 454 -65 170 213 180 -120 27 62 119 66 -13 -11 314 116 -93 198 160 36 174 141 11
7033 11 48 341 489 72 -66 304 66 229 -157 97 -206 189 152 11 231 -6 67 -215 239 -215 -14
7054 -14 -57 -57 77 130 -264 100 -88 -171 394 191 -292 100 -282 32 -76 4 185 -130 174 46 -163 112
7076 112 177 -336 98 -158 64 94 151 -397 -83 256 102 241 163 -233 95 -56 218 -152 -134 -115 44 -6
7098 -6 130 212 85 355 -84 183 180 21 108 -361 -108 152 56 -33 -35 -23 134 -196 106 17 115 -87 113 12
7122A2j16M2J49J46n76M21k83O1j97K53m8j6r2L51N9j34j97J74k45L95k64J33
7144B8M7p8lJ77K5l66J09J20L0j86K72M6L2j83j53P7l2k30L54k16J63j14K47n82
7168d16J39J87QJ68J1m0J51k52j31K78l45J13M93n20J95m09J24L87m70K59nm4
7190a19k2J70j00K03J24j00k15r8L70J6j56q6M1k3J20L07n49j86K63P2Mpq7K37
7214A79j84N4l35K51j16M48m51J40l7l54M02r6p3L09k56P6K96l9m97L0J62O7n8
7237h2rl4J04J6j66J21k14J79J25l68N1J67Q5J02j79r1K88m9K00l89K01K59l8
7260B79j76j77O0K00n7o5n9N2J45l81L94k75J95l13J21J73k10m6O2K50k30KQ8
7283C2J1n39N23Q4j30n1J44L17l77j58L37N1P1j82m97L64J23O2p3j67PL43l10
$$ plain form
7122 12 -104 -62 87 233 -343 78 -205 -144 -341 -88 -136 -152 -244 107 166 32 -165 9 -236 159 -105 28
7144 28 75 -3 -6 171 196 -170 -61 59 89 -97 175 221 253 70 -83 -6 -38 -268 86 -130 33 -81 166 -416
7168 -416 -277 -90 -82 86 97 57 208 -44 -175 103 -242 -129 364 -156 39 -370 -246 141 -329 -70 -75 -119
7190 -119 -141 29 -71 132 256 156 -59 -157 213 229 73 -13 28 5 125 432 -117 -303 -40 32 36 29 -58 179
7214 179 -5 49 -286 -35 -151 297 -154 -14 -51 -405 -3 -99 -172 137 -119 -43 253 214 -283 -253 -91 -24 -82
7237 -82 -91 -125 -21 -5 -171 -50 -264 -85 40 -328 -277 -110 -25 77 -102 -193 95 46 246 -143 58 317 279
7260 279 103 -74 -14 186 129 64 5 57 202 -179 215 -60 135 -178 -57 116 -94 -140 -78 172 -58 -56 32
7283 32 43 -496 27 111 -19 -70 74 391 14 -144 193 244 315 133 -364 0 123 185 112 -55 -48 295 -15
7306a5M0k2Q0N4l96L8L25j55m7J34J74l11j1O0l5l71O03q0j31O0O4m00L33n2K3
7331c8P3l35M35k00K22k52j50L30j99J23P3M2l88M37m16j00L76l07K15J01l3k8
7353a9P3j50r3L59l95L67K1q4l39J62p1N10l65k35N73n85MJ09K50k48J34j29L43
7376A92o0j50P1k35M77n87M98k12j96K72o0J61k08K3J0K9J56n73J50M14k48jp7
7399a54R3M0j52j42K56J34k11K3r3L62k78J31k37J55j10j49M58k08o5J19P7j09
7421f0J40m5J2RJ66j97j2j88J75m2r0M16l33L2J9NR5j44k7k96M41J48j49L76l48
7446A03r3q3J09j87j0M86m5l13k6r3N9N3l04N43k62k42O3J53J50J80l52K9M74
7469C92m42K9j09L1L75k91mK47k80k49N54j58l92K36K29m86O2L43Q0k24J13P3
$$ plain form
7306 -15 25 3 83 137 -259 -221 104 -51 -98 36 210 -101 -112 -52 -87 -458 145 65 -66 -6 58 -342 -9 -61 -38
7331 -38 35 -300 135 -65 157 -95 -245 85 -114 9 82 124 -264 173 -243 -343 33 -274 -59 42 9 -19
7353 -19 54 -96 -189 170 -225 142 163 79 -260 -98 -169 341 -24 -259 314 -271 -267 -158 92 -156 -22 -151 192
7376 192 132 -18 53 -182 295 -292 206 -6 -202 70 10 171 -37 -14 -4 25 181 -392 -242 172 -76 -77 -154
7399 -154 -61 -21 -173 -315 -59 75 -136 -113 -206 156 -122 9 -228 -73 -183 -332 126 -82 -147 -28 49 -60
7421 -60 80 35 47 56 222 25 13 -175 0 -42 -132 284 -49 -17 2 7 102 -42 -69 -365 76 224 75 451 103
7446 103 10 -73 36 -151 -161 325 280 -33 -59 -152 -93 -40 -344 199 -63 -305 -242 -89 61 241 -111 -82 392
7469 392 -50 -21 -130 -99 276 -15 -19 228 -52 -301 253 95 -297 -61 168 -318 -256 87 167 -57 56 129
7491A29m8J88l35k75L38k56L60j19%L8n2j2n6J31k49L65m36K5q4M57k18J43j13
7514g9J43n8o7P6k18J55J24j89J70L54m47q1J80K5j78L0K31M4k60r6K15o0J94
7537B08m07K80p7K72l31Q5L22n24K21J6J09l4k53O1q7K65j90k11M49l61N4N4J72
7560I3k13OJ29pPk69N48k07m63N65j43R8l12M36j05j9p7J74j89j14J00N0Q3k16
7584d5N4j8L5K53l60L83j98q5K3P7m9K05k67J83l34K73j35j05k4L51j49m5p1J32
7608H4K01l94J28K89k27k75J72L9l72M30J65k20Jk88J79qj40N3K74k73L52k77
7630a07K5j40L13r7L0k59j5J96l5j94L63l11n9M85k78K25j5k2J6k11L8J67O8Q2
7654B65l02m5j39M23k60j3j09n2J31O8J62J39j37m00L53m14L53J17k83J80j86
$$ plain form
7491 129 81 269 -66 -341 -3 -259 101 -18 -18 20 -32 -44 -100 31 -218 147 -289 -264 -348 109 -109 34 -79
7514 -79 64 6 -61 15 -203 -48 76 -113 57 411 -36 -117 63 88 -90 -60 171 215 -45 -141 74 14 208
7537 208 -199 81 4 276 -55 30 352 -172 49 65 174 140 -113 -52 -139 126 -64 -275 174 -187 -133 -79 93
7560 93 -120 -114 15 8 15 -254 294 87 -376 189 46 144 -168 268 163 144 67 241 52 -62 38 88 171 -45
7584 -45 9 -9 26 279 -81 302 104 19 42 119 70 275 8 191 -143 130 -5 -110 -134 217 68 23 -48 84
7608 84 285 -109 19 308 81 -194 -22 17 -355 75 240 20 21 -267 -88 -96 -236 -183 91 -182 170 -107
7630 -107 -82 -222 91 -6 24 -235 -250 -54 -89 -283 80 -231 -290 195 -83 142 127 105 121 -90 -52 115 183 265
7654 265 -37 -82 -221 202 -58 -71 -180 -232 -101 -33 129 268 131 -269 84 -330 23 140 -143 37 -149
7675a49N4j46K83N6k5j32l34M37J99k90l23J31J61K4J81l18k8K42K70l10Q5o7
7697Aj37K91j62J72L3p2l24L93J0N9m19J4K92k74J52n6j15O4k0J65J48j31j38
7720e4M6o2K10J3j45j91J55k2L6r1Q9m05M36j18K53j22N3ml4J29j50k18J41p8
7744a33j8M00k46l4r4K21J9k86J0J89L3p6J81m0k79L78n23L30K90o54M42k80J41
7767b9K09nl9P8r3k18J00j31J5J72K9j73J72Q1j73O6K22j20m87K69J42k67K09
7790B9k63K31j43N87n05Qj19j3J19N3j80J44l28K91k83L72l32J9L31j05K7r7M17
7813B60j54j08j7N9j3O4j29L53j63QJ03n39Q2K2j00N97j58k10o6N8R7r8l6K16
7837A28j68J84l81K34O0j60K35k7m16J74N5M8nJ66k24K0J40j85k40M71J21k51
$$ plain form
7675 -149 -95 -241 42 98 73 -59 -393 44 243 -47 -370 -239 -78 -54 127 -191 -219 23 293 -17 68 1
7697 1 -136 155 -7 165 198 126 -198 195 205 264 -155 -141 151 -123 29 -27 -142 -78 -98 67 215 84 -54
7720 -54 -8 -70 140 153 8 -183 -28 -50 -14 -105 -16 -421 15 -103 150 28 81 77 43 172 22 -196 -55 -133
7744 -133 -151 249 3 -31 -125 96 115 -171 -161 28 61 -15 166 126 -153 225 -298 32 322 -332 110 -170 -29
7767 -29 180 175 136 214 121 -97 3 -128 -113 59 88 -85 87 168 -5 61 283 163 -324 -55 87 -180 29
7790 29 -234 -3 -146 441 -64 -56 -175 -188 -69 -16 -196 -52 -380 -89 -372 0 -332 -313 18 -87 -60 -157 260
7813 260 106 -2 -19 40 27 91 -38 315 152 160 263 -276 -194 -172 -272 325 167 -43 -109 -51 46 -52 -88 128
7837 128 -40 144 -237 -3 57 -103 132 105 -311 -137 -82 -34 -39 127 -97 -77 63 -122 -362 109 230 -21
7859b1j57O3L2n6j01P5J90q4J20l55L21j63J54M2J22l78K72p6M03n93O8Q0P6j00
7883f6P2j11k70N37K3k78q7K73j6l07J96L30o64K59K38j14j40M6j9K79k91K18
7905A08q5j08P9kj56m18P70j19k80J60r8M9K25k21J39j31K31k98K35l07K87M26
7927D86o40N31l21nJ22j27k00J90k42L64j82N7J25J29j53k70J93o5m0mJ61j23
7949a4R7l0j86L79l18L9k7p3N53o12J50K49l85j28L18Q2k48K44j71K93l4m19J36
7972a05J36k28P6Q9k16k5K12l4R8J70q3k36J87J10l73o7J02L26k35K18q9J86j07
7995A12j34j4J62Ml48J21K02j91M7L2n7j0J26l9M2J35k20j68L71l0k15q2R1k50
8019c13M49l00k9m5K09l40L41J21j51J46k45N9K04r4q6K34k6l72K14J57l49J82
$$ plain form
7859 -21 -178 -115 -83 -139 -240 -165 25 -59 61 -294 27 -136 18 60 182 -196 76 0 403 -190 -122 -42 34 -66
7883 -66 6 -105 -375 162 185 -93 -180 93 77 -230 -34 296 -368 -109 129 15 -125 -79 -98 181 -110 108
7905 108 23 -85 -6 -8 -164 -582 188 69 -211 -51 -149 -100 125 -96 43 -88 143 -155 80 -227 60 486
7927 486 -154 377 56 51 173 46 -154 36 -206 158 -24 33 158 287 134 -136 57 -8 -48 -52 109 -14
7949 -14 83 53 -133 246 -72 -33 -60 -133 420 -192 -42 207 -178 -306 12 94 -154 90 -81 212 178 -241 -105
7972 -105 31 -197 -121 -32 -248 -273 -61 -95 3 173 90 -146 41 151 -222 -289 -187 139 -96 122 33 219 112
7995 112 -22 -36 126 130 -218 -97 105 -86 -39 -7 -64 -74 52 13 55 190 -30 -198 173 143 -72 -154 -63 -313
8019 -313 136 -164 -193 -238 -29 -369 -28 93 -58 88 -157 -98 106 12 -74 160 134 -238 -24 133 -216 -34
8041c4QK59m9k14j1l2J42j55o5l3M00j2k93J15j65p0n6L84j34j17K44O1m11J05
8065a33J74N9l33P1L75n3j73K97l51J23lj7l2l5K0J80r6K9j7p3r2J10K74jl62
8090e9J81R3k92L96l11J67k78K19j53M91j73qj16k25J59q9j82J62oJ64J79l92
8112g3K36k19P9j66J47k78L1L37j95L17l38m62N88j74J07O8K40l61k07K18K97
8133A92j03j87j35L27k80J12N06j68k10j3J44n30O41o19J73m4J62Q8r5r6J42K99
8155C06l95L3J48J51N1k21p5k15K71K65l68O6J4m4J94k98KJ86q0J98o0l89L78
8178A18m1l9K17l08K74j99p9P2k93L91r2Q7k38
$$ plain form
8041 -34 -26 233 184 -30 -41 -73 69 -86 -151 -184 216 204 -89 26 -139 -209 -265 119 -15 -132 112 173 -238 -133
8065 -133 41 100 -233 -162 213 160 -13 284 -67 56 53 36 4 -31 -11 169 73 102 85 12 -80 30 304 303 -59
8090 -59 122 215 -77 319 8 175 -103 116 -37 454 281 273 157 -68 91 2 -180 -18 -24 140 319 -73
8112 -73 163 -56 23 -143 4 -274 -243 94 -101 216 -122 -584 4 -170 -63 5 245 -116 -323 -105 192
8133 192 89 -98 -233 94 -186 -74 432 264 54 41 185 -345 296 -323 -150 -194 -32 56 -39 -135 7 306
8155 306 -89 -56 92 243 294 73 -2 -217 54 319 -49 17 31 -13 181 -117 -115 71 -9 189 129 -260 118
8178 118 77 38 255 -53 221 22 -57 15 -278 113 21 108 -130
8191a30
$$ Imaginary data points
##PAGE= N=2
##DATA TABLE= (X++(I..I)), XYDATA
0@%%%Qj6QjRk4K4k4M0n4O2o6Q2j04J20j37J61j93K26k58K96l42L93m47N07n76
29c06O50p30Q18r15J021j139J269j410J567j737J922k130K360k611K890l204L556
46A871l952M404m931N547o272P146q231R614j1433J3950j7676K3734l5156O3690
60D2305k51846l97322Q70259K27946q28734j27955Q20853j7644p53122J24158
70b91102P02187k27265o13543K88010N36259l31338m31337L47644L42673l54990
80c2802k51780L43967J88670l26799j36861K92851J06985k59125q6211K19615
90E8510P2082j97415o4979J86522O2865j96961o9330K12035P4278k36243p6643
101a75279K56422O3418k78582l5460K98657p614l19851N9066L38451j12632l45453
$$ plain form
0 0 0 0 0 8 -8 0 -1 8 -16 8 -16 24 -30 32 -34 48 -56 64 -73 88 -105 121 -137 159 -183 210 -237 270 -306
29 -306 344 -386 432 -483 538 -601 668 -742 825 -912 1010 -1120 1240 -1371 1519 -1685 1871
46 1871 -2081 2323 -2608 2939 -3333 3813 -4418 5196 -6237 7713 -9963 13771 -21385 42305
60 42305 -209541 -606863 263396 491342 -337392 -465347 355506 337862 -415260 -291102
70 -291102 411085 183820 -429723 -141713 394546 63208 -368129 -20485 322188 -32802
80 -32802 -284582 59385 248055 -78744 -215605 77246 184231 -74894 -161105 58510
90 58510 130592 -66823 -131802 54720 117585 -79376 -148706 63329 137607 -98636 -175279
101 -175279 81143 144561 -134021 -169481 129176 121562 -198289 -139223 199228 86596 -258857
112b58857J66079L38489k17949l11288K71273K69065l21690k13688L69826J55590
122B46850m01850r1905M17087K8783m11662L7934L91277j01627l58146J62365
132h0894L23449k08604k84195K39239K42535k51153j95315K52823J48286k47040
142f0869j01560K39788O4007k30983l6517K20488K3202k05253j7131J90316J5185
153A00673j77470j1961J72730R443j76709n338J87736K569k01727K830K13770
164A16546j3788k20467L2691K23594o1385k24583R5652K22448j31952k17893J66134
175a3003K06471j96975j86027K22155J53999k45938j15433K66096P2701k80872
185a16826l1093K87090j0009k82525M7989K67364q5461k43446J19942K16785j49715
$$ plain form
112 -258857 -92778 245711 27762 -283526 -12253 256812 -64878 -278566 91260 246850
122 246850 -155000 -246905 170182 198965 -212697 -174763 216514 114887 -243259 -80894
132 -80894 242555 33951 -250244 -11005 231530 -19623 -214938 37885 186171 -60869
142 -60869 -162429 77359 141366 -89617 -126134 94354 117556 -87697 -104828 85488 100673
153 100673 -76797 -88758 83972 93415 -83294 -88632 99104 101673 -100054 -97224 116546
164 116546 102758 -117709 -85018 138576 77191 -147392 -51740 170708 38756 -179137 -13003
175 -13003 193468 -3507 -189534 32621 186620 -59318 -174751 91345 164046 -116826
185 -116826 -147919 139171 129162 -153363 -105374 161990 76529 -166917 -46975 169810 20095
196B0095j88725J73092J60934j85334j32957J91376J05313j90141p5953J87364
206F5064N0245j81739k7942J77844J2352j70928k058J63256m254j55348J1874
217f1634J48099k0204j44310K8864J44660m0110j48312N0472J50120o3120j50814
228a06289P5514J46596r3067j39888J11207J28814j31578j17011J50123J01488
238A25909j66057q2597J77853N9580j85959l2713J91961M873j93450K4358J92397
249A16155n0502j85010P5540J73640r5764j55935J15937J36511j30459j15280
259a15167J43591R4966j51377p4774J55953N6292j56429l8315J55486K0396j53613
270f2991m651J49851r710j47372K1187J42398l2377j38882M0011J33480m9995
$$ plain form
196 20095 -168630 4462 165396 -19938 -152895 38481 143794 -46347 -122300 65064
206 65064 115309 -66430 -94372 83472 95824 -75104 -77162 86094 81840 -73508 -61634
217 -61634 86465 66261 -78049 -49185 95475 55365 -92947 -42475 107645 44525 -106289
228 -106289 -30775 115821 22754 -117134 -5927 122887 -8691 -125702 24421 125909
238 125909 -40148 -122745 55108 114688 -71271 -103984 87977 92850 -100600 -76242 116155
249 116155 65653 -119357 -43817 129823 34059 -121876 -5939 130572 113 -115167
259 -115167 28424 123390 -27987 -102761 53192 109484 -46945 -85260 70226 90622 -62991
270 -62991 -67642 82209 72499 -74873 -53686 88712 56335 -82547 -42536 90944 40949
281D0949j29499N8619J24253p0073j21480P9814J16621r1651j11584J02933J03709
292A02611j14740r3161J25563Q0964j36298o5246J45115N0452j51214l3162J56396
303F7280J6029j57066L064J56234k0689j51518M0718J45841n7732j35828P3759
314a9908J25980q7911j12418J00369R7484j09467q1464J16151O6020j21549n1252
325g7965J24104L6364j25762k2680J24980R324j25759L565J22363j7090j20519
336f9075K8997J15742m1574j11697N2095J05169o3504r9735P2581R2142q2207
347a066q4670R0836P6456r9894o7379J07783N6891j14511m4923J20982L2204j24504
359e1795j8154J27214M598j26706R770J26228k2509j22613L6298J18653m7478
$$ plain form
281 40949 -88550 -29931 94322 24249 -97231 -17417 99204 7553 -104031 -1098 102611
292 102611 -12129 -105290 20273 101237 -35061 -100307 44808 95260 -55954 -89116 67280
303 67280 83309 -73757 -70693 85541 64852 -86666 -45948 99893 42161 -93667 -19908
314 -19908 106072 18161 -94257 6112 103596 -5871 -87335 28816 94836 -26713 -77965
325 -77965 46139 82503 -43259 -65939 59041 68365 -57394 -53829 68534 51444 -69075
336 -69075 -40078 75664 34090 -77607 -25512 79657 16153 -83582 -11001 81141 -1066
347 -1066 -85736 5100 81556 -18338 -85717 22066 78957 -35554 -80477 40505 72709 -51795
359 -51795 -69949 57265 61863 -64843 -55073 71155 48646 -73967 -37669 80984 33506
370C3506j13374N9833J06881o9862r8585Q0857Q9346q9366p8778R6627O7031j01915
382a7799n5357J05973M2874j08606l1700J09602J9558j11450q473J10088k448
393E2262j10223J3777J07220k6113j05144L6776R9482m7811r4317N7612Q6953
404G0474o7863p9244P5547P0077q2605o1204Q9756N1744r5571m0391J00280K9707
416F0707j04597j7036J07701N029j07219Q017J06945j9584j03528L1439R9768
427F7642m1381r3552N1172Q8944n9536q2068O7727P5230p5349o6845Q2183N8181
439G2348q7569m9218R1922L8870r5851k9617R7412J9634r8550j0901R7982J130
451D7592r8595P849R6409j8106r5240K7166R2318l7426q9107M6769Q3594n6266
$$ plain form
370 33506 -79868 -20035 86846 16984 -81601 -744 88602 -764 -79542 17085 84116 -17799
382 -17799 -73156 32817 75691 -32915 -64615 44987 64545 -46905 -55378 54710 52262
393 52262 -57961 -44184 63036 36923 -68221 -31445 68037 20226 -74091 -16479 70474
404 70474 2611 -76633 -1086 68991 -13614 -74818 14938 66682 -28889 -69280 31000 60707
416 60707 -43890 -60926 46775 51804 -55415 -47398 59547 39963 -63565 -32126 67642
427 67642 26261 -67291 -16119 72825 13289 -68779 -1052 74178 -1171 -68016 14167 72348
439 72348 -15221 -64439 27483 66353 -29498 -59115 38297 57931 -40619 -51520 46462 47592
451 47592 -51003 -43154 53255 35149 -60091 -32925 59393 21967 -67140 -20371 63223 6957
463F957p6523O4224O8802p0996o0006P7636N1647q3404m1544Q8101L2067r0082
475c3121k1118R2735J0555r2910J371R3154j2147r0615K2872Q8260l2069q3723
487e6756M1739P8144m9865p1319N6895O5146o4241n8162P0430N0864p5693m4006
499e6824P9548L5646q2994k7017Q5527J7466q8266q409Q9144n71q9836Q315Q9155
512E0884j6934q6869K4463Q4073l3449q1022M2412P7369n0436p3078N8001O7222
524F2636o3918o0494O9399N2830p4381m2980P8725L3655q2457k4794Q5056J6833
536E0110q5803p904Q4663r29q2078J0386P9705k0958p6010K9914P2827l7385o8019
549e1481M3239O2136m8358n4056N3202M6207n8246l8074O3329L0904o6780k4885
$$ plain form
463 6957 -69566 -5342 63460 -7536 -67542 10094 61741 -21663 -63207 24894 56961 -33121
475 -33121 -54239 38496 49051 -43859 -42488 50666 38519 -52096 -29224 59036 26967 -56756
487 -56756 -15017 63127 13262 -58057 -1162 63984 -257 -58419 12011 62875 -12818 -56824
499 -56824 22724 58370 -24624 -51641 33886 51352 -36914 -45323 43821 43250 -46586 -38271 50884
512 50884 33950 -52919 -28456 55617 22168 -58854 -16442 60927 10491 -62587 -4586 62636
524 62636 -1282 -61776 7623 60453 -13928 -56908 21817 55472 -26985 -51779 33277 50110
536 50110 -35693 -43597 41066 40137 -41941 -31555 48150 27192 -48818 -18904 53923 16538 -51481
549 -51481 -8242 53894 5536 -48520 4682 50889 -7357 -45431 17898 48802 -17978 -42863
561d2863O9507J8364o9490j0591O9534J825o9534P684O9964j6790o9397K4103
573a7684O8654l0636o6046L6589O1104m3713n5490N0973M9803n9829m5134O5911
585A4502M0290p2016l4923P4060K6874p6142j8189P8085O597q0937K376Q1889
597D2466j0226q3015J6513Q1242k3423p6776L0770P1513l9021o6450M8009O2606
609E4208n4888n8456O0474N4111o2362m7243O5168L8620o6318k8669P0047K1283
621D5975p2341j5875P5480J0384p4203m805P1967j162o8815R950O6140j9392o4936
634d1633K6964O3691l2449o1758L5570N6643l9215n0410M3389M2598m9854l6117
646d2581N5621L1071o1441k6892O2975K1273o3050j3895O2131M018o1594O100
$$ plain form
561 -42863 26644 45008 -24482 -35073 34461 36286 -33248 -25564 44400 27610 -41787 -17684
573 -17684 50970 20334 -45712 -9123 51981 8268 -47222 3751 53554 -6275 -51409 14502
585 14502 54792 -17224 -52147 21913 48787 -27355 -45544 32541 39138 -41799 -39423 42466
597 42466 32240 -50775 -34262 46980 23557 -53219 -22449 49064 10043 -56407 -8398 54208
609 54208 -680 -59136 1338 55449 -6913 -54156 11012 49632 -16686 -45355 24692 45975
621 45975 -26366 -42241 33239 43623 -30580 -35385 36582 35420 -33395 -23445 42695 23303 -41633
634 -41633 -14669 49022 16573 -45185 -9615 47028 7813 -42597 792 43390 -6464 -42581
646 -42581 13040 44111 -17330 -44222 18753 40026 -23024 -36919 25212 29230 -32364 -26264
658b6264O2139j5011o2994K1827O1887k6087n7642L0648N1554l6515m3934M3962
670C570L8315n1569l3116N6966K9480n9727k4134N9424J6016n7730p030N8028
682B8493k800n9642J0187O0610j5443o0861J8460N7819k2195n2487K6894M7586
694C6621l4754m3175M1829M0566m7077l8620M9996L5937m9889l0952N1219K3828
706C5529n3000j6155N7997J1023o2679o685O6423L536o5671M23O5003p514o1739
719c3509J6854O0470k5919n9679L2833N9696l8061n7891M1024N3290m5793m6110
731d2795M9914L8420n7654l1814O3732K5424o7824k1225O8281J4253o6190o562
743c4040O2776l730o0345J2112N9641j9396n8406K3927N5854k6309m9955K8977
$$ plain form
658 -26264 35875 20864 -42130 -20303 41584 15497 -42145 -11497 40057 3542 -40392 3570
670 3570 41885 -9684 -42800 14166 43646 -16081 -40215 19209 35225 -22505 -29535 28493
682 28493 25693 -33949 -23762 36848 21405 -39456 -20996 36823 14628 -37859 -10965 36621
694 36621 1867 -41308 521 41087 -5990 -44610 5386 41323 -8566 -39518 11701 35529
706 35529 -17471 -33626 24371 35394 -27285 -33970 32453 35989 -29682 -29259 35744 28230 -33509
719 -33509 -16655 43815 17896 -41783 -8950 50746 12685 -45206 -4182 49108 3315 -42795
731 -42795 7119 45539 -12115 -43929 19803 45227 -22597 -43822 24459 38712 -27478 -34040
743 -34040 28736 25006 -35339 -23227 36414 17018 -41388 -17461 38393 12084 -37871 -8894
755h894M3293l2234l5225L7031K9590m0090k5634M2707K4074m1414k0773L9941
767A2372J6862l7652j0724L8352N909m0472j342M3247j348m4483L856M3808o958
780B1427m2212J2233L9618j9697l8100K7063L7712l4366l6554L8401L3700m1539
792b314k8741M5757K0169m9649j2261N5129M115n8873K812O0524r456n8347J6155
805a4980N5058k4039m9525L2084M5686l9410m1366M4396L8015m6960l2760M8019
817A4218K5931m8182j9059M8988J1757m9894o931N0625L477n0217k061M7228l46
830B5534m4885K497M2614o680m2390R252M2893j2289m4349J3630M4819j6170m4168
843b9692J8785M1815k3053l9969K9153L7722l4682l5780L9571L3556m3448k9250
$$ plain form
755 -8894 34399 2165 -33060 3971 33561 -6529 -32163 10544 34618 -6796 -27569 12372
767 12372 29234 -8418 -19142 19210 25119 -15353 -16695 26552 25204 -19279 -15423 28385 21427
780 21427 -20785 -8552 31066 11369 -26731 332 38044 3678 -32876 5525 39225 -2314
792 -2314 -31055 14702 34871 -14778 -27039 28090 32205 -26668 -23856 36668 27212 -31135 -14980
805 -14980 40078 16039 -33486 -1402 44284 4874 -36492 7904 45919 -1041 -33801 14218
817 14218 40149 -8033 -27092 21896 33653 -16241 -23172 27453 30930 -19287 -21348 25880 25534
830 25534 -19351 -16854 25760 19080 -23310 -14058 28835 16546 -27803 -14173 30646 14476 -29692
843 -29692 -10907 30908 7855 -32114 -2961 34761 79 -35701 3870 37426 -6022 -35272
855c5272M6811K3096m8666j5212N2057O763n3677R69N5324q451n3209J5278M9641
868C5452k1401m4445K8258L8189l4121l2330L8290K6926m1409k1511M2100J5102
880B9100m1675r474M0158K984l9292J487L8369o374l7118R001L4185j0748l2724
893b2121J2183K9905j3852k8758J5816K7616j8018k7793J9601K8277k1920k8120
905b7184K4445K7180k7303k5141L1095K2925l5433j9788L9808J6952m3277j2767
917b8488M6183Q045m7870j288M9356n531m9325J3096M8808j9580m6131K5677M3386
930C6338l1774l8060L6536L1923l9811k5556M2804J8936m4329j2960M4282P540
942B5869m3836k021M1265k420l9826P207L6932j1002l4367J3248L1327j5410k8992
$$ plain form
855 -35272 11539 34635 -14031 -29243 22814 29577 -24100 -23131 32193 23742 -29467 -14189 35452
868 35452 14051 -30394 -2136 36053 1932 -30398 7892 34818 -6591 -28102 13998 29100
880 29100 -12575 -22049 18109 21093 -18199 -16712 21657 15283 -21835 -12834 21351 10603 -22121
893 -22121 -9938 19967 6115 -22643 -6827 20789 2771 -25022 -5421 22856 936 -27184
905 -27184 -2739 24441 -2862 -28003 3092 26017 -9416 -29204 10604 27556 -15721 -28488
917 -28488 17695 25740 -22130 -23418 25938 20407 -28918 -15822 32986 13406 -32725 -7048 36338
930 36338 4564 -33496 3040 34963 -4848 -30404 12400 31336 -12993 -25953 18329 25869
942 25869 -17967 -19988 21277 18857 -20969 -13762 23170 12168 -22199 -8951 22376 6966 -22026
955b2026J6315K6515j7521k4768J8422K3114j9542k2760K1288K2079k3237k1563
967b3684K5866K0019k7888j8543L0744J6632l3874j2782L6410R625l8738n377
979b1590M0717J049m1794M453M2565r512m2082J5747M0468k1241l7513K7109L3743
992C2119l1972k8578L5503K3380l7913j7909L9725J1852m0158o602L9845Q52l8657
1005a8513L576L6191p677l4505J1148L1789j4472k8968J6315K5861j8485k3576
1017b1316K0046K0355k0820j8473K1230J6584k1974j5359K3107J4081k4511j2649
1029a9699K6563J0420k7705p992K9188O164l0989k984L2553l60l2726M140L3127
1042A9700p378l3619J2522L2773j5822l1634K0418K9619k4574k6693K8762K3513
$$ plain form
955 -22026 -5711 20804 3283 -21485 -3063 20051 509 -22251 -963 21116 -2121 -23684
967 -23684 2182 22201 -5687 -24230 6514 23146 -10728 -23510 12900 22525 -16213 -21590
979 -21590 19127 20176 -21618 -17165 25400 15888 -26194 -10447 30021 8780 -28733 -1624 32119
992 32119 147 -28431 7072 30452 -7461 -25370 14355 26207 -13951 -20553 19292 20144 -18513
1005 -18513 -14937 21254 13577 -20928 -9780 22009 7537 -21431 -5116 20745 2260 -21316
1017 -21316 -1270 19085 -1735 -20208 1022 17606 -4368 -19727 3380 17461 -7050 -19699
1029 -19699 6864 17284 -10421 -18413 10775 16939 -14050 -17034 15519 15159 -17567 -13427 19700
1042 19700 12322 -21297 -8775 23998 8176 -23458 -3040 26579 2005 -24688 4074 27587
1054B7587l2140j8870L3853J4877l5940j0042L6473N174l6517o53L5555l242l4708
1067a8593O934L2856j1040l0985J3566K9153j6927k6544J9134K3648k1398k0332
1079b0528K1771J7658k2998j5469K3493J3012k3855j1337K4761Q933k4827p151
1091a6537K5798M738k6452j982K6970q49k6942L654K7183o081k6665R417K6377
1104A8629j2257k4638J4987K3750j7982k1474K0982J9754k3451j6801K6226J3720
1116B1445k8095j0296L0222O097l0913k267L1187j357l1075N012K9706q455k8517
1129a7306J1086K7034j4581k5787J7392K3465k0400k1429K2212J7480k3527j5490
1141a9851K4925J1752k6036r061K6564O105k6610m400K6989J705k6470K37K6633
$$ plain form
1054 27587 -4553 -23423 10430 25307 -10633 -20675 15798 20972 -15545 -16198 19357 16115 -18593
1067 -18593 -11659 21197 10157 -20828 -7262 21891 4964 -21580 -2446 21202 -196 -20528
1079 -20528 1243 18901 -4097 -19566 3927 16939 -6916 -18253 6508 15441 -9386 -16537
1091 -16537 9261 13999 -12453 -14435 12535 11686 -15256 -11602 15581 9500 -17165 -7748 18629
1104 18629 6372 -18266 -3279 20471 2489 -18985 1997 21751 -1700 -18501 7725 21445
1116 21445 -6650 -16946 13276 19373 -11540 -13807 17380 16023 -15052 -10040 19666 11211 -17306
1129 -17306 -6220 20814 6233 -19554 -2162 21303 903 -20526 1686 19166 -4361 -19851
1141 -19851 5074 16826 -9210 -18271 8293 14398 -12212 -16612 10377 12082 -14388 -14151 12482
1154A2482k715k6131O079K5689p833k5105J0901K4390j2865k2603J5185K1490
1166A8964j6664j8866J9065J7603k0898j5364K2984J3555k4468j0923K5031R050
1178A9069k6225n859K6847K047k7132J095K7194m727k7200O688K6055r550k4964
1191a6662J1755K2745j4731k1219J7434J8809k0407j6886K1480J4527k2558j1762
1203a7475K3036Q496k3491m855K3639K116k4311J171K4338k908k3163N118K2227
1216A3938o929k0110R501J9089j2084j7313J4475J6436j6004j5114J7108J3028
1228A6021j7565j0615J8142P725j9518n801K1168L524k3174j856K2928J32k3348
1241a2237K459K1520n606k1270Q625K0858j1830k1301J4408K0268j6151j8745
$$ plain form
1154 12482 9767 -16364 -10285 15404 7571 -17534 -6633 17757 4892 -17711 -2526 18964
1166 18964 2300 -16566 2499 20102 -796 -16160 6824 20379 -4089 -15012 10019 19069
1178 19069 -7156 -13015 13832 15879 -11253 -10158 17036 12309 -14891 -8203 17852 8302 -16662
1191 -16662 -4907 17838 3107 -18112 -678 18131 -2276 -19162 2318 16845 -5713 -17475
1203 -17475 5561 14057 -9434 -14289 9350 11466 -12845 -11674 12664 9756 -13407 -8289 13938
1216 13938 7009 -13101 -3600 15489 3405 -13908 567 17003 999 -14115 2993 16021
1228 16021 -1544 -12159 5983 13708 -5810 -11611 9557 13081 -10093 -11949 10979 11111 -12237
1241 -12237 -9778 11742 6136 -15134 -6509 14349 2519 -18782 -4374 15894 -257 -19002
1253a9002J7224J6507j9160j3472K1263J1496k3648r423K6557P728k7175n592
1265a6697K7563L309k6568J120K6438m611k5851Q120K6355j0254k5884J1967K4433
1278A9440j3099k2005J4684J9171j6738j6658J8914J5203k1448j4440K1748J2702
1290A7474k1321j1144K0508P705k0349n334K0331K557k1833j265K2295K49k2327
1303a2454M79K0684k142j8846M902J7454q125j6990J1135J7065j2287j6120J2528
1316b717J5066j2745j1970J4125Q900j5805n909J8393M570k0532k333K0890R76
1329A0909j9211K021J8180o010j6328R821J5897j3106j5561J5207J4966j5789
1341I96j2792J6337R347j7413n763J9112L043k1672p22K2644l54k2333J663K0368
$$ plain form
1253 -19002 -1778 14729 -4431 -17903 3360 14856 -8792 -18215 8342 16070 -11105 -16697
1265 -16697 10866 14175 -12393 -11273 15165 10554 -15297 -7177 19178 8924 -16960 -4993 19440
1278 19440 6341 -15664 -980 18191 1453 -15205 3709 18912 -2536 -16976 4772 17474
1290 17474 -3847 -14991 5517 13222 -7127 -12461 7870 10427 -11406 -12671 9624 9873 -12454
1303 -12454 -11975 8709 6567 -12279 -7377 10077 1952 -15038 -3903 13162 875 -15245 -2717
1316 -2717 12349 -396 -12366 1759 10659 -5146 -11055 7338 11908 -8624 -10957 9933 10909
1329 10909 -8302 -6281 11899 5889 -10439 -618 15279 2173 -13388 1819 16785 996
1341 996 -11796 4541 13888 -3525 -9288 9824 12867 -8805 -9527 13117 12763 -9570 -7907 12461
1355A2461l806j8333O227J7553r627j7440J1508J7911j2178j8285J1831J7605
1367A5427j2607j5591J3426J3063j5697j2251J8451J1408k0566j1347K1253J0404
1379A5373k0987r116K0500O222k0696l786K2846L38k4593J558K5856k861k5240
$$ plain form
1355 12461 8655 -9678 -3451 14102 4475 -12965 -1457 16454 4276 -14009 -2178 15427
1367 15427 2820 -12771 655 13718 -1979 -14230 4221 15629 -4937 -16284 4969 15373
1379 15373 -5614 -14730 5770 11992 -8704 -12490 10356 10694 -13899 -12341 13515 10654 -14586
$$ [...]
8191A32
##END NTUPLES=NMR FID
##END=
