##TITLE=1H_SA_24.98
 DMSO, 64 sc, 
 15.1.2019
##JCAMPDX= 6.0         $$ Bruker NMR JCAMP-DX V2.0
##DATA TYPE= NMR FID
##DATA CLASS= NTUPLES
##ORIGIN= UXNMR, Bruker Analytische Messtechnik GmbH
##OWNER= root
$$ XWIN-NMR		Version 3.5
$$ Tue Jan 15 15:56:14 2019 Russian Standard Time (UT+4h)  she@DPX200
##.OBSERVE FREQUENCY= 200.1313
##.OBSERVE NUCLEUS= ^1H
##.DELAY= (6, 6)
##.ACQUISITION MODE= SIMULTANEOUS
##.ACQUISITION SCHEME= undefined
##.AVERAGES= 64
##.DIGITISER RES= 18
##SPECTROMETER/DATA SYSTEM= spect
##.PULSE SEQUENCE= zg30
##.SOLVENT NAME= DMSO
##.SHIFT REFERENCE= (INTERNAL, DMSO, 0, 15.7039)
##AUDIT TRAIL= $$ (NUMBER, WHEN, WHO, WHERE, WHAT)
$$ ##TITLE= Audit trail, XWIN-NMR		Version 3.5
$$ ##JCAMPDX= 5.01
$$ ##ORIGIN= Bruker BioSpin GmbH
$$ ##OWNER= she
$$ F:/spectra/data/she/nmr/H-F/1/audita.txt
$$ ##AUDIT TRAIL=  $$ (NUMBER, WHEN, WHO, WHERE, WHAT)
(   1,<2019-01-15 15:54:41.57 +0400>,<she>,<DPX200>,
      <continue with go, POWCHK disabled, PULCHK disabled
       configuration hash MD5:
       00 E9 B6 7A A2 85 ED C7 34 08 36 98 17 FE 4E 26
       data hash MD5: 16K
       E0 7E B5 F7 D6 04 B0 30 5D 3C 01 43 74 96 8D DE>)
$$ ##END=
$$ 
$$ hash MD5
$$ BC E7 93 B4 9D F8 B6 78 C5 57 D3 A1 33 C9 EC 25
##$RELAX= 
##$RELAX= 
##$RELAX= 
##$RELAX= 
##$RELAX= 
##$RELAX= 
$$ Bruker specific parameters
$$ --------------------------
##$DU= <F:/spectra>
##$EXPNO= 1
##$NAME= <H-F>
##$PROCNO= 1
##$TYPE= <nmr>
##$USER= <she>
##$AMP= (0..31)
100 100 100 100 100 100 100 100 100 100 100 100 100 100 100 100 100 100 
100 100 100 100 100 100 100 100 100 100 100 100 100 100 
##$AQSEQ= 0
##$AQ_mod= 1
##$AUNM= <au_zg>
##$AUTOPOS= <>
##$BF1= 200.13
##$BF2= 200.13
##$BF3= 200.13
##$BF4= 200.13
##$BF5= 200.13
##$BF6= 200.13
##$BF7= 200.13
##$BF8= 200.13
##$BYTORDA= 1
##$CFDGTYP= 0
##$CFRGTYP= 5
##$CHEMSTR= <none>
##$CNST= (0..31)
1 1 145 1 1 1 1 1 1 1 1 1 1 1 1 1 1 1 1 1 1 1 1 1 1 1 1 1 1 1 1 1 
##$CPDPRG= <>
##$CPDPRG1= <>
##$CPDPRG2= <>
##$CPDPRG3= <>
##$CPDPRG4= <mlev>
##$CPDPRG5= <mlev>
##$CPDPRG6= <mlev>
##$CPDPRG7= <mlev>
##$CPDPRG8= <mlev>
##$CPDPRGB= <>
##$CPDPRGT= <>
##$D= (0..31)
0 1.2 0 0 0 0 0 0 0 0 0 0.03 0 0 0 0 0 0 0 0 0 0 0 0 0 0 0 0 0 0 0 0 
##$DATE= 1547553018
##$DBL= (0..7)
120 120 120 120 120 120 120 120 
##$DBP= (0..7)
150 150 150 150 150 150 150 150 
##$DBP07= 0
##$DBPNAM0= <>
##$DBPNAM1= <>
##$DBPNAM2= <>
##$DBPNAM3= <>
##$DBPNAM4= <>
##$DBPNAM5= <>
##$DBPNAM6= <>
##$DBPNAM7= <>
##$DBPOAL= (0..7)
0.5 0.5 0.5 0.5 0.5 0.5 0.5 0.5 
##$DBPOFFS= (0..7)
0 0 0 0 0 0 0 0 
##$DE= 6
##$DECBNUC= <off>
##$DECIM= 32
##$DECNUC= <off>
##$DECSTAT= 4
##$DIGMOD= 1
##$DIGTYP= 9
##$DL= (0..7)
0 120 120 120 120 120 120 120 
##$DP= (0..7)
150 150 150 150 150 150 150 150 
##$DP07= 0
##$DPNAME0= <>
##$DPNAME1= <>
##$DPNAME2= <>
##$DPNAME3= <>
##$DPNAME4= <>
##$DPNAME5= <>
##$DPNAME6= <>
##$DPNAME7= <>
##$DPOAL= (0..7)
0.5 0.5 0.5 0.5 0.5 0.5 0.5 0.5 
##$DPOFFS= (0..7)
0 0 0 0 0 0 0 0 
##$DQDMODE= 0
##$DR= 18
##$DS= 0
##$DSLIST= <SSSSSSSSSSSSSSS>
##$DSPFIRM= 0
$$ [...]
##$SUBNAM2= <"">
##$SUBNAM3= <"">
##$SUBNAM4= <"">
##$SUBNAM5= <"">
##$SUBNAM6= <"">
##$SUBNAM7= <"">
##$SUBNAM8= <"">
##$SUBNAM9= <"">
##$SW= 20.0189088683792
##$SWIBOX= (0..15)
0 0 2 0 0 0 0 0 0 0 0 0 0 0 0 0 
##$SW_h= 4006.41025641026
##$TD= 16384
##$TD0= 1
##$TE= 0
##$TE2= 300
##$TE3= 300
##$TEG= 300
##$TL= (0..7)
0 120 120 120 120 120 120 120 
##$TP= (0..7)
150 150 150 150 150 150 150 150 
##$TP07= 0
##$TPNAME0= <>
##$TPNAME1= <>
##$TPNAME2= <>
##$TPNAME3= <>
##$TPNAME4= <>
##$TPNAME5= <>
##$TPNAME6= <>
##$TPNAME7= <>
##$TPOAL= (0..7)
0.5 0.5 0.5 0.5 0.5 0.5 0.5 0.5 
##$TPOFFS= (0..7)
0 0 0 0 0 0 0 0 
##$TUNHIN= 0
##$TUNHOUT= 0
##$TUNXOUT= 0
##$USERA1= <user>
##$USERA2= <user>
##$USERA3= <user>
##$USERA4= <user>
##$USERA5= <user>
##$V9= 5
##$VALIST= <valist>
##$VCLIST= <CCCCCCCCCCCCCCC>
##$VD= 0
##$VDLIST= <DDDDDDDDDDDDDDD>
##$VPLIST= <PPPPPPPPPPPPPPP>
##$VTLIST= <TTTTTTTTTTTTTTT>
##$WBST= 1024
##$WBSW= 4
##$XGAIN= (0..3)
0 0 0 0 
##$XL= 0
##$YL= 0
##$YMAX_a= 353134
##$YMIN_a= -484704
##$ZGOPTNS= <>
##$ZL1= 120
##$ZL2= 120
##$ZL3= 120
##$ZL4= 120
##$ABSF1= 10
##$ABSF2= 0
##$ABSG= 5
##$ABSL= 3
##$ALPHA= 0
##$AQORDER= 0
##$ASSFAC= 0
##$ASSFACI= 0
##$ASSFACX= 0
##$ASSWID= 0
##$AUNMP= <proc_1d>
##$AZFE= 0.1
##$AZFW= 0.1
##$BCFW= 1
##$BC_mod= 2
##$BYTORDP= 1
##$COROFFS= 0
##$CY= 11.3945322036743
##$DATMOD= 1
##$DC= 2
##$DFILT= <>
##$DTYPP= 0
##$F1P= 18.9103706918063
##$F2P= -1.10871071338519
##$FCOR= 0.5
##$FTSIZE= 0
##$FT_mod= 4
##$GAMMA= 1
##$GB= 0.15
##$INTBC= 1
##$INTSCL= 1
##$ISEN= 128
##$LB= 0.24
##$LEV0= 0
##$LPBIN= 0
##$MAXI= 10000
##$MC2= 0
##$MEAN= 0
##$ME_mod= 0
##$MI= 1.114404
##$NCOEF= 0
##$NC_proc= 0
##$NLEV= 6
##$NOISF1= 3.799351
##$NOISF2= 2.8
##$NSP= 1
##$NTH_PI= 0
##$NZP= 0
##$OFFSET= 15.70392
##$PC= 1
##$PHC0= -9067.187
##$PHC1= 31.00005
##$PH_mod= 1
##$PKNL= yes
##$PPARMOD= 0
##$PSCAL= 0
##$PSIGN= 0
##$REVERSE= no
##$SF= 200.130013532006
##$SI= 16384
##$SIGF1= 3
##$SIGF2= 2
##$SINO= 400
##$SIOLD= 16384
##$SREGLST= <1H.CDCl3>
##$SSB= 0
##$STSI= 0
##$STSR= 0
##$SW_p= 3612.71676300578
##$SYMM= 0
##$S_DEV= 0
##$TDeff= 0
##$TDoff= 0
##$TI= <>
##$TILT= no
##$TM1= 0
##$TM2= 0
##$TOPLEV= 0
##$USERP1= <user>
##$USERP2= <user>
##$USERP3= <user>
##$USERP4= <user>
##$USERP5= <user>
##$WDW= 1
##$XDIM= 8192
##$YMAX_p= 0
##$YMIN_p= 0
$$ End of Bruker specific parameters
$$ ---------------------------------
##NTUPLES= NMR FID
##VAR_NAME=  TIME,          FID/REAL,        FID/IMAG
##SYMBOL=    X,             R,               I
##VAR_TYPE=  INDEPENDENT,   DEPENDENT,       DEPENDENT
##VAR_FORM=  AFFN,          ASDF,            ASDF
##VAR_DIM=   8192,          8192,            8192
##UNITS=     SECONDS,       ARBITRARY UNITS, ARBITRARY UNITS
##FACTOR=    0.0002496,     1,               1
##FIRST=     0,             0,               0
##LAST=      2.0444736,     0,               0
##MIN=       0,             -484704,         0
##MAX=       2.0444736,     353134,          0
$$ Real data points
##PAGE= N=1
##DATA TABLE= (X++(R..R)), XYDATA
0@%%%%%%%%%%%%%%%%%%kO6j28J28j28J28j28J70k34K56k66L29l83M25m89N57o30
35c29P09q04R01j007J123j255J395j548J709j894K097k313K560k823L102l417
51a794L771m150M574n056N589o195O885p679Q613r722J1067j2732J4864j7713
65i678K1726k7820L8404o2003K28605j62943l62263J86752K74056J70456j10058
76A85234k04090j91090J0647J43077J43410L213m8739o3383p5440p2266Q3053
87h6374K09365J24138j39446k34915o5108J72867J98582L0194j65782j93038m5505
98a95022J39475J51745l609j21744n5266N4112M0743l1563n65Q3125N6267o7695
110E0003j14952k3055R5597J08491L183j30814j49610J53J60309J26680n8800
$$ y = [0, 0, 0, 0, 0, 0, 0, 0, 0, 0, 0, 0, 0, 0, 0, 0, 0, 0, 0, -2, 64, -64, 64, -64, 64, -64, 106, -128, 128, -138, 191, -192, 233, -256, 301, -329, 380, -424, 477, -530, 593, -662, 733, -815, 894, -1000, 1097, -1216, 1344, -1479, 1623, -1794, 1977, -2173, 2401, -2655, 2934, -3261, 3624, -4055, 4558, -5164, 5903, -6829, 8035, -9678, 12048, -15772, 22632, -39371, 189234, 26291, -335972, -149220, 124836, 295292, 185234, -18856, -209946, -199299, -56222, 87188, 90401, 41662, -21721, -97161, -169427, -86374, 122991, 247129, 107683, -127232, -192340, -19473, 179109, 209303, 43521, -149517, -195022, -55547, 96198, 92589, -29155, -84421, -30309, 10434, -21129, -21694, 61431, 117698, 50003, -64949, -88004, 7593, 116084, 119267, -11547, -161157, -161004, -695, 125985, 67185]
121F7185j38624k0360J01500O4806l6614m5883J2267K6275j6052m7686k1829M2876
133a2139P9476K0692r7694j20419K5122J55205Q4511j00118j41010k37J20505
144A3894Q2235l1053p9757l6842L4321N4170R31n7685k6676N0286M6237m7901
156B160p8530K1737J08951M5346q0634r5443R719R3878N8237m0894r3666l9682
168h8821O3428R1509j085r0874m7714O5220P7145k9478q5473j4114P3398N0593
180F3734l8634p1691j4196N7926O2660j2774q1328m7072O0409R3480k061r2515
192b2062m6144O0120O9917k1495p5436k3634N2360N3687j0357o0839l5919M1279
204a8523O8972R35q2194n2148N6757R4833M913q2409m9325M5367O5811l387o5304
$$ y = [67185, -71439, -91799, 9701, 74507, 37893, -7990, 4277, 30552, 14500, -33186, -55015, -12139, 67337, 88029, -9665, -130084, -104962, 50243, 134754, 34636, -106374, -106611, 13894, 96129, 65076, -14681, -51523, -17202, 36968, 37899, -19786, -46462, 3824, 50061, 2160, -76370, -54633, 54318, 99664, 19030, -76413, -66694, 27184, 85421, 44527, -49139, -88821, -25393, 66116, 65031, -25843, -73557, -8337, 68808, 39330, -46143, -60257, 13141, 63734, 25100, -46591, -60787, -2861, 59799, 47025, -34303, -81375, -20966, 72514, 70453, -22062, -68206, -8086, 61831, 40336, -35100, -58734, -6374, 47313, 36956, -23883, -59802, -18523, 50449, 51384, -30810, -82958, -26201, 68632, 73545, -8864, -58189, -12822, 52989, 49602, -15702]
217a5702m5998K1936O1154K0735m5782m9257K7915P2221J1176p0256n3435M1709
229b3584P4733M027o5766m3852L1481O3058J3584n4985o0661J2683P0639L4341
241E5698m9587n9922J9925P3820K3308n7629n5474J9785N9227J9034m5302n0089
253d7206J1030N8141K9849m3967o1794M327O7771L6352m2583n6743J1837O2315
265B9329K8035m0799n5027P22M9511L0972l2208n3763j962N6835M0008l2071n8647
278c9065l320N6459L6705l1550n4738l343M9582L7377k4864n3980j2580M5025
290A708L9365k1535n3109j2035M7781M2979j9965n2566j2043M6218L8756j8657
302B6897n2891j6034M0387M2320j4100n1902j8414L7888M4212j1178m9307j9739
$$ y = [-15702, -61700, -39764, 21390, 42125, -3657, -52914, -24999, 47222, 58398, -11858, -65293, -23584, 51149, 55176, -10590, -54442, -22961, 40097, 53681, -1304, -61965, -49282, 21357, 55698, 6111, -53811, -33886, 39934, 63242, 5613, -49861, -30076, 29151, 48185, 2883, -47206, -36176, 21965, 51814, 7847, -53947, -49620, 18151, 54503, 11920, -44823, -32986, 29329, 57364, 16565, -38462, -37740, 11771, 42743, 10535, -43228, -45190, 11645, 51653, 19582, -39065, -42385, 14074, 50779, 19229, -35509, -38852, 10730, 48107, 23243, -30737, -43317, 1708, 41073, 19538, -33571, -45606, 2175, 45154, 25189, -27377, -39420, 6798, 45554, 26897, -25994, -42028, -1641, 40679, 26579, -25323, -43737, -5849, 38363, 27185, -22122, -41861]
314d1861L7313M2886q490m6698k1018L3153M1921p487m7343k2966L0986M0986
326C1382l316m4250k3638K8664M3282k03m2546k5640K7104M0842P83m1525k7127
339c6188K3316L9472J300l8258k7672K1141M0814N849l6603k8088K0062M1917
351B7062O626l6884k9235J7689L8709Q599l4806l0273J4019L7559Q847l1973k9765
364c3826J2142L9323J2819k7950k9942J2402L7326R583k9117l0961Q623L2705
376A3127J3706k3873l0650M961L4386J5919k5398l0824N069L4916J7126k1892
388F573k6785N811K9572J5470k0908l0529k873K6998J9675j6383l1792j42L1569
401F256K0542j8823k9654M73K8034J8089j3187k3562k891K4091J8323j3192l1959
$$ y = [-41861, -4548, 38338, 29848, -16850, -37868, -4715, 37206, 29719, -17624, -40590, -9604, 31382, 28066, -16184, -39822, -11158, 32124, 31921, -10625, -36265, -9161, 31681, 32464, -9061, -36188, -12872, 26600, 27900, -10358, -38030, -16889, 23925, 29774, -6829, -34917, -14855, 27062, 33688, -3196, -32431, -14742, 23967, 32566, -2240, -32513, -18494, 19065, 27912, -4061, -33826, -21684, 17639, 30458, 2508, -27434, -15032, 22294, 31877, 2760, -28201, -19578, 13127, 26833, 2960, -27690, -22729, 11657, 27576, 2178, -28646, -23577, 11339, 28465, 6573, -20212, -14401, 15171, 30641, 9733, -20796, -23669, 3329, 23004, 6621, -25171, -25313, 6256, 26798, 7975, -21679, -21206, 6828, 24917, 11730, -11832, -14723, 9368, 27691, 14499, -17460]
414a7460j0194K3346K2638j2161k8864k09K9549K0825j3025k6118o621J8600J8262
427A8568m980k2650r510J9154K4174n392l0901j3440J7013J9914p938k2641k040
440b0669K2393J9036l235j8443r117J0756J5967j677k2954j5801J6001K5020k771
453A4506k6977j0729J7702J9749m372j8386o988J2924J7499M621j5111j7086L690
466h958K0606M816k1635j5929J1753K2277n48j9564p806J0830J1929j970j0203
479d402p260O227J7009Q290j3310j9479M869K1724K167k3577j5532J2546J9182
492H454P71j2014p064L450J1609Q466m019j6092n619J4432J2914j2317j8191M704
506a0516J8787K717j3464n912Q540P277j763p444p229k087Q372J2986n348j6341
$$ y = [-17460, -27654, -4308, 18330, 6169, -22695, -22904, 6645, 27470, 14445, -11673, -18294, 306, 18568, 13588, -9062, -18572, 582, 24756, 19364, -11537, -24977, -7964, 11950, 4012, -18629, -20669, 1724, 20760, 17525, -918, -10035, 721, 16688, 15011, -7943, -23744, -7743, 17277, 14506, -12471, -23200, -5498, 14251, 9879, -8507, -15495, -2571, 14928, 19549, 4438, -12648, -8958, 11648, 16464, -5171, -21100, -9347, 12930, 12382, -7182, -14988, -4158, 7771, 5801, -4402, -11662, -5435, 11574, 19864, 6554, -12925, -8056, 13668, 15835, -7742, -23274, -10728, 8454, 9225, -2789, -9853, -6403, 5206, 13672, 9653, -6439, -12058, 2374, 15288, 2971, -15220, -10516, 8271, 10988, -2476, -8388, 152, 7429, 5666, -1778, -9007, -11094, -2722, 10264, 4916, -11425]
520a1425J163K1314J0978j7095j9036K703J4865L432q251n120R07M891Q466L727
534A1519j2134j3570P365J3566k649j4571J133J6692N207j0294p480O130M169
547E083j797k313k998l707L110J2068j842j8069j0605J4752J5558n757j3903M681
561e739J6072N992m669n033p323o887K085O896k779j0535L881J5039L059j2236
575b177n916R852K320j0218n291R779R124J077Q39M22o667n900O141K560j5969
590a0024j3440J1011J8228R61j2309L45Q949K781k432m4j22n330J022R203K95
605I094j1763o086P224J740j0702l311J0919Q423m673l325O244M954l407l238
619B093J07m927l194P789R424n702j2669j311J2567j031j1793m113O607M528J317
$$ y = [-11425, -10262, 11052, 22030, 4935, -14101, -11398, 3467, 6899, -1352, -6472, -5565, -674, 7792, 11519, -615, -14185, -6820, 6746, 4097, -10474, -9341, 7351, 12558, 2264, -5216, 914, 5083, 3286, 973, -2025, -5732, -2622, 9446, 7604, -10465, -21070, -6318, 9240, 3483, -10420, -5739, 10333, 16325, 11656, 6623, -700, -7587, -5502, 1394, -1385, -11920, -8039, 7000, 10059, -2177, -8093, 1759, 4079, -6139, -11430, -1651, 7473, 8550, 9389, 9811, 3144, -2756, 3385, 5945, -10024, -23464, -12453, 5775, 6736, -5573, -5228, 3721, 6502, 4070, 4026, 3904, -1426, -404, 8799, 9094, -2669, -8755, -1531, 209, -10493, -13804, -2885, 5538, 865, -2460, 3784, 8738, 5331, 2093, 2200, -2727, -5921, 1868, 11292, 5590, -7079, -8390, 4177, 3146, -8647, -12760, -6153, -1625, -308]
634c08M899M870m019m075M867K554q875p894L545N406o838m638Q223Q669n579
649H07n400M077N145r80k496L963k717n897J885Q521j904j1875j704R176L711
664D312o302l075L399M29j800K762N635l779l428M003N476l812n970J891K597
679B338n109n878M796N759k431m210K284M997l82o97K488k8n097l98O173Q70p586
696b111n609M104M493k909k440L147L077j544J048M182j970n556J8L910j049k546
712a755Q92M760p97n989J188L732l324m405j4M518N23N61L985J593k991l332K589
729A734K564m870m454K727K748o4j579K299P44l078j656K701O19k442O81M358
745C032J34k681M75K048j866m216m1K740R47k256J001K697p29j677k50J492j702
$$ y = [-308, 4591, 9461, 5442, 1367, 6234, 8788, -87, -7981, -4436, 970, -5868, -10506, -2283, 6386, 807, -4593, -516, 4629, 3649, 1153, 5116, 2399, -3498, -1613, 6908, 5004, -6871, -8575, 601, 4312, -1990, -5065, -1666, -1237, -3037, -275, 5360, 1581, -1847, 2156, 7632, 3820, -2150, -259, 2338, -2771, -8649, -3853, 1906, -525, -4735, -2451, 2546, 2164, 1467, 3955, 3927, -1170, -1568, 4605, 5475, -2111, -7720, -3616, 877, -2032, -4472, -1325, 1752, 208, 1256, 5438, 3468, -2088, -2070, 1840, 791, -1755, -863, 3897, 3100, -2889, -1701, 2031, -1293, -5698, -5712, -1194, -671, -110, 3875, 5468, 2477, -855, 1734, 4298, -572, -5026, -2299, 449, 385, -1194, 1105, 1849, -1229, -2885, -184, 435, -2007, -1326, 3032, 3166, 485, 960, 3008, 1142, -3074, -3115, -375, 572, -1684, -683, 2014, 1285, -392, -642, 850, -852]
762h52k403K619L102l9k459J908J344k168j694K42j02j043j190L086J331n50j848
779g16J233R08k333j127J302Q06j676O96K195J189j993K09O95j28k597j10J172
796b75L56j336J05K299Lk044N32Q61jj390P06J233j4j177J297J071j315j824M98
815d15K95j092r70J654R34r84O80L0J253m84p66L33o99j89J83J070k01p51O54
834E35m52L3j013n42Q00L71n44L5J645k97m19J05K48L07j012Q3Q23J53j325N75
854A09R70j142j356J61Q70J82j15L98R47n08q36J067k11j080l15J122j09J63p24
873d07M52J10p55o54R33Q7O5m85K161k57p63N3j04J58j398L50k08J023p39P02
893C24J03P4o17o86O01n87L85N44P73q91mM62M32j214j843Q28Q48j1k93J490k71
$$ y = [-852, -3255, -636, 2466, 2427, -32, 1876, 3220, 1052, -642, -400, -502, -1545, -2735, 351, 1682, 1132, -716, 517, 1425, -908, -2035, -733, 73, -1603, -907, 1288, 2477, 484, 693, 1388, 1260, -1337, -1447, -275, 81, -1255, -1150, 1149, 1152, -892, -360, 501, 500, -890, -184, 1049, 1035, -142, 1155, 2226, 911, -913, -415, -120, -1212, -2182, -528, 406, -578, 102, 132, 1385, 901, 135, 468, -231, -420, -237, 833, 632, -119, 535, 83, 116, -897, -1439, -639, -268, -812, -777, 868, 571, 152, 257, 505, 812, -200, -117, 706, 859, -466, 109, 1079, -63, -1419, -1258, -388, -206, -321, 77, 1024, 516, -320, 747, 536, -544, -859, 263, 154, 317, -407, 45, 155, -600, -1254, -321, -234, -169, -654, 1507, 1250, 487, 540, 436, 594, -804, -454, -662, 361, -378, 324, 427, 501, -116, -802, -201, -788, -403, 141, 914, 23, 19, 481, 913, -301, -2144, -1316, -468, -479, -772, 718, 447]
914D47k14J55p82n19r59O54J909J00M56q91J361m69j916o32k79L16n70J857Q94
933I18M06N11M70n88k041j593j43J995j602l09J392K977q74j485k75Oj361J4J420
952a62K93k70K00K258k23k100j331J071q7k230J382J854J61j510R36N84j177n61
970i12J428P37p56j238J813J792q88k815m92k9m24o72O45J684J46J8K223J63j928
989D95j186j96J463j386n35J494J069q22j195O65O74j398j337J447M61j666J868
1006h5K185q69l071J946L053R3k696j399J170J29j689k64j93p04j022K649K923
1023B156j483j011J723J396k148k400J219J136n43k122K502J462j582j61M14k70
1039B88l470J200K617K13l132M80M278J310l092j581J340K29q65O91O07j534j728
$$ y = [447, 233, 388, -394, -913, -1872, -1218, 691, 791, 1247, 356, 1717, 1248, -668, -1300, -1579, -1263, -1833, 24, 918, 1324, 1835, 2305, 1717, -324, -1917, -2060, -65, -1667, -1976, -584, 2393, 1519, 34, -241, -235, -1596, -1582, -162, 131, -139, 61, 2319, 2096, -4, -1335, -264, -351, -2581, -1199, 655, 816, -694, 242, 826, -351, -912, 516, 1253, 497, -741, 1072, 2864, 1976, -839, -1331, -1360, -1784, -2456, -1811, -127, 19, 37, 2260, 2423, 495, -691, -887, 576, -810, -1345, 149, 1218, 396, -799, -134, 540, -858, -2195, -748, -287, -1953, -85, 2100, 1231, -1840, 106, 3159, 3252, 556, -843, 327, 456, -1233, -1497, -1690, -2394, -3416, -767, 2156, 673, -338, 1385, 2781, 633, -1767, -548, 588, 45, -2077, 425, 1887, 305, 144, 558, 288, -3182, -1982, 635, 848, -2284, -1804, 2474, 3784, 692, -889, 451, 680, -185, 506, 1113, -421, -2149]
1056b149J424J805j780k305J070L540q27j237K363J572k154k730J56J121j934
1071b065o67K436J545j170P5L273J95n109k245J791K024j504n11J855J792K50
1087A965N70N24k224m159M3K851k52j833J117L478R4l164M55K650j293l023N42
1104a659K139m67J62Q51O90k671j587K340K330k432k541K540L366j032k552K83
1120b40k01j472N62P76J008j436L36L353R20l590j297J896p98l658L19M144M06
1137A028o88K54J606k30k064k31P63k849r64K970K687m93k889r3L525j328j670
1154f66J92N73j210L43N57J757j667j256K607R79j914j047K006R34k749j371J693
1171b39J232j922p21J942K06j319J541J162j209k293J054K532l2l748j98K502
$$ y = [-2149, -725, 1080, -700, -3005, -1935, 1605, 778, -459, 1904, 3476, 1322, -1408, -1252, -131, -2065, -2732, -296, 1249, 79, 154, 3427, 3622, -1487, -3732, -1941, 83, -1421, -1932, -77, 1715, 1965, 2535, 3059, 835, -3324, -3281, -430, -682, -2515, -1398, 2080, 2174, -990, -535, 2115, 822, -2201, -1659, 480, 13, 175, 1026, 1716, -955, -2542, -202, 2128, -304, -2845, -305, 3061, 2029, -523, -240, -441, -1913, -1351, -575, 433, -1003, -667, 2686, 3606, 16, -1281, 615, -183, -3841, -3522, 622, 1028, 340, 594, 2200, 1970, -94, -325, 438, -2411, -3375, -405, 2282, 1789, -1100, -1193, 2332, 1004, -666, -474, 99, -1111, -768, -211, 1546, -121, -1377, 1230, 2209, 295, -752, 1254, 2188, -561, -1932, -239, 993, -929, -1650, 292, 498, -821, 720, 1882, 673, -1620, -566, 1966, 1934, -1814, -2012, 490]
1187D90l48l58r29K035j316o2L07K110k270j020K050K67j554m27J669J302j664
1204B82p58L71J875j154j685O96l64o40J44K380K83k173K64K094J528k250k462
1221a569J478R84j610j04J145j030N67K42Q96j539j640J234J651j675l54J648
1237C24J930q94j932O81Q61q19j653J063j42p78R34J395m24j851K0K287K23j701
1255d76p28J882N62p68L64J4j11j392j66M99j337M26L34J948m28j033L72J580
1273A542r75j529J462j93M11m01J91M87j262M31L28m3j553k08Q25J132l26j170
1291h51J571K86m38j92l81R1n62P8N50M47j270k16J440n37j636Q45J391K74o65
1310B25q35J385J2k38l10m72J32K2o02J127p53l02O98O27K50j619L41J453j069
$$ y = [490, 142, -216, -1145, 890, -426, -488, -181, 1929, -341, -1361, 689, 956, -598, -1025, 644, 1946, 282, -476, -105, 1770, 616, -1069, -373, -737, -1377, -1233, 1147, 1430, -743, -479, 1615, 3143, 893, -1569, -91, 893, -717, -821, 324, -706, -139, 103, 999, -540, -2180, -946, 705, -970, -1324, 324, 2254, 1360, -572, 109, 970, 151, -1502, -439, -581, -1359, -425, 970, 546, -1305, -1285, 1002, 1225, -476, -1204, 678, 1240, 472, 836, 850, 739, -653, -819, -320, -1657, -1231, -897, 1051, 623, -410, -38, 1542, 567, -962, 500, 307, 718, 317, 508, 995, -267, 164, 492, 449, -1104, -1312, -487, 645, 319, -851, 720, 1006, 568, 376, -5, 86, -476, -398, 152, 599, -671, -887, 553, 16, -1620, -775, 616, 890, 225, -610, 775, 787, 549, 239, -233, -101, -79, -681, 446, -307, -609, 89, 716, 966, -653, -312, 1141, 72]
1329G2k50L80q54Q24L4Pl47J05o3J15n05k45L24j9P60l19m29R99k48l3k32M17
1351D93j090P11m45J013o49n46O75l7M52n35k89J88Q25q36L03K23n03q73J171
1370B51k33m37K31K36N93n89J69M98m16j55l61J43P31p60k16J042l98n85J39j10
1390b27k71K01p1L30P57n98p3N07N3r23L9K91l93K27O33K06l83R6k2k40j138o2
1412a061J041J19n45M90K08M15m94n11Q65l10l21J04J26M15o34k11O32l28l36
1431c36j42L11M81n61L35R21k77o89O04j89p57l06J89J134p56J3M19l20J4l28
1451b40j94j04L24m78Q18N1L01m07r4L24n2n15M08o42J70k62N15N95l98l74l26
1472e80MO7N95j76N43J41k52J06J81j299M21J18j0q8M11Q24p34j9k34J21j202
$$ y = [72, -178, 202, -652, 172, 206, 213, -134, -29, -92, 23, -482, -727, -403, -422, 338, 19, -410, 589, 341, 308, 76, 493, -597, 114, -331, 682, 33, -513, 162, 125, 577, 42, -247, -59, 766, -70, 233, 456, -47, -920, 251, 18, -419, -188, 48, 641, 52, 221, 719, 303, 148, -213, -70, 661, -99, -315, 727, 329, -256, -117, -227, -498, -297, -368, -38, 719, 121, 48, 555, 608, -315, -276, 15, -378, -151, 482, 688, 305, 401, 379, 139, -999, -1061, -20, 99, -446, 44, 252, 667, 173, -338, 527, 217, -104, 0, 126, 541, -93, -304, 328, 0, -336, -478, -167, 314, -247, 88, 1009, 732, 43, 647, 458, -299, -605, -416, 718, -38, -25, 394, 74, 88, -240, -434, -538, -214, -692, 126, 177, 478, 71, -23, 301, 249, -266, 142, -500, -330, -592, -77, 518, 120, -254, -580, -576, -509, 86, -90, 453, 594, 342, 448, 629, -670, -249, -131, -141, -229, 182, 1006, 272, 253, 19, 140, -1062]
1493a062j45R73O60p6RJ38L34j05r22N80l25m45l31k28N57k38J80P31L5o03J63
1514a20O54o77K4M54L12l81p88P99J50l11o83P49m33r6m36M46K62K2n18k82P72
1535h1P21r02Q58Q10j378M39j241K178j763p69J274m80M00L72n79N85o16K10M68
1554E06N5o94j81N16l2k50l83P58o45n89Q40O81k53j6l22K04J20n26%L9O9j19
1576b22K97J300j362O62n74K31j099j5j39J109m89Q53J8P12q83k51q3q19o0L08
1596e06Q81j94k64q9J407p03n89j667J509m38l0k67J322L28j005M34N00k61j430
1615a062J261j42O73k18m52J85j2o96l95N22l61L6P68L37k61K48K73q4r94j046
1635a420J257Q05j044m75R48L08K57m95M45l70q60l35J067m41QJ143j81L90p69
$$ y = [-1062, -1207, -234, 426, 350, 359, 497, 831, 726, -196, 384, 59, -386, -717, -945, -388, -626, -446, 285, 320, -283, -120, 534, -143, -119, 335, 647, 266, -522, 277, 427, 116, -567, 182, -251, -347, -783, -337, -75, -53, -571, -853, -81, 640, -262, 596, 1406, 28, 467, -774, 1404, -359, -1128, 146, -334, 66, 438, -141, 444, -172, 38, 506, 561, -133, -314, 202, 170, -80, -463, 295, -350, -939, -99, 582, 329, 313, -9, 195, 315, -211, -211, -172, -103, -222, 75, 1375, 13, 675, 101, 332, -767, -782, -921, 188, -301, 552, 570, 1282, 399, 148, 65, -754, -814, -506, 375, 181, -83, -172, 1235, 532, -57, -1724, -215, -653, -683, -950, 372, 700, -305, 129, 629, 368, -1062, 199, 57, 730, 512, 60, 245, 233, -463, -858, -336, -697, -661, 107, 444, 183, 431, 704, 620, -374, -1420, -163, 642, -402, -877, 71, 379, 636, 141, 586, 216, -644, -979, 88, -353, -345, 798, 617, 1007, 238]
1654B38q53J229p55j003M55N42M5o89J188n1l15J80J6O86m97j385R65L13l00m87
1674d78K02J008j202O97j191R00L48r47N88P21k15j72O04p97j67J26l34O38p88
1693d59MJ23M91p68L19M89o44M74j00p3M39p5p87P57N83o56n67q8M58K54k88K65
1715A51r53L34J165m92k64k93J083l25m95j231M75J816j042j005J183M6M22r32
1733c57Q99o37k96J082P9n19j022J69N87Q66r92l54M91K23M06j82n32k23M88M90
1753F66qr26m73Q69R9m94nM61J20M7j67O30j470J79M90N32m02o87j26J279o25
1774a1j09j78p6O50k03j60j50M31k58K78m23N09k05J06M93j195k03J189J46q46
1794b15J51n26p5K13r9K95m52K90O88L16n68j023O70Q61L61p07r94L14O71M41
$$ y = [238, -615, 614, -141, -1144, -689, -147, -102, -791, 397, 346, 31, 211, 227, 913, 416, -969, -4, 309, 9, -478, -276, 732, -470, 227, -964, -64, 284, -663, -75, 646, 431, 259, 863, 66, -101, 25, -309, 329, -459, -455, -332, 159, -609, -290, 199, -445, 29, -71, -144, 295, 220, -567, 190, 773, 117, -450, -538, -80, 174, -114, 151, -802, -468, 697, 205, -59, -352, 731, 406, -89, -1320, -845, 971, -71, -1076, 107, 153, 575, -357, 542, -95, -391, 691, 770, 251, -771, -602, -15, 851, -141, -495, -4, 219, 625, 443, -89, -312, 176, 666, 658, -268, -741, 128, 227, -267, -272, 189, 309, 356, 189, 819, -651, -472, 18, 550, 148, -539, -665, 614, -11, -120, -298, -374, 276, 73, -87, -237, 194, -64, 214, -209, 300, 95, 201, 694, -501, -704, 485, 631, -215, -64, -590, -665, -452, -551, -256, -708, -418, 270, 586, 18, -1005, -335, 526, 887, 180, -814, -500, 171, 612]
1814F12r13J28J75J015j174l8M34j8O24l4j922M42M22R18J82j362J61J77O86m09
1834A06l39k08M51O74Oq10O4m7M27M84j022q05J049K73P89q01q63M35j62M01J03
1855B05p77k52J212m5l66n88M96M46J1l01p00L89P21J5k02O04j180L00N22r96
1875d86RL66O13N34j95j570j70J201j86o7k91k97Q18O46j135j69Pp1J227l71q83
1896d70j28P99N56q01J92q53R98M8M74o48j335J013J008n42L59r09K8l19J022
1915D92m64n01J43J404n85o63p43L02J179J84j000o41J104K71M91j005q40P68
1933a04J262j290p2o75N10O21Q26j002n05m4J128j073P58n72m87J351k61K51j238
1952f16J152k58N01n98j420J126O76M59m62j872M66J103J93l22j153L00J042O75
$$ y = [612, -301, -173, 2, 1017, -157, -195, 239, 221, 845, 811, -1111, -669, -247, 671, 853, -509, -348, -171, 515, 106, -233, -441, 10, 684, 690, -120, -56, -103, 324, 808, -214, -1019, 30, 303, 1092, 291, -572, -137, -299, 102, 205, -572, -824, 388, 343, -23, -611, -115, 331, 342, 41, -659, -270, 451, 466, 264, 868, -312, -12, 510, -486, -477, -111, 502, 1036, 841, -729, -899, 302, 116, 49, -242, -539, 279, 925, -210, -379, -372, -443, 784, 413, -470, -598, 201, 757, -44, 148, -705, 293, 341, 815, 167, -1168, -155, 853, 311, 670, -239, -211, -530, 492, 28, -473, -330, 1074, 489, -174, -917, -615, 564, 748, -252, -893, 211, 482, 973, -32, -872, -104, 1158, -132, -204, -879, -369, 252, 1078, 76, -429, -473, 655, -418, 340, -232, -719, 632, 371, 622, -616, 536, 278, 779, 181, -1239, -113, 563, 1022, 560, -1312, -846, 257, 450, 128, -1025, -725, 317, 992]
1970I92l87k04k91K80k81J14l78M02k8l30L1n69m92R32P17k77m64j81J058M65
1990A109q55p88j03J165o7l76j190N13O07L62Q46j304m73J116J42j72j232k1J181
2009D60J20p38r2J90k54P04l51m79l06M65O41j22o23j04M78P63k65r36n08Q23
2029a34P98l97m70k89L26Q97m83J9r81M28Q98n61M39j123O62J52R3k8q14L74O90
2050D96n48k36K67n26J095O7n55j529J494J58O32p96m16P71K60m12n46J42L51
2069A69k31Q99j149j48o44J208R6o69J49l70J247n46m83N2k54J247n01k86m78
2088f92j44J176n5r8k73n81Q26Q95l70j160r5L93Q37j76q62J43KJ031n56l02j304
2109a365J648J93o07L77j002J702m37J39q58n31O93R89J75j147k8J40J12K83p22
$$ y = [992, 605, 401, 110, 390, 109, 223, -155, 247, 219, -111, -80, -649, -1141, -209, 508, 231, -233, -414, 644, 1109, 254, -534, -637, 528, 461, 85, -1105, -592, 15, 377, 1223, -81, -554, 562, 704, 532, -700, -721, 460, 580, -158, -250, -60, -314, 390, 39, -440, -746, -281, 360, 238, -385, -489, -11, 752, 487, -449, -957, -134, 664, 267, -203, -492, -166, 731, 248, 267, -714, -286, 612, 51, 490, -633, 29, 181, 274, 246, -568, -194, 496, -52, -288, -21, -547, 548, 615, 60, -1469, 25, 183, 815, 19, -397, 374, 634, 222, -324, -182, 169, -62, 837, -312, -460, -1104, 104, 200, -469, -320, -690, 557, 11, -472, -420, -674, 573, 72, -214, -692, -836, 340, 285, 187, -86, -667, 159, 1054, 684, -476, -571, -178, 659, 483, -379, -236, -234, 797, 241, -61, -1365, 283, 476, -131, 246, -756, 946, 509, 648, -210, -741, -48, 941, 1116, -31, -59, 81, 193, 476, -246]
2128b46J53J73M93Qn31k10j92P52p9L76j088J137Pl63o85k13J121p15P24Q1q68
2149a65L21K49j7n17r81Q61K25J39K62j063j7J171M07j434K92K88K1K57m11K6
2169h6Q5J77K67n90l69L3R36K69o27o59M08M57K19q80J53m44P54j21M04j293M73
2190d34J066k61P0p64n16N43L47j0J11l38L36j55j44J11m63K97M10J2m1m16M35
2211A96k89M59l85o06L92N11J12l03j151J180J09r7j019O76P09P0p32M61o48N30
2231A75n48O98l56n11R45l55J57r38R17k02R87Rj614j21O79k52R51j240O58k54
2251b15N04M32j063M0O38R8l7m30l58J51K32K1j25p27N63O55J02l99j206O95K46
2272a83J261j362L14p78R07L4n5p40P26L12L2k42q27N72M9J26n12l56P98p2K93
$$ y = [-246, -93, 80, 573, 581, 50, -160, -352, 400, 321, 697, -391, 746, 753, 390, -295, -508, 613, -102, 622, 703, -165, 156, 405, 388, -129, -1110, -249, -24, 115, 377, -686, -703, 468, 875, -559, -267, 21, 42, 299, -112, -86, -1, 176, 443, -147, -516, -483, 453, 722, 95, -564, -156, 301, 520, -360, -207, -651, 103, -18, 386, -907, -434, 632, 371, 441, -323, -839, -296, 51, 41, 152, -186, 150, -5, -149, -38, -501, -204, 206, 218, 177, -239, 196, -93, 366, -19, -625, -233, 278, 390, 87, -1064, 116, 225, 128, -891, -215, 494, 564, -168, 293, -355, 175, -373, 325, -31, -542, 403, 48, 205, -733, 184, -18, 969, 978, -636, -757, -78, -330, 621, -619, 39, -215, 289, 721, -342, -302, 336, 434, 397, -33, -391, -240, -8, 13, -112, -839, -276, 379, 481, 82, -1124, -429, -183, 1078, -284, 30, -748, 159, 193, 138, -602, 124, 436, 468, 226, -601, -29, 20, 146, -366, -722, 76, 4, 297]
2293B97L44r05K61N58m25O37j400k1K67O41J65m22L03j320J306l87j92J6L70K39
2313C32K68r93L08L68J20l69m6M31j203P05O07m76j141J237L55K12j076J21j35
2332c75P57r37N08m34j17P73J044j072q92M35O50q24O70n27j84J336o12l92L9
2351a54n9L08oj77O8m1J092j016l8j59p10R19J06j47n13n42R13J52L82L81r79
2372b20L49k23Q6j66k97K6P11k78j037Q08N23J11J7r69N30m2N80j7p15M04j22
2393E9K35J94m84q72J140J34r2k59N91o50j30N70n76j95L8M33L68q86k33N80K56
2414B21l14O2q13Q05O11J8q03k0J11M90k35k58M1K85j99J36m59N27j29n1P35j028
2436b67K58n13J233r84o0n11M65N86o3m72J07j17M75M14p54k04K15P08N6j703
$$ y = [297, 641, -264, -3, 555, 130, 767, -633, -654, -387, 254, 419, -3, 300, -1020, 286, -101, -293, -277, 93, 332, 600, -393, -85, 283, 403, 34, -12, 419, -784, -79, 528, 52, -1089, 148, 503, 715, -361, -240, -375, 382, -555, -47, -481, -598, 175, 1219, 147, -745, -310, 340, -484, 186, -341, -525, 811, 199, -193, -154, -213, 95, 89, -88, -20, -61, 1031, 15, -23, -182, -892, 27, 133, -14, -527, -1069, -156, -4, 378, 759, -220, 129, -94, -8, -174, -471, -445, 266, -12, -1049, -241, 282, 393, 410, -559, -29, -71, 509, 492, -223, 181, 59, 294, 488, 4, -868, 272, 406, 314, 55, 646, -4, -134, 436, -140, -335, -297, 136, 504, -382, -615, -35, 221, -93, -31, -844, -39, 572, 590, -213, -233, -122, 368, 133, -125, -84, 201, 2, 138, -321, 206, 77, 26, 761, -267, -9, -522, 711, -273, -333, -844, -379, 207, 144, -328, -221, -338, 137, 551, -203, -407, -192, 516, 572, -1131]
2456a131J336J63n14Q48q06J62o17Q46M69n97l76K85m11P14l04l73M81m00K80
2475E5j17mM88k60Q4r2R5j85m61J214q40j60n34P90M59k16o06O13k06P7m9n2k37
2498a44J68N17n64k80o17Q79N67l21o65Q11n18m94Q56n62R6J44K39M34m20l07
2518a81l10J176o18k42k7m10N22J33r16L35r0N01l48Q44j061Q53L92m61J20p6
2538A36k61J59P6k61n3Pk32O08L47k97P0K21J33q12K09K38o40N2K30o38O62L51
2560C05q39M81k83K01J6J080q81Oj02L17l02N3l92M33k77N29K66q14J252j457
2580d08K66O59r53M4M71k04L89m00n98P16N12l68J00m81L67M75q77j8k11P79l70
2601a10J98m74J68K92q6k22k06p9K49L93j03j88L82j6nk97o76Q43O9o52Q45J91
$$ y = [-1131, 205, 368, -146, 702, -104, 58, -559, 287, 756, 159, -217, 68, -343, 371, 67, -306, 175, -225, 55, -62, -66, 422, 162, 246, 154, 249, 64, -397, 817, -23, -183, -717, 73, 532, 316, -290, 323, 117, 194, 145, 93, -144, 24, 541, -23, -303, -920, -41, 526, 205, -460, 351, -167, -661, 195, -367, -271, -127, 112, 546, 126, -181, -491, 685, 67, -175, -202, -612, -90, 43, -873, -538, -628, -127, -475, 369, -692, 161, 553, 92, 212, 136, -125, 34, 110, -151, -204, -197, -429, 179, 526, 229, 299, 520, 653, -159, 50, 288, -352, -300, -70, -708, -46, 305, -534, -53, -336, -135, -119, 961, 80, 86, -16, 301, -1, 52, -340, 93, -184, 345, 611, -203, 1049, -408, -142, 517, -436, -392, 79, -125, 264, -136, -734, -18, 494, 126, 226, -255, 112, 587, -290, -308, -519, 260, -110, 88, -386, -218, 74, -12, -234, -440, -519, -270, 123, 20, -168, 214, 198, 193, -104, -780, 63, 132, -520, 325, 516]
2623E16n37l7j55K32n68L73k94O0m80R65K24m8j02L9M71l10K10o65r6J117q93
2644B2PK0J45m57R0k29Q24m60K44K68l36o19K92k13J0L74L05n62l55O56J43m53
2666b84P87j475P56M62o78R09o89J2rOQ30P9j215k46J446j009O32n84J58k26K19
2687a19q7r9l8L01N88J3o13k73R13q72K38m07L64K21J016j970M81K23L23O4N48
2708H15k10p04O16o98M0l56jk16P87n67R06l07j29L64l31K72m30r49J422r28P51
2729A47K64K72m38J57o07o6L27K05o54Q12n02l88P14l85N5N0m90N83M48p0l25
2750A09k90M7K59l00M38k33j82J71K80J28k21m97P51m40r4M6Jp80L10M97k54L30
2772G6k49O01o07K2M53jp59Q63m6m62j98R40k07k18L81k56p59J013m40k18N9P7
$$ y = [516, -21, -58, -213, 19, -549, -176, -470, -410, -890, 75, 299, 251, 149, 188, 659, 349, 559, -106, -202, 915, 22, 29, 49, 194, -263, -173, -402, 422, -38, 206, 474, 138, -481, -189, -402, -392, -18, 287, -275, -630, 26, 169, -284, 503, -972, -216, 246, -432, 477, -212, -200, -209, -203, 627, 706, -509, -755, 691, -318, 314, -270, -112, -338, -119, -206, -305, -343, -42, 546, 559, -54, -327, 586, -286, -48, -455, -91, 130, 1146, -824, -343, -120, 203, 267, 815, 605, -99, 517, -181, -141, -497, -498, -714, 73, -494, 412, 105, -24, 340, 9, 281, -149, -1098, 324, -604, 147, 411, 683, 245, 402, -205, -271, 56, 261, -393, 419, -83, -471, 243, -142, -87, -37, -527, 56, 504, 434, 109, -181, -134, 125, -175, 263, 30, -152, 19, 299, 427, 206, -291, 460, 20, -74, -28, -27, -807, -497, 0, -254, 76, -173, 428, -179, -157, 296, 295, -464, 399, 353, -109, -307, 633, 426, 208, 589, 333, -426, 587, 147, -71, -12, 65]
2794F5k3N55j44k63K6o39m38Q1P25MK78n49k07Q03k39P99n19m55L62n28N7Q33
2816E84o41O12q24K03K07n06O05n88k1M32j14J73j3n65L72L91m97O49K31o01q3
2837Fp5j57Q9M03J58l11o86P82P7j60l94L33J24j46O21p17P15j23r79J84J61L7
2859e8r1J05O48n90j56L12l14J51k79N24k17J0K87m76j41R5M13m47N79N4j95r03
2881f89R55m34N43l09L27j370J231o37M08J90k11M85J26p83j25P87o35K08K17
2900B84J4k19j0p04R04j74l42O74n4j43K66j450K84R50l23j75O21k54n34J332
2920I47n66K9l87J45j88K23m61K20j22o03N36N7K74m0p9J24O23m10l83Q2L37m62
2942a04K39M35q55P58r07Q39r73K72Mq2K33M95K76l29j87l25r9J011mj038r7M55
$$ y = [65, 42, 597, 453, 190, 216, -423, -861, -780, -55, -51, 227, -322, -529, 274, 35, 834, 315, -140, 222, -306, -249, 584, -57, 555, -269, -66, 141, -365, 240, -348, -369, 63, -51, 122, 109, -456, -84, 307, -190, 459, 690, 89, 6, -69, -226, -137, 266, 424, 113, -573, 209, 286, 126, -268, 65, 189, 43, 664, -53, 662, 539, -440, -256, -95, -58, -149, -44, 604, 14, -142, 170, -144, 7, -272, 252, 35, 45, 332, -144, -285, -190, 223, -224, 355, 409, 214, -689, 266, -168, 375, 66, 393, -977, 254, -383, 25, 215, 4, 489, 615, -168, -293, 494, -141, 67, 284, 298, 79, 69, -635, 269, 95, -247, 427, 373, 230, 496, -954, -670, 280, -43, -218, 403, 149, -385, 947, 381, 410, 23, 168, -20, 203, -258, -38, -160, -763, -227, -170, 104, 64, -15, 109, 732, 322, -61, 21, 358, -104, 135, 570, -285, 473, -434, 405, -568, -296, -292, -374, -141, 354, 630, 301, 114, -211, -310, 701, 697, -341, -438, 17]
2964A7n46j1L94N52k38r87L10J239j085R94k5j066Q24p8J93j058N53n97Q27J73
2984C85j17L71o42J75q3N66j57l54K8Rj03m10l1O37k0p57K47M8M44J9J67j024
3006f02J89M73K97q62K83k11J49j70J481o88N7o33O0M12k23N26j17l65J65k39
3026a8L9l98N28n1k40o00K17O27k31N24j251J024r30N76K99j06l64L54M77j416
3046i40J065l07k78O06j63J99m70J59m79P70j10K06l9L2P8J05p07q9L45O89p62
3067i0J58j96O74j112R08j04p6k66J71l8j07p4O35m13p01N64J4J4K22l83K76n69
3089d93P0J16O36q46M12N6K49j02K70k64o3O7r32Q36K88LO4q89J008j16j208R71
3111A33k33k90L61k11K46J5J91l04O35m57n71R76j023R34l28J59o10M94m25m66
$$ y = [17, -529, -540, -146, 406, 168, -819, -509, 730, -355, 639, 614, -452, 372, 294, 487, -571, -18, -615, 212, 385, 268, 639, -3, 172, 89, 655, 498, 144, 172, 181, 78, -332, -363, 274, 254, -503, -256, -208, 236, 255, 422, -602, -413, 60, 357, -505, -222, -433, -284, -454, 1027, 339, 396, -237, -177, 235, 12, 538, 421, 56, 221, -18, 21, -377, 151, 100, -140, -740, -523, 104, -127, 397, -854, 170, -760, -184, 115, 9, -355, -1, 476, -940, 125, -182, -460, 146, -17, 182, -288, -129, -608, 162, 52, 258, 219, 251, 329, 434, -273, -362, -17, 672, -90, 68, -128, 546, -566, 342, 238, 162, -104, 67, 29, -78, -152, 483, 70, -631, -67, -53, -39, 183, -200, 76, -493, -423, -307, 329, -517, -105, -49, 200, 98, 368, 104, 41, 108, -824, 12, 300, 303, 367, -522, 486, 370, -838, 133, -100, -390, -29, -240, 6, 21, 212, -92, 543, 86, -485, 491, -532, 402, 74, 233, -377, 117, -308, -774]
3131g74R32N4L34J75j254K71J75K09O66m63l4k55k84K42P74r45M46Ro8k13j088
3152a091J373j86j24j37K71L24n66k06P58o82l09O26l34L61R1o06Q75l33j73m67
3172e35k67J192k07J37k18Q04o84n63M46k22J20j5M56l90k86N52K48n18L16l16
3192E0j62L08J84q61Q5J56J03m37L91K47k50J59J00j12M3n21M86l91P51J69k64
3213B34l0k94O16n30K24O2M31q71K3N14o79O45j78k9L37r86J094p83J34j58q9
3234c13n0m46R74j14n14Q4Q31p31R18q47L13J43j80J43J0nn60M56n7l36j55M26
3256a0R1j4M83n39p32N10N58p87j46L68M64j64L31M1j20m03L12o78P75k53k06
3277a19O12n44l56R16n42k46j08K83l82J004L5Q6j106Q26k46L07J46q65K72M82
$$ y = [-774, 158, 212, 546, 721, -533, -262, -87, 122, 788, 325, 291, 36, -248, -6, 768, -177, 269, 278, 210, -3, -1091, 282, 96, -28, -165, 106, 430, -136, -342, 416, -266, -575, 51, -283, 78, 169, -437, 438, 105, -68, -535, -802, 390, 183, 320, 102, 906, 222, -341, 105, -117, 3, -12, 444, 54, -232, 320, 568, 50, 366, 50, -112, 196, 380, -481, -396, -240, -137, -574, -183, 64, -186, -27, 73, -39, 4, -517, -31, -422, 329, 498, 234, 204, -90, 526, -4, 220, 282, 713, -158, -135, 379, -300, 345, 167, 138, 475, -511, 583, -200, -66, -224, -313, -363, -809, 165, 51, -463, -379, 452, -279, 639, -208, 105, 248, 68, 211, 221, 216, -344, 112, 55, -281, -436, -10, 81, 67, 550, 11, -721, -211, 347, -440, -586, -218, 246, 82, 413, 454, 334, -69, 243, -435, 340, 87, -119, 493, -51, -407, 509, -33, -279, -387, -104, -486, 518, 553, 639, -467, 359, 113, 420, 566, -299, -27, 455]
3297D55m25o8K27L7n5r8J71N1o86K50M22j58K28n99O8P0j52L73R3q9o57O81M89
3320F28m36J94r27k60P50Q16q61j76Q46p81P1j01q3L82k37L02k96K17N86n50j74
3341i0M99o23N76p22K47k79R6L31P1m62o54J639o5m85k29j10L06l33M11k68J33
3362a1J22m37K39L02P8j006Q21K0Q2k20j26J60J58j31m01M16m18N57m87r4N12
3383A36j67Q5k32j80Q17j212K88M31n45O03J47k37j68m8P28l98o24M12k25K81
3403a08N83n44k97M35L20n12L05K9k25l13K63O2J04N1M25L0n26N1n26O55j71m60
3425c69N40o40K44pj84Q20n7j107P92M7k02m43K71K70K39J81k39j190J032j048
3445a050J190m7k95j98j43M64L6K00l33M89o02P77r86K81K10q0L56l75N39n37
$$ y = [455, 30, -38, 189, 226, 171, 73, 244, 295, -391, -141, 281, 123, 351, -248, -180, -110, -262, 111, 204, 115, -542, 139, 628, 192, 386, -541, -801, -51, 765, -96, -272, 574, -207, -136, -237, -320, 62, -175, 127, -169, 48, 634, 84, -90, 409, -214, 362, -360, -113, -392, -296, 35, 106, -356, -1010, 629, 564, 79, -150, -260, 46, -287, 124, -144, -11, 111, -326, -87, 215, 293, -713, 108, 128, 210, -10, -136, 24, 182, 51, -350, 66, -352, 205, -282, -376, 136, -31, 54, -178, -358, 459, -753, -465, -34, -579, 24, 171, -66, -234, -282, 446, 48, -576, -164, -389, -108, 475, -69, -366, 69, 389, -123, 182, 211, -14, -327, -64, -2, 102, 153, 578, 608, 82, 133, -393, 262, 91, -369, 171, -469, -225, -232, -416, 404, 347, -760, 32, 79, -123, -566, -295, -25, 214, 395, 156, -1034, -2, -1050, 140, 93, -202, -400, -543, -79, -43, 157, -176, 313, -289, 488, -498, -217, -7, -87, 269, -106, 433, -104]
3465a04J67L16l94k19J26J87j10O82j088M73K95m31l79N20K7l73N1R27r04J4M84
3486B67l67l54O27J97p95L68J18l11J008o57P17m10m40j90j32O1j84M63J48n3
3506H1P05P5j449J168q64L91M08r07J094o07J06l66M27k42k98K11J46k53l7J12
3526i9J104p37K55j082q5R11l60R56j297k37N29q18K15P07J52pm1M2J18k42m29
3547d45O32Q4M76q64P4M76o9j79J9l44J62J25K66p69l36J418j97k65n66l4N48
3568B12k01m64J67L9K72j68K83J28q58J03N58l7M01p54M03k30j68L75J43j36o04
3589e36Q7M82Jj13K02j76M7J23l34O69k19l8k8L7n26L40N46p99L50k68n7N24o8
3612B46L86j334L63kL97P1r46J689j077Q13m26l14L27k82N79p26Q0K59l8m19P29
$$ y = [-104, 63, 379, -15, -234, -108, 79, -31, 651, -437, 36, 331, -100, -479, 41, 68, -305, -254, 673, -231, -217, 267, -100, -454, 173, 370, -425, -57, 61, -250, 758, 101, 818, 408, -32, -222, -354, -293, -477, -14, 134, 81, 786, 861, -588, 580, -284, 107, 515, -392, 702, 95, 201, -165, 262, 20, -278, -67, 79, -174, -211, -99, 1005, 268, 523, -559, -644, 267, -93, 863, -434, -671, -142, -960, -745, -38, 114, 107, 66, 108, 226, -16, -445, 187, 271, 747, -117, -43, 433, 364, 185, 204, -140, 22, 147, 413, -356, -692, 726, 529, 264, -302, -336, 212, 11, -453, -286, -247, 25, -143, 140, 268, -590, -487, 71, 34, 435, -319, 84, -146, -314, 61, 204, 68, -536, -449, 33, 34, -79, 123, -53, -6, 117, -217, 452, 233, 195, 167, 204, -322, 18, 564, -235, 115, -153, -210, 314, 246, 632, -702, -339, -341, 56, 127, -819, 870, -207, 606, 180, -134, 193, -89, 490, -236, -156, 103, 65, -354, 375]
3633C75l40R8m65M22m65K86k71N93m41K88m87J99R8P74p64J28L98n85K76m29J160
3654H48j269P97m04O68k38p52N60o71N03R5j41m25N29m06N74L38l10k50K76J6
3674C38n54P74n53N83j191R44n31m4j24O15j87l36N55k92k17O23n55k22p6J90
3694b60r5K25L79j34p13N46mK34k08J88K65k00m36J40K85p42K56L1L31j83p62
3715h57O26l57L23j63Q0R63l97o94O84j96J9L93m02K40l78j20K46r0J56k19P57
3736F14q20K24j29k36K48k93j03n11J213m00n34Q09K93k30j47J37M2k05nk92L38
3757A3n4N30r69j84P38N57n67O82j443J122j094Q67J37Q5p32k60J094n50N49r24
3777d03L08P91p50k11J36m27J070j051K01N91k78k14J82j08K99m42N69J61J13
$$ y = [375, 35, 133, -332, 90, -375, -89, -360, 233, -208, 80, -407, -208, -110, 664, -100, 28, 426, -159, 117, -312, 848, -421, 376, -28, 640, 402, -350, 210, -461, 42, 137, -4, -429, 100, -306, 268, 606, 296, 46, 322, 338, -216, 558, 5, 588, -603, 341, -190, -234, -358, 257, 70, -266, 289, -3, -220, 403, -152, -374, -450, -260, -355, -130, 249, 115, -598, -52, -56, 178, -30, 158, 423, 223, -213, -73, 212, -530, -274, -243, 88, -95, -857, -231, -588, -265, -428, -348, 615, 218, -476, 208, 12, 31, 424, 22, 262, -116, -236, 10, -80, 76, -143, 614, -206, 18, -111, -347, -99, -392, -495, -1006, 207, -193, -727, 82, 375, 145, -2, 135, 177, -28, -33, -325, 13, -41, 489, -480, -664, 74, 631, 64, 746, -697, 425, -669, 198, 335, 420, -312, -572, 522, -28, 521, -403, -95, 696, -54, -265, -129, -556, 514, -537, -336, 255, -23, -237, -55, -163, 136, -306, 263, 424, 537]
3796E37l31k48M05k61K16J61n48M6o5j05k47J57j9J36J87l96M30j66L08M18n11
3817A04P7k20k16K88m1k6K5j47N61p70L44M8L52q96Q76p6p02L48M80o23NL85P6
3840B52m25N91m1j66o14M24N24m73k23K60j14k46N3K62L4l51j16L34K36j73j34
3861a06M88m06n10R33l53K6J67pj4k5n84O81l50k49R10q59R5K31j3l02L87m44
3883c04j61J59J54P38r41m07N34J76oj89J96l38M60M54j071O19L5M76m65p9n3
3904a3m49L59L74K5J77q28M17O8l35n24L70Q65p22n28M18O74m70M79j5O6o85o7
3926c44N14OJ19l81q4J90O13j098L61L91K22j201J14M59L72J9O0o97j82K37L37
3947B7L90k66k01J86m56K82J84o47M79J59n2j152N88O45m4k89q03P50K9p1O82
$$ y = [537, 206, -42, 363, 102, 318, 479, -69, -23, -88, -193, -440, -283, -302, -166, 21, -375, 55, -111, 197, 615, 104, 181, -39, -255, 33, -8, -34, -9, -156, 405, -365, -21, 27, 379, -517, 359, 283, -419, -71, 409, -214, -209, 176, 252, -173, 418, 377, 211, -403, 21, 545, 72, -151, 109, -5, -251, -198, 64, 98, -253, -369, -35, 201, 28, -106, 382, -24, -534, 399, 46, 72, 239, 232, 218, 193, -391, 290, -60, -309, 601, -258, -163, 68, 55, -247, 140, -304, -465, -306, -152, 586, -355, -762, -228, -52, -58, -247, -51, -389, 71, 525, -546, 73, 108, 584, 119, 40, -13, -462, -103, 271, 296, 473, -355, 62, 130, -205, -729, -359, 506, -216, -744, -326, 348, -122, 357, 342, 408, -277, -344, 170, 176, 295, -86, -170, 20, 633, -465, -104, 287, 509, -692, -578, -119, 253, 272, 332, -365, -547, -310, 27, 417, 151, -50, 136, -320, -38, 146, -501, -22, 137, 85, -1067, -479, 166, 122, -167, -970, -220, -191, -262, 420]
3968D20o40O57q58L70l08J84l05J49Q60k26p87O55j25l47j30O59l57J22K05o44
3988d46K44Q59o05K89m33N05j272J089m44J011j7q3k44n15M36J73j021Q20m20
4007g4J84M05j063O06j66N9k45J87l8J32J15n71J266n94J27m31M82j37j36j275
4027a167J219j1M75o53r8L38j2N01r16Q10J93m62o8J32m59PL44O97j088J94L6
4048A2J50j14n9J04J86j93Q9n78lM38L05k4n7k83J31j23M23m61l64j95M10O40
4070D34r23P14j1l99o73J822j122q6M02N9p5o55Q48k53l43M55M5J23j87O9k85
4091d1L48l69M6j85M12m67j99R12n30M43m51J13j20Q8m0M06l90n52J252R2j077
4112c09J22J05k83R81p76N94k05j55j57L37J77o90K64k4J45p15L70K36m26K73
$$ y = [420, -220, 437, -421, -51, -359, -175, -480, -331, 529, 303, -484, 171, 46, -301, -431, 228, -129, -7, 198, -446, -202, 657, 52, 341, -92, 413, -859, 230, -214, 797, 780, 697, 453, -62, 374, 547, -474, 346, -74, 110, 515, -548, 58, -108, -49, -294, -107, -145, -13, 102, -469, 797, 203, 330, -101, 381, 244, 108, -1167, 52, 41, 516, -137, -235, 103, 91, 592, -324, 486, 679, 217, 149, 281, -178, -171, 173, 870, -218, -24, 12, 162, 48, -11, 93, 279, 86, 175, -403, -406, 32, 337, 313, 256, -27, 104, -19, 404, -57, -421, -616, -206, 434, -489, 225, 214, -185, -858, 964, -158, -244, 158, 217, 142, -513, 335, 82, -261, 194, 239, 362, 175, 244, -41, 307, -62, -16, -201, 211, -256, -455, 457, -73, 370, -81, 32, -88, 0, -40, 366, -24, -576, 676, 768, -309, -187, -82, -365, 616, -160, 434, 229, 74, -83, 254, 431, -259, 5, -19, 126, -589, -219, 17, -409, -136]
4132a36J06l49L69q90N30P22o48L13O03l36M2l5m81M26n92j27O99Km31j2J030
4153H05o14m24L75j35j51M68n4m2k9k18m69j94L88K44K21j1o92N49l05J88r5M40
4175B45l1n5k45m51Q01l79J3R67q15K5q4L16r11N16M7J45m57M87l50M93j18k62
4197a03L42n7J88j93p23J94L50L49k54M53m66o56O28L33j001Q48l96k51R52l17
4217B20l50R97n82k97J14k73K25K09l07J10n05N97M4l52J17m14L08Q18p00K85
4237B64M13n40K98m84K73L03j185J411n10l65N12Pk45O84j161Q0k52M01O31p11
4257a76q9N39j75m91k2P71k12K09l27k85O13l93m2l88O28o19R73j98j17m06j99
4278d06J056r16K13J65q53P79l03J49p7N86L14j161K63J40n5N21p83J066K3l19
$$ y = [-136, -30, -379, -10, -900, -370, 352, -296, 17, 620, 284, 326, 291, -190, 236, -356, -483, 216, 218, -213, -225, 805, 191, -233, 142, 7, -144, 324, 270, 228, 199, -19, -488, -682, -294, -50, 171, 160, -532, 17, -288, -100, -195, 245, 214, 159, -86, -537, 264, -115, -102, 865, 50, 75, -9, 307, -604, -88, -41, 104, -353, 134, -216, 277, 159, -103, 239, 182, 370, 177, -546, -352, -2, 347, 93, 546, 80, -576, 52, 385, -616, 232, -164, -415, 537, 220, -130, 867, 285, -12, 102, -171, 54, 263, -44, 66, -439, 158, 202, -150, -33, -447, -139, 679, -21, 264, 677, 137, 435, -49, 224, 527, -658, 753, 243, -122, 390, 397, 152, 836, -325, -245, -497, -96, 535, -176, -265, 274, 99, -392, -414, 357, 145, 354, 27, -258, 355, -38, -80, -468, 160, -459, 514, 316, 199, -207, -406, 650, -266, -53, 112, -741, 38, -265, -116, -193, 393, 707, -454, -191, -51, -106, 415, -368, 698, 721, 402]
4298D02l51l0K27l28p2l67L64Q6N78j80o77L34L81p22L26J31R06j219k77k27K98
4319d17R59m16n26M83L36j132P82M3o53P78l34k27K65k54O12n73N08K53n03n43
4339e59N34K25m52m32P97k05O06l31k82J07M74n48o98P10K45n45M3Q1l26N18m34
4360d72J109l31k84k07O31p40P08n56L01l49K75l86O15l69N84k35r13J22Q29L95
4380G27j14m05r25N02R6r0N55l53k5R2J83N14j226P15m03Q8M06k7p94M91Q1k76
4402a88p80O37LL78Q16p73L37q18K21l8M65j29l36k26J155j359O81M1l42n67Q74
4423E2J08k7k01o17R25J66l25m29N78o67O20N8o52O71n14N65J57r22N17k13r6
4444b46K72m63J05J132j099M69q53J057p97J336j607J008k02R0m93M23j117R11
$$ y = [402, 51, 21, 248, -80, -152, -519, -155, -69, 509, 329, -348, -14, 367, -355, -29, 102, 1008, -211, -488, -715, -417, 542, 126, -400, 83, 419, -713, 69, 112, -541, 237, -97, -324, -59, -313, 299, -274, 234, 487, -16, -559, -25, 200, -252, -684, 113, -92, 514, 183, -99, 8, 482, -66, -764, -54, 191, -354, -311, -230, -556, -38, -472, 637, 306, 22, -185, 446, -294, 414, -142, 159, -190, 85, -301, 314, -55, 529, 294, -619, -497, 332, 727, 613, 208, -717, -215, -119, -209, 346, -7, -32, 60, 243, 757, -469, 246, -157, -69, 337, 310, -484, 7, 88, -188, -968, -331, -328, 50, 866, 93, 430, -388, -167, -205, 260, 131, -205, -431, 724, -635, 46, 87, -255, -822, 52, 160, 133, -68, -685, 240, 406, 81, -348, 230, -437, 183, 241, -411, 260, -254, 311, 468, -454, 63, -150, -246, 26, -437, -332, 800, -299, 170, -683, 374, -423, 913, -694, 314, 112, 202, -291, 132, -985, -74]
4462g4N78p16J16o21L63l6J91n4j24P44L42j053M28J12j77m89J43L29K86k37k98
4483b47lL22J94q82R91k03n99N07k56l61K33N31m39N54o44O64m90M65L49j084
4503c98Q6J57L8J11M5m7k10J72L22q81J141r46P71n27Q42n95m04M29J00K21k87
4524A40q07J347l55o24k46M04j08l99P65l68R74n42P71o63p15O63K43j65o38K38
4544h5L45m18k54L54k12N02k96J53Q60j254k44N02p64P61L22l66j06K13L21L29
4564F63p12oL84m07l4N28j5o29k48N37M34q18R80r10J37K74m02J88J50K41k13
4585A22J41J84N02q01j24k74M4M62o08m40P26L57r6r75K53K42O08N7J27j027M48
4606g2N2J19L72q48M14n0P20j234N13J31q62J014M12m56p33J017l52R5L69q19
$$ y = [-74, 504, -212, -96, -717, -354, -390, -199, -253, -377, 367, 709, -344, 84, 196, 19, -470, -327, 2, 288, 51, -247, -250, 72, 266, -616, 375, 172, -427, 80, -176, -537, -304, 227, -212, 342, -302, 362, -128, 337, 686, -398, -312, -155, -117, -6, 39, -8, -218, -46, 276, -605, 536, -410, 361, -166, 676, 81, -323, 106, 206, 427, 140, -667, 680, 325, -299, -545, -141, -249, -648, 117, -251, 723, 181, 952, 289, -426, 237, 480, 315, -323, -85, 260, -158, -412, -58, -270, 232, -64, 89, 949, -305, -549, -47, -811, -50, 272, -94, -200, 13, 334, 663, -49, -55, 329, -78, -112, 416, 401, -228, -476, 61, 495, -323, 657, -253, -116, 158, -244, -56, 94, 335, 122, 263, 447, 949, 148, 24, -250, -206, 256, -352, -792, -66, 291, 195, -780, -527, -285, 323, 380, 507, -520, -72, -20, 99, 471, -377, 37, -13, 707, -527, -14, 117, -745, 269, 681, 225, -508, 509, 157, 252, 621, -198]
4626a98Q69p92Q77r62K06L50l28n05O78L47o2k04j48r6R6o33N70L20o08J08R87
4647H72p78N33m49l93L37k25k66R03m91J37J18N49p16j02o60P98p79R03p57O89
4667B23o80M54J38N9L17q67L71m58K04O68m42K16M00j068P18n49l3PN36m35r1
4688c12M61m27J51J70L82J3j60r9j44k40j74Q51L24j312N72n18R93p38L90k38
4708e5L31j7k36M09o1k53j28l94L3O06l4m04J47Q1n70K90J113j248L74K98n78
4729b96m55N88n26P25k24O9PK13K06n97O05m1o26K56O0m63q2k5L69l94L66K22
4751d3p3L87p40J68O44n01k17N37k4j72p02J197l50o28M93K27j57n0l73J51q4
4772c10K3N23r25Q64L26pm80N44q12K01l95K36L12o0k65P42O9q42M30n66K99j
$$ y = [-198, 671, -121, 756, -206, 0, 350, 22, -483, 195, 542, 480, 276, 128, 32, 128, -505, 65, 385, -223, -115, 872, 94, 627, 178, -215, 122, -103, -369, 534, 43, 180, 298, 847, 131, 29, -631, 167, -612, 291, -466, 223, -457, -3, 135, 194, 511, -356, 15, -443, -239, 429, -13, 203, 603, -465, 253, -296, -329, -322, 214, -221, -312, 149, -278, -127, 43, 425, 438, 278, 179, 35, -205, -379, 472, 796, -516, 56, -462, 531, -207, 183, -55, 276, 259, 23, 432, 371, 118, -10, -404, -371, 235, 201, -203, -56, 25, -545, -255, 858, -390, -16, 282, -296, -751, -163, -689, 36, -188, -119, -112, 101, 307, -290, 315, 274, -352, -96, -36, -499, -581, -606, -237, -631, -265, -43, -116, 271, -469, -301, 343, -158, -375, 162, 138, -34, -736, 461, 111, -517, -24, 203, 46, -4, -377, -226, -310, -287, 236, -689, 175, 501, 494, 14, 558, -254, -53, -448, -212, 100, 40, -225, 517, 586, -256, 174, -392, -93, -94]
4794i4m16M45J68m54J238j228M12q85Q96l10K17j70M42q7n5J32m27l26O99k09
4814a2K3l47M54l15L20j67m52J65N52o76l60J449p95M52n79j86L72q3K69l76L06
4835A4L13k59M71n20J10M95j107M40P7j37L27J7K41p7p85Q95k55p6J18m06L45
4856B41r90Q55j41m01M00L23j253J712o50J92n5k89Q05o93p3K2K25k28q18J155
4876C39o02k91N15J11k90J05L29j83p12Q85J22m10J12m1M40o61k99R36o21m14
4896f30O12L62o69k4O89p20R80l00j03l82j97K41N55o22L22m52P31l29l30j70
4916d36K4O75M5j64r10R36P3k83N76p9j86q15k42Q86J28J51p23K48j43j0R3J68
4938A2k7J63o05M32j29K39l62O15p37J483j306j79M53m07M67J71O1q12k82N27
$$ y = [-94, -510, -65, 103, -351, 887, -341, 71, -814, 82, -228, -11, -181, 261, 174, 119, 251, -176, -502, 197, -12, 11, -336, 118, -197, 123, -44, -496, -331, 221, -455, -815, 634, -161, 291, -288, -474, -102, -185, 84, -292, 14, 327, 68, 539, 19, 129, 624, -483, -43, 34, -103, 224, 241, 482, 405, -380, 515, 260, 184, 302, -104, 241, -749, 106, -35, -436, -36, 287, -966, 746, 96, 288, 233, -56, 749, 56, -17, 5, 230, 2, -816, 339, -263, -554, -39, 72, -218, -113, 216, 33, -679, 206, 328, -82, 30, -11, 429, -232, -531, 405, -216, -630, -18, 344, -325, -349, 340, -380, 600, 300, 197, -185, -382, -141, 414, -208, 114, -338, 393, 64, -266, -436, -412, 263, 308, 144, -766, 170, 243, -40, 536, 457, 271, -544, -786, 100, 228, 379, -344, -96, -239, -249, -156, 12, -15, 148, -457, -25, -154, 85, -277, 338, -399, 1084, -222, -401, 52, -355, 112, 283, 344, -468, -750, -223]
4958b23J40N77J68o25M6K21q0p23J067p71o31M08J21n09J291J34m92K93m66m53
4978e07J045q74O00n98O97l70m52K21j19M20N63j178N52m72j7M50m3R25p99J72
4998B16r62R98j17n66P59J5l56O5m56O27m4p38N34K57j30l68R53p51L97m1p09
5019d17M97L29n04K9pN5L88m60k54M15l72L48L76o18R4j4N0p90R59r4o05P57k48
5042h6o2m09O52R90p81j92ml17o56R73j19l48M27l37m37N97l49M31l66N33P4o09
5064c95P49m84k5j65L55k53j12M07L04r35N68j6k08P9L81K30j246O97L41J24m36
5085d0j11M60l92j89pK81j79l6J51j68M23l44L89m82K79P9K16m71M15n99J001
5106F76j81m48OL65l45M2K50n27K26K23k88l6oj00N79R9n47Q0m31P49l53K20m4
$$ y = [-223, -83, 494, 662, 37, 83, 304, 224, -499, 568, -203, -834, -426, -305, -814, 477, 611, 119, 412, -54, -507, 538, -336, 264, -334, 363, -7, -459, -238, -357, 63, 626, -552, 0, -472, -489, -39, -82, 843, 44, 216, -746, 252, 135, -431, 328, 343, -13, 52, -404, 223, 179, -559, -25, 232, 102, -266, 687, -64, 333, 292, -417, 80, 409, -95, -66, -73, -18, 370, -90, -344, 71, -301, 47, 423, -195, -101, -115, -65, -855, 104, 10, -595, 162, -86, -148, -557, 95, 1085, 304, 112, 108, -209, -865, 108, -11, -359, 68, -269, -706, -109, -458, -27, -393, 140, 214, -395, 354, -130, -155, -320, 35, -218, -330, 77, 381, -554, 14, -2, -210, -131, 250, 480, -766, -69, 272, 396, -40, -151, 309, -83, -272, -279, 2, -177, -213, -62, -230, 193, -151, 238, -244, 35, 114, 330, -141, 274, -325, 676, 495, 47, 53, 418, 73, 115, 365, -162, 64, 287, -1, -37, -43, -143, 436, 535, -12, 68, -363, 386, 33, 253, 209]
5129B09n67M03k91N31q65Q50M09l65l62k4J73j35r1k96M87k83j87L1m4L05q36
5150i48J114k38j22k14K58r7P72r64J44M6J55J63J8J11p33L14P87l53k64J99n16
5171c68O68q79L09K16O23p53M90m9J65q30P03m8q05M91M46P1r80M32o46R73m46
5192b17J75k99M47l95O8J93n2N47p57M86r64R83l11M63q76M95M10o49K38o0jP71
5214F95p08n19O36%l11O38K05o47L15j54j19l07K23M69p83M75n6K04l51j63L92
5235A34J60l16L09L92j089L07L24M55p53n15O85O26j443N05r8M95J04n75M23j086
5255i56M32O62K37k51M76k48K61j96j036J263l04k67J66J39j39l5j58j07L47p32
5275d46N29J21l22M10J57j193O15o10J78N90M41q61P37j084J069m58j01K42l50
$$ y = [209, -358, 45, -246, 285, -580, 270, 679, 314, -48, -72, 101, -34, -125, -421, 66, -217, -404, -373, -417, -112, -948, 166, -72, -194, -408, -150, -247, 525, -439, -295, -249, -94, 69, 87, 198, -535, -221, 566, 213, -51, 148, -368, 300, -579, -270, -54, 569, -184, 306, 257, 422, -408, 295, 247, -558, -67, 379, 450, -530, -98, -744, 229, -217, -42, -341, 106, -289, -221, -28, -80, 467, -290, 196, -768, 215, -96, 367, -509, -14, 396, -253, -15, -75, -76, 695, -13, -532, 104, 104, -207, 431, 636, -11, 304, 150, 31, -276, -53, 416, -367, 108, 52, 256, -95, -258, 134, 294, -22, 287, 679, -410, -103, 221, 676, -77, -592, 93, 719, -724, -219, -317, 178, 282, -293, 130, -956, -524, 138, 375, 124, 600, 352, 613, 417, -619, 644, 340, 73, 239, 378, 239, 204, 46, -61, 286, -446, 83, 204, -118, 292, 449, -744, -129, -739, -561, 29, 470, -391, 346, -738, 331, -127, -228, 14, -336]
5294c36N61l29j75O92j013M60n08Q64n52j35P30j60J10M9O3o64J143o91K37J32
5314D78l97K38k80L27o40P04l36L67r86J56L29K84l02J87m31J13j7K58L07o2R3
5335C90n53K44n95M04K39m51J21k20N82l03l98N42M25o44Q32j122K79R4l85N19
5355@J63l16J58L74n88J0L40n29O2N96l59J76J6O59p00L40m5k06N2k48o40Q68
5377A83R0k69k42O19j79k92j27M56j29O1J71j020M65k75N16n1M35l05J11K20m94
5398e6j7L05P6p13M94J98m09k11P55k86k6j20N79n42j11L55l72j05J02M21l89
5419g2k49M83l53K42k26K77m27O13l35o0Q0K45l00M8l02j15O51O2r35N12N26l69
5441dO6j21k10O12l33J07l88n65O58j75M58j96k48j7R84q42M40q32O88L20r94
$$ y = [-336, 225, -104, -279, 413, -600, -140, -648, 216, -336, -471, 259, 99, 209, 258, 321, -343, 800, 109, 346, 478, 81, 319, 39, 366, -274, 430, 94, 461, -525, -369, -40, 244, -58, 129, -302, -189, -206, 52, 359, 297, 390, -163, 81, -514, -110, 129, -322, -201, -421, 161, -142, -540, 2, 427, -217, 615, -507, -228, -134, -519, 0, 163, -153, 5, 379, -209, -199, 141, -388, -326, 270, -89, 87, 103, 762, 62, 402, 357, 151, 203, -45, -685, 183, 273, 4, -238, 381, 202, -90, -217, 239, 110, 171, 342, -678, -213, -488, 28, -23, 412, 107, 218, 438, -56, -73, 232, 308, -405, 89, 287, -122, -333, 422, 136, 110, -10, 569, 27, -84, 271, -101, -206, -104, 317, -72, -321, 162, -191, 51, -175, 102, -325, 288, -47, -107, -27, 218, -82, -34, -336, -451, 200, 262, -673, -161, 365, -4, 62, -59, -269, 343, 10, 117, -271, -836, -178, -353, 105, -91, -339, -356, 628, -214, 226, -606, 82, 402, -592]
5462e92M02o10J049k7j35k97K45J06O3m65J05j76O43Q4j21J28o65P39l24p27N94
5483A9j37l45K06n2L57J11J66k75l06J55k60M70p41Q62m81P37m23j41O31o91K04
5504F6N06n15J95m23N81o31P0L52o63O93l66L87m85K14K08M8m55K14L21L4k40
5525A11O0N77p71r2J65J10l67J09q12R08O2J9p68Q37n50N30J5k08L92r56Q9P01
5547A61j90j47q6m65J110Q4j23j63L72n87J83l58j72K78m41L72J36k89K61n72
5567f36L32L22M3k53j85L7k8P25j63M41j005k0K88k20O10n51P07j83j32P4M2m90
5589b45M90q66M12J01L0L14J78q03O20m60n09P01m9J32j73k98K16Q08j005K81
5609a25K77m9l91L31J71l02j08K8j9k23N39o47O07m6L53m70n2Q76p09j25l27O42
$$ y = [-592, -190, -800, 249, 222, 87, -210, 35, 141, 204, -261, -156, -332, 311, 395, 274, 402, -263, 476, 152, -575, 19, -118, -463, -257, -309, 48, 159, 325, 50, -256, -101, -361, 109, -632, 230, -251, 486, 63, -78, 553, -138, 66, 572, 57, 252, -171, 410, -221, -151, 201, -462, 231, -135, 252, -233, -19, 189, 237, -218, -4, 317, 351, 111, 171, 748, -23, -115, 50, 160, -207, -98, -910, -2, 60, 79, -689, 148, -402, 128, 143, -65, 327, -629, -540, 161, -29, -176, -262, -727, 383, 467, 344, 181, 553, -34, 149, -209, -381, -103, -544, -172, -36, -325, -64, -636, -304, 18, 61, -192, -377, -340, -368, 357, 194, 635, -370, -390, -102, -322, 288, -263, 444, 261, 129, 203, 245, -245, 245, -621, -209, -108, -78, 236, 414, -389, 231, -229, -738, -37, -86, 46, -127, -425, -209, 599, -406, -125, 152, 103, -288, 43, 214, -88, -196, -168, -187, -410, 129, -518, 89, 43, 396, -74, -126, 750, 41, -84, -411, 231]
5631B31l4J34o30k5P8M36P4L43l14m86O96r06Q02m29K69m36N80O5j327J186n17
5652b10Q2N05l84k42q20R46ol7L23j00N19K11j006N96j08k55m0L7k79R5j56K29
5674a00N37K59j39p91J88j75O94R4j295L51K90j53R56j002K60Q3m41N11J12J4
5694B53q89N43l65Q77j07k39Ok86J70K14J84J54j86o1j46l77%Q69o01K19K31l82
5716H1j71p40Q08m56M5j89N24O08k81J7L82q11K48k75J05J82l73K55N8O81o6j012
5738c80j1Q90o77O1O4q9j77N31j95k15k52M44m0n26r0O76N1J32j316P23N95m30
5760b31K05K88j28N15L7r87J93k35k29N9N94j21o94N62M5L58l3Q5j32m47L3M31
5782A68q24M48O56p06J50p34Q18k5j41j31K40k45L68k18O30p06l06L61O15m33
$$ y = [231, 197, 331, -299, -324, -246, 190, 264, 607, 293, -193, 503, -403, 399, -30, 239, -197, 383, 448, -879, 307, -210, -128, 377, -7, -249, -1069, -123, -129, -166, 157, 57, 576, 787, -219, 377, 269, 14, -26, 11, -268, -173, -329, -100, 437, 696, 557, -234, -46, -221, 473, 567, -728, -377, -87, -240, 716, -286, -26, 57, -384, 127, 239, 253, -636, -93, -458, 419, 312, 73, 79, -207, -37, 177, 361, 515, 329, 268, 122, -255, -255, 614, 13, 232, 463, 81, -90, -830, -22, -478, -433, -622, -98, 510, 229, 246, 628, -183, 65, -210, -105, 77, -296, -41, 17, 698, 632, -380, -391, 499, -178, -117, -53, -142, -319, 212, 17, -198, -450, -6, -46, -572, -662, 14, 65, 197, -1119, -396, 199, -231, -26, 262, 134, 649, 686, -301, -108, -343, -572, -513, 81, -40, -734, -172, -127, 231, 198, 283, 151, -296, -263, 168, -656, -208, 448, -258, -108, -842, -24, -49, -190, -321, -81, -326, 42, -176, 454, -252, -558, -197, 418, -15]
5802a5P90l44j6q71K78J023m78p14O79j71o73O06M70p87j87P27j68O8n08J12Q0
5823i9N83r59J277p56%j9J04k91J23l24M44J31l24L77l90k13l01K56P25O5m67
5844e8m73Q15r98L05Q30k91N2k01ko2N12m78P2l31M46K61l54K83J6k94n12R44
5866D82n31M5J94r4j360J745k73l18J40k58J57M68n56q9M08M86q03L23l05nN5
5887h9O5q7m8k31N73q58J133j83p37o5J59J02L18J89p97J216k76k74K69M7l73
5908E3M64m38K71l2j05r85P60J53K97p61N67n55J3O94p53L63kk31o6K15K35M99
5930F56j383R20j17M39p0k18N97j230N89j143J331j015Q37Qq3n33M81Q6N98q36
5950h6O68n45j52K48m72K43o22O98k36L90L75m47j18l36R3NJ81m73L84K44j88
$$ y = [-15, 775, 431, 415, -456, -178, 845, 367, -347, 332, 161, -512, 94, 564, -223, -410, 317, 149, 217, -291, -179, -99, 484, -475, 802, 46, 46, 27, 131, -160, -37, -361, 83, 214, -110, 267, -123, -336, -637, -381, 344, 409, -58, -531, 284, -714, -409, 421, 130, 182, -19, -21, -83, 429, -49, 23, -308, 138, 399, 45, 328, 344, 50, -462, 482, -49, -4, 190, 96, -1264, 481, 208, -110, 30, -228, -71, 397, -159, -248, 160, 646, -157, 166, -139, -144, -89, -24, -111, -159, -390, 183, -675, 458, 275, -462, -527, -368, -266, 52, 241, -556, 660, 384, 110, 379, 426, 53, 517, 79, 350, 318, 213, -772, -12, 141, 438, -323, 244, -311, -298, 396, -357, 6, 4, -227, -293, -78, 157, 656, -727, 193, 76, 515, 445, 227, 824, -406, 183, -960, 371, -644, 193, 201, 118, -415, 66, 152, 750, -86, 582, 37, -115, 133, -339, -96, -718, -20, -256, 134, 509, 62, -56, -392, -299, -294, -113, -586, -202, 42, -146]
5971a46M63j31k36L89m44K82Mq41M62K01j89L10m36J93k29r4Q33N7p96K75M7l90
5993d16M4K09M68j111P88k79O3L49O7m21Q5P4j40K35k30k84P95L11p61M26n15
6014b43k54P38k46k21k03J479p64l91L87l02k03K38K02J57j037N07k19J63P42
6033E30l97l90k33M32J60N92n95J33l15m6p5K45K2j49k33l02R17J86K46o06J97
6054C19m60m30N70q5J99j76M14m41o8P19q79M75K85m00l15J86j00p7M0L8Q4R9
6076cj53O35n52J3oq2K70k79J62P35p12m56Q9J10Q92q55N29q32L00L58M43p65
6098a59K68O45j367N92J96o24M66k43M42J43q21R3J94k97L30O07K5j69m25M50
6118C46m16M09o25O96K81j094R8J60O1K57m58L74j37K06J70J6m88L34l00L36K2
$$ y = [-146, 317, 186, -50, 339, -105, 177, 181, -660, -198, 3, -186, 124, -312, -119, -348, -442, 391, 448, -348, -73, -26, -416, -372, -163, 305, -806, -18, -297, -234, 115, 182, -239, -154, -80, -220, 15, -215, -499, 296, 607, -154, 272, -243, -497, 241, -5, -226, -429, 1050, 286, -105, 282, -20, -223, 15, 217, 374, -663, -156, -375, -212, 530, 133, -257, -490, -58, 102, 694, 99, 232, -83, -129, -204, 41, 63, -86, -319, -621, 296, 482, 728, 122, 319, -141, -571, -1, -86, 113, -63, 351, -90, -158, 561, -318, 157, 442, 42, -273, -87, -187, -264, -224, -186, -102, -3, -156, 479, -73, -60, -66, -148, 122, -157, 5, 740, 28, -428, -339, -229, 663, -192, 337, -495, -195, 163, 606, -159, 109, 754, -613, -21, 175, -449, 17, -226, 216, 359, -462, -369, -175, -472, -142, 465, 490, 321, -104, 346, -70, 339, -286, 410, 691, -403, -305, -145, -84, 173, -285, 89, -48, 158, 328, 344, -144, 190, -110, 226, 248]
6139B48j37K86p86L40m36N4J96J35K42m73nL60m44K45J89j5M92m95j26L94j20
6160A44J16k3m61j87K25P09j77K23m34L39j09J9o37M77P7p67K51K73j52K3mj72
6182b47J36L41q16O83n71Q87r77L47K68N41l16P5m64j42L98J16K0n03J39M42n32
6203a75K97N3p83R06o27N77K51m89L16k81N34j19l19q6j45J8R0m09K35R9K1m30
6225d66j9M93m1k83N50m53J59j6K36o13l2P58m92KJ02J56p2n8M67n01K06J14j03
6248I4k43o25J060m41m23M79l10P35m93J25j56K43r16P54J30K44q2K10l12q6Q0
6269F7j05L56q36K2O63n7J58k0k57l78J120n87J21l94k88Q59k09j13m91K68m39
6290e40O75j97N07n99J37j93M74p32K33K20k21j33L19m05K62N89J32m51r1N13
$$ y = [248, 111, 397, -389, -49, -485, -431, -235, -100, 142, -331, -336, 24, -420, -175, 14, -1, 491, -4, -130, 264, 144, 260, 237, -224, -411, -186, 523, 346, 569, 135, 474, 365, 384, -253, 224, 301, -466, -215, 58, -94, -71, -75, -247, -111, 230, -586, 97, -474, 413, -564, -217, 51, 592, 276, 351, -113, -255, 143, 259, 279, -224, -85, 357, -175, 122, 175, -608, 298, -329, 248, 499, 10, 326, 45, 579, 460, 141, 55, -90, -72, 18, -391, -156, -57, -36, -466, -485, 8, -33, -316, 234, -219, -60, -76, 160, -453, -485, 273, -219, -217, -115, 41, -31, -89, 378, -123, 83, 197, 94, -149, -774, 286, -155, -578, -99, -409, 326, -167, -42, -198, 45, -871, -117, 13, 257, 175, 385, 73, -13, 67, -38, 318, -518, -496, 167, 110, 268, 248, -9, -387, 733, 146, 267, -127, -415, 444, 235, 122, -369, -101, -540, 135, -62, 445, -154, -17, -210, 264, -468, -235, -15, -236, -369, -50, -455, -193, 396, 528, 77, -14, 499]
6310D99q46J90j14R79q52J80M28j215Q15J25M6m12J3J74o4K80J20m23P79p50l93
6331d41L64o69Q76m24O71Mk99l17Q81n83n44L12Q16r33l67P09J79j82m9K92P4
6352C70p8k35k25N9m77L33J28R22p02m11m36J109k88J87m02M23k52r9L3q5L68
6373B42j21j08j26r6O21m28N78j00n73J32N25n95M42l11N16l17l10K62n65M25
6393I3M20J51p90M9m81N89p2K08l11J21j03n0L97o99N97n5K85k52K57j103P19
6414c0J97p31Q91j00p51M32k28M65J86l22j68J12k26L04m43o12J485o43M64o8
6434B14l30j22O25l72p6M69j87M94m98O06j207J154j207Q5L61k84N47n11j3J94
6454e8J51n76P23n39M25m62P4M39l08K56n70J252n98m29J60j20l94L68L23jj40
$$ y = [499, -347, -157, -271, 708, -144, 36, 464, -751, 64, 189, 235, -177, -164, 10, -54, 226, 346, -77, 702, -48, -441, -77, -746, 130, -294, 377, 381, 82, -235, 646, 63, -481, -169, 647, -286, -653, 56, 235, 53, 4, 296, 370, 292, 57, -168, -109, -586, -253, -125, 797, 95, -316, -752, 357, 69, 256, -146, 277, 25, -74, -41, -126, 242, 121, 13, -113, -209, 412, -16, 562, 462, -111, 21, 546, -49, 393, 82, 598, 281, -29, 233, -332, 93, 513, 664, -126, -77, -558, 31, -41, 167, -144, -23, -126, -176, 221, -478, 119, 64, 349, 97, 354, -749, -30, 167, -564, 327, 227, -524, -92, -320, 145, 331, 9, -159, -47, -273, 31, -412, -1024, 461, -182, 282, 214, -116, -238, 387, 15, -61, 408, 221, 715, 217, 823, -384, 770, -437, -352, 9, -275, 272, -239, -252, -58, 93, -483, 240, -299, 126, -336, -262, 177, -131, 125, -445, 807, 209, -220, -60, -180, -574, -206, 117, 116, -24]
6475b4O92o82K54o51K99L55n89M24P20L60o74n63P6OK34J65r39J008j275J168
6495C64m55m72Q62J87m70P64j250J97M14p83K90M81l0n6n93N13j17K71j2k26N28
6516D07m30J24l3n83N32M87k70k79M7L45q71Q95m48J508j140k41N53n19l21N04
6536B67o7P4n11L53J0o2J97n50J45l06O17j45K82l41P38p08l50N61j08M2m60O58
6558C36l97j34K62l5k63O46p27J034p68L30n25J3K02J52k17J08K10n91L17O17
6578E70l53m8J27J96m61O39j55m01q46L01Q59o95O50l64l76L14P42o63k17m22
6598f03J065o69j65M71Q3j41m88N58o0o81N39M83p65L80j17m08M47J70k37P83
6618F45j087M83L57l7m78M56q06N10J38o10J075l27m26O29j16p93O27K27J35k97
$$ y = [-24, 668, -14, 240, -411, -112, 243, -346, 78, 798, 1158, 484, -79, -3, 3, 237, 402, -537, 471, -804, 364, -91, -563, 299, 486, 16, 780, -470, -273, 141, -642, -352, 129, 99, 43, -550, -37, -154, 117, 105, -121, 407, -23, 101, 68, -515, 17, 504, 234, -45, 2, 347, -524, 371, -77, 1431, 291, 50, 603, 84, -237, 267, 200, 274, -237, 116, 126, 64, 261, -289, -144, -450, 167, 22, 304, -37, 701, -7, -357, 204, 96, 138, -322, 336, -61, -195, 67, 32, -231, 415, -312, 722, -46, 284, -241, -228, -26, 126, -91, 17, 227, -364, -47, 570, 217, 169, 296, 492, 31, 670, 515, 114, -732, -431, 428, -267, 383, 19, -357, -43, 699, 36, -181, -603, 462, -207, -372, 99, 182, 41, -447, 111, 51, -630, -91, 392, -373, 7, -110, -518, -71, 99, -138, 645, -442, 41, 398, 361, -117, 339, -467, 43, 181, -429, 646, 319, -107, 522, 406, -387, 240, 467, 602, 305]
6638C05n84j0M55r25J2O08n43R1N97K28j20q59J112J9K51r31N22j19j87M6m75
6659e07J42N33j94O6L44j72j48N3n7L21m64J00m41K18J38L7m35N42M8j09N03n75
6681e7K66K34j236J80L39J01k1j45Nk6l7J20l99R68o95O35j231J472m18n79J7
6702e07K38Q49k02M02p23k3j293J011N62k13l7n52Q56k90L31N1n58J68n40L35
6722a35j09L71%r83K61L17J13M42L3l23m04M91j16n15J50N63K63m72m38Q19j98
6743A30o85M15m13N02L10O99p28j0q77N19j53O66j245L29P75o06M46k78m62O39
6763b7k46j78O74j83N63p95M28K5J89n41k44M41J44M82p53N91p72j38O82m00P03
6784F45o72n11J096k03r40j8J068l66o1J37o84N61Q85k1q19m64M49n38M01J11
$$ y = [305, -279, -289, 166, -759, -747, -139, -682, -591, 6, 234, 114, -745, 367, 386, 637, -294, 228, 109, -78, -32, -507, -365, 168, -26, 40, 384, 212, 64, 117, 60, 381, -83, 17, -424, -206, -68, -31, -466, 76, 124, 15, 518, -57, 209, 443, -793, -613, -274, -173, -194, -339, -334, -360, -397, -277, -676, 292, -403, 232, -999, 473, 55, -524, -507, -269, 580, 378, 780, 57, 34, -1259, -248, 314, 101, 64, -488, 368, 78, 409, 460, -98, 70, -470, -135, -244, 127, 127, -856, -595, -278, -165, 277, 310, -13, -417, 74, -42, -557, -407, 156, 419, -53, -491, 328, 130, -555, -140, -553, -51, 259, 958, 230, 220, -657, -138, -291, 375, -870, -541, 234, -372, 74, -204, -666, -27, -273, -451, 223, 40, 603, -192, 236, 261, 450, -91, -335, 106, 250, 732, -21, 570, -202, -340, 342, -58, 645, -27, -538, 558, 355, -585, -603, 465, 99, 38, 175, -509, 52, 937, 916, 97, -367, 82, -456, -55, 56]
6804E6P31r61J88N47r23P25q75P05L25l93k34k22J71L12n1N53j413P13m67J19
6824c94O29o67O18l35m6k8J41n57R7R00K76o29k78K1KJ46k76J59K07K1k29p3P
6847b88rKL5O82n61J4M94j033P02j53n2m44R47k65k37L36j56J27n57P95k92l41
6869b54Q13n90J60q68P47J4j58N39p11P4p4j17N14N3k1LL58m29l67N34l49K65
6891A36R7r52L70R53r38J69j01J53J97j82j66R45r48N25J44p10j36K25P68m38
6911A11K16m97k91J242o69N3n00l80P29j52M51j72k01m33N55K70K17q97M03n61
6931e06L98O16o5m29j55l0Q3N12n9n2M47j135m57J219k0L69m95o8r89O21O78m35
6953D8N88n78l47M62l29M93j240Q90K63p2N57j532J014N2j57M00r59N6m25Q51
$$ y = [56, 787, -174, 14, 561, -362, 363, -512, 193, 518, 125, -109, -331, -160, 152, 101, 654, -759, -46, -513, -394, 235, -432, 186, -149, -195, -223, -82, -639, -542, 358, 634, 5, -273, -252, -250, -104, -380, -221, -14, 7, -222, -295, -288, -297, -295, -260, 422, -139, -125, 369, -664, 38, -115, -167, -611, 336, 71, -166, 170, 14, 141, -416, 379, 87, -254, 559, -31, 129, -739, 8, 22, -136, 403, -308, -234, -308, -425, 89, 142, 121, 124, 482, 53, -314, 220, -129, 136, 233, -719, -349, 604, -334, -165, -266, -113, 84, -98, -264, 681, -267, 258, 402, -308, -444, -219, 549, 111, 327, -170, -461, 781, 112, 165, -335, -715, 14, -138, 313, 141, -60, -493, 62, 332, 549, -348, 55, -506, -108, 508, 443, 14, -141, -171, -88, 424, 365, 313, 760, -375, -832, 387, 367, 736, 241, 173, -816, -195, 483, 48, 636, 58, -289, 173, -156, 337, -903, -13, 250, 178, 735, -797, 217, 269, 112, 512, -447, -391, -816, 35]
6973C5J12K84j269P74j16R3L49k18l28Q86p7m11k49L04k5m94M91J9M1n29N32n39
6995c35J86l1J42M87j118J15Q15k36r32R20J94p81Q70m74L69r10Q07n06N50O1
7015A93k81J37J11p63J053m88K82p84N68m39Q10q83L32k24L07k24P36m2m40J26
7035H7q9o2j53J20k67Q82O0n81n07R41N5j300J269m94m79P39n67M05p3p7L5n7
7057a13K47r4p7M76l76L46l30J1n99L54L58m57l58O74m49J92Q31o92J66o96K05
7078c81L63K46m69O10m91l18J063l90J96r37M21j36N08m46k96J8P94j42q3J05
7098B35l98l28L91O0L22%n14J11Q18o78l95J316p29l81Q9n54O75o9n00J86K62
7119h1k83m01P00M07p28K33L84l57nL1k10K90J60l70Q92r87J91PL51J4L65m18
$$ y = [35, 147, 431, -838, -64, -180, -87, 262, 44, -284, 602, 525, 114, -135, 169, 144, -350, 141, 160, 201, -328, 204, -335, -149, -180, -38, 449, -669, -554, 261, 25, -907, 13, 207, -574, 296, -178, 191, -719, 88, -418, 132, 193, -88, 49, 160, -603, 450, -38, 244, -540, 28, -411, 399, -484, -152, -376, -69, -293, 443, 401, -39, 87, -2, -64, -217, -97, -364, 518, 578, -3, -510, 431, 486, -814, 455, -39, -518, 221, -346, 59, -14, -91, -56, -113, 134, 40, -37, 439, 63, 409, 79, 90, -509, -155, 203, -254, -612, 62, -387, -195, 636, -56, 110, -586, -381, -18, 228, -241, 369, -122, -440, 623, 233, 429, -508, -87, -223, 285, -161, -457, -439, 355, 213, 130, 235, -163, -491, -100, -40, 282, 282, -232, -121, 697, 19, -376, 940, 211, -170, -81, -635, 40, -29, -529, -343, -81, -364, -765, -65, 342, -386, -153, 231, -126, -131, -100, -310, -20, 140, -230, 662, -325, -134, -127, 224, 238, 603, 185]
7141A85q93R22K5m29L91j9p6K39k82J11N4m72N32l24Q0kk27J55p31J239q45P45
7163C78k64K96k31k87j46Q1J78l46Kj31J006n26M44l65m22l76M23K72P51m51r1
7184A95J56q54M49P8l96O1O34l78j01J78n9l62QJ18M06m38L21O75j024K44l1K47
7206A27o80J157K4n00l31L78J58m0P0J9Q7l75n26K61k8Q4K45k78M40N68o93n3
7228A14r3L14l73k29J01N56o02P11j134K99J67n96J325j183R02j55o41M49N68
7247E00n36j58J19l36J136j45j40q0j40p17P03j71L6M55q2o45K79k10O80j138
7267e90M92m30M07m24K94P23m68o82O96M50J62r02j94n38N75J95L38p17P51K15
7287C53j17j78N83l72J38p54J24Q30q31k43J61M64j37j08P22j04J35k30k98l16
$$ y = [185, -708, 214, 239, -190, 201, 182, 106, 345, 63, 174, 228, -244, 288, -36, 44, 42, -185, -30, -761, 478, -367, 378, 114, 410, 179, -108, -254, -173, 5, -341, -339, -470, 536, 10, 454, 89, -333, -709, -286, -14, 737, 286, 195, 351, -503, -54, 24, -372, -311, 323, -55, -156, 22, -37, -399, -391, -273, 133, -305, 16, 691, -333, -89, -120, 127, -553, 604, 628, 128, -203, 175, 333, 293, 363, 382, 469, 94, -432, -171, -199, -115, 130, -148, 292, 860, 167, 114, 21, 335, -38, -267, -166, 390, -212, 499, -635, -336, -169, -765, 560, -623, 279, 124, -517, -68, 500, -36, -194, -75, -411, 725, 580, 440, 360, 220, -497, 206, 35, 71, 526, 444, -201, 78, -132, 548, -590, -98, -528, -121, -545, -251, 472, 4, -678, 18, 468, 630, -272, -466, -1004, -429, -234, 104, -613, 138, 353, 236, 58, 641, 269, 407, -347, -223, 607, -224, -467, -306, 158, 21, -87, 635, 531, 666, 436, 138, -178]
7307a78l41M23K15l87j48Q4P84m36k62K74R2L42l10m85P34q32l19J016M27l14
7327C79m65L83j167J076N35n13k89l97O81p81Q65o55K99l43J70N38O2o95L55M41
7347D79k95K73k02j33j49k75p4R54n51r3J82mn47R98o73k93J68k38P12k76Q11
7368G74r37j1l17p8N74k31j002J356k74K02l82J97k88M35L11l8j42n50M82J26
7388B07L28q09j81N15K9m17k51l66O68L19m12L43K68o97R56p52r1L91K5n79L73
7409a33l30M29K00k4l82O44n25j90M32n8K16p63L88J88j67J18L49k03l1k72j80
7430b94M03k38M86l11J2l98j69O25l68l36O23n6k9J02k24k22O71k26K78N62o60
7451B31k7n25K96j78O32m30K51j36j43k85J97j86R7M23k04k09l70P06M19p08j84
$$ y = [-178, -519, -96, 119, -268, -416, -332, 452, 16, -246, 28, 120, 462, 152, -333, 401, -431, -750, 266, 693, 379, -86, 297, -870, 206, 741, 228, -61, -458, 223, -558, 307, -348, -49, -392, -222, 316, 378, -317, 38, 479, 184, 457, 255, 122, -27, -302, -376, 578, 27, -66, 116, 112, -435, 563, -110, -403, -235, -473, 239, -37, 774, -163, -174, -491, -569, 5, -226, -1228, 128, -146, 56, -326, -129, -417, 18, 329, 291, 149, -401, 81, 207, 535, -274, -455, 60, 89, -328, -579, -945, -277, 42, -370, -27, 241, -456, 500, -252, -343, 48, 73, -506, -133, -463, -34, 166, 142, -240, 404, -121, -311, 121, 63, 279, -484, -96, 92, -75, 43, 392, 189, 158, -114, -294, 109, -129, 357, 46, 58, -340, -509, 116, -252, -588, 35, -21, -50, 52, -172, -394, 277, 51, 329, 891, 231, 204, -321, -25, -203, 429, -1, 250, 114, -29, -314, -117, -303, -206, 217, 13, -196, -566, 140, 559, -149, -333]
7472c33R11q90J17K35k73j03M05P6k05L59q42Q60J52n88q13M41jQ90J30p17j50
7493c39O84q78Q78k25k29M96j03M17r02j88N81J61j97Q3n4n03l2N91p7K99m95
7514c2L63k1m70M64m19%k81K63l55L01o4K11J1J19o34O36o54P5Q24j006K96J36
7536b37R11r98Q75o91R3J62o82Q84m23M23K78m6l20p03Q59k72N27j433J169k52
7556A24k96J50r2J57J3M17o68K4J14K82o04k17R69O12j497R11j18k89j32k02N96
7577B54R6r53P88m50M05K57j52k76N11o32M7N74l18P0j86P1k06R0M12q19N55l94
7599b56l6P17o25L44p08L23q9K20K30m99N47O58q68k53M03p6N06q95M11j94n8
7620a98N8J00J082r32L09n88m70N28j62J80r2M51p5l22p2l81N70j60l91J437j149
$$ y = [-333, 578, -312, -195, 40, -233, -336, 69, 145, -60, 299, -543, 317, 469, -119, -932, -491, -492, 398, 528, -189, -339, 345, -533, 345, 120, -109, 387, 284, 701, -201, -389, 192, 353, 156, 239, 185, -318, -350, 241, 164, 463, -32, 331, 310, -160, 304, -115, -115, -396, -133, -488, -187, -251, -40, -29, 90, -544, 92, -562, -487, 337, -669, -373, -237, 674, -324, 551, -140, -47, 115, -567, 317, -106, 317, 595, 549, 229, -474, 385, 113, 640, -793, 376, 124, -172, -22, -114, 43, 56, 473, -195, -171, -57, 225, -379, -596, 373, 985, -512, 399, 281, -8, -140, -342, 254, 350, -603, 185, -265, 140, 397, 245, -31, 480, -152, -105, 469, 151, 221, 35, 106, -100, -10, 402, -417, 138, -256, -292, 425, -200, 144, -564, -241, -330, -110, 120, -379, 168, 826, -42, -295, 108, 32, 538, -357, 54, -140, -198, -140, -40, 1042, 110, 419, -169, -639, -111, -273, -93, -185, 266, 191, -131, -203, -584, -14, -174, -565, 872, -277]
7641b77L0p3O36q25M34L89k11M92q61l35L91P89o06j32J10J61m37P1O17k83n84
7662e04J03j72N08K84j26N9mm2j79L80n52R50p33n10N73k37l36P84m50l99L56
7683b47k33J74Q61m39l59o24R36o69P64m4m12N25n2K44n99K74p69J262l78j82
7703C3j10O74m94M46o51J035j098O3P24j169N79l49M73M4J37j99M58m70r5m93
7723d62O00Jn6O0j37L25j123Q74L14m96j15L52J14l53M2K02p39K28L21k73j40
7744d61L33Q01m76l71L77o17Q57r43P43Rp94P99n65J002l03n93L74p9P5j50N06
7765E24o26K37L92l12P9m41P4O81o70n65K30j81P71O5k26j36q58O13K03l99N83
7786C8j94K05n20L13L15l40k80J203j473M75Q24j095L90O11k57l9m78m94Q56j40
$$ y = [-277, -247, -320, 316, -509, -75, 314, 103, 595, -266, -601, -210, 579, -27, -159, -49, 112, -325, -254, 363, 80, -504, -401, -573, -65, 219, 93, 152, 148, 106, -73, 307, -245, 705, -28, -538, 35, -202, -538, 246, -204, -603, -247, -480, -306, 555, 116, -243, -867, 69, -600, 164, 120, -292, 233, 181, 425, -174, 100, -669, 593, 215, 33, -77, 597, 103, 549, -102, 933, -165, -102, 622, -547, 32, -317, 156, 200, 337, 138, 596, 126, 31, -462, 138, 139, 83, 143, 6, 331, -792, 82, 396, -100, -215, 137, 251, -102, -60, 142, -597, -369, -48, -321, -461, -128, 673, 197, -174, 203, -414, 443, -500, 243, 252, -542, 257, -308, 694, 391, -202, 172, 93, 168, 18, 524, -102, 135, 527, 215, 294, -147, -73, 608, -62, -627, -397, -578, 193, 258, 32, -104, -962, -349, -146, -545, 38, -156, 49, -471, -158, 157, -183, -463, 740, -733, -258, 566, -529, -139, 472, 215, 176, -302, -796, 60, -80]
7806h0n94O17p0M07q71M63M76o16M27r81O38M88m22j70M85n30J0l98O0J038j92
7827A85L53m48J16q25L73J35p6p8J95m16J025p76l0J4N02j98k99M97J5k24P6k06
7849i0k41K55k89O58J04l39m73K79M99Km69n41Q26P8j31r1k45L13q18J192p60
7870b81K53l48L59o18L33K40j64L36J64m04N79J11m84L74l59M89o97K81O02o30
7890A36J82o8k93k87M07J10m15M06L75n87mK7j69j13L11n32O35N36n77K4n71K92
7912a75K85m25N52o41L01m3K81j48j36J56M4k02O49L62r70J95l07J13P3k50m43
7933g29O67k54R3J10N41l49m19O93p52L42M83j8l85J40J83Ln30k76K79P81r45
7954c42J80j9M10l02j71N10P0m78j71M56O02o01k24l33M18J19J33M61m23O8Q1
$$ y = [-80, -674, -57, -127, 280, -591, -128, 348, -268, 159, -822, -184, 304, -118, -288, 197, -333, -323, -721, -661, 377, 185, 538, 90, 206, -619, -246, -111, -187, -265, -70, -486, 539, -237, -267, -253, 249, 51, -248, 249, 264, 40, 116, -90, -331, -76, -365, 293, 397, 58, -415, -136, 363, 365, -104, -645, 181, 259, 128, 37, -208, 105, -713, 479, -281, -28, -376, -17, -635, -302, -62, -226, 110, 274, -130, 449, 560, 76, 450, 91, 580, -117, 164, 766, 136, 318, 250, -43, -330, 77, 187, -228, 178, 553, -34, -38, -11, -180, -293, 18, -514, 121, 657, 80, 104, -467, -175, 110, -315, 237, -404, -103, -146, 135, -13, -149, 7, 51, -151, 498, 860, -110, 85, -222, -109, -36, -286, -729, -62, -316, -223, -113, 428, 79, -340, 353, -399, -57, 426, 408, 23, 163, 346, 349, -181, -457, -178, 603, -342, -162, -181, 229, -73, -244, 266, 336, -142, -313, 143, 745, 144, -80, -413, 5, 124, 257, 718, 295, 363, 444]
7975D44n95P47m14m52l1J00l70Q56o39r5P12o97r2J97J95N68q26L50j76J89J64
7996A35j22L44n92N31r0l05m83N6n42J334k38j49N30q41L55M38l47K39M89n55
8016A87n94J68k62K67J73P2L3j18K36P4l26J56l37Q36k00p53R32o05j02k77Q2
8037c58J026p49K25l62n30R1J215m10M25p30k26L60L2L32q33N22j02QN0O29l70
8058B45l03L21m30N97n97P4o3j37k77P17J48J05m46N53q60O29k70R17n00L4j19
8079C38m98o2J54Q51q27L50j79p6J0M93n52M28n79q6R06j090p7j74Q74j64M2o07
8101e25k50J012l19J51m62K15j35P50j50q55QP10M41q47N19M17p76m00J86Q52
8121E42o75J73N46o73l93O93r8n7L07o8p0K77k57n62j29J93j28J20l83Q89j055
$$ y = [444, -151, 596, 182, -270, -301, -201, -571, 285, -354, -449, 263, -434, -526, -329, -134, 434, -392, -42, -218, -29, 135, 13, 357, -235, 296, 206, -99, -582, -526, -1068, 266, 28, -121, 409, -432, -77, 361, 14, 253, 742, 187, -407, -239, -501, -234, -61, 11, 44, -74, 162, 236, -90, 66, -271, 565, 365, -388, 544, -61, -163, -440, -358, 668, -81, 144, -218, -748, -657, 558, 148, 573, -157, -383, -23, 9, 341, -492, 30, -72, -64, -14, 615, 245, -58, 263, -167, 430, -167, -93, -156, -293, -570, 147, 295, 400, -46, 507, -353, 276, 6, 923, 423, 457, 338, -160, -222, -68, 783, -44, 306, 127, 51, 61, 554, 2, 430, -149, -235, 671, -419, -496, -670, 204, 40, 82, -525, -775, 237, -82, 69, -393, -178, -313, 437, 287, -568, -560, 150, 591, -256, 263, 680, -96, -496, -310, 542, -133, 40, 586, -87, -480, 213, 115, 58, 365, 297, 227, 504, 247, -315, -444, -251, -379, -259, -642, 247, -808]
8142h08J446o14l26L0oj18n3J21qo4L89j26J22J18q9m50j32N31R5j57K23m49O2
8165b63L35M86p50L88L37m76M5m06O27n16L34O1L75n60K61m26K62L04j1K13j048
8186d28P38q62J017o41K32
$$ y = [-808, 638, 24, -302, -272, -278, -396, -449, -328, -336, -400, -11, -137, -15, 103, 14, -436, -568, -37, 58, -99, 124, -325, -263, 72, 558, -192, 196, 533, 57, 102, -304, 323, -193, 141, 202, 577, 17, 278, -148, 114, 418, 407, 620, -428, 310, -552, 465, -176, 56]
8191E6
$$ Imaginary data points
##PAGE= N=2
##DATA TABLE= (X++(I..I)), XYDATA
0@%%%%%%%%%%%%%%%%%%J0p4J28j28J28j28J29j90K53k56K71l35L86m44N08n72
34c14O44p16Q23r16J014j133J267j408J563j736J917k117K343k587K850l139L455
51A810l803M189m626N116n655O269o979P799q764R915j1314J3074j5348J8430
65A0113k2862K9783m2321P2302l02325k29394M13026L33919R0893k32309k08033
76h7208r3012J14204J66003Q5535r1578j15670o9060j9081K62J02607J44584Q251
88A45837k05546j88088N7182K54640J71897n8067k01628j31440N3997J75907R9009
99A73700q4364j63252m5584Q0856N6561l3415j4407N5728K1375q1844p9331M4118
111f9859J36562Q6544m4819j35192r1975N8282J53139N1823j32923j54152J4561
$$ y = [0, 0, 0, 0, 0, 0, 0, 0, 0, 0, 0, 0, 0, 0, 0, 0, 0, 0, 0, 10, -64, 64, -64, 64, -64, 65, -125, 128, -128, 143, -192, 194, -250, 258, -314, 330, -386, 437, -479, 535, -598, 669, -739, 824, -912, 1005, -1112, 1231, -1356, 1494, -1645, 1810, -1993, 2196, -2430, 2686, -2969, 3300, -3679, 4120, -4644, 5271, -6043, 7031, -8317, 10113, -12749, 17034, -25287, 47015, -255310, -484704, -71678, 262241, 353134, 120825, -87208, -180220, -66016, 99987, 185522, 93944, -21726, -90786, -109867, -109605, -6998, 137586, 145837, -59709, -247797, -190615, 64025, 235922, 177855, -23773, -155213, -101216, 74691, 173700, 89336, -73916, -119500, -38644, 17917, -15498, -29905, 25823, 47198, -34646, -113977, -69859, 66703, 153247, 108428, -26764, -118739, -60457, 92682, 144505, 11582, -142570, -128009]
122a28009J33398O3146n1637m7980K5170L5096j8407l9310N84M9451N2619j5246
134E8875r6631p0735O8768J44774K5341j46318j28224M8231J41138N1265p3054
145B3430q6149k309O3885N4274j2167n5761j7104N1286L1040n5911o7068L5784
157c6770R6526R773r9005o9554N5427J07310L1070p3262q5237m739P9356O6928
169G7823l5234r6284k3364Q2674O8324m5835q2575N810Q0949L2776n9534o2229
181e6699J3444P0006M0567m1262p9202k1570P2718P2918l0834r3863j9420Q3972
193A0775O5605m0142p8189m500O2144L7942l3671n9351j0730N8553N5093k3169
205D0360q4396l2902O7857P4125k8159q9755k3135P7149P1294j9185o8149k7325
$$ y = [-128009, 5389, 68535, 16898, -31082, -5912, 29184, 10777, -28533, -27949, 21502, 74121, 58875, -37756, -108491, -39723, 105051, 130392, -15926, -144150, -95919, 45219, 96484, 23430, -62719, -65028, -1143, 53131, 40964, -14797, -31901, 19385, 50425, -5486, -72554, -36770, 59756, 69529, -29476, -99030, -43603, 63707, 94777, 21515, -63722, -68461, 10895, 77823, 42589, -53695, -77059, 5615, 73939, 28104, -54471, -48661, 32288, 65064, 5530, -56699, -43255, 26751, 67318, 26056, -53146, -74716, -1998, 70920, 40086, -53777, -73197, 10775, 76380, 36238, -41951, -46451, 15693, 53635, 19964, -39387, -50117, 8436, 63529, 40360, -44036, -76938, -9081, 65044, 36885, -52870, -76005, 1144, 72438, 53253, -14896, -42221]
217d2221L8095M8070q648o1556l6679M0630O7929m102p1073l2644N8613O3975
229F0389k2314p5181k4028N5476O1456n118o1551m0099L1628O4059N061o8630
241a8852n2288L8164P3023P066o2873l7649M1219N9256j841n6356l7103K8138
253b0096N8898J1714n3460m9583K4274O3138J3876o0428n1023K8280O5888J5340
265D6818n0571l8828K4163N4754J3725m6821m8160J3162N5641K1428m5622n0139
277e0450J6783O1297K0807m6234m8915J4114N5642K2733l6940m6537P574N3212
289B3086K5744l7193n0878K368N2107K7640l7015m8636N126N4041K9400l3185
301A2605m8426K405M9838K9096k8807m9765l182M7051L2156k6769m9186n104M5002
$$ y = [-42221, -4126, 43944, 35296, -26260, -62939, -22309, 45620, 41518, -29555, -62199, -3586, 60389, 38075, -37106, -61134, -5658, 55798, 50680, -10871, -50970, -19342, 44717, 49778, -18852, -71140, -32976, 40047, 47113, -15760, -53409, -12190, 47066, 45225, -11131, -48234, -20096, 38802, 50516, -2944, -52527, -28253, 34885, 48761, -11667, -62690, -34410, 31478, 46818, -3753, -42581, -18418, 36336, 50061, 3240, -44920, -31758, 23883, 45311, -311, -50450, -33667, 27630, 48437, 2203, -46712, -32598, 23044, 45777, 8837, -37700, -30126, 23086, 48830, 11637, -39241, -36873, 15234, 42874, 5859, -42777, -37651, 16390, 45790, 12605, -35821, -33416, 16422, 45518, 16711, -33054, -36236, 10815, 42971, 16202, -32984, -38088, 6914]
314F914L2842k3974m7275n373M4200L3093k0188m5452q634M0580L2657j8665m6318
327b5593j1967L7283L5239j5418m4441j2182L6745L5432j2313m2598j3570L4311
339I28L5497j1385m1901j6039K9482L4688q125m2872j6946K9577L7118o453m0351
352a6782j8461K9525L6603n035l7939j9412K6203L5535k497l7536k3063K2132
364a0727L5230j914l6326k2038K3818L6528K379l3069k0861J9111L2945K167l1249
377d006k4214J4020L5119O270l0708k6325J5352L3117L212l1102k2884J4957L4315
390A7123Q175k2989k1761R646K9425J0018k6498k9628O567L2815J1557k5669k5668
403b6887J0196K9013P404k3249k1144P621K7862J4830j5781k3325K622K7178J2461
$$ y = [6914, 39756, 15782, -31493, -36866, 7334, 40427, 20239, -25213, -33847, 6733, 39390, 20725, -25593, -37560, -277, 34962, 19544, -24897, -37079, -334, 35098, 22785, -19813, -33383, 928, 36425, 25040, -16861, -32900, -3418, 31270, 23145, -19727, -36673, -7096, 30022, 23569, -16782, -35243, -5718, 30885, 25850, -12089, -31501, -5298, 30237, 27740, -9796, -32859, -10727, 24503, 22589, -13737, -35775, -11957, 24571, 26950, -6119, -26980, -7869, 25076, 27243, -4006, -28220, -14200, 20919, 27189, -3519, -29844, -14492, 18625, 21837, -9265, -32149, -17192, 17123, 25298, 2309, -19452, -9806, 19619, 29637, 3139, -26489, -19922, 12893, 24450, -1219, -26887, -16691, 12322, 19726, -3523, -24667, -17046, 10816, 25646, 9865, -13460, -10838, 16340, 28801]
416B8801k4346l0847L168K9205J3267j9278k1522O510K4245J3578j5707k3722
428a6648l630K2243K0252q574k5491k017K5577J5112j7911k9118j952K0406J1468
441I717j1158j5513K204J8763J7578n859k2554q603J8240K0501j1599k7180l803
454a9266K3933J5856j4092k2381l662J5621J3589j924j4356q697J3067K1433l35
467A8786k2270j3466J4676J9273o948k0783l186J6558J0642q311j3668n322O727
480g292J2895K910j3980j1555J4775K3184m45k4226j2246J6312J6065q130j9347
493a1080n069R063J1187N092p809j1935N07J7547R748j3948j7330P808J7707j997
507I491j6760m692J2223Q986l298o063l257J652O265L656r731j6394L344K1994
$$ y = [28801, 4455, -26392, -23224, 5981, 19248, -30, -21552, -15042, 9203, 22781, 7074, -16648, -20278, 1965, 22217, 13643, -11848, -13865, 11712, 26824, 8913, -20205, -22157, -1751, 9717, -1441, -16954, -14750, 4013, 21591, 15732, -6822, -15425, 2815, 23316, 11717, -15463, -19266, 4667, 20523, 6431, -15950, -19612, -3991, 9598, 7674, -6682, -15379, -2312, 19121, 18786, -3484, -16950, -2274, 16999, 10051, -10732, -13918, 2640, 13282, 4971, -8697, -14019, -7292, 5603, 8513, -5467, -17022, -2247, 20937, 20492, -3734, -15980, 332, 16397, 8267, -11080, -16149, -7086, 4101, 9193, 1384, -10551, -10044, 7503, 17251, 3303, -14027, -6219, 11488, 9491, -7269, -11961, 262, 9248, 5950, -113, -3370, -1718, 4547, 8203, -1528, -17922, -14578, 7416]
521G416R414j7640j3364J1948J7259k220j5063p609K306O034O975J518r104n894
535h024R176J3209p997j8379p91J5895K309j0590m029J0526P517m036n099j550
549a863j088M455Q982j502j3653n776J6393Q629j5942j9427L363J6026M987m782
563a198J252K831K113M445L525q181j4722K41J2978J215j1275o36J3484M481j2574
578b021p510N269K812m470j550L437M515L774J1085K908j3517j2109O224J1196
592A0043r632j5802k21J3915M916l460j321P75l562K199Q605J889q016j201J0759
607I886K414j1489p986O493J191r174l887O874Q016j270j483K869j988k545N374
622C295M999o945r636O162J3731J874j4177n236M530J299o140k640L882j557r0
$$ y = [7416, 16830, -810, -14174, -2226, 15033, 12813, -2250, -9859, -7553, -1519, 5456, 6974, -2130, -8024, 1152, 14361, 6364, -12015, -12806, 3089, 5398, -5192, -9221, 1305, 8822, 4786, -313, -1863, -2951, 1504, 10486, 8984, -4669, -10445, 5948, 14577, -1365, -20792, -17429, -1403, 3584, -1198, 54, 2885, 4998, 9443, 12968, 4787, -9935, -9694, 3284, 4499, -6776, -7412, 6072, 10553, -2021, -9531, -4262, -1450, -5920, -7470, -4033, 482, 4256, 15341, 18249, 4732, -7377, -1153, 10043, 411, -15391, -15612, -1697, 3219, -241, -1562, -787, -4349, -2150, 6455, 8344, 328, -873, 9886, 12300, 811, -7175, -682, 509, -8665, -12552, -5678, 2338, 1068, -415, 2454, 466, -2079, 3295, 8294, 1349, -8287, -2125, 11606, 13480, -697, -5933, -1403, -104, -6244, -8884, -5002, -6559, -6649]
637f649R969O935l429n967M791M747q453q620N595N604p462p142N352O656j598
652C29l048K946n25k484L204Q435k085j1267l50J1316J492q071n101M754J511
667A056m017J165K676l452m748N526N748j758l604L691M621l747m865K661M007
682D960m738p081J802N167j237j596J366J041k591J733O972J060o077l152N981
697C610L137n561n467M21K616k793K43N242Q0l485J212M304q03n054j87M574m96
714A593l822L231N058r45n581p20J390k060l072J182K420j822N62N379M289m673
730B409m082L348Q62k862k134K188J887k226l9J975O81m623o22K528J24j537O47
747a476M055R52k809J5J773o91l299j101K154J014j108J743N07j801k020J110
$$ y = [-6649, 3320, 10255, 6826, 859, 5650, 10397, 1944, -6676, -1081, 4523, -2939, -10081, -4729, 1927, 329, -2719, 227, -298, -2782, 422, 8857, 6772, -4495, -4845, 6471, 7963, -108, -5209, -455, 1056, -2961, -1796, 880, -2572, -7320, -1794, 3954, 2196, -1408, 2283, 6904, 3157, -1708, 953, 4960, 222, -6859, -5057, 110, -1127, -2723, -1357, -316, -2907, -1174, 5798, 6858, 781, -2371, 3610, 6747, 1186, -4281, -3860, -1244, -4037, -3794, 1448, 1528, -1957, -745, 3559, 2756, -2298, -2485, 2089, 1593, -2229, 1002, 6060, 5115, -466, -1186, 204, -1856, -4928, -3746, -1326, -3148, -2586, 2793, 7082, 2409, -1673, 1675, 2537, -325, -2459, -271, 1616, -610, -649, 1326, 2007, -2616, -3238, -710, -586, -2123, -1476, 2579, 3531, 722, 737, 2510, 1819, -1480, -2581, -427, 587, -521, 1222, 1729, -72, -2092, -982]
763i82J611j468k069J190L156J218k403J596R52k718j370J473J34j607p70K352
779B95J415j409O5J022R1k177p51O91J643k184J06K126J415j907J08J477r40k262
797a176L97O89O99j424O60J381j265m90j36O00k17r65R26J244p37J1N58R00j078
816E77q64M33J22j348o88O10J843j485O58P71j98r71K52R55j02r53M71J058j40
835A001J1q44l0p5o77m01Q95k07o98P41Q33p28L97k73O34m34K49K27K05k47m66
856A13j05J24p62j58N52n9m78N77J050m06K87j629M96K32k44J88k3J459q65m14
876f5R1Jp43j9j08P70l06L74O12J13k30k30J60m24n97J50M8J241k83Q7j78m2o28
899b06n66J058j718M47O25J508l69l21L44m13k18k022Q70J167p3L22R10l66o19
$$ y = [-982, 629, -839, -2908, -1718, 1438, 2656, 253, 1849, 2801, 83, -1287, 186, 320, -1287, -2057, 295, 1710, 301, 366, 1388, 1479, -698, -1449, -758, 885, -1299, -1193, 933, 2348, 441, 549, 2026, 1086, -1176, -779, -90, 609, -815, -155, 1226, -39, -529, -665, -65, -282, -1247, -321, 923, 186, 197, 755, 1655, 577, -287, 146, 268, -1080, -1768, -1158, 685, -800, -142, 629, 431, -540, -288, 667, 565, -388, 83, 1141, 1001, 1012, 168, 138, 63, -614, -1015, -120, -327, -1025, -284, 549, -179, 218, -55, 579, 145, 394, 621, 826, 579, 113, 8, 132, -630, -788, -236, -295, -773, -196, 854, 448, 735, -894, -398, -166, -410, -222, -245, 1214, 349, -65, 26, 27, -716, -735, -843, -73, -379, -5, 607, 720, 490, 260, 420, -4, -601, -451, -403, 838, 555, 642, 464, 422, -206, -772, 286, -1432, -985, -360, 1148, 779, 458, 802, 389, 171, -1851, -981, 186, 113, 435, 1345, 979, 360]
918C60l85o9n29j664Q23J438K029j342O72J70j125j085p80K47p03M92J670J563
936A782o04m22P30M81k462j983P11J179j16K15P95J018k33p76l00q4k144L96K301
955D84J127j145m62J889l04k008L10N2J51j076M72N89J18j041k90J819j576j442
973b333J657J951k48m21M93J099m29k112j28j286n71m4J247J767j261K53K055
990A689M82j946j710J416N04n90n37J123J541j390l88P38r59p04m23J753k250
1007a651j288J012L105O85l033K20K303J481j310k11m46j494l53N48L06j173j621
1024b920J995K010k03j265J288J045k297j645N01K188p66p94K293L71j967R12
1040G46J034j256l967J23K822J960k298r21J927J499j577n15K102j811j045K326
$$ y = [360, -25, -94, -623, -2287, -1464, -26, 2003, 661, 1333, 1503, 378, -707, -1487, -1240, -1943, -1451, 219, 1782, 1178, 756, 1486, 1967, -495, -2478, -1767, -588, -704, -489, 306, 1324, 1091, 315, 15, -69, -2213, -1817, 484, 1611, 466, 4, 1893, 1589, -419, -109, -57, 94, -982, -510, 79, 197, -844, -1134, 685, -891, -2333, -676, 1275, 1027, 606, 1099, 2198, 1769, -343, -471, -1757, -2328, -2372, -1125, 642, -619, -366, 1689, 2171, 225, -1485, -69, 435, -155, -692, 431, 1972, 582, 194, 932, -27, -731, -1154, 599, -1651, -2939, -1927, 1178, 1863, -1170, -950, 1353, 2834, 1524, 1313, 867, -627, -980, -432, -126, -1299, -2920, -925, 1085, 882, -383, 905, 1950, -347, -1992, -1491, 697, -69, -863, 1430, 1801, -166, 746, 1780, 524, -3443, -3320, -498, 1462, -836, -1757, 170, 1669, 92, -423, 1679, -132, -1177, 1149]
1056A149J394j675k621M4K678k101k045N48L308N81j710J915K022j417k741j41
1072h12q61k285J662L472J200k055p36L617Q24l966l935J005J311K81m16L405
1088A711Q11j705N86K247j716m790N94J794Q7j876K056K512n87l049Q6K203p17
1105B47j592J039Q46q52k43K420O46k763l532K073K881o81j492J225J234m10p29
1122C17K73j433j777j90K738J978k538J148K651n62l279n75J223p0k544o89L039
1139b90J146n93J415O16j320k716K312J410k439l408K361K633N89k240Q2J021
1155E79r15m16J169k39j140q85K123R51j061j042J270J169j767n61J730J966k885
1172D6j178O61N79j223R95M94j442m66K164K178o57l137j07J954O90k041r85J413
$$ y = [1149, 2543, 868, -1753, -1709, 969, -1132, -3177, -2629, 679, 1260, -450, 1465, 3487, 2070, -671, -812, -1673, -3958, -2296, 1176, 2376, 321, -415, 3202, 4026, 60, -3875, -2870, -1559, -1278, -1694, 1711, 2522, 817, 1403, 3650, 1934, -2856, -2262, -468, -381, -2257, -201, 2311, 1724, -1325, -1239, 964, 247, -1345, -306, 540, -312, -555, 1865, 2511, -252, -3784, -1711, 1170, 489, -1003, 222, 1456, 1046, 317, 590, -843, -2620, -2810, -72, 1906, -632, 516, 3167, 2605, -674, -1249, -26, -96, -2640, -3329, -290, 856, 263, 1678, 2294, 974, -1742, 570, 1980, -459, -3867, -1506, 1127, 1716, -524, -442, 579, -336, -752, 417, 178, -962, -1847, 276, 1227, 166, -876, 394, 1563, -204, -765, 965, 2931, 46, -1132, -471, 108, -1115, -120, 374, -1068, -1534, 630, 2808, 2151, -986, -1093, 861, 1551, -490, -1475, -62]
1190f2l75r54J151J870j888j130J463J152j466o31J806J023k184j517J610J960
1206A828p82j166O81K97r89l05M93o61k182J144K320R80j920J30J739M57j731
1223C33j061P77K41j161J151O52p57m45M10J461j981k193J492J599q55o96K63
1240g70K708p09k27j58k11j497O92P79r5k465Q57K240n41k149p72J787J664j325
1258a92m96J213J36m9l2N82p18j014J4jl24o41Q45J292k29p59j34M66K98k35k37
1279b15P17m47L01R72O52k077q25J164P39j482q21P60J038l51m82N80J0J59o28
1298b36J021o33k82M3O71J07j864J044J157j012j7j464J204J72j45N25o5k67N85
1317E44O77l80r13p95R02j7m25l69Q5R27Q6m28l45K25l2K83j047J132J13m65j92
$$ y = [-62, -437, -1391, -240, 1630, -258, -1388, 75, 1227, -239, -870, 936, 1959, -225, -1742, -132, 1828, 1046, -120, 561, 858, -131, -436, 57, -604, -2786, -1642, 678, 1658, -262, -132, 1607, 2064, 333, -728, 49, 290, -871, 280, 932, 175, -270, 140, 1601, -380, -2573, -1081, 518, -337, -1033, -770, 1938, 1229, 1002, 844, 633, -864, -172, 607, 512, -1953, -1096, 1144, 603, -1546, -2318, -531, 1133, -192, -688, 525, 661, 612, 580, 1162, 444, -570, -556, -557, -881, -1522, -677, 615, 386, -373, -507, -41, 257, 22, -215, 502, 55, 356, 1328, 1980, -97, -922, 242, 981, -501, -1322, -562, 476, 125, -357, 223, 233, 392, -236, 785, 152, -130, -87, 584, 691, -1173, -129, 1028, 16, -1, -1465, -261, -89, -234, 291, 226, -41, 544, 1221, 841, -72, -867, 35, 18, -407, -776, -691, 236, 322, -106, -451, -226, -258, 25, -1022, 110, 223, -242, -434]
1338d34J146q04n3M7N90n19q15J218k39J21L12o54K08r28P14O16m07p44N7J396
1358H28Mj881M80L38NJ53m97J330k64k07m05O60p82L37l12q8n58L6J91J663q47
1379A84m08O8J226j312j82N04o78n7O36N20Q0l86o77L77O40q28q19Q59L49m55
1399c59K8M8j10p6J36O47m13q3j69J166m37m23j40N27n01m78J090o49P97m15m7
1420A39Q62j158L15l21o0Mp5O83M73O2l51j76M7j412j34K17N00R0M71Q26j89n22
1442B91m94jj65K23r8L2P40m38Q93j4j414l80K96N85j412K76P79N77p00J379j065
1463a10O39m13K29o93L25L55k7j38k98n82K8P09k16p37N26J052m05Q50r92N47
1483F49p49j74K63m3J54k37J74Q03n26n72j27K66o84P56l26j27Q75K07J00n9l4
$$ y = [-434, 712, -92, -145, -98, 492, -27, -842, 376, 137, 258, 570, -84, 124, -804, -90, 526, 119, -625, -568, 828, 832, -1049, -569, -231, -226, -73, -570, 760, 496, 289, -116, 544, -238, 99, -213, -301, -859, -823, -632, 1031, 184, -224, -156, 1070, -242, -424, 80, -598, -655, -19, 501, 581, 195, -482, -105, 535, -293, -1112, -253, 96, -359, -331, -283, -393, -469, -333, 314, -99, -182, -351, 815, 378, -45, -185, 342, -159, -637, 453, -196, 601, 186, 139, 1001, -157, 158, -163, -223, -219, -294, 389, 862, 924, 573, 397, 444, -968, -1102, -885, -385, -295, 176, 1002, 813, 291, -203, -204, -369, -146, -244, -212, 528, 90, 983, 969, -445, -825, -529, 56, -1356, -1080, -301, 276, -424, 955, -110, 529, 116, 345, -348, -23, 332, 305, 167, -131, -713, -685, 24, -192, -929, -403, 649, 244, 1094, 102, 649, -100, -274, -11, -54, 100, -137, 37, 840, 314, -258, -385, -119, -803, -47, -373, -500, 375, 582, 682, 623, 589]
1504E89m17l11O56o61r37O96N5q7l98J381q30J50O63o82N39p58O69k40J90p76
1524e09j19J038q67Q8K46M15M91r56K12L83l79j022K83O61J35m03Q56j57k80L27
1544D43m14J52o04l43L18J052r41l49P73o41L88o46R72M44m29n66Q95n03j43o78
1564h20J576q73l56P48P7j71L70o16J238j332n29L94Q7j14J23M83P17l53j083
1583d34Q25n06j098l90J506L12k08m40Q24j66J50n84J257r93j021L42J03J719
1601A198j259j085J674k03m19k89J19j59l15O07l7P69p18l63J288j202k58O53
1619AM24l03n23M32J14L87r48p62R92k44n09P69J479p87o6J7Q31j305l99m93N99
1640b94j02K47O78q71N37l67R5j47j010N35K17M20n90O38P96k13n35J77O3j41
$$ y = [589, 172, -139, 517, -144, -1081, -385, -330, -417, -815, 566, -264, -114, 549, -133, 406, -352, 317, 77, 267, -509, -628, 410, -457, -369, -123, 292, 783, -173, 39, 422, 43, -979, -696, -35, 100, -303, 553, 396, 116, 443, 29, 181, -423, -766, -448, 604, -337, -686, 87, -554, -166, -812, 160, 604, 175, -391, 504, 1, -142, -820, 756, -117, -473, 275, 352, 181, 551, -65, 1173, -159, -688, -294, -207, -321, -198, 285, 1002, 649, -434, 391, -115, -1213, -1603, -97, 215, 7, -433, 391, 225, 375, -209, 1048, 55, -966, -624, -521, 1198, -61, -1146, 528, 325, -94, -383, -264, -423, -738, -131, -168, 601, -117, -480, 808, -394, -652, 1, 425, 122, -401, 31, 145, 532, -416, -1178, -186, -430, -939, -170, 1309, 522, 456, 473, 1304, -1, -400, -893, -294, -396, -149, 529, -342, 195, -172, -77, -224, -1234, -699, -482, -62, -652, -14, 782, 569, 34, 211, 274, 133]
1660A33l44K5N26j84j31N61n55J90j173O97J402j361j92J030k98J03j326O54O33
1679C90K9q40L71N52j089L7R95k21n94L34m43M95m43L52P8K21O68p11l73k33q5
1700e10M71O63j178K05l66J327k76p97P43pK02j32j138J549m80q30Q54l05p17
1719g22K0P63P8q65O87r8R84o88r91M57O34n23k72K53O49n06J73L41l84q81K76
1740f15J463J83q78j426J465J74n32K29l62K50K74L83l89o81J20L26Q62l58j139
1759f51Q91M62Q2p40q78O86J91L30L62o06q36O67Q55n5j233O05P63M59j555m00
1779f01O67J01l52M36o39m35J505n57O1M31j489Q93K56L24j620J15O24O35R8j207
1799g54N82O47k87k86k21M72M2K2M81q55ml3Q42Q3r87J73J06Q46p84n58m30Q74
$$ y = [133, -211, -186, 340, 156, 25, 586, 31, 221, -952, -255, 1147, -214, -406, 624, 326, 429, -897, -243, 390, 419, -421, -50, 502, -587, -550, 445, 224, -370, -36, -479, 16, -427, -75, 3, 224, 892, 181, -192, -425, -510, -39, 624, -554, -349, -715, 612, 336, -461, 282, 275, 477, 345, -793, 756, 276, -554, 300, -5, -722, -702, 61, 139, -726, -39, -137, 847, 159, -832, -375, 259, -264, -536, -283, 366, -140, 33, 374, -10, -891, -615, 848, 1031, 153, -1273, 192, 366, -166, 63, -299, -49, 225, 608, 219, -462, -342, -16, 846, 488, -651, 240, 702, 784, 44, -834, -148, 43, 373, 735, 129, -707, -40, 815, 760, -473, 132, 895, 1354, -201, -601, 66, 167, -185, 251, -388, -823, 682, 125, 186, 617, -872, 21, 277, 601, -1019, -904, -280, 355, 453, -754, -172, 475, 188, -98, -319, 153, 195, 217, 698, -157, -161, -194, 648, 731, -256, -83, 23, 869, 85, -473, -903, -29]
1821b9R09j442P93k08r05J483K63j302K23L15O57q21K4L76r46Q05K95p59m50O29
1841i0j48O56j140n1M98Q08n65J55j294J274k19O22r59k20J052L8L5l18o15J44
1861c37J142K2j025q79Q97P0O39j60l79k70N95pk03j218J049K57N51o46j055m
1881i61J267M1m98m14L74L16m2L38j343p1Q38N58o8j019O36O59q6m80m25N33j8
1902A35P14q01Jq52R08J248j010r67L61O91M38o07j27o26Q82m09L94q06N6L88
1922A1L77k22m35n31P17N69J50j212k73R96M31r2j194L65l07J151q68n6j89L42
1942b70J344m17j499L06J73L27L15n03m23J253R1k8J56o84O6m48M99j04p11N33
1962b4Q57n31j68J4q06P76O40r67j29J05O71K62m77j115P92L72j7j073M39k28
$$ y = [-29, 880, -562, 231, 23, -882, 601, 864, -438, -215, 100, 757, -64, -40, 336, -610, 195, 490, -269, -719, -90, -238, 418, -722, -773, -275, 533, -32, 123, -1171, 103, -116, 506, -453, -673, 379, 417, 452, 134, -481, -337, 805, 827, -198, -1077, -180, -110, 529, 369, -10, -280, 315, 308, 105, -1113, -64, 193, 744, 98, -957, -961, 306, 347, -151, -565, -191, 125, 83, 421, -922, -993, -155, 403, 335, -684, -48, 611, 525, 45, -380, 153, 135, 849, 48, 49, -803, 105, 1353, 343, -624, -263, 428, 866, 259, 132, -494, 388, -21, 373, -433, -377, 11, 388, 166, -269, -800, -83, 486, 636, -576, -849, 147, 578, 486, -708, -343, -650, 501, -367, -423, -612, -270, 1074, 657, -842, -536, -363, -36, 279, -224, -647, 606, 697, 669, 825, 141, 207, -241, 258, 154, -557, -24, 833, 302, 134, 148, -658, 118, 758, -209, -338, -233, 438, 700, 223, -892, -100, 272, 255, -818, -379, -607]
1982f07O66J72r3r34L88P85K87o00j31o39J777j1o68q03k60Q64L7o43m58O17M74
2003B20L36j13n72j96M16k6n17o72J240j16N03k76j275L91J563q72k04o58P7Q73
2023A22K86n47n27o27J928j10L92j197NL40P79r34o47M88L01J5l13n94j49J004
2043A5M25nn15l46m1L21M21j061K57J45R19R5m62o28K78N75k90n07m8N75L00k60
2065A63r3l00K73N90q86lj98j74O88O06p82p24J54l5O25q19N55j3k0Q71p17k32
2087d71n87J341Q5m65l23N15K66P31j030q0n18O54o2k46r11J356j94L60n05j72
2107b56j43J249k43l05j017K53M00j6qo81M23O42K41j91j82n49K97K05P22j109
2127b68o09J89Q5p6N7M11P11P7k44j170Q27L69L62n31j84n86J387J45j080k20
$$ y = [-607, 59, 231, 138, -796, -408, 377, 664, 64, -67, -706, 1071, 1060, 392, -411, -671, 193, 230, -413, -871, -254, 220, 556, 443, -129, -325, 91, 65, -452, -1124, 116, 0, 503, 227, -1048, -657, 906, 34, -170, -828, -751, 122, 408, -139, -666, -1293, 635, 525, 917, -280, -275, 65, 844, -90, -737, -249, 52, 67, -246, -840, -989, 15, 440, 435, -80, -426, -467, -146, 275, -786, -529, -384, 535, 630, 168, -460, -182, 393, 103, -404, -452, 123, 423, 163, 70, -230, 43, 633, -253, -256, -454, -628, 60, 666, -116, -840, -686, -721, -96, -915, -360, -373, -393, 478, -239, -471, -1058, 283, 368, -97, -420, 95, 361, 1092, 62, -18, -536, 118, 56, -190, -1101, 255, 61, 421, -84, -256, -399, 850, 607, 302, -715, -462, -62, -78, -86, -767, -344, 298, 539, 348, 166, -383, -86, 119, 841, -268, -877, -688, -603, -679, -622, -211, 500, 577, 333, -837, -10, 359, 721, 190, 6, -580, 807, 952, -128, -348]
2147c48j03Q35J01m16n92j41O78O45j045O9p7N21K30k50J31j83M1p2M14q3l92
2168c7l21P5M28K76n99o6O47Qm38J93j03m00O97l12j42l25M58L75p81j17M07P13
2190F36J53j152m00L89j63O49r7p19M11M87R31j212l82j86Q13L05k79j77o21M47
2210a67J24o92L51k83K79L21k20k8K96q54J531J6j372N39L88M17k81n83k74L91
2230a01L41l73l77M48k08J070np02k92K94P06m31m95m15O08K72M6m34q24J231
2250C59k7k66m9p52J600q39L82l63k84M05P33k49K33j173Q8N38n40j49K02N62
2270D11J5k22n5p29K73J38O99m06p96R11K8L73k75j528N08P67R31j010L61j204
2290h10O96M03o97J59j96J134n57L74o30R8r2N81j323J92J04M89K06l30Q80q61
$$ y = [-348, -451, 384, 485, 69, -523, -664, 14, 659, -386, -317, -394, 127, 357, 107, 238, 55, 96, 24, 438, 355, -37, -358, -283, 145, 421, -178, -244, 403, 411, -27, 166, 63, -337, 360, 48, -94, -419, 39, 414, -367, -484, -77, 636, 789, -363, -763, -374, -537, 112, 15, -704, -293, 194, 1125, -87, -469, -655, 158, 463, 184, 7, -614, -167, -43, -735, -384, -667, -388, -67, -287, -315, -19, -873, 658, 674, -698, -159, 229, 646, 365, -218, -492, -101, 240, -133, -510, -62, -270, 800, 795, 93, -199, 95, 801, 370, -125, -540, 68, 340, 386, -48, -872, 359, 332, 66, 17, -735, 865, 26, 408, 45, -239, 166, 899, 650, 883, -290, -202, 336, -204, -353, -151, 411, 426, 204, 149, -580, -307, -169, 530, 124, -672, 239, 267, 640, 365, -1163, -655, 112, 1043, 33, 394, -810, -114, 289, -408, -249, -445, 689, 132, 506, -124, -26, -118, 463, -860, -668, -564, -75, 131, -199, 681, -180]
2310a80N78k89n1J57p99N07N09n41k6j61Q55R2r6n76q97Q95L26M52n00m58L32
2331A29L78k99r69N20J7R57p83J84k2R1K14m93N90r36P78K42j61p39L35p41k14
2352i22J486j703N64O30O31l81p21m7M60J36o02J102M7p17k44N79m79L56o85P36
2372B26k45N32q07J98n68K40P26q27L98N43K35p0q43j32K43J03J12J03p58J138
2392E47m11J05J00p46L94r0R4j86k05k46Q31L17j081M59J65M87q29m6k31N23m41
2413d90K92j07m54J123M4j064O31k18P90q92J118k65n80J65K05J91p11kl78L98
2433b04N33p25k1M99O34p81K73m51O11O6q5j81o43K70K94k49L51p33K98M21J77
2454C54l00n01O44K38K38m52m62Q42o3q19k61L24N54j34p63J59J12P50m88j90
$$ y = [-180, 398, 109, 58, 215, -584, -77, 432, -109, -135, -296, 559, 651, 555, -21, -918, -23, 303, 755, 255, -203, 129, 507, 208, -761, -241, -224, 733, -50, 134, 112, 203, 417, -76, 514, -422, 356, 598, 437, -302, 33, -708, -922, 564, -1139, -575, 55, 686, 305, -416, -463, -3, 133, -469, 633, 680, -37, -281, 298, -181, 175, -510, 226, -19, 513, -294, -96, -664, -424, 302, -525, -127, 416, 651, 581, -262, -394, -151, -48, 64, 167, -591, 547, 136, 241, 341, -405, -11, -101, -7, -193, -398, -644, 187, 504, -577, -118, 47, 534, -295, -341, -572, -49, -490, -198, -305, -759, 364, 408, -656, -25, -243, 547, -345, 773, 508, -72, 93, 298, 489, -222, -224, -602, -204, 329, -396, -417, 82, 716, -65, 208, -243, 368, 434, 349, 168, -475, -205, 89, -160, 191, -542, -244, 177, 354, 54, -447, 197, 435, 673, 221, -241, 601, 538, -281, -542, -218, 336, 202, -561, -402, -290, 460, -28, -218]
2474b18n78L28P8L56K9J6n47O36M26j42k29p80Q07k09Q21j034N02ln71K3Q81o81
2496h9m89N76o2N23o94R65n07j12j30n11PK66P52m45J97n13m53N12L20P1M01l54
2518B31J42p3m33K84L26m38l8m40J35K47R01q08q0J31q81N58M24R3o52J73N71
2539C73J38o10l49N80l80P7j72m62N76K06k5K28q71L68Q65n15n14N09K00l56m06
2560e40P1M79k70J47L31P8p17KR51K1k74J93k65p66P20k86j009J034k45P79m22
2581A2O2j88j02P78m10k73j145J317oP57l50m50j96J45l56M59n77K37N24p78P41
2602B01o56J07J068j71j179KO49P23qj238Pn52J207m24M7O56k81K41o89k93N13
2623g0L4J61K77m5j519J004P35Q0k28j098O11j80L54J37p79K50M39l56M62j047
$$ y = [-218, -796, -468, -390, -34, -5, 11, -536, 100, 526, 384, 155, -625, 182, -27, 794, -240, 262, 259, -312, -289, 592, -89, -578, -2, -64, 459, -235, 730, 223, 111, -19, -530, -523, -257, 495, 50, 247, -266, -719, -207, 113, 184, 585, 231, 373, 300, -133, 151, 477, 39, 1, -439, -304, -57, 844, 36, -44, 87, -794, -236, 188, 281, -371, -198, 373, 511, -99, -448, 132, -248, -171, -343, -805, -229, -23, -48, 180, -691, -323, 542, 27, -487, 22, 222, -134, -540, -469, 10, -260, -113, 218, 296, -421, -419, 532, 553, 279, 472, 207, -559, 161, -125, -1134, -100, -345, 434, 12, 74, -114, -216, 562, 152, -121, -1266, 51, 45, 802, 452, 2, -194, -49, -405, 54, -523, -286, 238, -540, 201, -455, -348, 720, 549, -630, -628, 21, 744, 736, -502, -495, -1047, 160, -264, -217, 439, 158, 399, -290, -583, -70, -36, 125, 402, 357, -1162, -158, 577, 657, 429, -669, -58, -238, 116, 253, -526, -276, 163, -193, 269, -778]
2643g78J231j74k21k56k06L15LP02j251Q16J36m43J12k05L32j82L4L64l85kpn7
$$ y = [-778, 453, 279, 58, -198, -404, -89, -86, 616, -635, 181, 317, -126, -14, -219, 113, -69, -35, 329, -56, -58, -65, -122]
$$ [...]
8191G91
##END NTUPLES=NMR FID
##END=
