##TITLE=1H_SA_24.218
 DMSO, 140 sc, 
 6.8.2020
##JCAMPDX= 6.0         $$ Bruker NMR JCAMP-DX V2.0
##DATA TYPE= NMR FID
##DATA CLASS= NTUPLES
##ORIGIN= UXNMR, Bruker Analytische Messtechnik GmbH
##OWNER= root
$$ XWIN-NMR		Version 3.5
$$ Fri Aug  7 10:10:02 2020 Russian Standard Time (UT+4h)  she@DPX200
##.OBSERVE FREQUENCY= 200.1314999998
##.OBSERVE NUCLEUS= ^1H
##.DELAY= (6, 6)
##.ACQUISITION MODE= SIMULTANEOUS
##.ACQUISITION SCHEME= undefined
##.AVERAGES= 108
##.DIGITISER RES= 18
##SPECTROMETER/DATA SYSTEM= spect
##.PULSE SEQUENCE= zg30
##.SOLVENT NAME= DMSO
##.SHIFT REFERENCE= (INTERNAL, DMSO, 0, 15.7039)
##AUDIT TRAIL= $$ (NUMBER, WHEN, WHO, WHERE, WHAT)
$$ ##TITLE= Audit trail, XWIN-NMR		Version 3.5
$$ ##JCAMPDX= 5.01
$$ ##ORIGIN= Bruker BioSpin GmbH
$$ ##OWNER= she
$$ F:/spectra/data/she/nmr/H-F/1/audita.txt
$$ ##AUDIT TRAIL=  $$ (NUMBER, WHEN, WHO, WHERE, WHAT)
(   1,<2020-08-07 10:08:40.71 +0400>,<she>,<DPX200>,
      <continue with go, POWCHK disabled, PULCHK disabled
       configuration hash MD5:
       00 E9 B6 7A A2 85 ED C7 34 08 36 98 17 FE 4E 26
       data hash MD5: 16K
       14 CF 91 04 E6 A6 E4 FE 48 B0 63 88 6D 73 A5 B4>)
$$ ##END=
$$ 
$$ hash MD5
$$ 12 0F D5 C6 07 9F 0C B7 F1 B6 F8 EA C0 DB 06 C5
##$RELAX= 
##$RELAX= 
##$RELAX= 
##$RELAX= 
##$RELAX= 
##$RELAX= 
$$ Bruker specific parameters
$$ --------------------------
##$DU= <F:/spectra>
##$EXPNO= 1
##$NAME= <H-F>
##$PROCNO= 1
##$TYPE= <nmr>
##$USER= <she>
##$AMP= (0..31)
100 100 100 100 100 100 100 100 100 100 100 100 100 100 100 100 100 100 
100 100 100 100 100 100 100 100 100 100 100 100 100 100 
##$AQSEQ= 0
##$AQ_mod= 1
##$AUNM= <au_zg>
##$AUTOPOS= <>
##$BF1= 200.13
##$BF2= 200.13
##$BF3= 200.13
##$BF4= 200.13
##$BF5= 200.13
##$BF6= 200.13
##$BF7= 200.13
##$BF8= 200.13
##$BYTORDA= 1
##$CFDGTYP= 0
##$CFRGTYP= 5
##$CHEMSTR= <none>
##$CNST= (0..31)
1 1 145 1 1 1 1 1 1 1 1 1 1 1 1 1 1 1 1 1 1 1 1 1 1 1 1 1 1 1 1 1 
##$CPDPRG= <>
##$CPDPRG1= <>
##$CPDPRG2= <>
##$CPDPRG3= <>
##$CPDPRG4= <mlev>
##$CPDPRG5= <mlev>
##$CPDPRG6= <mlev>
##$CPDPRG7= <mlev>
##$CPDPRG8= <mlev>
##$CPDPRGB= <>
##$CPDPRGT= <>
##$D= (0..31)
0 1.2 0 0 0 0 0 0 0 0.06 0 0.03 0 0 0 0 0.0002 0 0 0 0 0 0 0 0 0 0 0 0 
0 0 0 
##$DATE= 1596706143
##$DBL= (0..7)
120 120 120 120 120 120 120 120 
##$DBP= (0..7)
150 150 150 150 150 150 150 150 
##$DBP07= 0
##$DBPNAM0= <>
##$DBPNAM1= <>
##$DBPNAM2= <>
##$DBPNAM3= <>
##$DBPNAM4= <>
##$DBPNAM5= <>
##$DBPNAM6= <>
##$DBPNAM7= <>
##$DBPOAL= (0..7)
0.5 0.5 0.5 0.5 0.5 0.5 0.5 0.5 
##$DBPOFFS= (0..7)
0 0 0 0 0 0 0 0 
##$DE= 6
##$DECBNUC= <off>
##$DECIM= 24
##$DECNUC= <off>
##$DECSTAT= 4
##$DIGMOD= 1
##$DIGTYP= 9
##$DL= (0..7)
0 120 120 120 120 120 120 120 
##$DP= (0..7)
150 150 150 150 150 150 150 150 
##$DP07= 0
##$DPNAME0= <>
##$DPNAME1= <>
##$DPNAME2= <>
##$DPNAME3= <>
##$DPNAME4= <>
##$DPNAME5= <>
##$DPNAME6= <>
##$DPNAME7= <>
##$DPOAL= (0..7)
0.5 0.5 0.5 0.5 0.5 0.5 0.5 0.5 
##$DPOFFS= (0..7)
0 0 0 0 0 0 0 0 
##$DQDMODE= 0
##$DR= 18
##$DS= 0
##$DSLIST= <SSSSSSSSSSSSSSS>
$$ [...]
##$SUBNAM2= <"">
##$SUBNAM3= <"">
##$SUBNAM4= <"">
##$SUBNAM5= <"">
##$SUBNAM6= <"">
##$SUBNAM7= <"">
##$SUBNAM8= <"">
##$SUBNAM9= <"">
##$SW= 24.9337058888022
##$SWIBOX= (0..15)
0 0 2 0 0 0 0 0 0 0 0 0 0 0 0 0 
##$SW_h= 4990.01996007984
##$TD= 16384
##$TD0= 1
##$TE= 0
##$TE2= 300
##$TE3= 300
##$TEG= 300
##$TL= (0..7)
0 120 120 120 120 120 120 120 
##$TP= (0..7)
150 150 150 150 150 150 150 150 
##$TP07= 0
##$TPNAME0= <>
##$TPNAME1= <>
##$TPNAME2= <>
##$TPNAME3= <>
##$TPNAME4= <>
##$TPNAME5= <>
##$TPNAME6= <>
##$TPNAME7= <>
##$TPOAL= (0..7)
0.5 0.5 0.5 0.5 0.5 0.5 0.5 0.5 
##$TPOFFS= (0..7)
0 0 0 0 0 0 0 0 
##$TUNHIN= 0
##$TUNHOUT= 0
##$TUNXOUT= 0
##$USERA1= <user>
##$USERA2= <user>
##$USERA3= <user>
##$USERA4= <user>
##$USERA5= <user>
##$V9= 5
##$VALIST= <valist>
##$VCLIST= <CCCCCCCCCCCCCCC>
##$VD= 0
##$VDLIST= <DDDDDDDDDDDDDDD>
##$VPLIST= <PPPPPPPPPPPPPPP>
##$VTLIST= <TTTTTTTTTTTTTTT>
##$WBST= 1024
##$WBSW= 4
##$XGAIN= (0..3)
0 0 0 0 
##$XL= 0
##$YL= 0
##$YMAX_a= 1907266
##$YMIN_a= -1032774
##$ZGOPTNS= <>
##$ZL1= 120
##$ZL2= 120
##$ZL3= 120
##$ZL4= 120
##$ABSF1= 10
##$ABSF2= 0
##$ABSG= 5
##$ABSL= 3
##$ALPHA= 0
##$AQORDER= 0
##$ASSFAC= 0
##$ASSFACI= 0
##$ASSFACX= 0
##$ASSWID= 0
##$AUNMP= <proc_1d>
##$AZFE= 0.1
##$AZFW= 0.1
##$BCFW= 1
##$BC_mod= 2
##$BYTORDP= 1
##$COROFFS= 0
##$CY= 11.3945322036743
##$DATMOD= 1
##$DC= 2
##$DFILT= <>
##$DTYPP= 0
##$F1P= 16.9975609425685
##$F2P= -3.02152046262296
##$FCOR= 0.5
##$FTSIZE= 0
##$FT_mod= 4
##$GAMMA= 1
##$GB= 0.15
##$INTBC= 1
##$INTSCL= 1
##$ISEN= 128
##$LB= 0.24
##$LEV0= 0
##$LPBIN= 0
##$MAXI= 10000
##$MC2= 0
##$MEAN= 0
##$ME_mod= 0
##$MI= 1.114404
##$NCOEF= 0
##$NC_proc= 0
##$NLEV= 6
##$NOISF1= 3.799351
##$NOISF2= 2.8
##$NSP= 1
##$NTH_PI= 0
##$NZP= 0
##$OFFSET= 15.70392
##$PC= 1
##$PHC0= -9815.652
##$PHC1= 38.60092
##$PH_mod= 1
##$PKNL= yes
##$PPARMOD= 0
##$PSCAL= 0
##$PSIGN= 0
##$REVERSE= no
##$SF= 200.130013532006
##$SI= 16384
##$SIGF1= 3
##$SIGF2= 2
##$SINO= 400
##$SIOLD= 16384
##$SREGLST= <1H.CDCl3>
##$SSB= 0
##$STSI= 0
##$STSR= 0
##$SW_p= 3612.71676300578
##$SYMM= 0
##$S_DEV= 0
##$TDeff= 0
##$TDoff= 0
##$TI= <>
##$TILT= no
##$TM1= 0
##$TM2= 0
##$TOPLEV= 0
##$USERP1= <user>
##$USERP2= <user>
##$USERP3= <user>
##$USERP4= <user>
##$USERP5= <user>
##$WDW= 1
##$XDIM= 8192
##$YMAX_p= 0
##$YMIN_p= 0
$$ End of Bruker specific parameters
$$ ---------------------------------
##NTUPLES= NMR FID
##VAR_NAME=  TIME,          FID/REAL,        FID/IMAG
##SYMBOL=    X,             R,               I
##VAR_TYPE=  INDEPENDENT,   DEPENDENT,       DEPENDENT
##VAR_FORM=  AFFN,          ASDF,            ASDF
##VAR_DIM=   8192,          8192,            8192
##UNITS=     SECONDS,       ARBITRARY UNITS, ARBITRARY UNITS
##FACTOR=    0.0002004,     1,               1
##FIRST=     0,             0,               0
##LAST=      1.6414764,     0,               0
##MIN=       0,             -1032774,        0
##MAX=       1.6414764,     1907266,         0
$$ Real data points
##PAGE= N=1
##DATA TABLE= (X++(R..R)), XYDATA
$$ [...]
$$ plain form
2890 -1660 2481 2041 -2239 -4176 -1024 2268 2205 -1215 -4203 -2803 3478 3973 -3746 -4522 -1313 2922
2906 2922 2045 -3510 -5619 -325 2642 1304 -2928 -5017 -2664 1460 1431 -1239 -4800 -3378 1632 2786
2922 2786 -2540 -5994 -1588 3317 1888 -2474 -4206 -1931 1951 1266 -2617 -3881 -2722 278 1567
2937 1567 -1213 -3789 -3377 1464 2363 -1476 -6056 -2611 1714 1645 -1253 -4987 -2654 2772 2585 -2694
2953 -2694 -4126 -204 2506 2304 -1193 -3761 -3323 1967 3347 -394 -4183 -1907 1776 2988 -117
2968 -117 -4218 -1395 2434 1840 -1077 -4122 -860 987 1913 -616 -2593 -2308 2004 4239 349 -3141
2984 -3141 -2275 2488 3476 633 -2528 -2461 1993 3668 -1505 -3225 -2262 1605 2624 -972 -2337 -2682
3000 -2682 1189 1679 -1206 -4159 -2865 1344 3065 1039 -2414 -2385 1457 3942 113 -2439 405 2377
$$ packed form
2890a660M141m40m280j937L152L292o3l420k988J400O281M95p719p76L209M235
2906B922q77n555k109N294K967j338m232k089K353M124k9k670l561J422N010J154
2922B786n326l454M406M905j429m362j732K275L882o85l883j264J159L000J289
2937A567k780k576M12M841Q99l839m580L445M325o9k898l734K333N426j87n279
2953b694j432L922K710k02l497k568M38N290J380l741l789K276L683J212l105
2968a17m101K823L829n94k917l045L262J847R26k529j977K85M312K235l890l490
2984c141Q66M763R88k843l161O7M454J675n173j720R63L867J019l596j365l45
3000b682L871M90k885k953J294M209J721k026l453K9L842K485l829k552K844J972
$$ plain form
3016 2377 3219 844 -2325 -1187 990 2621 -1304 -2375 -1593 -36 1494 547 -3938 -3420 -78 2335
3032 2335 -601 -3393 -1967 1190 2456 237 -3030 -2069 1901 2156 -937 -2941 -1843 -846 1810 773
3048 773 -3280 -3735 -1212 655 -288 -3628 -2641 -274 1374 -1026 -3946 -2320 -201 1982 -658 -1636
3064 -1636 -1135 328 1394 695 -2396 -4226 -906 2645 -1138 -4413 -4446 -1656 871 220 -4678 -4488
3080 -4488 -958 91 -1968 -2677 -2456 -490 483 544 -1957 -1974 -1008 1672 776 -2332 -1648 952 1953
3097 1953 770 -2654 -2185 992 1814 -798 -3835 -1933 -1197 1673 262 -566 -1255 -808 2881 1501
3113 1501 -1354 -1367 683 2732 2649 -1711 -2330 122 1978 104 -1923 -2054 -1521 929 -180 -1941 -1908
3130 -1908 120 1411 -222 -1379 -981 -550 2570 1726 -1019 -498 2777 3252 2008 -268 457 2329
$$ packed form
3016B377Q42k375l169J138K177J631l925j071P82J557J530r47m485N18L342K413
3032B335k936k792J426L157J266k219l267R61L970K55l093k004J098R97K656j037
3048G73m053m55K523J867r43l340R87K367J648k400k920J626K119K183k640r78
3064a636N01J463J066o99l091j830L320L551l783l275l3K790K527o51m898J90
3080d488L530J049k059p09K21J966R73O1k501j7R66K680q96l108O84K600J001
3097A953j183l424M69L177Q22k612l037J902P36K870j411q28o89M47L689j380
3113A501k855j3K050K049q3m360o19K452J856j874k027j31N33K450j109j761L3
3130a908K028J291j633j157L98M31L120q44k745N21L275M75j244k276P25J872
$$ plain form
3146 2329 3321 1750 1262 118 915 2136 1239 34 -918 -468 1164 2520 -920 -2351 300 2620
3162 2620 1543 -1375 -705 1332 2575 -31 206 -761 925 1292 442 598 -1420 -1191 897 978 -320
3179 -320 -2889 -690 1974 422 -1724 -1581 998 2227 1567 -808 -656 2401 2524 1866 389 802 -479
3196 -479 2486 3413 1888 -502 -888 1739 1427 72 -1039 -620 1117 -1039 -1976 -3084 -490 627
3212 627 -1222 -1811 -1338 -940 -1480 92 -913 -2355 -2511 82 1108 -940 -2746 -810 1076 -124
3228 -124 -1594 -2011 1393 1459 82 -733 -101 1110 142 580 -165 -1259 699 1418 2371 523 -1367 -1130
3246 -1130 754 1382 -1633 -2767 -501 1539 -488 -1300 -1880 -1424 -1488 -47 -941 -1051 -404 -247 -258 -273
3264 -273 -2503 -2541 -436 721 -1330 -1282 -110 2176 -604 -1209 -488 197 -434 -255 -1047 -2027 -354 273
$$ packed form
3146B329R92j571m88j144P97J221q97j205r52M50J632J356l440j431K651K320
3162B620j077k918O70K037J243k606K37r67J686L67q50J56k018K29K088Q1j298
3179c20k569K199K664j552k146J43K579J229o60k375J52L057J23o58j477M13j281
3196d79K965R27j525k390l86K627l12j355j111M19J737k156r37j108K594J117
3212F27j849n89M73L98n40J572j005j442j56K593J026k048j806J936J886j200
3228a24j470m17L404O6j377q15O32J211r68M38p45j094J958P19R53j848j890K37
3246a130J884O28l015j134K266K040k027q12n80M56o4J441q94j10O47J57j1j5
3264b73k230l8K105J157k051M8J172K286k780o05P21O85o31J79p92r80J673O27
$$ plain form
3282 273 -4 373 -928 -1177 729 2072 551 -157 944 2092 1438 -340 -366 337 662 -438 -1123 -971
3300 -971 1042 -2233 -1825 -1027 -642 -2146 -1911 561 -315 -3358 -1834 946 1157 -868 -1230 -467 127
3317 127 367 365 -488 1243 415 1644 1397 1258 393 -154 2388 1271 -573 -1157 -115 1288 489 -1955
3335 -1955 -332 984 705 -1454 -1001 791 1500 -1314 -435 608 -205 -854 1774 992 326 -323 382
3352 382 1906 1071 -731 -708 883 585 -699 -2269 -1149 187 147 -907 -554 -13 412 153 992 912
3370 912 -380 -758 930 705 629 433 1211 2135 754 -606 1589 698 -112 -897 471 780 -873 -382
3388 -382 -281 -999 -662 -950 -107 282 -156 -2426 -550 205 -786 -1288 -1205 -111 -379 -446 -69 202 79 -491
3408 -491 1769 906 733 -369 -300 1273 331 -796 -1653 831 77 -1666 -708 120 628 -1278 -1405 -203
$$ packed form
3282B73k77L77j301k49J906J343j521p08J101J148o54j778k6P03L25j100o85J52
3300i71K013l275M08P98L85j504K35K472q76l043J524K780K11k025l62P63N94
3317A27K40kq53J731q28J229k47j39q65n47K542j117j844n84J042J403p99k444
3335a955J623J316k79k159M53J792P09k814Q79J043q13o49K628p82o66o49P05
3352C82J524q35j802K3J591k98j284j570J120J336m0j054L53N41M25k59Q39q0
3370I12j292l78J688k25p6j96P78R24j381j360K195q91q10p85J368L09j653M91
3388c82J01p18L37k88Q43L89m38k270J876P55r91n02Q3J094k68o7L77K71j23n70
3408d91K260q63j73j102O9J573r42j127q57K484p54j743R58Q28N08j906j27J202
$$ plain form
3426 -203 531 -861 -158 173 208 645 584 293 400 -1125 -315 1161 81 -153 -1476 463 672 -1721
3444 -1721 -1297 -665 -448 -52 -949 -599 -689 -350 -500 -557 573 -577 -2233 -247 723 -1898 -1425 -339
3462 -339 -745 -9 -893 -1701 556 -541 -1213 145 203 -66 -525 127 -248 -35 -1337 107 162 -571 -293
3481 -293 -534 -585 -508 -255 -412 234 -3 -1125 -801 -1382 177 -1093 -443 721 123 -1642 490 949 -478
3500 -478 261 -1021 -611 -565 -1137 -1512 298 1655 227 -818 -262 251 341 -1385 -1094 -193 -946 321
3518 321 -184 -754 688 -1026 -261 657 181 -928 -189 602 547 65 -542 1108 645 562 -28 324 212
3537 212 -1049 29 518 895 -70 426 453 817 34 -583 842 547 -286 4 697 330 -59 -328 145
3556 145 927 615 -144 17 237 1355 -259 434 691 -370 -8 1281 1184 262 67 141 791 1100 -77
$$ packed form
3426b03P34j392P03L31L5M37o1k91J07j525Q10J476j080k34j323J939K09k393
3444a721M24O32K17L96q97L50r0L39j50n7J130j150j656J986R70k621M73J086
3462c39m06P36q84q08K257j097o72J358N8k69m59O52l75K13j302J444N5p33K78
3481b93k41n1P7K53j57O46k37j122L24n81J559j270O50J164n98j765K132M59j427
3500d78P39j282M10M6n72l75J810J357j428j045N56N13R0j726K91R01p53J267
3518C21n05n70J442j714P65R18m76j109P39P91n5m82o07J650m63q3n90L52j12
3537B12j261J078M89L77r65M96K7L64p83o17J425k95q33K90O93l67l89k69M73
3556A45P82l12p59J61K20J118j614O93K57j061L62J289r7r22j95P4O50L09j177
$$ plain form
3575 -77 -321 53 1226 -854 462 -85 1461 -104 684 1354 -87 283 412 1630 378 246 1022 713
3593 713 948 -113 -276 708 1387 -1238 437 -148 91 717 -1153 294 703 689 -611 835 961 -372
3611 -372 981 324 276 1194 567 1069 1761 1109 -416 993 1724 174 -334 841 1115 -340 -54 756
3629 756 -323 479 -583 -636 1220 -238 -544 44 149 -950 -1185 578 1337 -607 -473 695 1319 206
3647 206 -625 -519 385 215 -636 -672 76 395 108 -239 106 230 324 206 564 -245 -528 18 -361 -376 -105
3668 -105 -408 -615 67 298 290 -296 -289 -206 -774 234 262 -911 -82 469 25 -185 -622 -276 34 468 63
3689 63 150 -175 1380 -1619 13 1543 542 471 641 -680 -453 303 569 361 -81 -232 -1384 -486 183
3708 183 -390 176 1623 1118 -512 -371 344 63 1119 -529 114 607 -509 285 -383 -884 639 621
$$ packed form
3575g7k44L74J173k080J316n47J546j565P88O70j441L70J29J218j252j32P76l09
3593G13K35j061j63R84O79k625J675n85K39O26j870J447M09j4j300J446J26j333
3611c72J353o57m8R18o27N02O92o52j525J409P31j550n08J175K74j455K86Q10
3629G56j079Q02j062n3J856j458l06N88J05j099k35J763P59j944J34J168O24j113
3647B06q31J06R04j70q51l6P48L19k87l47L45J24R4j18L58q09k83N46l79j5K71
3668a05l03k07O82K31qn86PQ3n68J008K8j173Q29N51m44k10m37L46L10M34m05
3689F3Q7l25J555k999J632J530j001p1J70j321K27P56K66k08m42j51j152Q98O69
3708A83n73N66J447n05j630J41P15k81J056j648O43M93j116P94o68n01J523j8
$$ plain form
3726 621 834 117 -129 -700 339 -145 -480 -97 -492 1039 573 1556 34 823 536 -389 -250 759 1164
3745 1164 -304 466 1297 422 859 302 500 949 -852 226 -180 -207 -331 -1433 156 -337 -695 8
3763 8 -321 678 -253 -928 130 396 -1234 -479 380 -346 -202 733 114 126 -207 585 164 997 672 402
3783 402 292 771 182 -320 1230 1094 -568 -153 -71 1174 614 282 2093 -142 -259 437 -1021 209
3801 209 277 -869 -464 -207 -1291 -1424 -852 -1230 -603 -1723 -134 -385 -648 151 -428 -1165 -309 -1165 -188
3820 -188 -154 122 -874 -242 186 575 -255 186 -15 -676 803 583 -236 1052 -896 57 37 662 314 -383
3840 -383 980 521 -1026 -647 337 -411 503 -517 -840 -349 288 -1375 -983 -1446 -1349 -977 -1078 215 -493
3859 -493 -863 258 -1454 660 -470 366 78 202 341 -1149 899 359 -174 429 1376 1658 -776 41
$$ packed form
3726F21K13p17k46n71J039m84l35L83l95J531m66R83j522P89k87r25J39J009M05
3745A164j468P70Q31q75M37n57J98M49j801J078m06k7j24j102J589m93l58P03
3763Hl29R99r31o75J058K66j630P55Q59p26J44R35o19J2l33P92m21Q33l25k70
3783D02j10M79n89n02J550j36j662M15Q2J245n60l32J811k235j17O96j458J230
3801B09O8j146M05K57j084j33N72l78O27j120J589k51k63P99n79p37Q56q56R77
3820a88L4K76r96O32M28L89q30M41k01o61J479k20q19J288j948R53k0O25l48o97
3840c83J363m59j547L79R84p48R14j020l23M91O37j663L92m63R7L72j01J293p08
3859d93l70J121j712K114j130Q36k88J24J39j490K048n40n33O03R47K82k434Q17
$$ plain form
3877 41 523 -81 -934 441 1133 -1528 609 431 697 -297 -591 328 -60 472 -922 815 50 -788 -212
3896 -212 -603 -879 306 -216 -507 407 537 -778 771 -738 250 -521 -1693 -17 148 -617 -179 1427
3914 1427 718 141 92 1071 23 1771 396 1285 1187 479 1048 1515 815 843 279 1126 804 156 -729 350
3934 350 -276 285 -723 -37 -498 -656 389 -1272 -991 58 -629 -38 1036 1273 -565 -733 128 704
3952 704 169 100 866 517 414 1234 19 393 525 1241 640 96 1441 -340 419 1216 854 -723 1909
3971 1909 -25 870 683 490 1572 -515 766 479 -345 504 64 101 960 -113 881 -790 1054 430
3989 430 -1371 441 555 -523 186 606 135 -245 -64 -744 534 -827 -506 478 499 212 -942 -507
4007 -507 992 650 287 9 996 109 48 626 620 266 654 355 -272 548 -121 -410 -479 -450 -593 -394 964
$$ packed form
3877D1M82o04q53J375O92k661K137j78K66r94k94R19l88N32j394J737p65q38N76
3896b12l91k76J185n22k91R14J30j315J549j509R88p71j172J676J65p65M38J606
3914A427p09n77m9R79j048J748j375Q89r8p08N69M67p00K8n64Q47l22o48q85J079
3934C50o26N61j008O86m61j58J045j661K81J049o87N91J074K37j838j68Q61N76
3952G04n35o9P66l49j03Q20j215L74J32P16o01n44J345j781P59P97l62j577K632
3971A909j934Q95j87j93J082k087J281k87q24Q49m40L7Q59j073R94j671J844o24
3989D30j801J812J14j078P09M20m71l80J81o80J278j361L21R84K1k87j154M35
4007e07J499l42l63k78R87q87o1N78ol54L88k99o27Q20o69k89o9K9j43J99J358
$$ plain form
4028 964 28 371 119 -651 348 228 1137 582 362 496 -331 861 -584 -122 -644 625 593 981 -1320
4047 -1320 -456 290 144 -902 -301 903 -572 36 799 893 79 -889 -415 518 -274 -706 520 -643
4065 -643 -1123 -371 -318 815 -485 254 364 828 269 -1095 -133 772 596 59 182 215 1394 213 46
4084 46 482 494 -1118 -243 449 390 227 -205 -365 -293 497 -80 1034 -936 -357 -504 -525 67 -1076 108
4104 108 -115 898 548 -563 -71 -198 969 -214 33 150 -224 308 540 203 -49 -1058 -1102 -254 271
4123 271 -84 354 -323 -868 -1715 598 1191 -193 848 -1161 -81 803 132 347 326 809 374 281 180
4142 180 638 -399 346 -830 174 -639 -58 -5 -221 -235 -603 298 1665 117 -309 -986 1126 -125
4160 -125 360 786 231 824 327 268 485 382 -21 575 -232 155 -758 -56 684 428 -697 -340 336 355
$$ packed form
4028I64r36L43k52p70R99j20R09n55k20J34q27J192j445M62n22J269l2L88k301
4047a320Q64P46j46j046O01J204j475O08P63R4q14r68M74R33p92m32J226j163
4065f43m80P52N3J133j300P39J10M64n59j364R62R05j76n37J23L3J179j181j67
4084D6M36J2j612Q75O92n9j63m32j60P2P90n77J114j970N79j47k1N92j143J184
4104A08k23J013l50j111M92j27J167j183K47J17l74N32K32l37k52j009m4Q48N25
4123B71l55M38o77n45q47K313N93j384J041k009J080Q84o71K15k1M83m35r3j01
4142A80M58j037P45j176J004q13N81N3k16j4l68R01J367j548m26o77K112j251
4160a25M85M26n55N93m97n9K17j03m03N96q07L87r13P02P40k56j125L57O76J9
$$ plain form
4180 355 -501 582 311 1252 -133 328 213 -325 -1536 -19 776 402 209 -494 -865 534 -876 -365
4198 -365 -219 964 1360 -76 392 292 -729 -1018 418 729 -671 -429 -785 -435 -579 -980 731 538
4216 538 -327 -322 810 -53 1126 -787 -704 537 -1418 -127 367 311 186 -1284 -1381 -50 -376 151 -672
4235 -672 -439 -1204 -624 65 155 -814 -318 -366 -840 110 -232 -84 -640 -292 -373 -923 769 -397 -816 -60
4255 -60 368 -496 296 -174 234 -165 339 -81 -467 -291 145 -695 835 247 -486 -430 -596 49 -379 -617
4275 -617 -442 1054 -247 286 845 299 -166 309 -395 494 109 309 -105 319 -471 16 205 -126 -335
4294 -335 -448 -1298 -65 22 -956 -715 -81 -93 109 721 667 -189 -35 -942 -132 513 199 -195 -823 -1377 396
4315 396 -462 -81 89 434 393 616 226 -509 458 -37 131 -77 -467 1027 393 156 102 238 1296 1000
$$ packed form
4180C55q56J083k71R41j385M61j15n38j211J517P95l74j93p03l71J399j410N11
4198c65J46J183L96j436M68j00j021k89J436L11j400K42l56L50j44m01J711j93
4216E38q65NJ132q63J179j913Q3J241j955J291M94n6j25j470r7J331l26N27q23
4235f72K33p65N80O89R0r69M96m8m74R50l42J48n56L48q1n50J692j166m19P56
4255f0M28q64P92m70M08l99N04m20l86J76M36q40J530n88p33N6j66O45m28k38
4275f17J75J496j301N33N59n46m65M75p04Q89l85K00m14M24p90M87J89l31k09
4294c35j13q50J233Q7r78K41O34j2K02O12n4q56J54r07Q10O45l14l94o28n54J773
4315C96q58L81J70L45m1K23l90p35R67m95J68k08l90J494o34k37n4J36J058k96
$$ plain form
4335 1000 739 428 694 -797 -199 -47 190 435 -33 477 1235 559 -103 312 1070 107 -513 191 -31
4354 -31 -611 1015 -428 691 235 -722 249 -124 -844 40 765 -329 -161 -528 149 1009 615 758 470
4373 470 814 347 1017 -190 230 519 378 -163 -781 457 10 350 -251 1442 21 785 360 605 -13
4392 -13 -752 109 285 1264 -1149 185 418 -1162 -644 165 188 -149 -520 -121 731 662 22 8 -1035 -267
4412 -267 -123 388 745 -175 -1145 256 421 -742 -49 343 1879 1308 -373 408 21 -15 -172 323 -132
4431 -132 -176 -220 -736 762 834 -407 472 54 169 -809 400 -436 -919 65 -712 282 -257 819 5 649
4451 649 101 -745 -114 -946 182 -865 45 296 1512 467 -27 -582 192 261 -99 268 342 135 -1457
4470 -1457 -164 398 -410 485 189 968 -633 764 200 143 758 328 524 1355 396 -309 126 -404 160
$$ packed form
4335A000k61l11K66j491N98J52K37K45m68N10P58o76o62M15P58r63o20P04k22
4354c1n80J626j443J119m56r57R71l73p20Q84P25j094J68l67O77Q60l94J43k88
4373D70L44m67O70j207M20K89j41n41o18J238m47L40o01J693j421P64m25K45o18
4392a3p39Q61J76R79k413J334K33j580N18Q09K3l37l71L99Q52o9o40j4j043P68
4412b67J44N11L57r20r70J401J65j163O93L92J536n71j681P81l87l6j57M95m55
4431a32m4m4n16J498P2j241Q79m18J15r78J209q36m83R84p77R94n39J076q14O44
4451F49n48q46O31q32J128j047R10K51J216j045m94n55P74O9l60L67P4k07j592
4470a457J293N62q08Q95k96P79j601J397n64n7O15m30J96Q31r59p05M35n30N64
$$ plain form
4489 160 161 -219 495 -577 551 832 -584 601 89 -179 -254 -141 491 546 1472 572 -281 705 -114 1749
4509 1749 -1047 432 441 949 1050 362 -114 -46 460 549 747 1253 733 -1030 -141 -190 -4 95 1118 116
4529 116 149 -8 470 86 336 -135 -784 891 1593 31 -739 -1009 156 -112 423 -178 77 -57 -225
4548 -225 1218 96 -402 -987 189 577 279 216 183 -104 -521 691 -136 -846 -431 -811 15 235 -317
4567 -317 -334 481 705 1361 -771 22 -141 329 -800 -248 931 -962 161 509 764 -318 -406 -630 -403
4586 -403 -659 -1486 -219 501 -456 -379 -292 -573 153 43 -316 275 -564 -1011 126 -237 -1001 -944 550 -149
4606 -149 312 -235 -772 732 -801 -887 -553 14 364 -293 -156 459 -594 -279 335 -159 -642 -977 -341
4625 -341 158 -419 896 -905 71 753 364 -839 -305 59 -777 -212 410 -655 -372 154 157 -887 -362
$$ packed form
4489A60Jl80P14j072J128K81j416J185n12k68p5J13O32N5R26r00q53R86q19J863
4509A749k796J479RN08J01o88m76O8N06Q9J98N06n20j763Q89m9J86R9J023j002
4529A16L3j57M78l84K50m71o49J675P02j562p70k70J165k68N35o01K55j34j68
4548b25J443j122m98n85J176L88k98o3l3k87m17J212q27p10M15l80Q26K20n52
4567c17j7Q15K24O56k132P93j63M70j129N52J179j893J123L48K55j082q8k24K27
4586d03k56q27J267P20r57P7Q7k81P26j10l59N91q39m47J137l63p64N7J494o99
4606a49M61n47n37J504j533q6L34N67L50o57J37O15j053L15O14m94m83l35O36
4625c41M99n77J315j801R76O82l89j203N34L64q36N65O22j065K83N26Lj044N25
$$ plain form
4644 -362 814 774 -428 992 -582 -704 -277 -341 114 -178 -173 444 554 -630 -22 -777 -1062 -125 236 57
4664 57 -1193 -854 -485 338 -557 -584 1306 330 -377 -1033 -149 287 -1247 42 -1034 -71 162 -1214 497
4683 497 692 -347 703 760 -225 -1652 367 -368 622 -485 427 -925 175 481 7 250 46 -771
4701 -771 893 413 -798 195 279 321 73 -928 -86 -554 219 75 -988 -54 -627 742 265 -194 647
4720 647 694 -242 -455 -401 -32 -202 -92 -506 409 -352 1337 27 -305 -146 -441 -435 170 197 -336 904 -71
4741 -71 -27 -1010 -827 799 -103 630 184 -750 37 782 920 -652 788 1 -475 1749 830 -137 363
4760 363 567 -939 180 -146 297 400 -616 -63 270 615 719 129 -709 -285 37 153 -982 -505 -265
4779 -265 -91 -55 -823 -240 930 736 109 -951 179 -1134 -891 -542 -578 789 758 -399 429 -820 -55
$$ packed form
4644c62J176m0j202J420j574j22M27o4M55k92NO17J10j184O08p55k85R37L61j79
4664E7j250L39L69Q23q95k7J890r76p07o56Q84M36j534J289j076R63K33j376J711
4683D97J95j039J050N7r85j427K019p35R90j107R12j352J100L06m74K43k04q17
4701g71J664m80j211R93Q4M2k48j001Q42m68P73j44j063R34n73J369m77m59Q41
4720F47M7r36k13N4L69j70J10m14R15p61J689j310l32J59k95OO05K7n33J240r75
4741g1M4r83J83J626r02P33m46r34P87P45J38j572J440p87m76K224r19r67N00
4760C63K04j506J119l26M43J03j016N53L33L45J04n90q38M24L22J16j135M77K40
4779b65J74L6p68N83J170j94o27j060J130j313K43L49l6J367l1j157Q28j249P65
$$ plain form
4798 -55 -100 -881 814 -368 -495 96 -5 518 -349 307 -244 -50 -509 -714 915 -780 -355 -6 659
4817 659 235 478 -993 195 1030 -630 -1046 -1155 174 -523 739 12 -52 662 -1299 -171 -551 556
4835 556 379 31 1139 175 -958 -73 656 98 399 -268 -117 703 1252 -368 -555 351 134 -1170 -370
4854 -370 484 327 -424 458 280 -435 436 318 -100 -771 -604 -149 -397 -1599 -671 -235 627 798 -1582
4873 -1582 165 -278 -1545 195 326 -143 -1074 -862 -837 -73 -1004 264 -28 -31 734 320 -897 -474 -606
4892 -606 699 -1077 288 -116 -822 -395 -25 -945 325 -235 484 322 684 -844 181 -343 -386 -658
4910 -658 10 393 -471 -33 417 -243 -698 889 -1137 567 -508 249 -601 216 642 621 -345 890 52
4929 52 123 146 776 -225 -950 293 -233 -1022 -714 325 -167 -387 -671 -505 -628 212 175 131 0 -150 -643
$$ packed form
4798e5m5p81J695j182j27N91j01N23q67O56n51J94m59k05J629j695M25L49O65
4817F59m24K43j471J188Q35j660m16j09J329o97J262p27o4P14j961J128l80J107
4835E56j77l48J108r64j133Q85P29n58L01o67J51Q20N49j620j87R06k17j304Q00
4854c70Q54j57p51Q82j78p15Q71j18m18o71J67M55k48j202R28M36Q62J71k380
4873a582J747m43j267J740J31m69r31K12K5P64r31J268k92lP65m14j217M23j32
4892f06J305j776J365m04p06M27L70r20J270n60P19j62L62j528J025n24m3k72
4910f58O68L83q64M38M50o60m55J587k026J704j075P57q50Q17M26k1r66J235q38
4929E2P1K3O30j001p25J243n26p89L08J039m92k20k84J66j23Q40l7m4j31j50m93
$$ plain form
4950 -643 802 1170 -359 -1118 -202 -748 736 -713 -647 447 -941 906 -352 573 177 -108 120 1930
4968 1930 -365 -162 -614 -110 1197 -964 155 234 633 89 275 -1576 9 411 325 134 621 -776
4986 -776 -169 -309 -436 -1294 646 164 552 -513 -926 -827 1127 -290 -571 -102 -673 -268 -572 895 319
5005 319 -411 356 1208 -223 547 -263 671 -462 -1146 -361 -384 1128 584 -383 448 -104 32 -1117 329
5024 329 -301 -1616 -405 575 -1034 1285 205 326 366 327 -604 -141 653 406 259 -469 467 401 248
5043 248 338 393 -464 562 -120 210 -1143 -361 521 -366 924 -45 -144 406 767 -57 -1554 -765 1123
5062 1123 864 351 157 -485 421 691 535 -675 -756 -335 557 -1204 725 -798 -453 235 -586 -140 -413
5081 -413 150 257 -860 -617 -524 369 -451 549 -90 653 129 322 -434 -139 -1316 -72 1540 -320
$$ packed form
4950f43J445L68j529p59R16n46J484j449O6J094j388J847j258R25l96k85K28J810
4968A930k295K03m52N04J307k161J119P9L99n44J86j851J585M02q6j91M87j397
4986g76O07j40j27q58J940m82L88j065m13R9J954j417k81M69n71M05l04J467n76
5005C19p30P67Q52j431P70q10R34j133o84P85k3J512n44r67Q31n52J36j149J446
5024C29o30j315J211R80j609K319j080J21M0l9r31M63P94k47j47p28R36o6j53
5043B48R0N5q57J026o82L30j353P82Q82q87J290r69r9N50L61q24j497P89J888
5062A123k59n13j94o42R06K70j56j210q1M21Q92j761J929j523L45O88q21M46k73
5081d13N63J07j117K43R3Q93q20J000o39P43n24J93p56K95j177J244J612j860
$$ plain form
5099 -320 -257 256 447 71 -138 1026 -106 -719 602 -1075 114 -883 86 55 836 -351 -473 194 1558
5118 1558 288 479 1086 -456 329 454 -1108 372 -78 127 262 -715 -480 190 1064 -275 -333 -996
5136 -996 -370 721 -530 -590 -386 235 -309 601 -1026 -202 -264 184 1221 -804 760 -374 -186 -360
5154 -360 367 497 731 994 1493 95 111 55 -82 1005 -124 -808 -163 464 905 -304 -762 113 -66
5173 -66 -199 676 -313 -59 1354 606 233 -331 -1252 92 456 -295 -300 -471 755 1531 -1240 -853 183
5192 183 219 -164 99 -983 -477 1452 761 -338 -437 -106 -461 1045 391 -277 -82 -81 288 675 -597 -583
5212 -583 415 696 -521 -6 -1029 -239 -437 -485 1013 348 -674 183 106 -657 505 172 444 -684 -1045
5231 -1045 -243 126 403 443 -98 1112 -477 -662 -133 -1288 -1597 787 1591 -123 -532 95 -562 -141
$$ packed form
5099c20O3N13J91l76k09J164j132o13J321j677J189r97R69l1P81j187j22O67J364
5118A558j270J91O07j542P85J25j562J480m50K05J35r77K35O70Q74j339n8o63
5136i96O26J091j251o0K04O21n44R10j627Q24o2M48J037k025J564j134J88j74
5154c60P27J30K34K63M99j398J6n6j37J087j129o84O45O27M41j209m58Q75j79
5173f6j33Q75r89K54J413p48l73n64r21J344L64p51nj71J226P76k771L87J036
5192A83L6l83K63j082N06J929o91j099r9L31l55J506o54o68J95JL69L87j272J4
5212e83R98K81j217N15j023P90j98m8J498o65j022Q57p7p63J162l33K72j128l61
5231a045Q02L69K77M0n41J210j589j85N29j155l09K384Q04j714m09O27o57M21
$$ plain form
5249 -141 -608 680 -420 279 1035 -500 -601 737 -8 -559 -669 -127 157 755 832 88 -722 -505 -596
5268 -596 1680 -181 -245 61 259 2017 574 -986 -535 36 6 576 74 100 262 701 317 -314 33
5287 33 -5 319 -955 -12 -265 97 11 -782 407 -623 1033 181 -583 -102 -51 -43 0 -541 1009 -326
5307 -326 1339 -196 249 -758 25 241 254 -319 -422 -531 608 512 32 -224 137 -476 35 -287 -458
5326 -458 -947 170 -94 518 -856 -247 1677 724 -730 -1582 -560 845 332 -293 -902 -525 -40 -1377
5344 -1377 -942 -20 -672 1216 298 460 -605 -604 -343 238 370 422 -1119 -219 521 125 -59 -535 645
5363 645 889 -764 317 -885 95 -14 -51 -735 -760 1172 -832 -425 -1303 -1118 817 -164 134 -554 -484
5382 -484 291 229 -29 535 284 300 -109 -833 -468 85 -438 -431 -501 -142 -722 -1019 -596 428 -359 -585 -581 284
$$ packed form
5249a41m67J288j100O99P56j535j01J338p45n51j10N42K84N98P7p44q10K17r1
5268e96K276j861o4L06J98J758j443j560M51N71l0N70n02K6J62M39l84o31L47
5287C3l8L24j274R43k53L62q6p93J189j030J656q52p64M81N1QM3n41J550j335
5307c26J665j535M45j007P83K16J3n73j03j09J139r6m80k56L61o13N11l22j71
5326d58m89J117k64O12j374O09J924r53j454q52J022J405n13o25o09L77M85j337
5344a377M35R22o52J888r18J62j065JK61N81J32N2j541R00P40l96j84m76J180
5363F45K44j653J081j202R80j09l7o84k5J932k004M07q78J85J935r81K98o88P0
5382d84P75o2k58N64k51J6m09p24L65N53n23Pp0L59n80k97M23J024p87k26MQ65
$$ plain form
5404 284 -465 -603 417 577 -543 691 -726 983 -669 -198 436 -801 -200 133 905 407 -159 -939
5422 -939 474 -212 1175 -1097 713 -15 -104 -326 -915 698 -581 837 704 194 26 59 -1027 667
5440 667 1 -381 -78 524 640 1481 603 1270 -3 1002 -309 97 587 337 649 440 365 -382 787
5459 787 896 -18 449 -792 -439 261 -345 767 -464 446 -292 -443 -968 -606 177 -138 -1304 -745 1050
5478 1050 -437 -140 265 -552 372 3 834 -306 -709 745 117 497 -1235 -388 -373 135 -466 160 -243
5497 -243 277 631 1004 598 -488 -96 -615 -924 -188 -265 285 -408 924 -67 -373 -275 914 -577 -6
5516 -6 -124 -188 723 -208 -315 55 538 -520 -249 -376 -364 -312 -44 100 -268 -293 309 -227 -287 -49 -1620 12
5538 12 107 857 85 -308 250 217 155 37 -14 -587 159 296 -686 -72 486 65 1214 -328 -317 22 952
$$ packed form
5404B84p49j38J020J60j120J234j417J709j652M71O34j237O01L33P72m98n66p80
5422i39J413o86J387k272J810p28q9k22n89J613j279J418j33n10j68L3j086J694
5440F67o66l82L03O02J16Q41q78O67j273J005j311M06M90k50L12k09p5p47J169
5459G87J09r14M67j241L53P00o06J112j231R10p38j51n25L62P83l15j166N59J795
5478A050j487K97M05q17R24l69Q31j140m03J454o28L80j732Q47J5N08o01O26m03
5497b43N20L54L73m06j086L92n19l09P36p7N50o93J332r91l06R8J189j491N71
5516fj18o4R11r31j07L70M83j058K71j27J2N2K68J44l68k5O02n36o0K38j571J632
5538A2R5P50p72l93N58l3o2j18n1n73P46J37r82O14N58m21J149j542J1L39R30
$$ plain form
5559 952 23 -194 -90 -275 866 -12 236 156 -273 -147 358 -160 -416 -1 625 789 -121 157 -429 733
5579 733 746 743 -246 306 -1000 -255 836 1178 306 -318 746 688 132 -1014 117 406 -178 -353 -182 528
5599 528 -555 102 131 -29 387 -989 -156 -515 480 -8 332 522 -313 48 1046 1212 55 -974 -242
5618 -242 474 -156 -4 -853 -203 167 179 529 -668 -678 183 -542 447 -336 -436 -1248 66 969 -986 -89
5638 -89 387 1793 183 -853 -255 386 396 -193 502 -262 -111 354 143 -163 -582 -75 -203 -286 481 -1065
5658 -1065 18 110 -34 32 81 238 66 -156 160 -769 -329 936 168 -599 61 -275 -75 -180 -1019 458
5678 458 628 453 380 631 147 770 143 -951 -425 -412 -457 912 948 726 139 -81 858 -343 1107 -167
5698 -167 386 443 376 387 -803 791 997 -160 -38 -95 -323 -594 -963 -71 -891 861 -747 1105 -231
$$ packed form
5559I52r29k17J04j85J141q78K48q0m29J26N05n18k56M15O26J64r10K78n86J162
5579G33J3lr89N52j306P45J091L42q72o24J064n8n56j146J131K89n84j75J71P10
5599E28j083O57K9j60M16j376Q33l59R95m88L40J90q35L61R98J66j157j029P32
5618b42P16o30J52q49O50L70J2L50j197j0Q61p25R89p83j00q12J314R03j955Q97
5638h9M76J406j610j036N98O41J0n89O95p64J51M65k11l06m19N07j28q3P67j546
5658a065J083R2j44O6M9J57j72k22L16r29M40J265p68p67O60l36K00j05q39J477
5678D58J70j75p3K51m84O23o27j094N26J3m5J369L6k22n87k20R39j201J450j274
5698a67N53N7o7J1j190J594K06j157J22n7k28k71l69Q92q20J752j608J852j336
$$ plain form
5717 -231 959 641 -205 -501 -1536 -526 -187 685 526 -801 -361 1075 -54 211 -147 217 -216 213
5735 213 -302 -937 619 479 961 -91 -245 43 -7 -179 308 -54 420 73 296 558 -605 468 -857
5754 -857 231 701 238 -908 -706 -386 353 120 -362 -163 -113 226 -608 -448 -228 -527 583 -176 240
5773 240 -984 -69 890 1033 -722 597 389 59 927 -65 420 -706 -124 193 -327 -955 494 382
5791 382 -275 -243 1331 457 -269 429 -353 1148 963 140 -256 158 -688 886 -274 437 -328 271 -619
5810 -619 -335 670 -227 363 220 -1079 112 1200 -419 -488 -522 1098 28 -1283 98 250 -781
5827 -781 -230 494 196 234 -498 715 96 49 -400 -208 778 -204 -182 1495 600 -566 -186 419 -117 746
5847 746 -6 -404 475 1001 -639 496 -283 -279 366 -364 179 508 -519 352 -649 -346 -75 -404 -733
$$ packed form
5717b31J190l18q46k96j035J010L39Q72j59j327M40J436j129K65l58L64m33M29
5735B13n15o35J556j40M82j052j54K88n0j72M87l62M74l47K23K62j163J073j325
5754h57J088M70m63j146K02L20P39k33m82J99N0L39q34J60K20k99J110p59M16
5773B40j224R15R59J43j755J319k08l30Q68r92M85j126N82L17n20o28J449j12
5791C82o57L2J574q74p26O98p82J501j85q23l96M14q46J574j160P11p65N99q90
5810f19K84J005q97N90j43j299J191J088j619o9l4J620j070j311J381J52j031
5827g81N51P24k98L8p32J213o19m7m49J92R86r82K2J677q95j166L80O05n36Q63
5847G46p52l98Q79N26j640J135p79MO45p30N43L29j027Q71j001L03K71l29l29
$$ plain form
5866 -733 -774 -38 -948 625 -670 -1 788 -34 395 -484 -180 940 32 -266 -109 409 -1805 -115 555
5885 555 20 -160 -1322 -632 -670 -242 20 501 -621 273 1004 365 -95 -623 1145 -593 70 123 -166
5904 -166 -1270 -147 -13 -479 630 -273 854 149 -136 269 364 459 -41 -128 -545 -506 465 432 -236 -28
5924 -28 -130 16 -384 425 581 -203 1224 588 618 250 -320 1392 -1355 602 744 -546 57 -440 548
5943 548 700 401 -996 -584 -903 4 -385 850 264 -394 -89 -863 841 1165 30 915 -861 -512
5961 -512 1032 -624 1070 257 -80 -48 525 111 719 1072 896 749 15 -865 129 262 307 -151 121 505
5981 505 -505 -331 1268 671 -267 42 62 320 -68 962 -396 -240 959 -109 558 1311 1222 1435 172
6000 172 773 1234 -359 -365 929 1203 146 -96 642 -803 22 -420 419 -15 1427 -494 710 809 726
$$ packed form
5866g33m1P36r10J573j295O69P89q22M29q79L04J120r08k98J57N18k214J690O70
5885E55n35j80j162O90l8M28K62M81j122Q94P31o39m60n28J768j738O63N3k89
5904a66j104J123J34m66J109r03J127p05k85M05R5R5n00q7m17L9R71l3o68K08
5924b8j02J46m00Q09J56p84J427o36L0l68n70J712k747J957J42j290O03m97R88
5943E48J52k99j397M12l19R07l89J235n86o58L05p74J704L24j135Q85j776L49
5961e12J544j656J694q13l37L2N73m14O08L53j76j47p34q80R94J33M5m58K72L84
5981E05j010J74J599n97r38L09K0K58l88J030j358J56J199j068O67P53q9K13j263
6000A72O01M61j593oJ294K74j057k42P38j445Q25m42Q39m34J442j921J204R9q3
$$ plain form
6019 726 135 -77 100 334 -501 -96 -223 -443 -1316 56 -882 675 191 -395 945 295 598 15 240
6038 240 590 457 53 184 148 1244 77 235 -842 -770 -238 -419 145 20 -254 238 -613 151 -468 46
6058 46 13 -913 -119 -525 -653 -281 -1071 -1060 423 373 -444 -70 -957 157 -934 579 456 -249 -1125 397
6078 397 661 -1107 -1220 -165 260 -524 295 -160 -518 316 -819 580 797 -293 56 -318 557 -1298
6096 -1298 575 -50 -118 396 1111 802 87 -599 -1029 449 -660 82 683 700 -122 677 -815 215 -198
6115 -198 111 -84 656 -189 -110 27 375 477 122 -118 -311 589 79 -146 -720 720 -132 -241 444 303
6135 303 573 -64 623 99 -197 355 319 893 -318 -189 -979 203 -239 -1617 -239 -28 -586 -344 637
6154 637 1 113 186 900 861 447 -54 363 -577 426 380 155 166 503 498 -476 763 801 -267 -508 -88
$$ packed form
6019G26n91k12J77K34q35M05j27k20q73J372r38J557m84n86J340o50L03n83K25
6038B40L50j33m04J31l6J096j167J58j077P2N32j81N64j25k74M92q51P64o19N14
6058D6l3r26P94m06j28L72p90J1J483n0q17L74q87J114j091J513j23p05q76J522
6078C97K64j768j13J055M25p84Q19m55l58Q34j135J399K17j090L49l74Q75j855
6096a298J873o25o8N14P15l09p15o86m30J478j109P42O01J7q22P99j492J030m13
6115a98L09j95P40q45P9J37L48J02l55k40j93R00n10k25n74J440q52j09O85j41
6135C03K70o37O87n24k96N52l6N74j211J29p90J182m42j378J378K11n58K42R81
6154F37o36J12P3P14l9m14n01M17r40J003m6k25J1L37nr74J239L8j068k41M20
$$ plain form
6175 -88 -51 137 929 -654 -347 321 109 693 477 -329 -541 133 -605 -194 1107 476 491 -454 -65 -24 -467
6196 -467 -305 -369 132 152 -649 -1012 -251 -328 -523 -979 -20 3 -346 506 195 337 653 39 373 -187 1379
6217 1379 302 195 344 -146 -324 100 211 -808 -832 166 625 -490 -84 327 -811 -237 378 304 -893
6236 -893 756 -493 -693 316 -302 -507 82 1054 164 121 -452 867 -358 213 -287 -676 934 -318
6254 -318 -476 -734 -540 280 -935 -458 339 -103 -158 -807 367 347 397 225 -72 1165 -119 167 373 -215
6274 -215 212 149 -98 93 -747 -355 163 -90 -424 222 -485 -273 1116 392 -108 102 -555 -1105 -341 569
6294 569 500 -1280 21 527 523 1037 1289 787 -337 592 156 -537 -789 8 -175 144 -102 614 744 139
6314 139 216 -55 252 316 -34 684 650 436 191 -6 448 -57 1337 1053 -32 -681 -160 -177 636 587 649
$$ packed form
6175h8L7J88P92j583L07O68k12N84k16q06k12O74p38M11J301o31J5r45L89M1m43
6196d67J62o4N01K0q01l63P61p7j95m56R59K3l49Q52l11J42L16o14L34n60J566
6217A379j077j07J49m90j78M24J11j019k4R98M59j115M06M11j138N74O15p4j197
6236h93J649j249k00J009o18k05N89R72q90m3n73J319j225N71n00l89J610j252
6254c18j58k58J94Q20j215M77P97m42n5o49J174k0N0j72k97J237j284K86K06n88
6274b15M27o3k47J91q40L92N18k53l34O46p07K12J389p24n00K10o57n50P64R10
6294E69o9j780J301N06mN14K52n02j124R29m36o93k52P97j83L19k46P16J30o05
6314A39P7k71L07O4l50P18l4k14k45j97M54n05J394k84j085o49N21j7Q13m9O2
$$ plain form
6335 649 725 -516 507 -352 733 901 -419 186 -223 -388 -487 1270 549 -16 -275 184 494 -473 -382
6354 -382 73 194 -17 -125 548 -716 -793 -27 327 635 -392 -1093 437 -265 -808 104 -155 576 412
6373 412 476 578 465 76 -6 -168 253 161 372 93 127 -558 -223 513 657 419 -239 479 -112 -651 -687 1300
6395 1300 58 -301 -7 617 550 -717 179 -1215 665 450 413 680 -560 -27 287 -189 100 58 478
6414 478 765 -2041 -254 -228 176 -17 635 -309 -895 1205 -1347 360 969 422 187 919 1048 -11
6432 -11 -393 -101 -511 431 360 -874 539 -321 -635 -85 -1106 10 -336 33 -1023 27 -56 280 628
6451 628 -493 165 -859 -85 43 -728 -1081 432 -1051 -592 498 -1148 -979 -546 -710 489 -743
6468 -743 16 -271 -535 -668 -370 -993 163 99 120 -88 -14 -294 -133 -358 -1073 -103 -671 -357 -1075 621
$$ packed form
6335F49P6j241J023q59J085J68j320O05m09j65r9J757p21n65k59M59L10r67R1
6354c82M55J21k11j08O73j264p7P66L54L08j027p01J530p02n43R12k59P31j64
6373D12O4J02j13l89q2j62M21r2K11k79L4o85L35P36J44k38o58P18n91n39l6J987
6395A300j242l59K94O24o7j267Q96j394J880k15l7K67j240N33L14m76K89m2M20
6414D78K87k806J787K6M04j93O52r44n86K100k552J707O09n47k35P32J29j059
6432a1l82K92m10R42p1j234J413q60l14N50j021J116l46L69j056J050q3L36L48
6451F28j121O58j024P74J28p71l53J513j483M59J090j646J69M33j64J199j232
6468g43P59k87k64j33K98o23J156o4K1k08P4k80J61k25p15R70n68L14p18J696
$$ plain form
6488 621 -1063 450 84 283 325 -556 110 -616 -541 -285 510 -468 196 -774 -737 -24 -501 -451 119 128 5
6509 5 431 252 -828 113 448 686 -24 -168 114 934 -510 345 492 497 -443 177 -834 -449 -40 177
6529 177 206 -1099 -129 283 81 -161 375 -219 -134 -1227 283 -48 -728 -486 242 238 386 672 -1294 -621
6549 -621 436 -455 249 -455 -360 -230 91 -607 333 357 -702 -1022 -618 -1061 -414 -777 439 545 226 -760
6569 -760 366 314 -71 -435 558 -1244 109 546 -152 -17 912 -368 200 1151 -195 -332 -274 -83 449
6588 449 -1039 137 -408 354 -331 -503 -536 -96 268 -594 566 -152 -468 -868 501 1119 -269 -49 139
6607 139 62 -343 499 153 -617 -255 -102 -269 -959 -1049 -66 -257 196 1255 210 -1567 -129 -333 -538
6626 -538 -781 532 -549 311 418 93 -201 -816 -937 -160 -449 81 -204 555 1189 404 -600 -155 -944
$$ packed form
6488F21j684J513l66J99M2q81O66p26P5K56P95r78O64r70L7P13m77N0N70Rj23
6509EM26j79j080R41L35K38p10j44K82Q20j444Q55J47Nr40O20j011L85M09K17
6529A77K9j305R70M12k02k42N36n94Q5j093J510l31o80K42P28mJ48K86j966O73
6549f21J057q91P04p04R5J30L21o98R40K4j059l20M04m43O47l63J216J06l19r86
6569g60J126n2l85l64R93j802J353M37o98J35R29j280N68R51j346j37N8J91N32
6588D49j488J176n45P62o85j72l3M40L64q62J160p18l16m00J369O18j388K20J88
6607A39p7m05Q42l46p70L62J53j67o90r0R83j91M53J059j045j777J438k04k05
6626e38k43J313j081Q60J07l25k94o15j21P77k89N30k85P59O34p85j004M45p89
$$ plain form
6645 -944 -798 128 762 -911 316 40 621 180 780 -390 -326 -393 108 -55 -255 235 -306 463 179 -94
6665 -94 -956 -598 -120 133 -306 -363 -11 301 489 290 -917 -218 -992 218 -297 901 289 270 344 1432
6685 1432 -217 -24 406 -665 -273 -148 -677 776 210 395 1163 365 -391 -861 695 -357 -82 488
6703 488 547 -614 508 -803 307 -172 305 704 -807 155 325 -168 -327 -91 442 -770 474 1376
6721 1376 407 817 400 510 -468 -857 185 78 276 -671 -216 394 1060 -337 -965 1064 -950 202
6739 202 -447 314 -458 629 1040 -9 177 183 -626 601 -112 -265 390 680 -103 642 271 346 -972 -291
6759 -291 258 611 336 66 1175 -837 -30 -585 -166 224 -555 671 345 -628 28 400 826 17 562
6778 562 948 -585 -69 -215 133 542 364 -792 652 -92 -467 1144 -835 -588 -426 450 -53 -1232
$$ packed form
6645i44J46R26O34j673J227k76N81m41O00j170O4o7N01j63k00M90n41P69k84k73
6665i4q62L58M78K53m39n7L52L12J88j99j207O99p74J210n15J198o12j9P4J088
6685A432j649J93M30j071L92J25n29J453n66J85P68p98p56m70J556j052K75N70
6703D88N9j161J122j311J110m79M77L99j511R62J70m93j59K36N33j212J244R02
6721A376r69M10m17J10r78l89J042j07J98r47M55O10O66j397o28K029k014J152
6739B02o49P61p72J087M11j049J86Oq09J227p13j53O55K90p83P45l71P5j318O81
6759b91N49L53k75k70J109k012Q07n55M19L90p79J226l26r73O56L72M26q09N45
6778E62L86j533N16j46L48M09j78j156J444p44l75J611j979K47J62Q76n03j179
$$ plain form
6796 -1232 215 -79 -939 293 -811 833 -802 -95 -66 -164 372 -1120 -161 250 503 117 -736 172
6814 172 -331 600 225 -31 370 256 344 -645 -372 -911 620 937 -192 94 -194 27 63 -1036 -391 -44
6834 -44 -188 932 577 481 361 137 -69 -325 -364 839 506 137 721 824 -162 274 167 502 -1482 -83
6854 -83 614 -466 -506 -1124 -1075 -1447 157 -701 724 702 -1437 -201 -72 -412 -199 348 362 -202 6 791
6874 791 546 -637 578 837 894 1356 51 -128 88 -881 1290 -1169 781 370 -158 217 -103 -441
6892 -441 -596 1629 -264 -64 627 81 66 -544 150 -119 -421 112 -303 -592 24 492 -320 48 578 355
6912 355 464 -743 -223 -155 -78 485 -76 -1761 23 153 21 490 -568 -1066 -406 545 547 1007 659 872
6932 872 946 528 138 24 48 344 -515 -827 -360 289 68 139 917 97 -433 144 232 -349 311 613 248
$$ packed form
6796a232J447k94q60J232j104J644j635P07K9r8N36j492R59M11K53l86q53R08
6814A72n03R31l75k56M01j14Q8r89K73n39J531L17j129K86k88K21L6j099O45L47
6834d4j44J120l55r6j20k24k06k56l9J203l33l69N84J03r86M36j07L35j984J399
6854h3O97j080m0o18M9l72J604q58J425k2k139J236J29l40K13N47J4n64K08P85
6874G91k45j183J215K59N7M62j305j79K16r69K171k459J950m11n28L75l20l38
6892d41j55K225j893K00O91n46j5o10O94k69l02N33m15k89O16M68q12L68N30k23
6912C55J09j207N20O8P7N63n61j685J784J30j32M69j058m98O60R51KM60l48K13
6932H72P4m18l90j14K4K96q59l12M67O49k21P1P78q20n30N77Q8n81O60L02l65
$$ plain form
6953 248 95 154 677 -785 292 -332 -296 537 -523 -693 1626 -458 1360 170 543 -309 547 -618
6971 -618 435 37 -623 499 -99 -156 -237 -525 -660 92 -766 -200 616 228 -196 -62 -867 -147 226 -239
6991 -239 -285 -57 291 -908 -77 289 1208 -34 205 388 986 -66 579 -905 -155 1233 -609 -120
7009 -120 -1049 -366 -64 -821 890 -510 -1010 -1191 -640 -251 656 -359 155 224 -707 185 1243 -371 -518
7028 -518 -494 -557 -1128 -423 -561 56 -858 152 -313 186 27 -246 443 1032 968 -1101 -339 355 -451 271
7048 271 136 -456 -1377 -324 -446 -23 288 596 460 68 895 -27 461 48 718 105 -207 -1025 90
7067 90 385 -740 -355 581 670 -16 -273 -262 -52 -852 -435 -764 -356 -364 -468 -55 -879 -69 -596 649 303
7088 303 158 983 460 -844 -222 121 95 -853 -110 797 -89 -431 486 68 -17 541 -139 -557 -29 -322
$$ packed form
6953B48j53N9N23j462J077o24L6Q33j060j70K319k084J818j190L73q52Q56j165
6971f18J053l98o60J122n98n7q1k88j35P52q58N66Q16l88m24J34q05P20L73m65
6991b39m6K28L48j199Q31L66R19j242K39J83N98j052O45j484P50J388j842M89
7009a20r29O83L02p57J711j400n00j81N51L89R07j015N14O9r31Q92J058j614j47
7028e18K4o3n71P05j38O17r14J010m65M99j59k73O89N89o4k069P62O94q06P22
7048B71j35n92r21J053j22M23L11L08j36l92Q27r22M88m13O70o13l12q18J115
7067I0K95j125L85R36Q9o86k57J1K10q00M17l29M08qj04M13q24Q10n27J245l46
7088C03j45Q25n23j304O22L43k6r48P43R07q86l42R17m18q5N58o80m18N28k93
$$ plain form
7108 -322 269 -130 -675 1393 -98 -1338 432 510 840 -474 1049 163 62 456 277 -225 444 713
7126 713 412 479 -119 123 655 -321 370 437 -645 -1064 -545 -162 -182 376 328 -1162 -156 -299 117 -72
7146 -72 -4 970 74 124 834 -657 173 -233 -71 -38 72 927 -371 497 448 -869 -499 1596 -296 1221
7166 1221 203 398 -224 433 -21 631 352 207 -59 798 -778 -11 -183 -126 -157 -305 273 -1144 116
7185 116 765 331 -473 269 -298 -691 226 -563 -846 -94 -239 414 -437 -637 158 -143 -974 -238 1025 127
7205 127 -12 622 -935 -742 -305 441 423 -383 890 406 115 478 -178 -128 585 -613 577 175 -18
7224 -18 378 -422 693 859 -208 -88 20 -143 84 -88 883 313 34 -466 -229 -415 -301 -489 394 -331
7244 -331 -836 514 -294 136 -349 -433 1184 -1 213 919 17 586 -623 -135 -172 650 -366 -1185 546
$$ packed form
7108c22N91l99n45K068j491j240J770P8L30j314J523q86j01L94j79n02O69K69
7126G13l01O7n98K42N32r76O91O7j082m19N19L83k0N58m8j490J006j43M16j89
7146g2O8R74q96N0P10j491Q30m06J62L3J10Q55j298Q68m9j317L70K095j892J517
7166A221j018J95o22O57m54O52k79j45k66Q57j576P67j72N7l1j48N78j417J260
7185A16O49m34q04P42n67l93R17p89k83P52j45O53q51k00P95l01q31P36J263q98
7205A27j39O34j557J93M37P46j8q06J273m84k91L63o56N0P13j198J190m02j93
7224a8L96q00J115J66j067J20J08j63K27j72R71n70k79n00K37j86J14j88Q83p25
7244c31n05J350q08M30m85q4J617j185K14P06r02N69j209M88l7Q22j016q19J731
$$ plain form
7263 546 -71 -917 12 -94 -453 -883 75 -99 569 -729 -410 235 -628 443 291 -544 405 460 -191 745
7283 745 -543 1058 -659 -803 28 471 1008 -167 -591 -790 182 -2 996 -46 -31 813 354 -335 290
7302 290 588 183 -63 729 436 -523 251 1024 150 -1079 339 -646 -670 246 -483 327 114 -767 -180 412
7322 412 569 -207 854 412 -506 -660 634 -564 565 778 -446 793 893 254 356 -802 -404 -1311
7340 -1311 -90 -321 413 -237 209 -99 634 1841 521 1178 123 68 -96 -660 -8 7 -1473 493
7358 493 -861 99 310 -508 -85 -473 153 -865 112 895 -285 -452 293 -132 329 784 200 -980 514
7377 514 526 76 959 111 -226 -216 938 201 857 146 -77 741 -721 -417 -509 224 1090 159 272 11
7397 11 402 459 387 494 -330 -1045 818 365 -149 324 -211 1285 588 1077 -557 399 650 504 797 -167
$$ packed form
7263E46o17q46R29j06l59m30R58j74O68j298L19O45q63J071j52q35R49N5o51R36
7283G45j288J601j717j44Q31M43N37j175m24j99R72j84R98j042J5Q44m59o89O25
7302B90K98m05k46P92k93r59P74P73q74j229J418r85k4R16p29Q10k13q81N87N92
7322D12J57p76J061m42r18j54J294j198J129K13j224J239J00o39J02j158L98r07
7340a311J221k31P34o50M46l08P33J207j320O57j055n5j64n64O52J5j480J966
7358D93j354R60K11q18M23l88O26j018R77P83j180j67P45m25M61M55n84j180J494
7377E14J2m50Q83q48l37J0J154p37O56p11k23Q18j462L04r2P33Q66r31J13k61
7397A1L91N7p2J07q24p15J863m53n14M73n35J496o97M89j634R56K51j46K93r64
$$ plain form
7417 -167 -4 460 -787 -551 525 533 -235 236 -37 234 335 384 -1190 712 -40 -308 33 811 -13 65
7437 65 -672 42 -797 322 470 470 -732 -80 -123 887 -465 -534 -40 -334 -327 -234 -594 -499 -172 -525 555
7458 555 -214 222 76 690 -659 -257 189 168 -310 583 -159 350 -621 843 -239 -31 760 -523 -605
7477 -605 270 -220 -606 1103 -1047 925 -1054 -537 -331 -61 -360 418 196 685 228 74 181 -763 -595
7496 -595 -816 -310 -828 -2 -642 360 404 -728 988 339 -353 227 -126 -231 -949 -1678 344 -695 -430
7515 -430 178 -508 185 108 -1284 -315 -820 514 213 1142 -1008 1007 621 -317 -175 11 208 241 262 675
7535 675 31 -320 -610 -351 697 -42 386 -56 -529 -239 613 -571 137 173 873 -886 -894 135 640 661
7555 661 40 -173 110 179 477 1188 -476 795 -550 -1339 843 -490 -1078 467 568 246 -484 90
$$ packed form
7417a67J63M64j247K36J076Qp68M71k73K71J01M9j574J902p52k68L41P78q24P8
7437F5p37P14q39J119J48%j202O52m3J010j352o9M94k94PR3l60R5L27l53J080
7458E55p69M36j46O14j349M02M46k1m78Q93p42N09r71J464j082K08P91j283q2
7477f05Q75m90l86J709k150J972j979N17K06K70k99P78k22M89m57j54J07r44J68
7496e95k21N06n18Q26o40J002M4j132J716o49o92N80l53j05p18p29K022j039K65
7515d30O08o86O93p7j392R69n05J334l01R29k150K015l86r38J42J86J97L3K1M13
7535F75o44l51k90K59J048p39M28m42m73K90Q52j184P08L6P00j759qJ029N05K1
7555F61o21k13K83O9K98P11j664J271j345p89K182j333n88J545J01l22p30N74
$$ plain form
7573 90 -299 -696 -232 -612 24 -33 568 -833 -1161 -607 -192 390 -180 122 -1002 -624 478 227 689 -91
7593 -91 -542 139 1055 -378 285 274 701 629 -72 -1447 1051 296 -780 -674 276 782 -55 906 1152 -1475
7613 -1475 961 -514 990 62 -593 -996 -903 420 -214 729 -189 235 -327 -565 173 -867 750 1407
7631 1407 68 -409 -214 970 -30 -725 396 398 513 1100 -880 37 -861 -57 -393 297 -108 -177 953
7650 953 42 419 -312 -148 -391 -441 -1706 813 1295 196 459 -795 469 -1023 691 -879 0 -239
7668 -239 872 783 78 531 -499 -110 520 280 -132 -42 -223 -755 -623 161 121 141 -828 29 -111 -583 125
7689 125 7 388 511 181 -333 -1034 -877 -466 20 -248 -209 -538 272 512 183 456 175 -128 383 -1545
7709 -1545 836 353 -39 -621 -321 790 -437 -224 136 -92 14 -1198 395 -9 -193 -499 773 186
$$ packed form
7573I0l89l97M64l80O36n7O01j401l28N54M15N82n70L02j124L78J102k51M62p80
7593i1m51O81R16j433O63j1M27p2p01j375K498p55j076J06R50N06q37R61K46k627
7613a475K436j475J504r28o55m03R3J323o34R43r18M24n62k38P38j040J617O57
7631A407j339m77J95J184j000o95J121KJ15N87j980R17q98Q04l36O90m05o9J130
7650I53r11L77p31J64k43n0j265K519M82j099K63j254J264j492J714j570Q79k39
7668b39J111q9p05M53j030L89O30k40m12R0j81n32J32P84m0K0r69Q57j40m72P08
7689A25j18L81J23l30n14p01J57M11M86k68L9l29Q10K40l29K73k81l03N11j928
7709a545K381m83l92n82L00J111j227K13L60k28J06j212J593m04j84l06J272n87
$$ plain form
7727 186 127 740 -209 -99 -115 -689 725 -41 -112 -411 146 -295 -196 -147 667 -225 410 -302 198 706 755 -487
7749 -487 -82 1449 -249 -135 -599 -237 -1132 -204 -142 568 -598 701 104 680 -998 716 224 -9
7767 -9 -240 -24 741 312 -274 395 414 -355 -480 521 -392 -774 -242 585 130 -581 -141 286 388 -335 787
7788 787 859 -673 311 -384 -221 100 -618 -641 -147 -342 -82 -637 206 -257 688 1624 96 -124 675 436
7808 436 187 -869 737 686 486 64 290 -455 461 587 -560 795 710 163 -374 357 137 746 448
7827 448 64 -477 130 88 1027 -403 442 -61 7 193 -157 764 404 -71 -63 -596 -942 -66 499 14 -737
7848 -737 518 -373 990 -71 -242 -761 -62 -447 107 -89 201 65 928 53 -492 38 -767 -757 -128
7867 -128 -336 666 824 721 -178 -287 -838 686 -758 -460 329 334 410 -719 -584 748 150 -972 199
$$ packed form
7727A86n9O13r49J10j6n74J414p66p1k99N57m41R9M9Q14q92O35p12N00N08M9j242
7749d87M05J531j698J14m64L62q95R28O2P10j166J299n97N76j678J714m92k33
7767ik31K16P65m29n86O69J9p69j25J001r13l82N32Q27m55p11M40M27J02p23J122
7788G87P2j532R84o95J63L21p18k3M94j95K60n55Q43m63R45R36j528k20P99k39
7808D36k49j056J606n1k00m22K26p45R16J26j147J355q5n47n37P31k20O09k98
7827D48l84n41O07m2R39j430Q45n03O8J86l50R21l60m75Qn33l46Q76N65m85p51
7848g37J255q91J363j061j71n19O99l85N54j96K90j36Q63q75n45N30q05J0O29
7867a28k08J002J58j03q99j09n51J524j444K98P89NP6j129J35J332n98j122J171
$$ plain form
7886 199 -588 -505 269 -328 -790 789 227 270 347 479 -112 129 21 -175 696 -706 -506 270 -204 -945
7906 -945 -606 -605 79 551 -745 -733 -77 271 513 46 254 462 -96 368 -398 -751 -148 323 427 -207 267
7927 267 445 508 -100 432 -508 -453 1118 683 -375 76 263 128 154 -255 -49 -293 456 79 827 433
7947 433 25 -665 100 -445 132 696 -23 311 513 793 388 -143 516 -122 597 82 307 -521 -104 -795
7967 -795 -1006 105 -582 -18 818 -700 119 -51 -476 -481 230 243 430 317 42 376 -1201 -475 -768 -602
7987 -602 -927 -625 884 1127 -352 43 126 -258 -325 -5 115 -169 164 -184 801 338 457 400 612 357
8007 357 -1162 325 -534 439 -478 -178 590 256 -464 -157 611 106 720 158 457 968 254 -537 -471 -290
8027 -290 122 655 -191 -204 -451 -739 -707 -1021 480 -1143 49 -2 -164 124 -235 222 -204 -786 375 -419
$$ packed form
7886A99p87Q3P74n97m62J579n62M3P7J32n91K41j08j96Q71j402K00P76m74p41
7906i45L39JO84M72j296J2O56L48K42m67K08K08n58M64p66l53O03M71J04o34M74
7927B67J78O3o08N32r40N5J571m35j058M51J87j35K6m09K06k44P49l77P48l94
7947D33m08o90P65n45N77N64p19L34K02K80m05n31O59o38P19n15K25q28M17o91
7967g95k11J111o87N64Q36j518Q19j70m25nP11J3J87j13k75L34j577P26k93J66
7987f02l25L02J509K43j479L95Q3l84o7L20J20k84L33l48R85m63J19n7K12k55
8007C57j519J487q59R73r17L00P68l34p20L07P68n05O14n62K99N11p14p91O6J81
8027b90M12N33q46j3k47k88L2l14J501j623J192n1j62K88l59M57m26n82J161p94
$$ plain form
8047 -419 -29 -965 922 188 63 296 -152 855 -806 661 836 -366 537 323 436 756 869 -601
8065 -601 40 281 662 -755 -237 -172 -422 334 -851 120 -1211 -615 -747 -554 271 312 -298 -816 -779 60
8085 60 872 -535 -907 -206 -605 -727 -739 659 -147 641 509 605 5 489 594 -494 805 572 650 -129
8105 -129 388 -563 -715 -771 1617 66 763 121 -389 -357 789 317 -501 -373 147 -253 -329 -1102 -1351 45
8125 45 -1058 -812 77 -735 -564 -57 621 1392 1030 -721 -481 -1008 498 217 -611 194 1245 -59 -91
8144 -91 -1017 1249 619 -467 -311 509 27 1284 -386 832 -595 -586 722 -600 -564 145 767 -187 -324
8163 -324 -501 -300 118 -292 1030 858 -395 535 -427 -486 -793 -415 -261 34 45 -619 -1318 -646 -252 27
8183 27 -98 -125 -13 1151 290 -169 -632 -170
$$ packed form
8047d19L90r36J887p34j25K33m48J007j661J467J75j202R03k14J13L20J13j470
8065f01O41K41L81j417N18O5k50P56j185R71j331N96j32J93Q25M1o10n18L7Q39
8085F0Q12j407l72P01l99j22j2J398q06P88j32R6o00M84J05j088J299k33P8p79
8105a29N17r51j52n6K388j551O97o42n10L2J146m72q18J28N20m00p6p73k49J396
8125D5j103K46Q89q12J71N07O78P71l62j751K40n27J506k81q28Q05J051j304l2
8144i1r26K266o30j086J56Q20m82J257j670J218j427RJ308j322L6P09O22r54j37
8163c24j77K01M18m10J322j72j253R30r62n9l07L78J54K95J1o64o99O72L94K79
8183B7j25k7J12J164q61m59m63M62
8191a70
$$ Imaginary data points
##PAGE= N=2
##DATA TABLE= (X++(I..I)), XYDATA
$$ plain form
0 0 0 0 0 0 0 0 0 -5 108 -108 108 -108 216 -216 219 -324 336 -432 540 -644 747 -860 974 -1093 1297
25 1297 -1469 1668 -1904 2157 -2432 2746 -3081 3455 -3857 4312 -4804 5341 -5929 6578 -7303
40 -7303 8086 -8954 9902 -10962 12154 -13480 14984 -16695 18647 -20938 23639 -26879
52 -26879 30858 -35888 42482 -51527 64797 -86221 126747 -231039 1115740 1907266 9871
63 9871 -350972 176393 949816 830105 579270 203290 14447 -10915 385672 535695 269749
74 269749 -94205 73567 331818 247411 -18888 169121 496501 397172 -29475 -22713 410131
85 410131 637629 326586 2187 76917 375794 440958 263705 88738 58220 125511 270941
96 270941 327086 104330 -196225 -78455 366081 448238 -28941 -341638 7176 489176
$$ packed form
0@%%%%%%%nJ13k16K16k16L24m32M35n43O60p68R72j184J391j607J834k067K390
25A297k766L137l572M061m589N178n827O536p312Q169r116J0145j1270J2507j3881
40g303J5389j7040J8856k0864K3116k5634K8464l1679L5342l9585M4577n0518
52b6879N7737o6746P8370r4009J16324j51018K12968l57786J346779P91526j897395
63I871l60843N27365P73423j19711k50835l75980j88843k5362L96587J50023k65946
74B69749l63954J67772K58251q4407k66299J88009L27380r9329m26647O762M32844
85D10131K27498l11043l24399P4730K98877O5164j77253j74967l0518O7291J45430
96B70941N6145k22756l00555J17770M44536Q2157m77179l12697L48814M82000
$$ plain form
106 489176 392063 -70777 -189052 131924 359128 256945 88428 24412 5045 77414 243251
117 243251 223311 -72729 -221362 35543 250552 12987 -303825 -180467 148248 95432
127 95432 -255886 -309797 10323 159099 -71932 -264052 -146595 36192 69952 27054 -53897
138 -53897 -169286 -133939 129963 270821 1776 -324243 -186220 251474 323668 -86366
148 -86366 -351557 -96097 246876 188235 -99628 -191769 -62818 58890 85342 28386 -95071
159 -95071 -161391 -45805 115420 54447 -180426 -229839 1892 141050 -66530 -290911 -152104
170 -152104 114741 64318 -198467 -239855 -18965 115192 21875 -112871 -127453 -33825 88291
181 88291 141899 42871 -127185 -122093 131029 292053 73345 -232146 -146698 207893 277399
$$ packed form
106D89176r7113m62840j18275L20976K27204j02183j68517o4016j9367P2369J65837
117B43251j9940k96040j48633K56905K15009k37565l16812J23358L28715n2816
127I5432l51318n3911L20120J48776k31031j92120J17457J82787L3760m2898q0951
138e3897j15389L5347K63902J40858k69045l26019J38023M37694P2194m10034
148h6366k65191K55460L42973n8641k87863r2141J28951J21708K6452n6956j23457
159i5071o6320J15586J61225o0973k34873m9413K31731J39158k07580k24381J38807
170a52104K66845n0423k62785m1388K20890J34157r3317j34746j4582R3628J22116
181H8291N3608r9028j70056N092K53122J61024k18708l05491Q5448L54591O9506
$$ plain form
192 277399 -22784 -225409 -76365 143834 138447 -19075 -108286 -63535 37907 114257 89069
203 89069 -36050 -102102 38698 217389 143863 -89662 -88080 162354 250542 34100 -135914
214 -135914 -8944 186730 152572 -43397 -128752 -23988 96890 87778 -19218 -116593 -106109
225 -106109 34511 156856 67767 -139646 -139739 111837 263252 100256 -116856 -59791 186196
236 186196 271392 99783 -61100 1085 156373 187368 79909 -24011 -40347 35265 120513
247 120513 78915 -80484 -143729 -235 130262 33779 -155288 -145593 56666 149186 3347
258 3347 -145084 -66420 112119 140242 21359 -66367 -31085 76326 146127 85196 -60733
269 -60733 -101714 40681 165527 74977 -124001 -154089 25542 146564 23473 -164710 -146175
$$ packed form
192B77399l00183k02625J49044K20199n387j57522q9211M4751J01442P6350k5188
203H9069j25119o6052J40800J78691p3526k33525J582K50434Q8188k16442j70014
214a35914J26970J95674l4158j95969q5355J04764J20878r112j06996r7375J0484
225a06109J40620J22345q9089k07413r3K51576J51415j62996k17112N7065K45987
236A86196Q5196j71609j60883O2185J55288L0995j07459j03920j6336P5612Q5248
247A20513m1598j59399o3245J43494J30497r6483j89067R695K02259R2520j45839
258C347j48431P8664J78539K8123j18883q7726L5282J07411O9801o0931j45929
269f0733m0981J42395J24846r0550j98978l0088J79631J21022j23091j88183J8535
$$ plain form
280 -146175 30017 104737 -1049 -118725 -105368 7534 90800 47339 -72853 -107283 5864
291 5864 116781 70295 -79217 -123188 7462 126629 45683 -125006 -136585 15096 92427
302 92427 -7808 -135433 -129634 -15338 59039 -1416 -118692 -137985 -28163 68821 27201
313 27201 -99485 -140892 -23623 102357 55739 -102782 -133671 7122 110201 37886 -94429
324 -94429 -109552 1049 88015 36530 -83064 -111546 -12502 77196 40637 -74496 -118943
335 -118943 -26162 87722 53951 -86949 -128330 -9267 95170 42491 -84519 -110846 -7958
346 -7958 89314 48297 -72970 -104297 -4924 88180 53994 -57112 -100109 -13992 91935 67375
358 67375 -57047 -103757 -4032 98256 62515 -54384 -95890 -6360 92614 64697 -54424
$$ packed form
280a46175J76192P4720j05786j17676J3357J12902Q3266m3461j20192l4430J13147
291E864J10917m6486j49512m3971J30650J19167q0946j70689j1579J51681P7331
302I2427j00235j27625N799J14296P4377o0455j17276j9293J09822R6984m1620
313B7201j26686m1407J17269J25980m6618j58521l0889J40793J03079p2315j32315
324i4429j5123J10601Q6966n1485j19594k8482R9044Q9698l6559j15133m4447
335a18943R2781J13884l3771j40900m1381J19063J04437n2679j27010k6327J02888
346g958R7272m1017j21267l1327R9373R3104l4186j11106m2997Q6117J05927k4560
358F7375j24422m6710R9725J02288l5741j16899m1506Q9530R8974k7917j19121
$$ plain form
369 -54424 -94447 -1717 87539 57784 -44479 -87650 -11974 84328 68868 -42203 -90042 -7015
381 -7015 89370 69047 -35564 -83840 -9652 90306 75016 -35291 -80882 1874 90532 70827
393 70827 -23223 -67742 -3641 88495 84334 -14399 -66567 581 91305 79493 -12629 -66985
405 -66985 -4494 89896 80468 -25203 -74419 -3074 79023 62955 -24594 -69694 -13648 73086
417 73086 74144 -16384 -69360 -6858 82472 85021 1130 -55547 -1020 97396 99584 3127 -51640
430 -51640 10957 92158 82757 -70 -49747 -8114 64150 67709 -10056 -66397 -26143 48796
442 48796 58010 -12453 -72358 -32649 58659 72588 -10488 -62256 -1661 79908 73798 4939
454 4939 -32989 9735 77816 81267 14542 -34618 -3889 58783 71854 9191 -56888 -39231
$$ packed form
369e4424m0023R2730Q9256k9755j02263m3171P5676R6302j5460j11071m7839Q3027
381g015R6385k0323j04611m8276P4188R9958j5290j10307m5591Q2756Q8658j9705
393G0827r4050m4519O4101R2136m161r8733n2168O7148R0724j1812r2122n4356
405f6985O2491R4390r428j05671m9216P1345Q2097j6068q7549m5100N6046Q6734
417G3086J058r0528n2976O2502Q9330K549q3891n6677N4527R8416K188r6457n4767
430e1640O2597Q1201r401q2827m9677M1633P2264L559p7765n6341M0254P4939
442D8796R214p0463n9905L9709R1308J3929q3076n1768O0595Q1569o110o8859
454D939l7928M2724O8081L451o6725m9160L0729O2672J3071o2663o6079J7657
$$ plain form
466 -39231 45288 67734 -15554 -81732 -34946 47098 51749 -16196 -58262 -18880 50582 60575
478 60575 9072 -28138 -4011 49178 67609 29973 -28492 -24260 43435 71823 1772 -67555
490 -67555 -38664 33668 35818 -37617 -86874 -48972 16236 14797 -47837 -77217 -41978 6552
502 6552 20993 -9378 -52417 -48310 17984 63972 16308 -56741 -43440 38824 70435 5229
514 5229 -63941 -38529 33935 38287 -24913 -58448 -32857 -4489 -2194 -17886 -44254 -59712 -30939
527 -30939 8866 -7726 -64058 -70209 -10944 26364 -25845 -88484 -61566 15010 16214 -61165
539 -61165 -89930 -38327 411 -16636 -48982 -62347 -57229 -27065 6064 -6239 -61265 -77454
551 -77454 -14716 48398 16350 -69456 -68828 19785 57643 -8016 -61166 -28407 15152 7322 -19376
$$ packed form
466c9231Q4519K2446q3288o6178M6786Q2044M651o7945m2066L9382O9462R993
478F0575n1503l7210K4127N3189J8431l7636n8465M232O7695K8388p0051o9327
490f7555K8891P2332K150p3435m9257L7902O5208j439o2634k9380L5239M8530
502F552J4441l0371m3039M107O6294M5988m7664p3049J3301Q2264L1611o5206
514E229o9170K5412P2464M352o3200l3535K5591K8368K295j5692k6368j5458K8773
527c0939L9805j6592n6332o151N9265L7308n2209o2639K6918P6576J204p7379
539f1165k8765N1603L8738j7047l2346j3365N118L0164L3129j2303n5026j6189
551g7454O2738O3114l2048q5806O28Q8613L7858o5659n3150L2759M3559p830k6698
$$ plain form
564 -19376 -30250 -31638 -30254 -19002 -9475 -27822 -55015 -42136 2898 3554 -52260 -64956 3135
577 3135 43092 -19910 -76473 -28044 42623 23545 -44920 -57773 -18685 4884 -11561 -32101
589 -32101 -46224 -64364 -56509 -4887 8924 -64593 -112748 -39747 47950 13807 -70212 -54678
601 -54678 30500 56871 14625 -277 31817 47288 31520 36980 58652 40998 1176 14154
613 14154 48395 20185 -39188 -28038 19856 -8503 -80660 -77955 -9104 2422 -69830 -106491
625 -106491 -47964 13521 -9204 -53756 -40916 -4196 2085 11667 36720 19892 -30337 -14636
637 -14636 64058 75850 -12269 -65565 -7446 58443 20357 -58921 -57550 -6754 -7724 -47037 -38949
650 -38949 -9501 -30750 -56633 -17653 24832 -2776 -37529 -3262 43993 18981 -21074 8688
$$ packed form
564a9376j0874j388J384J1252R527j8347k7193J2879M5034O56n5814j2696O8091
577C135L9957o3002n6563M8429P0667j9078o8465j2853L9088K3569j6445k0540
589c2101j4123j8140P855N1622J3811p3517m8155P3001Q7697l4143q4019J5534
601e4678Q5178K6371m2246j4902L2094J5471j5768N460K1672j7654l9822J2978
613A4154L4241k8210n9373J1150M7894k8359p2157K705O8851J1526p2252l6661
625a06491N8527O1485k2725m4552J2840L6720O281R582K5053j6828n0229J5701
637a4636P8694J1792q8119n3296N8119O5889l8086p9278J371N0796r70l9313Q088
650c8949K9448k1249k5883L8980M2485k7608l4753L4267M7255k5012m0055K9762
$$ plain form
662 8688 59962 26503 -48214 -32047 43941 34489 -58744 -87419 -30843 -12160 -57823 -78502
674 -78502 -64402 -78241 -98505 -62754 -17810 -51118 -117670 -94756 2587 26566 -49236 -84215
686 -84215 -16110 37178 4176 -24846 5315 19223 -14331 -19083 20798 27681 -26065 -55291
698 -55291 -15882 12437 -25895 -63561 -34989 -8234 -50315 -81272 -30343 12004 -43528 -102111
710 -102111 -57757 12321 -4652 -67943 -71177 -26901 -19955 -43624 -35217 -18899 -50436 -83233
722 -83233 -38087 21412 -18210 -98361 -77047 7589 13469 -48682 -61126 -13851 1085 -28884
734 -28884 -24248 15306 9724 -36642 -32769 27763 37918 -19431 -36370 11721 24985 -16069 -21021
747 -21021 21856 15813 -36203 -37823 23208 45475 -10553 -51613 -10661 39925 20952 -17886
$$ packed form
662H688N1274l3459p4717J6167P5988r452r3233k8675N6576J8683m5663k0679
674g8502J4100j3839k0264L5751M4944l3308o6552K2914R7343K3979p5802l4979
686h4215O8105N3288l3002k9022L0161J3908l3554m752L9881O883n3746k9226
698e5291L9409K8319l8332l7666K8572K6755m2081l0957N0929M2347n5532n8583
710a02111M4354P0078j6973o3291l234M4276O946k3669Q407J6318l1537l2797
722h3233M5146N9499l9622q0151K1314Q4636N880o2151j2444M7275J4936k9969
734b8884M636L9554n582m6366L873O0532J0155n7349j6939M8091J3264m1054m952
747b1021M2877o043n2016j620O1031K2267n6028m1060M0952N0586j8973l8838
$$ plain form
759 -17886 -9332 11579 -6304 -12559 20456 27448 -26797 -54598 -3481 41313 4194 -55539 -39775
772 -39775 15371 17710 -23428 -19883 17947 13576 -15354 11052 61122 45720 -1501 16385 71985
785 71985 72680 31823 32321 65319 58044 22923 30639 67447 50935 -10663 -17408 40199 49372 -10570
799 -10570 -37918 -2025 17458 -6889 -13410 8864 7577 -16973 -5902 40700 49139 4936 -13754
812 -13754 34167 72465 42369 3366 26083 51538 32556 10171 30389 41306 7318 -16055
824 -16055 10994 35285 10692 -24126 -9625 23289 15651 -8461 7402 34080 18794 -4988
836 -4988 22946 62160 41832 3651 12587 52692 53766 20177 10793 24803 26493 5083 3383
849 3383 19135 5001 -31389 -28599 10601 8889 -33397 -44383 -6661 8827 -15028 -23443 -2480
$$ packed form
759a7886Q554K0911j7883o255L3015O992n4245k7801N1117M4794l7119n9733J5764
772c9775N5146K339m1138L545L7830m371k8930K6406N0070j5402m7221J7886N5600
785G1985O95m0857M98L2998p275l5121P716L6808j6512o1598o745N7607R173n9942
799a0570k7348L5893J9483k4347o521K2274j287k4550J1071M6602Q439m4203j8690
812a3754M7921L8298l0096l9003K2717K5455j8982k2385K0218J0917l3988k3373
824a6055K7049K4291k4593l4818J4501L2914p638k4112J5863K6678j5286k3782
836d988K7934L9214k0328l8181Q936M0105J074l3589r384J4010J690k1410j700
849C383J5752j4134l6390K790L9200j712m2286j0986L7722J5488k3855q415K0963
$$ plain form
862 -2480 10853 -4864 -6045 19933 32714 5641 -7204 21787 40467 15640 -3580 14047
874 14047 26407 4109 -7144 10423 16058 -10203 -24410 -5647 13307 -4178 -28360 -19590
886 -19590 4065 600 -18909 -9936 6325 -6510 -16700 1116 18071 348 -19640 -5504
898 -5504 16282 11400 -10587 -11008 3765 7935 -7118 -10402 5213 2976 -18107 -14747 7690 7271
912 7271 -14011 -14656 2299 6710 -7165 -9976 1814 5132 -6304 -9658 6725 12645 -7125 -15874
926 -15874 3647 15497 -484 -12200 194 9269 -1347 -6103 3872 6473 -4199 -9318 2664
939 2664 10843 -66 -13309 -4988 8310 482 -11457 -4297 6009 -3805 -13826 -2758 6099
952 6099 -1100 -9212 -4565 5579 5661 -2852 -3424 6126 7971 -862 624 11325 8046 -4396 477
$$ packed form
862b480J3333j5717j181K5978J2781k7073j2845K8991J8680k4827j9220J7627
874A4047J2360k2298j1253J7567N635k6261j4207J8763J8954j7485k4182Q770
886a9590K3655l465j9509Q973J6261j2835j0190J7816J6955j7723j9988J4136
898e504K1786m882k1987m21J4773M170j5053l284J5615k237k1083L360K2437m19
912G271k1282o45J6955M411j3875k811J1790L318j1436l354J6383N920j9770q749
926a5874J9521J1850j5981j1716J2394R075j0616m756R975K601j0672n119J1982
939B664Q179j0909j3243Q321J3298p828j1939P160J0306r814j0021J1068Q857
952F099p199q112M647J0144Q2q513n72R550J845q833J486J0701l279j2442M873
$$ plain form
967 477 12264 9027 -2201 -2020 4393 6147 -1159 -4278 -1079 2649 -2933 -7817 -375 3617 -6080
982 -6080 -8629 1934 6596 -1639 -4466 3489 6163 161 718 5763 7941 4126 -471 4346 9918
997 9918 5249 -2659 1783 9990 3858 -2592 2546 6028 540 -4072 427 2281 -1600 -4729 -2779
1012 -2779 1401 114 -7568 -7228 1056 1276 -6045 -4063 2605 1085 -4837 -1640 4584 1828 -504
1027 -504 613 4254 4757 1710 -357 2690 5992 1326 -3828 1185 3054 -4437 -7481 -1354 -1187 -8224
1043 -8224 -6532 -2976 -4346 -5620 -6389 -4742 400 -1142 -5013 -1617 4644 3341 -1123 3210 8975
1058 8975 4153 1173 6429 5564 1508 -525 1503 2257 -199 -4238 -4546 -881 -3480 -8842 -8164 -2170
1074 -2170 -1440 -9561 -5730 1107 -1646 -3971 -837 3133 901 -120 1881 2727 3851 -165 -1779
$$ packed form
967D77J1787l237j1228J81O413J754p306l119L199L728n582m884P442L992r697
982f080k549J0563M662q235k827P955K674o002N57N045K178l815m597M817N572
997I918m669p908M442Q207o132o450N138L482n488m612M499J854l881l129J950
1012b779M180j287p682L40Q284K20p321J982O668j520n922L197O224k756k332
1027e04J117L641N03l047k067L047L302m666n154N013J869p491l044O127J67p037
1043h224J692L556j370j274p69J647N142j542l871L396O261j303m464M333N765
1058H975m822k980N256q65m056k033K028P54k456m039l08L665k599n362O78N994
1074b170P30q121L831O837k753k325L134L970k232j021K001Q46J124m016j614
$$ plain form
1089 -1779 1892 2987 -4263 -5559 -789 -2715 -7537 -8318 -3785 -4361 -7835 -5054 -1312 -1566 -3457 -2958
1105 -2958 -350 4250 2757 -958 3513 7992 1144 -1478 4305 7103 451 -4258 1271 3829 -1579
1120 -1579 -5265 -4850 -1096 -982 -4796 -4267 838 -1658 -6833 -2245 5404 61 -5705 541 8303 1395
1136 1395 -3722 -1817 1864 -193 -3858 -3331 1031 427 -5080 -5383 4514 4616 -5208 -1642 7886 9180
1152 9180 3014 5778 13631 12937 8217 10555 17526 17705 8119 3690 8888 14855 4757 -5025 -2
1167 -2 1778 -6458 -10237 -3472 -4043 -13468 -13839 -3467 1357 -5643 -9550 -1019 10941 9558 2241 8988
1183 8988 19649 15153 6427 14984 23774 14621 5116 11130 16686 8747 -347 1112 6871 1561 -4922
1198 -4922 -1810 8258 4408 -8445 -3060 16617 16455 2252 3655 20515 22687 14463 16775 22862
$$ packed form
1089a779L671J095p250j296M770j926m822p81M533n76l474K781L742k54j891M99
1105b958K608M600j493l715M471M479o848k622N783K798o652m709N529K558n408
1120a579l686M15L754J14l814N29N105k496n175M588P649n343n766O246P762o908
1136A395n117J905L681k057l665N27M362o04n507l03R897J02r824L566R528J294
1152I180o166K764P853o94m720K338O971J79r586m429N198N967j0098r782N023
1167bJ780q236l779O765n71r425l71J0372M824p000l907Q531J1960j383p317O747
1183H988J0661m496q726Q557Q790r153r505O014N556p939r094J459N759n310o483
1198d922L112J0068l850j2853N385J9677j62j4203J403J6860K172q224K312O087
$$ plain form
1212 22862 20200 13125 13689 20213 15381 -1270 -7910 6512 6635 -12156 -20702 -8520 -5152 -17612
1226 -17612 -20437 -7720 -4086 -12903 -11767 2449 11404 6239 2149 11490 25047 21614 14194 23893
1240 23893 30661 19034 10352 23545 30132 13286 -3088 6567 17927 8379 -8218 -9289 417
1253 417 -641 -11158 -7107 2015 -4645 -15821 -4261 14311 5631 -11506 -4857 14665 12416 -1785
1267 -1785 -295 9669 8043 -4105 -3471 11037 7281 -10203 -13953 4402 6985 -9416 -12332 1083
1281 1083 2432 -5743 -2292 11605 8874 -4145 -2780 17050 25294 7693 -4525 7631 22572
1294 22572 13727 55 6012 10695 1183 -3876 8516 10931 -6815 -15603 -3474 10093 -609
1307 -609 -17885 -13296 2586 -197 -13898 -9348 4226 -5380 -21004 -10364 8288 -1839 -20098
$$ packed form
1212B2862k662p075N64O524m832j6651o640J4422J23j8791q546J2182L368j2460
1226a7612k825J2717L634q817J136J4216Q955n165m090R341J3557l433p420R699
1240B3893O768j1627q682J3193O587j6846j6374R655J1360r548j6597j071R706
1253D17j058j0517M051R122o660j1176J1560J8572q680j7137O649J9522k249j4201
1267a785J490R964j626j2148O34J4508l756j7484l750J8355K583j6401k916J3415
1281A083J349q175L451J3897k731j3019J365J9830Q244j7601j2218J2156J4941
1294B2572q845j3672N957M683r512n059J2392K415j7746q788J2129J3567j0702
1307f09j7276M589J5882k783j3701M550J3574r606j5624J0640J8652j0127j8259
$$ plain form
1320 -20098 -14469 2427 2226 -10481 -8968 4527 1111 -9651 -1288 19171 13683 -7341 -4040
1333 -4040 22836 27143 5061 -304 13826 18773 8612 7231 13221 7960 -8101 -6714 7827
1346 7827 6952 -15698 -26388 -8661 3891 -13550 -25314 -12483 -3089 -14272 -18144 -1004 5040
1359 5040 -6620 -13985 1099 15389 7916 -5182 482 13828 6225 -5428 3974 11700 -4028
1372 -4028 -19400 -2724 13658 -124 -22815 -17366 2799 5271 -8427 -10317 1389 5304 -3196
1385 -3196 4180 18999 12697 -6036 1371 25648 21876 -1849 -7353 11590 13057 -5511 -9914
1398 -9914 -1588 -2111 -20199 -22760 -8294 -6307 -24737 -31714 -13456 -4601 -15363 -20804 -4705 721
1412 721 -9512 -6192 12397 18185 1682 -5389 10744 27601 15940 -2405 2531 15578 10934
$$ packed form
1320b0098N629J6896k01j2707J513J3495l416j0762Q363K0459n488k1024L301
1333d040K6876M307k2082n365J4130M947j0161j381N990n261j6061J387J4541
1346G827q75k2650j0690J7727J2552j7441j1764J2831R394j1183l872J7140O044
1359E040j1660p365J5084J4290p473j3098N664J3346p603j1653R402P726j5728
1372d028j5372J6676J6382j3782k2691N449K0165K472j3698j890J1706L915q500
1385c196P376J4819o302j8733P407K4277l772k3725n504J8943J467j8568m403
1398i914Q326n23j8088k561J4466J987j8430o977J8258Q855j0762n441J6099N426
1412G21j0233L320J8589N788j6503p071J6133J6857j1661j8345M936J3047m644
$$ plain form
1425 10934 -1653 2609 6263 -6352 -15094 -2725 6964 -8524 -21858 -13932 2964 1069 -14739
1438 -14739 -14068 2157 3083 -9915 -5711 9366 6070 -11986 -6974 10253 7290 -9328 -10470 548
1452 548 276 -9887 -10798 -1078 -2812 -18205 -17658 1839 4785 -13864 -21286 -1890 8288 -4102
1466 -4102 -10738 286 7118 -1209 -1254 9789 10908 -1409 -6948 7539 16348 1978 -10872 -624
1480 -624 10498 -664 -11315 -3834 3815 -6620 -13804 -4521 2736 -5700 -15965 -11569 -814 -1749
1494 -1749 -11179 -9541 -943 -2685 -12709 -6050 5461 -1787 -13759 -8888 7038 5988 -8041 -9706
1508 -9706 2021 6096 -1484 -4563 2043 5345 -4081 -4331 7963 6669 -8940 -8886 5772 7360 -7122
1523 -7122 -10450 -956 1207 -7088 -9167 -3204 1811 -6348 -12019 -2937 5902 -2379 -11080 -2011 5099
$$ packed form
1425A0934j2587M262L654j2615q742J2369R689j5488j3334P926J6896j895j5808
1438a4739O71J6225R26j2998M204J5077l296j8056N012J7227k963j6618j142J1018
1452E48k72j0163r11R720j734j5393N47J9497K946j8649p422J9396J0178j2390
1466d102o636J1024O832q327m5J1043J119j2317n539J4487Q809j4370j2850J0248
1480f24J1122j1162j0651P481P649j0435p184R283P257q436j0265M396J0755r35
1494a749r430J638Q598j742j0024O659J1511p248j1972M871J5926j050j4029j665
1508i706J1727M075p580l079O606L302r426k50J2294j294j5609N4J4658J588j4482
1523g122l328R494K163q295k079N963N015q159n671R082Q839q281q701R069P110
$$ plain form
1538 5099 -739 -4340 1788 6399 -2606 -5515 4165 8592 715 -8461 -3741 6075 4518 -7498 -7321
1553 -7321 2414 -1222 -6983 -3024 2965 -2452 -7080 312 6218 2902 -4210 -660 5721 7109 1187
1568 1187 -1168 5926 8876 410 -1477 6887 8418 -122 -3157 2848 4081 -2012 -3721 -960 1253
1583 1253 -2848 -4177 1213 2295 -2815 -6565 2294 9184 -190 -4903 2373 8494 3790 129 4045
1598 4045 5381 4607 2875 5032 7003 2862 -1677 1746 6111 2518 -4603 -843 5678 1000 -4843
1613 -4843 -1078 3246 546 -2890 -639 1196 1760 4 89 3193 3641 1019 991 5819 4345 2
1629 2 915 7517 6011 358 -382 4342 5529 1966 -1282 947 2660 1110 -2074 -1272 670 -1356
1645 -1356 -3594 -1392 1376 -2990 -4463 897 2650 -1223 -2100 95 3555 1977 337 204 4004
$$ packed form
1538E099n838l601O128M611r005k909R680M427p877r176M720R816j557j2016J77
1553g321R735l636n761L959N989n417m628P392N906l316p112L550O381J388n922
1568A187k355P094K950q466j887Q364J531q540l035O005J233o093j709K761K213
1583A253m101j329N390J082n110l750Q859O890r374m713P276O121m704l661L916
1598D045J336p74j732K157J971m141m539L423M365l593p121L760O521m678n843
1613d843L765M324k700l436K251J835N64j756Q5L104M48k622k8M828j474m343
1629BR13O602j506n653p40M724J187l563l248K229J713j550l184Q02J942k026
1645a356k238K202K768m366j473N360J753l873q77K195L460j578j640j33L800
$$ plain form
1660 4004 3491 -884 -418 3827 1885 -2194 -410 1627 -1955 -4129 -1372 -1167 -3718 -5608 -3711 -3812
1676 -3812 -744 -3914 -4144 -1143 1276 -1885 -2978 1632 1794 -740 -993 1762 38 -1201 -1107 444
1692 444 -238 -2204 -2787 -2910 -749 -2185 -5691 -2806 -670 -2902 -5297 -1437 -532 -2370 -2784 58
1708 58 -194 -1095 -1103 162 519 -513 -3204 -1067 1285 -952 -6130 -3330 -421 -3999 -5734 -4538 -1780
1725 -1780 -4603 -5756 -3579 -2361 -3101 -3105 -2499 -1713 -852 -3512 -3088 921 297 -3777 -3476 718 -143 -4708
1743 -4708 -4703 -2019 -3290 -4926 -4167 -3216 -3887 -5812 -5837 -2241 -1455 -4319 -4412 620 1514 -1732 -1122 2209
1761 2209 1156 -301 -1553 -524 -271 -2315 -4331 -4237 -2334 -5713 -8255 -8840 -5896 -7206 -9963 -7412
1777 -7412 -5075 -7461 -8181 -3947 -2176 -2122 -2819 135 3805 3915 1489 3960 4560 5213 758 531 4750
$$ packed form
1660D004n13m375M66M245j942m079J784K037l582k174K757K05k551j890J897j01
1676c812L068l170k30L001K419l161j093M610J62k534k53K755j724j239R4J551
1692D44o82j966n83j23K161j436l506K885K136k232k395L860R05j838m14K842
1708E8k52r01qJ265L57j032k691K137K352k237n178K800K909l578j735J196K758
1725a780k823j153K177J218p40mO06P86Q61k660M24M009o24m074L01M194q61m565
1743d708NK684j271j636P59R51o71j925k5L596P86k864r3N032Q94l246O10L331
1761B209j053j457j252J029K53k044k016R4J903l379k542n85K944j310k757K551
1777g412K337k386p20M234J771N4o97K954L670J10k426K471O00O53m455k27M219
$$ plain form
1794 4750 1120 -3581 -2919 -666 -2860 -7645 -6812 -4855 -5909 -9242 -8841 -6555 -5802 -6880 -6349 -1720
1810 -1720 -349 -4824 -4957 2234 2869 -1888 -2615 1350 1399 -1114 -3691 -1847 -1673 -4683 -7262 -4092
1826 -4092 -1464 -5379 -8588 -3804 -938 -4226 -5883 -861 2016 -467 -2368 3090 6165 4271 2571
1841 2571 3665 7504 4980 2034 1829 5046 2583 -2070 -1249 1941 -3807 -8190 -4913 -66 -4137
1856 -4137 -9362 -7879 -3779 -3548 -6824 -6815 -1973 -722 -5054 -2906 2780 2082 -4996 -2586 4736 3529
1872 3529 -1416 -1578 3000 2710 -1618 441 4024 3643 -1125 -1965 4508 6999 458 -1789 3569 6925
1888 6925 1898 -1044 3186 4743 -943 -2450 1923 2293 -2558 -7586 -3928 886 -3308 -8596 -5490
1903 -5490 -1215 -4881 -7644 -3229 1161 -3523 -6258 -869 3950 2300 -2141 -827 4657 5463 -636
$$ packed form
1794D750l630m701O62K253k194m785Q33J957j054l333M01K286P53j078N31M629
1810a720J371m475j33P191O35m757p27L965M9k513k577J844J74l010k579L170
1826d092K628l915l209M784K866l288j657N022K877k483j901N458L075j894j700
1841B571J094L839k524k946k05L217k463m653Q21L190n748m383L277M847m071
1856d137n225J483M100K31l276RM842J251m332K148N686o98p078K410P322j207
1872C529m945j62M578k90m328K059L583l81m768q40O473K491o541k247N358L356
1888F925n027k942M230J557n686j507M373L70m851n028L658M814m194n288L106
1903e490M275l666k763M415M390m684k735N389M819j650m441J314N484Q06o099
$$ plain form
1918 -636 -942 3927 3180 -2904 -1426 3936 1633 -6407 -2358 3299 2275 -4529 -3288 2846 3219 109
1934 109 -54 6211 6068 1067 329 8262 9877 1797 -1750 3843 5397 -1579 -3488 -1217 -1681 -8759
1950 -8759 -8977 -4269 -3374 -9638 -12948 -7040 -347 -3614 -9966 -3803 1510 1284 -1147 4384 9040 4843
1966 4843 3061 9279 13525 9354 2975 6560 10766 8914 853 1574 5020 2651 -5218 -1836 4182
1981 4182 -814 -8302 -5436 1563 855 -3432 -2854 1506 2797 953 -143 7488 6368 257 195 9113
1997 9113 10318 -270 -4167 5301 6820 -1008 -2355 -519 97 -4860 -3743 -354 2181 -3991 -5427
2012 -5427 3012 7852 1500 -2427 5584 10818 6653 3041 10568 12313 7303 4176 9255 11404 7680
2027 7680 861 1866 6780 4784 -2017 126 2842 -864 -6877 -1674 4343 -2074 -8968 -4146 4612
$$ packed form
1918f36l06M869p47o084J478N362k303q040M049N657j024o804J241O134L73l110
1934A09j63O265j43n001p38P933J615q080l547N593J554o976j909K271m64p078
1950h759k18M708Q95o264l310N908O693l267o352O163N313k26k431N531M656m197
1966D843j782O218M246m171o379L585M206j852q061P21L446k369p869L382O018
1981D182m996p488K866O999p08m287N78M360J291j844j096P631j120o111o2Q918
1997I113J205j0588l897R468J519p828j347J836O16m957J117L389K535o172j436
2012e427Q439M840o352l927Q011N234m165l612P527J745n010l127N079K149l724
2027G680o819J005M914j996o801K143K716l706o013N203O017o417o894M822Q758
$$ plain form
2042 4612 3284 -4419 -4474 2805 4962 610 -744 4289 4135 -776 1324 7545 6989 -2235 23 7563
2058 7563 7012 1583 -273 4852 6356 41 -1319 4442 7742 2060 -2597 2461 7328 1306 -2396
2073 -2396 2017 3195 395 -1214 2411 3369 -3945 -5097 2375 5575 -995 -7962 -1986 4931 2462
2088 2462 -5272 -2112 3600 400 -2339 986 3553 -341 -4586 -246 3593 14 -4389 -2113 2885
2103 2885 3166 -4089 -2839 4503 3562 -4171 -2665 4313 4830 23 -781 3720 6516 3014 1944 5043
2119 5043 3720 -101 443 6113 6145 -3136 -5794 3555 6779 -2850 -7730 -2260 2123 -1692 -5442 -3340
2135 -3340 -1222 -3010 -2653 1194 3604 -195 -1750 4093 7230 3007 -884 5752 8500 3611 -1040
2150 -1040 3269 7303 4335 -2159 -1366 3222 4545 726 -2089 610 -319 -2189 1374 2329 -639 -4024
$$ packed form
2042D612j328p703n5P279K157m352j354N033j54m911K100O221n56r224K258P540
2058G563n51n429j856N125J504o315j360N761L300n682m657N058M867o022l702
2073b396M413J178k800j609L625R58p314j152P472L200o570o967N976O917k469
2088B462p734L160N712l200k739L325K567l894m245M340L839l579m403K276M998
2103B885K81p255J250P342r41p733J506O978N17m807q04M501K796l502j070L099
2119E043j323l821N44N670L2r281k658R349L224r629m880N470M383l815l750K102
2135c340K118j788L57L847K410l799j555N843L137m223l891O636K748m889m651
2150a040M309M034k968o494P93M588J323l819k815K699r29j870L563R55k968l385
$$ plain form
2166 -4024 755 7066 4108 -2795 -1631 5625 7303 2280 -1299 1802 5485 4808 696 2611 3411
2181 3411 -402 174 4179 1637 -2934 -2362 2653 2006 -3822 -3480 -105 5200 -694 -4952 -693 5180
2197 5180 3706 -1636 760 3208 3659 2369 3818 2421 -122 1544 4774 4794 453 -3997 776 6364
2213 6364 1492 -5771 -5000 1572 4240 -1558 -5610 -1041 359 134 579 -1004 -1688 -929 1641 3252
2229 3252 -240 -2896 -26 4150 4345 -3455 -3102 3829 5181 -163 -3949 -2430 2743 2087 -1341 -2888
2245 -2888 -1882 -1928 350 821 -2155 -4250 -3525 2904 2896 -2540 -6326 -260 5905 1959 -3401 -3115 2526
2262 2526 4331 1612 -734 -917 2448 2893 1406 -36 -963 -1570 2360 3571 -1832 -6791 -1186 5377
2278 5377 1666 -4316 -3970 960 3900 905 -1755 -2471 2131 4172 1391 438 -1061 -166 4004 3994
$$ packed form
2166d024M779O311k958o903J164P256J678n023l579L101L683o77m112J915Q00
2181C411l813N76M005k542m571N72N015o47n828L42L375N305n894m258M259N873
2197E180j474n342K396K448M51j290J449j397k543J666L230K0m341m450M773N588
2213F364m872p263P71O572K668n798m052M569J400k25M45j583o84P59K570J611
2229C252l492k656K870M176J95p800L53O931J352n344l786J519N173o56l428j547
2245b888J006m6K278M71k976k095P25O429qn436l786O066O165l946n360K86N641
2262B526J805k719k346j83L365M45j487j442r27o07L930J211n403m959N605O563
2278E377l711n982L46M930K940k995k660p16M602K041k781r53j499Q95M170j0
$$ plain form
2294 3994 -954 -3655 -417 5360 3197 -3393 -4988 177 4002 2794 -2763 -3855 1656 3319 1256
2309 1256 -1494 -1829 -201 2404 4648 580 -2599 -266 4837 5051 174 -3494 314 4807 4151 -2999
2325 -2999 -4983 1021 3747 1324 -2938 -3174 -207 3739 4128 -344 -3457 -824 5189 4628 -211 -2416
2341 -2416 -77 5277 5525 -1378 -4698 393 4488 2904 -2423 -3281 -396 3140 2478 -1958 -3812 -2042
2357 -2042 4095 3543 -101 -2549 -1883 4659 5468 -340 -4597 183 6298 4427 -1659 -2977 -228 3888
2373 3888 3174 -1435 -5138 -2410 1933 2419 -1628 -4906 -2879 2893 5569 340 -5180 -790 6720
2388 6720 6146 -669 -2289 706 5597 5830 143 -2974 1624 3539 2574 -26 -3657 -2126 2462 4201
2404 4201 -902 -6126 -3712 4312 4646 -1440 -3356 -1104 5303 6045 439 -3474 1304 5966 6352 3756
$$ packed form
2294C994m948k701L238N777k163o590j595N165L825j208n557j092N511J663k063
2309A256k750l35J628K605K244m068l179K333N103K14m877l668L808M493o56p150
2325b999j984O004K726k423m262k36K967L946L89m472l113K633O013n61m839k205
2341b416K339N354K48o903l320N091M095j584n327q58K885L536o62m436j854J770
2357b042O137n52l644k448O66O542Q09n808m257M780O115j871o086j318K749M116
2373C888p14m609l703K728M343M86m047l278K027N772K676n229n520M390P510
2388F720n74o815j620K995M891K33n687l117M598J915r65k600l631J531M588J739
2404D201n103n224K414Q024L34o086j916K252O407P42n606l913M778M662L86k596
$$ plain form
2420 3756 1302 1005 4390 9012 4089 -2714 -1091 6347 7957 2348 -3688 294 7019 7650 1383
2435 1383 -2897 1533 7742 7386 2869 132 652 5670 9078 5295 -1637 -976 6479 8652 2378 -3613
2451 -3613 -2225 4510 7973 -2 -4964 -1438 3935 4536 582 -2358 -1317 3144 6926 3971 -1672
2466 -1672 -1644 6261 10116 4568 -1204 -15 7111 10539 3222 -3778 -34 6668 5827 924 -1791 -1395
2482 -1395 4184 6660 2837 -2715 -2283 4021 7334 5093 -3741 -3767 3462 7792 1331 -5689 -3942 4366
2498 4366 5501 -1900 -6085 -4976 -1185 1198 -1074 -6986 -6421 -914 2262 1031 -5016 -5801 1549
2513 1549 8631 3511 -4807 -2337 6311 7696 2112 -2857 -1144 4420 6054 1224 -4738 -4354 -286
2528 -286 2823 -45 -7255 -10439 -2664 2545 -278 -10008 -10108 323 3167 -667 -7730 -6313 942
$$ packed form
2420C756k454k97L385M622m923o803J623P438J610n609o036L982O725O31o267
2435A383m280M430O209l56m517k737N20N018L408l783o932O61P455K173o274n991
2451c613J388O735L463p975m962L526N373O01l954k940J041M461L782k955n643
2466a672K8P905L855n548n772J189P126L428p317p000L744O702q41m903k715L96
2482a395N579K476l823n552M32O304L313k241q834k6P229M330o461p020J747Q308
2498D366J135p401m185J109L791K383k272n912N65N507L176j231o047p85P350
2513A549P082n120q318K470Q648J385n584m969J713N564J634m830n962L84M068
2528b86L109k868p210l184P775N209k823r730j00J0431K844l834p063J417P255
$$ plain form
2543 942 3712 -1934 -5312 -4214 -851 2295 615 -3703 -7117 -3030 3151 220 -8513 -9548 -1141
2558 -1141 4004 -1286 -7781 -7338 755 4679 -867 -6188 -3123 3073 6348 3567 -710 -2394 913
2573 913 7081 5412 -2881 -6417 -808 6459 2041 -7824 -8872 -2031 3035 -2108 -9747 -7174 -2813
2588 -2813 -1 -2150 -4688 -6990 -4212 2147 2502 -2848 -5722 -265 7685 6001 -3282 -6088 2013
2603 2013 8794 4178 -5214 -3715 2793 6092 912 -3131 -3789 46 5552 3821 -1422 -4422 -1157
2618 -1157 5983 6693 -2226 -5831 1020 7555 5342 -3969 -4474 1375 5142 1936 -2861 -4023 -747
2633 -747 2077 2388 -2057 -4585 -2784 3022 3336 -1473 -8636 -2035 7091 4945 -3758 -6450 1265 7044
2649 7044 4163 -2641 -3104 1742 6776 5116 477 -3596 -155 5438 6211 914 -6432 -2318 5707
$$ packed form
2543I42K770n646l378J098L363L146j680m318l414M087O181k931q733j035Q407
2558a141N145n290o495M43Q093L924n546n321L065O196L275k781m277j684L307
2573I13O168j669q293l536N609P267m418r865j048O841N066n143p639K573M361
2588b813K812k149k538k302K778O359L55n350k874N457P950j684r283k806Q101
2603B013O781m616r392J499O508L299n180m043o58L835N506j731n243l000L265
2618a157P140P10q919l605O851O535k213r311n05N849L767l206m797j162L276
2633g47K824L11m445k528J801N806L14m809p163O601R126k146q703k692P715N779
2649G044k881o804m63M846N034j660m639m073L441N593P73n297p346M114Q025
$$ plain form
2664 5707 7586 -3022 -6009 351 6581 3426 -3073 -5179 -793 3817 1815 -3420 -3909 -3033 -141
2679 -141 2475 -1950 -8086 -4296 2767 3550 -3104 -8402 -3030 5682 3631 -4309 -6761 939 6816
2694 6816 4478 -1319 -2687 142 3992 4380 588 -3530 -3755 3950 6949 1266 -7154 -4581 3390
2709 3390 3352 -3813 -8997 -2945 4232 1763 -3796 -5094 -1542 1700 2735 55 -2993 -2837 2349 5155
2725 5155 604 -5453 -3537 2548 4163 -2354 -9661 -2852 4494 1760 -5064 -6573 -2896 2224 2008
2740 2008 -2017 -6209 -3818 2389 5212 209 -4386 -3903 3144 7403 2530 -6423 -2823 6391 6908
2755 6908 -1378 -4796 -1271 3158 1681 -1583 -5199 -3812 -541 2224 -780 -5456 -6243 691 4402
2770 4402 -394 -7527 -4768 3623 4972 -530 -6021 -2419 5062 4375 -510 -2429 -540 2832 2520
$$ packed form
2664E707J879j0608k987O360O230l155o499k106M386M610k002n235m89Q76K892
2679a41K616m425o136L790P063P83o654n298N372Q712k051p940k452P700N877
2694F816k338n797j368K829L850L88l792m118k25P705K999n683q420K573P971
2709C390l8p165n184O052P177k469n559j298L552L242J035k680l048J56N186K806
2725E155m551o057J916O085J615o517p307O809P346k734o824j509L677N120k16
2740B008m025m192K391O207K823n003m595M83P047M259m873q953L600R214N17
2755F908q286l418L525M429j477l264l616J387L271K765l004m676p87O934L711
2770D402m796p133K759Q391J349n502n491L602P481o87m885j919J889L372l12
$$ plain form
2785 2520 1451 -3648 -4367 557 4303 1570 -5833 -5998 2053 3696 -738 -6813 -4199 2535 3535
2800 3535 -1651 -5659 -1678 1257 2417 635 -1944 -3177 535 4544 1819 -3815 -4921 1998 5638
2815 5638 -37 -5477 -3769 2864 3636 -1080 -5599 -3011 2607 3686 -947 -3068 -3011 5 3022 2071
2831 2071 -3383 -5101 1210 4709 2452 -3674 -4828 2042 5902 1044 -4739 -2333 3732 4265 434
2846 434 -3578 -1729 1559 2474 1116 -2940 -4731 -474 2838 1980 -4083 -5531 850 5782 729 -5363
2862 -5363 -2403 2495 4060 1262 -2848 -2229 1902 4244 1257 -2344 -3525 595 4047 2545 -2750
2877 -2750 -4911 -687 5238 2117 -4317 -4896 476 3981 -817 -4441 -2587 -665 3124 1396 -1388
2892 -1388 -2335 585 2753 1969 -1782 -4247 -569 3887 2194 -2936 -4491 1532 4184 1294 -3787
$$ packed form
2785B520j069n099p19M924L746k733p403j65Q051J643m434o075K614O734J000
2800C535n186m008L981K935J160j782k579j233L712M009k725n634j106O919L640
2815E638n675n440J708O633P72m716m519K588N618J079m633k121N7L016L017r51
2831B071n454j718O311L499k257o126j154O870L860m858n783K406O065N33l831
2846D34m012J849L288R15j358m056j791M257L312q58o063j448O381M932n053o092
2862e363K960M898J565k798m110O19M131K342k987l601j181M120L452j502n295
2877b750k161M224N925l121o434n79N372L505m798l624J854J922L789j728k784
2892a388r47K920K168p84l751k465L678M456j693n130j555O023K652k890n081
$$ plain form
2907 -3787 -4331 414 2711 638 -3394 -3875 225 3058 1685 -2696 -3969 -1814 2382 2668 -3293 -5365
2923 -5365 -133 4149 2251 -3637 -3712 -674 1373 362 -2881 -3812 -330 1163 1041 -1576 -3095 -1919
2939 -1919 2974 3082 -2256 -4762 -1744 2461 798 -3281 -5217 -1869 1967 265 -4091 -4323 -317
2954 -317 2050 1386 -1552 -3886 -1780 1733 3147 -1396 -4748 -2386 2110 1554 -3271 -3614 -602 2823
2970 2823 772 -3271 -4683 -519 1579 160 -2513 -4188 -805 1153 1308 -2270 -3682 -2664 1468
2985 1468 1635 -939 -4155 -1631 3014 3494 -2883 -3576 515 2959 2264 -274 -1786 -1972 1349 2239
3001 2239 -1347 -3729 -1251 1842 1604 -1447 -4186 -2483 2216 3223 -2157 -4615 -306 2543 2933
3016 2933 -491 -1977 -559 2786 3167 305 -1300 -785 1676 3266 445 -2864 -1734 2076 2236 -1066
$$ packed form
2907c787n44M745K297k073m032m81M100K833j373m381j273K155M196K86n961k072
2923e365N232M282j898n888p5L038K047j011l243r31L482J493j22k617j519J176
2939a919M893J08n338k506L018M205j663m079j936L348L836j702m356k32M006
2954c17K367o64k938k334K106L513J414m543l352K362M496n56m825l43L012L425
2970B823k051m043j412M164K098j419k673j675L383J958J55l578j412J018M132
2985A468J67k574l216K524M645M80o377o93M091K444o95k538j512j86L321Q90
3001B239l586k382K478L093k38l051k739J703M699J007n380k458M309K849L90
3016B933l424j486J418L345L81k862j605N15K461J590k821l309J130L810J60l302
$$ plain form
3032 -1066 -3658 -1337 1731 784 -545 -2582 -654 1881 1709 -1563 -2142 -456 622 414 454 -996
3048 -996 -2142 1177 3286 -853 -2888 -1137 1831 896 -2131 -3815 -1992 852 2396 -1714 -2348 -785
3064 -785 1912 2306 731 -965 -1439 2268 3405 -484 -3534 -202 1325 1724 435 -3098 -2057 1511
3080 1511 2455 -2680 -4218 -1603 255 -596 -1390 -3118 -3399 530 395 -1389 -3610 -2338 -280 1242
3096 1242 -249 -4098 -1919 1505 2304 -1415 -3608 -2079 -1081 -819 -149 -1837 -3146 -621 326 -799
3112 -799 -3183 -3136 130 1429 -149 -2863 -1707 1662 1848 -942 -1592 -574 -128 860 105 -2836 -1939
3129 -1939 -1431 51 -1506 -3787 -3821 -2817 -524 -1684 -5310 -4881 409 290 -2030 -4094 -1873 793
3145 793 1713 154 -890 -888 741 1005 1483 -1431 -993 450 1511 2312 -468 -2555 -277 3196 158
$$ packed form
3032a066k592K321L068r47j329k037J928K535j72l272n79J686J078k08M0j450
3048i96j146L319K109m139k035J751K968r35l027j684J823K844J544m110o34J563
3064g85K697L94j575j696m74L707J137l889l050L332J527L99j289l533J041L568
3080A511R44n135j538K615J858q51p94j728k81L929j35j784k221J272K058J522
3096A242j491l849K179L424P99l719k193J529R98K62O70j688j309K525R47j125
3112g99k384M7L266J299j578k714J156L369J86k790o50J018M46R88p55k941Q97
3129a939N08J482j557k281l4J004K293j160l626M29N290j19k320k064K221K666
3145G93R20j559j044KJ629K64M78k914M38J443J061Q01k780k087K278L473l038
$$ plain form
3162 158 -2469 -829 754 1797 -302 -491 -1113 1184 36 1210 -1161 -637 116 2003 1544 -662
3178 -662 -998 -629 1402 453 -2600 -3377 -477 561 -534 -2855 -1915 -1241 1249 203 -1455 -534 -657
3195 -657 1289 2313 -696 -1583 1160 4030 1961 -278 200 2799 4269 2107 469 757 2005 2860
3211 2860 -338 -198 621 230 -242 1704 -707 -2053 -234 1246 1169 -1075 -1695 -146 818 979 -1832
3228 -1832 -1854 898 1588 -546 -1395 -369 -257 1186 521 -943 -1289 -1266 1318 1086 2118 -306 256 2976
3246 2976 2897 642 -473 1412 2681 1067 -700 877 833 1168 258 -329 -1158 -1240 -609 709 -246 -1563
3264 -1563 -1298 -269 -444 -1974 -2906 -728 1339 203 -773 -1740 -207 -255 -1063 -891 -1800 -1027 -225 943
3282 943 -913 -1523 -1914 -578 -336 -596 -1900 -1555 -164 -1761 -1269 -1286 786 1260 -131 -545 -7 1131
$$ packed form
3162A58k627J640J583J043k099j89o22K297j148J174k371N24P53J887m59k206
3178f62l36L69K031r49l053p77K900J038j095k321R40O74K490j046j658R21j23
3195f57J946J024l009q87K743K870k069k239M78K599J470k162j638K88J248Q55
3211B860l198J40Q19l91m72J946k411j346J819J480p7k244o20J549R64J61k811
3228a832k2K752O90k134q49J026J12J443o65j464l46K3K584k32J032k424N62K720
3246B976p9k255j115J885J269j614j767J577m4L35r10n87q29q2O31J318r55j317
3264a563K65J029j75j530r32K178K067j136r76r67J533m8q08J72r09P73Q02J168
3282I43j856o10l91J336K42k60j304L45J391j597M92j7K072M74j391m14N38J138
$$ plain form
3300 1131 888 -124 545 -515 -1172 -392 1575 -1149 -2639 -1626 249 232 -2502 -2469 -1725 -1397 -1817 -1972
3318 -1972 -1975 -1149 -736 -1070 -447 -1086 -2509 -222 1677 2036 -807 -209 1283 1084 550 -207 -538 1355
3336 1355 457 -422 -1200 472 -221 -1371 -416 141 -1268 -262 106 481 -1142 -1189 1283 997 -1235 -1472
3354 -1472 -151 450 1927 -1783 -2816 585 405 -393 -543 -463 -863 -666 -58 147 -1686 -1689 -1474 624
3372 624 635 -2038 -127 444 1053 -398 -346 575 528 334 -482 156 690 -535 -130 719 821 45 360 142
3392 142 543 2 -897 -108 384 648 -1319 -1294 1435 -276 -1746 -1348 730 -451 -439 1318 345 -1554
3410 -1554 -425 1320 387 1020 -475 262 1080 815 -1195 209 379 899 142 671 -1051 731 988
3427 988 -324 -325 901 399 -717 -259 302 113 207 796 208 -1192 -959 1250 146 -82 -1367 423
$$ packed form
3300A131k43j012O69j060o57P80J967k724j490J013J875j7k734L3P44L28m20j55
3318a972lQ26M13l34O23o39j423K287J899L59k843N98J492j99n34p57l31J893
3336A355q98q79p78J672o93j150R55N57j409J006L68L75j623m7K472k86k232k37
3354a472J321O01J477l710j033L401j80p98j50Q0m00J97O08K05j833lK15K098
3372F24J1k673J911N71O09j451N2R21m7j94q16O38N34j225M05Q49J02p76L15k18
3392A42M01n41q99P89M92K64j967K5K729j711j470L98K078j181J2J757r73j899
3410a554J129J745r33O33j495P37Q18k65k010J404J70N20p57N29j722J782K57
3427I88j312jJ226n02j116M58N61j89R4N89n88j400K33K209j104k28j285J790
$$ plain form
3445 423 464 632 -829 -613 -423 297 -6 103 744 147 22 503 228 -960 -1523 -883 1137 -681 -484
3464 -484 -341 -401 1082 -1340 -1352 99 71 -1388 -662 -801 -178 36 -887 814 178 -1003 -174 671 -135
3483 -135 -1113 -1006 21 -707 -1504 -1374 165 -219 -397 60 72 334 -776 -1015 -304 588 -326 -2057 164
3502 164 955 182 -1930 -376 693 -131 -212 -1400 1124 -188 -852 -365 742 -255 -1234 -77 -325 -1615
3520 -1615 -908 -1780 -507 -341 -1377 -496 908 -31 -1689 -961 -230 -198 -1360 -284 -1194 -494 -763 97
3538 97 -687 -191 224 -359 887 -271 -823 -931 664 670 -167 -1240 699 8 -1228 -566 -916 -794 -227
3557 -227 -271 -285 369 474 -303 190 1393 311 569 -1536 989 582 379 49 188 460 125 372 364 -393
3577 -393 -881 45 372 1927 -367 -29 911 194 455 -38 532 717 -123 644 31 -155 -86 638 871 900
$$ packed form
3445D23M1J68j461K16J90P20l03J09O41n97j25M81k75j188n63O40K020j818J97
3464d84J43o0J483k422j2J451k8j459P26j39O23K14r23J701o36j181Q29Q45q06
3483a35r78J07J027p28p97J30J539l84j78M57J2K62j110k39P11Q92r14j731K221
3502A64P91p73k112J554J069q24q1j188K524j312o64M87J107r97r79J157k48j290
3520a615P07q72J273J66j036Q81J404r39j658P28P31L2j162J076r10P00k69Q60
3538I7p84M96M15n83J246j158n52j08J595Oq37j073J939o91j236O62l50J22N67
3557b27m4j4O54J05p77M93J203j082K58k105K525m07k03l30J39K72l35K47qp57
3577c93m88R26L27J555k294L38R40p17K61m93N70J85q40P67o13j86O9P24K33K9
$$ plain form
3597 900 -295 174 612 658 -545 458 897 162 -34 380 -37 599 303 -395 -237 714 270 444 755
3616 755 987 463 544 246 803 354 693 928 851 513 1147 1971 668 461 -1256 16 767 1041 943 61
3636 61 1692 1207 299 34 309 -174 -218 558 972 646 160 490 826 1251 74 190 -131 212 173 -678
3656 -678 569 868 174 990 215 277 38 -328 1320 1192 218 -134 46 410 561 348 278 1732 -1009
3675 -1009 -1070 983 455 81 -537 387 150 92 -81 410 477 58 -165 -686 184 328 -738 526 248 2
3695 2 50 82 1247 -580 -300 -318 662 -462 597 1200 650 259 -915 -326 597 295 298 -245 -199 -306 -314 523
3717 523 -961 175 631 453 -121 669 -69 -155 -1353 -612 -1225 507 774 167 -1155 -778 198 -395 -1313
3736 -1313 -300 -31 -174 69 -452 215 580 90 285 361 1005 900 855 287 1654 950 -345 416 303
$$ packed form
3597I00j195M69M38M6j203J003M39p35j96M14m17O36k96o98J58R51m44J74L11
3616G55K32n24Q1k98N57m49L39K35p7l38O34Q24j303k07j717J272P51K74r8q82
3636F1J631m85r08k65K75m83m4P76M14l26m86L30L36M25j177J16l21L43l9q51
3656f78J247K99o94Q16p75O2k39l66J648j28r74l52J80L64J51k13p0J454k741
3675a009o1K053n28l74o18R24k37n8j73M91O7m19k23n21Q70J44j066J264k78k46
3695BM8L2J165j827K80j8R80j124J059O03n50l91j174N89R23l02Ln43M6j07qQ37
3717E23j484J136M56j78n74P90p38q6j198P41o13J732K67o07j322L77R76n93r18
3736a313J013K69j43K43n21O67L65m90J95P6O44j05m5n68J367p04j295P61j13
$$ plain form
3755 303 633 396 1255 978 255 182 296 -245 -514 -72 -1211 -140 999 -369 178 -727 262 -363 -655
3774 -655 505 121 -780 1036 -79 166 108 -215 -461 -258 -269 -602 592 203 347 -331 220 192 633 239
3794 239 302 -278 -21 1046 -477 1092 494 1018 97 1032 -983 -43 843 385 -716 166 -85 188 388
3813 388 359 -391 42 -171 -272 -1114 242 -414 -748 423 -547 -298 -794 258 -100 -628 -1458 -48 282
3832 282 40 -1276 -803 565 233 617 -527 -342 1114 251 -395 131 846 -1499 -980 -310 387 -698
3850 -698 665 -942 690 1816 -766 161 81 628 -349 -124 259 -404 -954 -676 -675 -1321 -2100 -647 190
3869 190 -350 -1149 750 401 41 166 -1967 759 -989 160 -575 290 879 -101 888 146 -218 848
3887 848 -2 -212 -808 -596 -803 886 -344 -58 -1098 -161 570 -635 -135 -164 465 -1008 225 3
$$ packed form
3755C03L30k37Q59k77p23p3J14n41k69M42j139J071J139j368N47r05R89o25k92
3774f55J160l84r01J816j115K45n8l23k46K03j1l33J194l89J44o78N51k8M41l94
3794B39O3n80K57J067j523J569n98N24r21R35k015R40Q86m58j101Q82k51K73K00
3813C88k9p50M33k13j01q42J356o56l34J171r70K49m96J052l58n28q30J410L30
3832B82k42j316M73J368l32L84j144J85J456q63o46N26P15k345N19O70O97j085
3850f98J363j607J632J126k582R27q0N47r77K25L83o63n50K78Jo46p79J453Q37
3869A90n40p99J899l49l60J25k133K726j748J149p35Q65N89r80R89p42l64J066
3887H48q50k10n96K12k07J689j230K86j040R37P31j205N00k9O29j473J233k22
$$ plain form
3905 3 116 -1438 -1367 -618 -531 -196 -767 -1053 -323 17 -1035 -612 -8 -1040 -2027 -188 91 -765 156 248
3925 248 423 -340 -551 251 277 -491 -154 723 410 -143 -1101 10 552 -589 -1445 -547 1143 -387 -431
3944 -431 -21 11 135 -1974 -1516 -572 79 -1541 -748 -83 -141 -1062 -693 320 214 -539 -917 -47 268 -252
3964 -252 -1009 -251 -611 -914 -989 -61 641 -59 28 202 610 -566 -926 686 340 274 -1237 214 1170 1220
3984 1220 -4 -96 763 -871 -1444 108 1068 -1368 113 -234 704 -1234 -48 -258 -496 -309 491 994
4002 994 270 172 346 -726 454 -640 901 -657 -335 213 -223 -113 418 533 -649 -139 716 406
4020 406 -1033 -857 780 182 -608 -1132 256 523 -373 534 -580 -651 -139 -741 15 106 290 -169 -621
4039 -621 525 298 -46 -324 1586 -155 -375 377 -359 -486 600 219 217 378 -279 896 -92 -216 -887
$$ packed form
3905CJ13j554P1P49Q7L35n71k86P30L40j052M23O04j032r87J839K79q56R21R2
3925B48J75p63k11Q02K6p68L37Q77l13n53r58J111N42j141q56Q98J690j530m4
3944d31M10L2J24k109M58R44O51j620P93O65n8r21L69J013j06p53l78Q70L15n20
3964b52p57P58l60l03p5R28P02p00Q7J74M08j176l60J612l46o6j511J451R56N0
3984A220j224r2Q59j634n73J552R60k436J481l47R38j938J186k10k38J87Q00N03
4002I94p24r8J74j072J180j094J541j558L22N48m36J10N31J15j182N10Q55l10
4020D06j439J76J637n98p90n24J388K67q96R07j114p1N12o02P56R1J84m59m52
4039f21J146k27l44k78J910j741k20P52p36j27J086l81kJ61o57J175r88j24o71
$$ plain form
4058 -887 -326 288 243 49 -953 706 811 -231 361 -372 536 -222 -104 61 115 636 -1714 -899 -12
4077 -12 -822 -439 718 410 -839 -443 1266 534 -1394 -1070 703 93 -678 -69 -105 496 -125 833 -680
4096 -680 -316 522 -1385 -506 -202 -1395 -315 -324 417 -895 104 -501 -318 918 -47 -130 86 990 -1395
4115 -1395 -640 661 38 -443 -91 -279 388 -455 562 890 -277 453 -445 509 334 -446 -297 946
4133 946 694 -81 350 1490 44 -710 786 643 581 -505 -25 164 577 -382 -1306 300 199 -148 -992
4152 -992 710 828 -1206 -583 -13 488 198 -637 -1289 -378 -594 -429 -209 -197 207 -290 284 124 -117 163
4172 163 507 1167 468 -564 983 737 -318 279 1299 -374 322 440 524 1112 675 502 544 429 317
4191 317 773 -441 449 268 -297 1364 291 -233 1021 -704 416 -206 488 -618 833 675 103
$$ packed form
4058h87N61O14m5j94j002J659J05j042N92p33R08p58J18J65N4N21k350Q15Q87
4077a2q10L83J157l08j249L96J709p32j928L24J773o10p71O09l6O01o21R58j513
4096f80L64Q38j907Q79L04j193J080rP41j312R99o05J83J236r65q3K16R04k385
4115a395P55J301o23m81L52j88O67q43J017L28j167P30q98R54j75p80J49J243
4133I46k52p75M31J140j446p54J496j43o2j086M80J89M13r59r24J606j01l47q44
4152i92J702J18k034O23N70N01k90q35o52R11k16J65K20J2M04m97N74j60k41K80
4172A63L44O60o99j032J547k46j055N97J020j673O96J18Q4N88m37j73M2j15j12
4191C17M56j214Q90j81n65J661j073n24J254j725J120o22O94j106J451j58n72
$$ plain form
4208 103 -338 885 516 462 955 -659 -25 732 123 143 235 -587 475 -189 143 391 -649 -6 626 637
4228 637 -289 772 787 320 -327 359 -140 711 -200 -625 446 -72 -618 -1489 418 -627 27 -831 607
4247 607 -262 -1364 352 -52 1008 -447 -705 1075 -611 208 481 1217 -1103 -159 -424 247 646 191
4265 191 264 390 229 -675 296 946 344 792 -34 916 81 -380 -1193 -1396 856 814 -1350 692 -40 -167
4285 -167 -1211 -21 -724 247 101 -340 -457 1113 825 204 289 -660 454 -479 353 1030 511 483 418 -319
4305 -319 -659 -253 -1035 -340 -339 372 -292 459 65 -823 386 876 -820 -1048 460 212 476 -758 -209
4324 -209 -294 -528 -759 -580 -232 10 -581 -600 -388 -955 -1000 -204 -44 -135 -410 -1234 8 15 -1202 -350 -614
4345 -614 -18 14 226 889 -136 -20 435 133 -259 793 -513 787 573 -326 611 -404 330 -870
$$ packed form
4208A03m41J223l69n4M93j614O34P57o09K0R2q22J062o64L32K48j040O43O32J1
4228F37r26J061J5m67o47O86m99Q51r11m25J071n18n46q71J907j045O54q58J438
4247F07q69j102J716m04J060j455k58J780j686Q19K73P36k320R44k65O71L99m55
4265A91P3J26j61r04R71O50o02M48q26R50q35m61q13k03K252m2k164K042p32j27
4285a67j044J190p03R71j46m41j17J570k88o21Q5r49J114r33Q32O77n19k8o5p37
4305c19l40M06p82O95JP11o64P51l94q88J209M90j696k28J508k48K64j234N49
4324b09q5k34k31J79L48K42n91j9K12n67m5P96J60r1k75q24J242Pj217Q52k64
4345f14N96L2K12O63j025J16M55l02l92J052j306J300k14q99R37j015P34j200
$$ plain form
4363 -870 -4 538 525 433 260 123 -736 202 639 299 589 -902 -553 -585 -25 -155 515 343 540 984 455
4384 455 -485 438 573 -178 520 -788 267 372 142 157 928 -478 1162 435 1113 -955 -4 -996 674
4403 674 -151 359 399 -152 34 -224 -672 -747 -108 167 80 466 -143 248 235 -903 -129 -870 169 -384 739
4424 739 458 1250 530 152 166 951 166 631 1523 192 1171 781 1079 -440 785 -310 344 53 -370
4443 -370 -196 -1420 276 706 -769 -538 259 -512 -236 88 1064 150 226 -328 -42 -176 -607 -554 -1635
4462 -1635 -619 573 -703 -109 92 -680 473 240 218 341 34 520 78 -552 -424 -783 1123 472
4480 472 -35 -252 -77 15 200 234 310 330 711 464 -131 -376 -614 1852 -42 -741 -173 -1637 -615 -1328
4500 -1328 -185 391 787 -231 568 -394 -61 -185 -242 -7 908 -936 -756 37 -127 -164 271 446 253
$$ packed form
4363h70Q66N42j3r2j73j37q59R38M37l40K90j491L49l2N60j30O70j72J97M44n29
4384D55r40R23J35p51O98j308J055J05k30J5P71j406J640p27O78k068R51r92J670
4403F74q25N10M0n51J86k58m48p5O39K75q7L86o09L91j3j138P74p41J039n53J123
4424G39k81P92p20l78J4P85p85M65Q92j331R79l90K98j519J225j095O54k91m23
4443c70J74j224J696M30j475K31P97p71K76L24R76r14P6n54K86j34m31N3j081
4462a635J016J192j276N94K01p72J153k33k2J23l07M86m42o30J28l59J906o51
4480D72n07k17J75R2J85L4P6K0L81k47n95k45k38K466j894o99N68j464J022p13
4500a328J143N76L96j018P99r62L33j24n7K35R15j844J80P93j64l7M35J75j93
$$ plain form
4519 253 546 531 -685 970 253 642 461 976 619 -394 115 -567 1041 284 870 630 735 -83 1585
4538 1585 -774 911 -606 -281 546 1635 -653 1099 -691 -264 52 463 1040 -202 679 425 1176
4555 1176 882 708 550 130 460 773 494 49 -244 -59 -87 -438 178 395 530 1468 1494 610 135 1095
4575 1095 -523 1177 657 255 316 282 1133 -510 905 703 606 32 122 983 687 -40 383 294 -239 -871
4595 -871 -857 209 368 -875 -985 393 -1207 192 107 523 392 -163 52 22 325 82 110 873 537 148
$$ packed form
4519B53K93j5j216J655p17L89j81N15l57j013N09o82J608p57N86k40J05q18J668
4538A585k359J685j517L25Q27J089k288J752j790M27L16M11N77j242Q81k54P51
4555A176k94j74j58m20L30L13k79m45k93J85k8l51O16K17J35R38K6q84m75R60
4575A095j618J700n20m02O1l4Q51j643J415k02r7n74R0Q61k96p27M23q9n33o32
4595h71J4J066J59j243j10J378j600J399q5M16j31n55K15l0L03k43K8P63l36l89
$$ [...]
8191d0
##END NTUPLES=NMR FID
##END=
