##TITLE=1H_SA_24.217
 DMSO-d6, 40 sc, 
 29.7.2020
##JCAMPDX= 6.0         $$ Bruker NMR JCAMP-DX V2.0
##DATA TYPE= NMR FID
##DATA CLASS= NTUPLES
##ORIGIN= UXNMR, Bruker Analytische Messtechnik GmbH
##OWNER= root
$$ XWIN-NMR		Version 3.5
$$ Wed Jul 29 11:21:12 2020 Russian Standard Time (UT+4h)  she@DPX200
##.OBSERVE FREQUENCY= 200.1315
##.OBSERVE NUCLEUS= ^1H
##.DELAY= (6, 6)
##.ACQUISITION MODE= SIMULTANEOUS
##.ACQUISITION SCHEME= undefined
##.AVERAGES= 40
##.DIGITISER RES= 18
##SPECTROMETER/DATA SYSTEM= spect
##.PULSE SEQUENCE= zg30
##.SOLVENT NAME= DMSO
##.SHIFT REFERENCE= (INTERNAL, DMSO, 0, 15.7039)
##AUDIT TRAIL= $$ (NUMBER, WHEN, WHO, WHERE, WHAT)
$$ ##TITLE= Audit trail, XWIN-NMR		Version 3.5
$$ ##JCAMPDX= 5.01
$$ ##ORIGIN= Bruker BioSpin GmbH
$$ ##OWNER= she
$$ F:/spectra/data/she/nmr/H-F/1/audita.txt
$$ ##AUDIT TRAIL=  $$ (NUMBER, WHEN, WHO, WHERE, WHAT)
(   1,<2020-07-29 11:19:35.23 +0400>,<she>,<DPX200>,
      <continue with go, POWCHK disabled, PULCHK disabled
       configuration hash MD5:
       00 E9 B6 7A A2 85 ED C7 34 08 36 98 17 FE 4E 26
       data hash MD5: 16K
       5B 76 08 1C AC B2 F1 FE 8A 76 6B 07 32 4B 31 28>)
$$ ##END=
$$ 
$$ hash MD5
$$ 62 98 09 F5 2C E2 05 75 07 0D B8 DA F2 F2 B6 2C
##$RELAX= 
##$RELAX= 
##$RELAX= 
##$RELAX= 
##$RELAX= 
##$RELAX= 
$$ Bruker specific parameters
$$ --------------------------
##$DU= <F:/spectra>
##$EXPNO= 1
##$NAME= <H-F>
##$PROCNO= 1
##$TYPE= <nmr>
##$USER= <she>
##$AMP= (0..31)
100 100 100 100 100 100 100 100 100 100 100 100 100 100 100 100 100 100 
100 100 100 100 100 100 100 100 100 100 100 100 100 100 
##$AQSEQ= 0
##$AQ_mod= 1
##$AUNM= <au_zg>
##$AUTOPOS= <>
##$BF1= 200.13
##$BF2= 200.13
##$BF3= 200.13
##$BF4= 200.13
##$BF5= 200.13
##$BF6= 200.13
##$BF7= 200.13
##$BF8= 200.13
##$BYTORDA= 1
##$CFDGTYP= 0
##$CFRGTYP= 5
##$CHEMSTR= <none>
##$CNST= (0..31)
1 1 145 1 1 1 1 1 1 1 1 1 1 1 1 1 1 1 1 1 1 1 1 1 1 1 1 1 1 1 1 1 
##$CPDPRG= <>
##$CPDPRG1= <>
##$CPDPRG2= <>
##$CPDPRG3= <>
##$CPDPRG4= <mlev>
##$CPDPRG5= <mlev>
##$CPDPRG6= <mlev>
##$CPDPRG7= <mlev>
##$CPDPRG8= <mlev>
##$CPDPRGB= <>
##$CPDPRGT= <>
##$D= (0..31)
0 1.2 0 0 0 0 0 0 0 0.06 0 0.03 0 0 0 0 0.0002 0 0 0 0 0 0 0 0 0 0 0 0 
0 0 0 
##$DATE= 1596007013
##$DBL= (0..7)
120 120 120 120 120 120 120 120 
##$DBP= (0..7)
150 150 150 150 150 150 150 150 
##$DBP07= 0
##$DBPNAM0= <>
##$DBPNAM1= <>
##$DBPNAM2= <>
##$DBPNAM3= <>
##$DBPNAM4= <>
##$DBPNAM5= <>
##$DBPNAM6= <>
##$DBPNAM7= <>
##$DBPOAL= (0..7)
0.5 0.5 0.5 0.5 0.5 0.5 0.5 0.5 
##$DBPOFFS= (0..7)
0 0 0 0 0 0 0 0 
##$DE= 6
##$DECBNUC= <off>
##$DECIM= 24
##$DECNUC= <off>
##$DECSTAT= 4
##$DIGMOD= 1
##$DIGTYP= 9
##$DL= (0..7)
0 120 120 120 120 120 120 120 
##$DP= (0..7)
150 150 150 150 150 150 150 150 
##$DP07= 0
##$DPNAME0= <>
##$DPNAME1= <>
##$DPNAME2= <>
##$DPNAME3= <>
##$DPNAME4= <>
##$DPNAME5= <>
##$DPNAME6= <>
##$DPNAME7= <>
##$DPOAL= (0..7)
0.5 0.5 0.5 0.5 0.5 0.5 0.5 0.5 
##$DPOFFS= (0..7)
0 0 0 0 0 0 0 0 
##$DQDMODE= 0
##$DR= 18
##$DS= 0
##$DSLIST= <SSSSSSSSSSSSSSS>
$$ [...]
##$SUBNAM2= <"">
##$SUBNAM3= <"">
##$SUBNAM4= <"">
##$SUBNAM5= <"">
##$SUBNAM6= <"">
##$SUBNAM7= <"">
##$SUBNAM8= <"">
##$SUBNAM9= <"">
##$SW= 24.9337058887773
##$SWIBOX= (0..15)
0 0 2 0 0 0 0 0 0 0 0 0 0 0 0 0 
##$SW_h= 4990.01996007984
##$TD= 16384
##$TD0= 1
##$TE= 0
##$TE2= 300
##$TE3= 300
##$TEG= 300
##$TL= (0..7)
0 120 120 120 120 120 120 120 
##$TP= (0..7)
150 150 150 150 150 150 150 150 
##$TP07= 0
##$TPNAME0= <>
##$TPNAME1= <>
##$TPNAME2= <>
##$TPNAME3= <>
##$TPNAME4= <>
##$TPNAME5= <>
##$TPNAME6= <>
##$TPNAME7= <>
##$TPOAL= (0..7)
0.5 0.5 0.5 0.5 0.5 0.5 0.5 0.5 
##$TPOFFS= (0..7)
0 0 0 0 0 0 0 0 
##$TUNHIN= 0
##$TUNHOUT= 0
##$TUNXOUT= 0
##$USERA1= <user>
##$USERA2= <user>
##$USERA3= <user>
##$USERA4= <user>
##$USERA5= <user>
##$V9= 5
##$VALIST= <valist>
##$VCLIST= <CCCCCCCCCCCCCCC>
##$VD= 0
##$VDLIST= <DDDDDDDDDDDDDDD>
##$VPLIST= <PPPPPPPPPPPPPPP>
##$VTLIST= <TTTTTTTTTTTTTTT>
##$WBST= 1024
##$WBSW= 4
##$XGAIN= (0..3)
0 0 0 0 
##$XL= 0
##$YL= 0
##$YMAX_a= 1160686
##$YMIN_a= -607800
##$ZGOPTNS= <>
##$ZL1= 120
##$ZL2= 120
##$ZL3= 120
##$ZL4= 120
##$ABSF1= 10
##$ABSF2= 0
##$ABSG= 5
##$ABSL= 3
##$ALPHA= 0
##$AQORDER= 0
##$ASSFAC= 0
##$ASSFACI= 0
##$ASSFACX= 0
##$ASSWID= 0
##$AUNMP= <proc_1d>
##$AZFE= 0.1
##$AZFW= 0.1
##$BCFW= 1
##$BC_mod= 2
##$BYTORDP= 1
##$COROFFS= 0
##$CY= 11.3945322036743
##$DATMOD= 1
##$DC= 2
##$DFILT= <>
##$DTYPP= 0
##$F1P= 16.9975609425685
##$F2P= -3.02152046262296
##$FCOR= 0.5
##$FTSIZE= 0
##$FT_mod= 4
##$GAMMA= 1
##$GB= 0.15
##$INTBC= 1
##$INTSCL= 1
##$ISEN= 128
##$LB= 0.24
##$LEV0= 0
##$LPBIN= 0
##$MAXI= 10000
##$MC2= 0
##$MEAN= 0
##$ME_mod= 0
##$MI= 1.114404
##$NCOEF= 0
##$NC_proc= 0
##$NLEV= 6
##$NOISF1= 3.799351
##$NOISF2= 2.8
##$NSP= 1
##$NTH_PI= 0
##$NZP= 0
##$OFFSET= 15.70392
##$PC= 1
##$PHC0= -9807.398
##$PHC1= 26.60092
##$PH_mod= 1
##$PKNL= yes
##$PPARMOD= 0
##$PSCAL= 0
##$PSIGN= 0
##$REVERSE= no
##$SF= 200.130013532006
##$SI= 16384
##$SIGF1= 3
##$SIGF2= 2
##$SINO= 400
##$SIOLD= 16384
##$SREGLST= <1H.CDCl3>
##$SSB= 0
##$STSI= 0
##$STSR= 0
##$SW_p= 3612.71676300578
##$SYMM= 0
##$S_DEV= 0
##$TDeff= 0
##$TDoff= 0
##$TI= <>
##$TILT= no
##$TM1= 0
##$TM2= 0
##$TOPLEV= 0
##$USERP1= <user>
##$USERP2= <user>
##$USERP3= <user>
##$USERP4= <user>
##$USERP5= <user>
##$WDW= 1
##$XDIM= 8192
##$YMAX_p= 0
##$YMIN_p= 0
$$ End of Bruker specific parameters
$$ ---------------------------------
##NTUPLES= NMR FID
##VAR_NAME=  TIME,          FID/REAL,        FID/IMAG
##SYMBOL=    X,             R,               I
##VAR_TYPE=  INDEPENDENT,   DEPENDENT,       DEPENDENT
##VAR_FORM=  AFFN,          ASDF,            ASDF
##VAR_DIM=   8192,          8192,            8192
##UNITS=     SECONDS,       ARBITRARY UNITS, ARBITRARY UNITS
##FACTOR=    0.0002004,     1,               1
##FIRST=     0,             0,               0
##LAST=      1.6414764,     0,               0
##MIN=       0,             -607800,         0
##MAX=       1.6414764,     1160686,         0
$$ Real data points
##PAGE= N=1
##DATA TABLE= (X++(R..R)), XYDATA
0@%%%%%%%%%%m0Q0q0Q0r9J39j60J88k28K66l06L59m28M91n66O51p41Q39r58J090
30E77j230J387j555J735j938K169k420K690k985L309l669M068m500M977n517O119
46C217o786P538q404R404j0559J1928j3582J5622j8216K1630k6378L3488m5441
59b6539P0643k24130L85355K82411o68088m27452O4434K84209J34238J26506l9558
70c7971k15792j52154J85797K05659l7129j13649J11037J14582j25100j83501
80b48221J07928K36898L285k20616q0329J39968R6334j20354j39109M3796J47931
91c2489L3608r8715j05548l5734M2705J39380J24389q2365k30496l9823K43209
102d1879J64764j60533j97738R9704K20939l1653k26449o8780J48697J10058l3353
$$ y = [0, 0, 0, 0, 0, 0, 0, 0, 0, 0, 0, -40, 40, -40, 40, -59, 80, -80, 108, -120, 146, -160, 199, -229, 262, -304, 347, -394, 445, -513, 577, -653, 734, -821, 914, -1024, 1145, -1275, 1415, -1570, 1739, -1930, 2138, -2362, 2615, -2902, 3217, -3569, 3969, -4435, 4969, -5590, 6338, -7244, 8378, -9838, 11792, -14586, 18902, -26539, 44104, -180026, 205329, 487740, -180348, -607800, -543366, -259157, -124919, 1587, -37971, -253763, -405917, -220120, -14461, -51590, -165239, -54202, 60380, -64720, -248221, -140293, 96605, 99890, -120726, -201055, -61087, 35247, -85107, -224216, -180420, -32489, 1119, -97596, -203144, -238878, -196173, -56793, 67596, -14769, -245265, -285088, -41879, 122885, -37648, -235386, -135682, 85257, 53604, -172845, -241625, -92928, 17130, -16223]
113a6223o8090o6730q3767J0916J58526R4078j31584j50562P1227J37449n0960
124i5720j14099R3363J90071l4315k15237m6032J91519J35163o6882r1257N416
135d8010K1133j067L3025K5399n9673m4845Q8787Q3249j18134j86382M5341K46147
147H4970R2159j97170k01370M7857J71228N4305o0852m3107N1p764k415K3938
159c8170J3238o227K7236N0361l2654j19267k9731J47274J31160p9115j58277
170i4172L277J23566K4897q5527j7245Q6120M4193o6748q2808j2022N2999Q0355
182E6885N3820n0567j43958p0197J17563J60246k3307j53364m5212J00574N0342
193E2825p7459n6490O9043Q7730k1281r2946n1341K8162O6089N6808k220q1466
$$ y = [-16223, -84313, -151043, -234810, -223894, -65368, 28710, -102874, -253436, -182209, -44760, -95720, -209819, -116456, 73615, 39300, -175937, -221969, -30450, 104713, 37831, -53426, -48010, -26877, -27944, 5081, 30480, -29193, -74038, 14749, 97998, -20136, -206518, -161177, 84970, 177129, -20041, -221411, -173554, -2326, 51979, -8873, -51980, -51929, -59693, -62108, -38170, -24932, -31159, -3923, 46438, 13784, -105483, -135214, 12060, 143220, 64105, -94172, -90895, 32671, 57568, -27959, -45204, 40916, 85109, 18361, -64447, -76469, -23470, 56885, 110705, 60138, -83820, -154017, -36454, 123792, 100485, -52879, -98091, 2483, 52825, -24634, -81124, -12081, 75649, 54368, -38578, -89919, -61757, 4332, 61140, 58920, -22546]
205b2546p8476L5479R9985R223q5000j8957Q5707L3824r6358q5752N9742J28463
217F5334L1172r0890r0779J908O9961N9724m5m9969m0109J8794M5871p808n9054
230d5890q611Q2693O1132o6184j21012j2060J15962Q9172m5453r4415j9593M6475
242a7784K8069r165r867P865J8916R178l1140n7334k962Q7772Q3796l9618j26050
255e8324m7372Q6823R4609j3594p1247j6309L6450J5154k8683k4370K1530N3321
267D7988K8962m4595q4738k5287P7369R2826l901r3532o2898L6673O8312J330
279C8509m6915o925M5641J8233m7971n7077J1734P7501N9670l1491q6819m2403
291f8313M7720P7013J8246n0331m4300J5725L9129r640m6640j244O1035M1400
$$ y = [-22546, -101022, -65543, 34442, 43665, -41335, -60292, 25415, 59239, -37119, -122871, -63129, 65334, 96506, 5616, -85163, -83255, -13294, 46430, 46385, -3584, -43693, -24899, 20972, 13164, -45890, -54501, 28192, 89324, 23140, -97872, -109932, 6030, 95202, 49749, -44666, -64259, -17784, 10285, 1120, -8747, -882, 18034, 27212, -3928, -61262, -64224, 23548, 107344, 67726, -58324, -105696, -18873, 75736, 62142, -9105, -25414, 11036, 26190, -2493, -26863, -5333, 47988, 76950, 32355, -52383, -77670, -301, 92525, 88624, -4908, -67806, -31133, 37179, 38509, -8406, -15331, 30310, 48543, 572, -56505, -44771, 32730, 92400, 60909, -25910, -68313, -20593, 56420, 74666, 24335, -19965, -4240, 34889, 25249, -21391, -22635, 38400, 79800]
303G9800m6994q6985k3228O9901P8990k677p2586n2458J6474M9265J9698k2097
315G103k0695J8905K7305k2238n7372p807O7442O3172k3168q4379m6992M1014
327c7710P1237J4691m5606l8111J0520K7902l045l2141o707M3661M3197k5100
339B2788p3284l2523N1195P5863J2534n8914n5063J0899N0532J4310l0128j5842
351b7633K6788K5713k4278n3266j4599N3631O3037n013o9983n5294K2537O4455
363F095K9920k9358m1369J691K8775j738l0391k844M4407L9029k2836o7499l4456
376h0574M2776P2785K0346n0153n5287j666M1156K5569j2907k0151J1789K1522
388A5205j4436m5764j2524M7208N6139l560o1668n1818J7621O1351L1991k5866
$$ y = [79800, 32806, -54179, -77407, -7506, 71484, 68807, -3779, -56237, -39763, 9502, 29200, 7103, -13592, 5313, 32618, 10380, -46992, -54799, 12643, 75815, 52647, -31732, -78724, -37710, 33527, 48218, 2612, -35499, -24979, 2923, -122, -32263, -38970, 4691, 47888, 22788, -50496, -83019, -31824, 44039, 56573, -2341, -57404, -46505, 4027, 18337, -11791, -27633, -845, 24868, 590, -52676, -67275, -13644, 49393, 44380, -25603, -80897, -58360, 6095, 36015, 6657, -34712, -33021, -4246, -5984, -36375, -39219, 5188, 44217, 21381, -46118, -80574, -37798, 34987, 55333, 5180, -50107, -51773, -10617, 14952, 2045, -18106, -6317, 15205, 769, -44995, -57519, -10311, 45828, 42268, -19400, -71218, -53597, 7754, 39745, 13879]
400A3879l8001m484K2494R660j8266r418K7646L6510r308n4465l3605L1762O0513
413C4917K1377l9540m9241m428L4814K0814j3648j6885R577J9033r576l6047j8459
426d7292L3578N4169R025m9879m8975P102N2207L5230j4253l3653n630J9639O294
439A7562j8167o778K3909K9536o149m4829l5707J6335N2845K6613k9077m7358
451b1265j3846K7604K5908m352j7342L670J9124l240l1112j4526K8331M3699J1177
464E3830l5414m0404k420L6064L1619m533k4689j3430P225Q438j1459j1848J6411
477I390L3617j79m4928l8768J6367N1120K5826k1674l7701j3185J6556J9693Q366
490B4500l825m348M224J768j7121k2465J2266M6691K0878l8233n1630l954L7844
$$ y = [13879, -24122, -28606, -6112, 3548, -14718, -24136, 3510, 40020, 30712, -23753, -57358, -25596, 34917, 56294, 16754, -32487, -36915, -2101, 18713, 5065, -11820, -2243, 16790, 7214, -28833, -47292, -13714, 40455, 49480, -399, -49374, -42272, 9935, 45165, 30912, -2741, -8371, 11268, 17562, -605, -7383, 16526, 46062, 39913, -4916, -40623, -24288, 28557, 55170, 26093, -21265, -35111, -7507, 18401, 14049, -3293, 377, 19501, 16261, -14851, -29377, -1046, 42653, 53830, 18416, -21988, -24408, 11656, 43275, 38742, 14053, 623, 7848, 16286, 4827, -7021, 9390, 43007, 42828, -2100, -40868, -24501, 26619, 52445, 30771, -6930, -20115, -3559, 16134, 24500, 20675, 16327, 20551, 22319, 5198, -17267, -5001, 41690, 62568, 24335, -27295, -31249, 6595]
503F595K6981p508k0559r842j786m826k415P619R817J0385N17k1784l0354J596
517c5564M5390L7465j7992m5882j2574K9767K5172o532j2309R412J1130r922k0634
530c073l823J3879J7370J1147r690l4530k5889J6663L9356Q894l1088k2185J0438
543a2531J2447j3177j2851K1249K9293p962l3268j3726J6318J9658J4587N100
555B5137j3107k5255o250K3220J9297j1751j4739J3063J3690k7049l5051J6778
567b2017N0757J3011l8286l0503M679J4406J2852J6359M165j9836k0621Q660K1473
580A5099K93j0989J3360K0889j6716m2944k795M2318K5981k1414k7160j148N662
593D36n268j150J6791J1056j1563j6886j397K099k977J3771L1777K920m4842l2290
$$ y = [6595, 33576, 26068, 5509, -4333, -6119, -10945, -13360, -5741, 4076, 14461, 14978, -6806, -37160, -35564, 9826, 47291, 29299, -16583, -29157, 610, 25782, 19250, 6941, 16353, 27483, 17561, -3073, -6896, 6983, 24353, 35500, 25810, -8720, -34609, -17946, 21410, 30304, -784, -22969, -12531, -84, -13261, -26112, -4863, 24430, 16468, -16800, -30526, -14208, 5450, 20037, 25137, 12030, -13225, -19475, 3745, 23042, 11291, -3448, 9615, 23305, -3744, -38795, -22017, 28740, 41751, 3465, -27038, -22359, -7953, 4899, 21258, 25423, 5587, -15034, -6374, 15099, 15392, 4403, 17763, 38652, 21936, -21008, -23803, 18515, 44496, 23082, -4078, -5226, 436, -4832, -5982, 10809, 21865, 10302, -6584, -7981, -5882, -8859, 4912, 36689, 39609, -5233, -37523]
607c7523L0200M7269k153l0031l846J4310r163j9330J0642K8947P50k3363p043
620c34M969j0814o659K8482K8089k3211m5275K387L4774M465k2731N018K4899
633B4059r596m1045j1138L6015K5882j4905j7819j769q563j1419K0782L5342n864
646A9962l8546r099L1434J2995k3380o997L0245J6460k8613k9738J1374K3610
658I707j002j0663M313j441k6426j5779J9856K2997r726k1242L427O572j7754
671c7161j4089L0370M0039j4486m6845m392L8644J4665j6098J959J9161q876k7025
684b4134K390K4952j55j7484Q492J8129k4242m3155R535N1210J5046l8372k3750
697d1538J4094P854p911J2012K9377N55l4219j4667K5227K1730n491n727J1413
$$ y = [-37523, -7323, 39946, 37793, 7762, 3916, 18226, 9063, -10267, 375, 29322, 30072, 6709, -334, 4635, -6179, -12838, 15644, 43733, 20522, -24753, -22366, 12408, 16873, -5858, -840, 24059, 14463, -26582, -37720, -1705, 24177, 9272, -8547, -10316, -18879, -30298, -9516, 25826, 19962, -18584, -27683, 3751, 16746, -6634, -13631, 16614, 33074, 4461, -25277, -13903, 9707, 8705, -1958, 2355, 914, -25512, -41291, -21435, 1562, -8164, -29406, -25979, -19407, -37161, -51250, -20880, 19159, 4673, -42172, -46564, -7920, 6745, -9353, -7394, 11767, 2891, -24134, -21744, 3208, 3053, -14431, -5939, 12190, -12052, -55207, -45672, 5538, 20584, -17788, -41538, -27444, -19590, -27501, -15489, 13888, 14443, -19776, -34443, -9216, 12514, 7023, 1296, 12709]
710A2709l793k7781q323K9076J8860k3168k3095J2131J3186k2035k0631K0712
722b2152L1754m644k8693p449J1538N813O427K4670J3082k7063l1043J7789M2060
735C2089N482k3437l644J3765o406k0762N377K5172J862k5284r808J3214j689
748E931k1803K698K7618N332k8536j4270J3479O466o927J1522K4462q528l9724
761b2280r824L4799K9906j1355k1223q8K848p645L443J9487L405j9991j0151J3569
775D900N986j5443o811K0631J7497j3957k4973P06J6702M830j556Q444M271j9170
789B057k0525J1656K7771N626j7164j0498j09n877n374J3776J8699q894k6745
802a5601o737J6079O871j2774L58J6413J404k0081j0387J0527J3812M070K947
$$ y = [12709, 8916, -18865, -27188, 1888, 20748, -2420, -25515, -13384, -198, -22233, -42864, -22152, 9602, 4958, -23735, -31184, -19646, -13833, -7406, 17264, 30346, 3283, -27760, -9971, 32089, 37571, 14134, 10490, 24255, 17849, -2913, 2464, 27636, 29498, 4214, -5594, 7620, 5931, -15872, -13174, 14444, 19776, -8760, -23030, -9551, -3085, -10012, 1510, 25972, 17444, -22280, -32104, 2695, 32601, 21246, 23, -65, 2783, -4862, -1419, 18068, 21473, 1482, -8669, 4900, 10886, -4557, -11368, 9263, 26760, 12803, -12170, -11464, 5238, 10068, 8512, 16956, 21227, 2057, -18468, -6812, 20959, 26585, 9421, -1077, -1186, -7063, -12437, 1339, 20038, 11144, -15601, -22338, -6259, 612, -12162, -11804, 4609, 6013, -14068, -24455, -13928, -116, 3954, 6901]
815F901J567j1346j8220L192K9587J8982j4630k2520j799Q401L50L115J2696K263
829A8539j9782j6830P741J4568n30o086M192J134j1755j0956Q518J4566J16n171
843a736J713j159j1164m281J4485J6941j553j5478r688J421N893O382N707J950
857I433r212j3527n08J1882O857k709q32K251l499q578m70J2941R759k797n075
872E916k955k442l047M419J3653P116j0975j5698k788N942N126N709L006o487
886F495j4769q241O829J2713M076m652m671k536m603j329P968J1686J881p206
900C641o689m91J060L966Q574N927n701j2247o266M846P409M339J332k833j0393
915c526q686J081J1105Q166o83o992p584l369K044O583P537L599m331r305n821
$$ y = [6901, 8468, -2878, -21098, -17906, 11681, 30663, 16033, -6487, -8286, 115, 465, 3580, 16276, 18539, -1243, -18073, -10332, 4236, 3706, -2380, 1812, 2946, -8809, -19765, -11247, 3319, 3435, -1736, -23, -1182, -12346, -16627, -2142, 14799, 13246, -2232, -11920, -10499, -4606, 1776, 7483, 9433, 221, -13306, -13814, -1932, 4925, 2216, 1384, 3635, 136, -8442, -8912, 4029, 13788, 10991, 5916, 2961, 519, -2528, 1891, 15544, 22660, 11685, -4013, -6801, -859, 4267, 9976, 12982, 6495, -8274, -16515, -9686, 3027, 7103, 2451, -2220, -4756, -9359, -10688, -2720, 8966, 10847, 3641, -3048, -3539, -2479, 1487, 10061, 15988, 10287, -1960, -8226, -3380, 4029, 8368, 9700, 6867, -3526, -12212, -11131, -26, 8140, 7457, 465, -7119, -10488, -8444, -1861, 5676, 9275, 4944, -4361, -10182]
930a0182L355O985N763L240k679j0472q911J815J1354P578p19o721o570m703o39
945a1506P412R895K207q544r385k420L519N617P913L409o609r410k433L702O828
960A95M520O95m348m306m644r50P180P384P78m918n569m627R68N298O411J691
976E758l332o292m612J022N096N017K674n55o488p077m08P099P880J483k946n628
992a309m808j141N334O760L488k216p992m938j01L999N413O672j413r545p187
1007h984J63O654P065K947j662o802o307j242O090Q827K849l384p390m434k36
1022e846L908Q703L363k999q642n253R54N216O770K620k427o278n732q89N917
1037f15P526K573l709m171n608j351M548P842L414k860o632o157J62L854M816
$$ y = [-10182, -6827, 158, 5921, 9161, 6482, -3990, -12901, -11086, 268, 7846, 7127, 406, -6164, -10867, -11506, -4094, 5801, 8008, -536, -9921, -12341, -8822, -3205, 4708, 8117, 1508, -7902, -10335, -6633, 195, 4715, 5410, 1062, -3244, -7888, -8838, -1658, 5726, 6504, 1586, -3983, -8610, -7642, -2344, 4067, 5758, 2426, -3866, -8478, -7456, -2360, 2657, 5331, 4776, -1712, -8789, -9197, -2098, 5782, 7265, 4319, -1309, -6117, -7258, -1924, 4836, 8324, 6108, -1884, -6822, -6923, -2924, 2489, 9161, 7748, -1797, -8984, -8821, -2167, 4898, 7845, 6183, -619, -6926, -8168, -2078, 6749, 9598, 6214, -1176, -5610, -5846, -1938, 6765, 10128, 7129, -1513, -6766, -5812, -596, 6174, 8794, 6367, 89, -5643, -6532, -615, 6911, 9484, 5775, 1604, -4004, -5355, -807, 7035, 10449, 7589, 957, -5200, -5038, -1184, 3632]
1052C632L923j356o667o260j86M724O283L035j222n291p102q13O425P263L289
1067I677l709n834m018l1L178O111M040l371o711n047Q50K867M667K498j061o204
1083b098n741m67M891O537J548j770l826l426j731K008P303M712k243m778l915
1098b996r45J792M497L800K52n129o539j478L525K465K050P52k465o771m292L134
1114h348P111M085j280l755m722k328K522P709N702J47o101n334J46L383L647
1129B584N145J630n594q678k856N366N798J181o47m050o804m208K153P396N360
1144C776l785n606l176r96J973N836O832N39p645m999K124N434L449J377O60l036
1160B757n665l679N032N143L83l535j615j372m963j785P735N205k39o618k847
$$ y = [3632, 7555, 6199, -468, -6728, -6914, -2190, 4093, 7128, 5906, 615, -6487, -7300, -875, 6388, 9677, 5968, 134, -3884, -3915, -737, 5374, 9414, 6043, -668, -5715, -4865, -1998, 2669, 5167, 4106, -2098, -7839, -8306, -3415, 3122, 4670, 2900, -926, -4352, -6083, -4075, 3228, 7940, 5697, 919, -2996, -3941, -2149, 2348, 6148, 6400, 1271, -5268, -6746, -3221, -756, 1294, 2046, -419, -7190, -11482, -8348, -1237, 2848, 1568, -2187, -6909, -9237, -6715, 994, 6696, 6843, 742, -4592, -4446, -1063, 2584, 7729, 9359, 3765, -4913, -7769, -2403, 3395, 4576, 3929, -121, -6925, -11133, -8980, -1584, 3776, -9, -5615, -8791, -9787, -7814, -1978, 4854, 5393, -2252, -7251, -5127, 307, 3756, 5133, 5793, 2757, -2908, -6587, -1555, 3588, 3971, 436, -1179, -2551, -7514, -9299, -1564, 3641, 3402, -3216, -6063]
1175f063R80K083K436N249M955l632q417j741P038M384p24K37m31n454o493J485
1191d108O916J891n686l924p85j967l708K007Q649L330p089n965K057L876K582
1206a924L716O218j539q361k854O747P339O05k182j237j442o241j601O686O125
1221A0055m288p159j080J078k506r42O162N670m622q228p33M069L378P13L862
1236E429K091p238r270L255J0950K382n809l053M25l816l549L379Q150R64q153
1251c863m460K801K462j177L993O985k82r921l611P405O567j022l89L666k782
1266F372r759k330R956Q177n562q631j442L85k076J06P855K541q499o460K812
1281f555N799j510k130M336L382n801o722K956Q090K112m839J52J933m865n393
$$ y = [-6063, -5083, -3000, -564, 4685, 9640, 6008, -2409, -4150, 2888, 7272, 6548, 6785, 6354, 900, -5593, -4108, 2808, 4699, -987, -4911, -5696, -7663, -11371, -9364, -715, 2615, -4474, -10439, -8382, -4506, -1924, 1792, 8010, 6471, -1890, -4744, 2003, 9342, 9947, 7765, 6528, 5086, -1155, -2756, 3930, 10055, 5767, -1392, -2472, -1394, -3900, -4842, 1320, 6990, 2368, -5860, -6593, -2524, 854, 1567, 5429, 7520, 282, -8988, -5733, 5217, 7599, 1790, -1263, -838, -4654, -8203, -4824, 3326, 4290, -3863, -8323, -5522, -3060, -4237, -244, 6741, 6459, -3462, -7073, 332, 6899, 5877, 5488, 9154, 6372, -3387, -5717, 4239, 12416, 6854, -1777, -3219, -2834, -4910, -4804, 3051, 5592, -2907, -9367, -6555, -756, -2266, -4396, -60, 3322, -2479, -9201, -6245, 1845, 3957, -882, -730, 1203, -3662, -9055]
1296i055M475Q889J230p568k922M061j046k578M601R138k048r763k718P304M764
1311F764l342l56M378j628q116k359P890L193m059k607J838k662p440R23R365
1326A782M119o678p416J548M238o02M27O821P82o276o056L863Q056P23l087J301
1342C545J381n877m095N820P769j946p786m56L807k817l825N162P135j030q431
1357a644k758L653L337l80L151K387m334q018j61P739M745m305l445J670j339
1372B98n670P89P267M083o018n828J303J793J06P61N148J516o109m187M045M098
1388C395p17m5L891m15p664l612N881O585L23n066l505l93M3p67L691L817l542
1405A900o371k1M502M03k348L014M430l867o779j3O638K333j453j049K719j195
$$ y = [-9055, -4580, 4309, 5539, -2029, -4951, -890, -1936, -4514, 87, 9225, 7177, -2586, -5304, 2000, 6764, 3422, 3066, 7444, 5816, -2300, -4659, 3231, 6424, 2365, -242, 1596, -1066, -8506, -7583, 1782, 5901, -777, -8193, -6645, -2407, -3009, -2582, 4239, 5021, -1255, -7311, -3448, 4608, 5331, 2244, 3545, 4926, -951, -5046, 774, 8543, 6597, -1189, -1645, 2162, -655, -4480, 682, 7817, 6787, -1644, -4402, -749, 2588, 2208, 5359, 7746, 3412, -4606, -4767, 2972, 7717, 3412, -33, 1637, 298, -5372, -4583, 2684, 6767, 749, -5079, -3776, -1983, -1877, -1116, 4032, 5548, -561, -4748, -703, 3395, 2678, 2633, 6524, 6109, -1555, -5167, 714, 7299, 7622, 2556, -949, -1342, -1299, -2066, 1625, 5442, 1900, -4471, -4492, 10, 413, -1935, 1079, 5509, 1642, -5137, -5150, 1488, 3821, 2368, 1319, 4038, 2843]
1421B843o892N81P705L205m014l420nj815k475M105O302j308o644l814K922L957
1437A233O90j016J856J80l932l062L526L704J010k215M98j267l044k044M831N490
1453F438r99p174k917J402J118L31L355K404m748o747L2O181L074j43j285n34
1469b12j596j907K938N209J511l057j656J108o82l020J970M971J443n303m298
1484b581r47J629K117K102k58k944m458j978L366M808M06j578j586j76k096J191
1500b983M990L334j817k835q37L47J358J212K79J913o76n496k526J871K305J326
1516A765P41j310m484l902K399M895L465k339k959o72P14M46K464J981O32k904
1532I32j898R41M52J479J107J609k566l102k533N94J875K165R9j207k609j725
$$ y = [2843, -4049, -3468, 4237, 7442, 3428, 8, 3, -1812, -4287, -182, 6120, 4812, -1832, -5646, -2724, 1233, 1923, 907, 2763, 2943, -989, -4051, -525, 3179, 4189, 1974, 2472, 1205, -1839, -3883, 948, 6438, 5439, -1735, -4652, -3250, -2132, -1801, 1554, 3958, -790, -7537, -7505, -1324, 1750, 1607, 322, -212, -1808, -3715, -777, 4432, 5943, 2886, 1230, 2338, 1656, -1364, 606, 5577, 7020, 1717, -2581, -3528, -1899, 218, 2320, 2062, -882, -5340, -7318, -3952, 856, 1262, -316, -1902, -2078, -4174, -2983, 2007, 5341, 3524, 689, -148, 199, 1557, 2769, 3048, 4961, 4285, -1211, -3737, -1866, 439, 1765, 2506, 1196, -3288, -7190, -4791, 104, 3569, 1230, -1729, -2401, -1687, -1241, 1223, 3204, 3836, 932, -966, -25, 427, 1906, 3013, 4622, 2056, -1046, -3579, -2985, -1110, 1055, 1154, -53, -2662, -4387]
1548d387j555K986M756R72l594k265j239K165L137J584J696j728l384q19J074
1563f01K368J511K7q99j789m241m95L552K961n53k003l011j286L94K383K566Q68
1580A752j734l055k066J974K735K474p5l60l334j876K348K733K036k65k739j792
1596a244k99p22J799K656L55k428k873r01O58J133K686J462k896k475j526J329
1612c286L293J359m09n88r61j613o52K078L080J244k245j672j188q93J841K395
1628A783J057p37l566j261O32J194J742O64O27k317l136j206L980K308N53o03
1644A714k398j303n06J554L105J807k434k274j152J209Q59J853J718r16l468k598
1660c230J555J785J893P82j403j235j714r08J484L106Q94q14k042j481n23R83
$$ y = [-4387, -5942, -2956, 1800, 2772, -822, -3087, -4326, -2161, 976, 2560, 4256, 2528, -856, -1675, -601, 1767, 3278, 3305, 2406, 617, -3624, -4119, -567, 2394, 1841, -162, -3173, -4459, -4065, -1682, 884, 1752, 18, -3037, -5103, -3129, -394, 2080, 2005, 1645, -1689, -3565, -1217, 1516, 3552, 3287, 548, -1244, -1543, -2265, -466, 2190, 2545, 117, -2756, -3657, -2999, -1866, 820, 2282, -614, -3089, -4615, -3286, 7, 1366, 957, 369, -592, -2205, -2857, -779, 2301, 3545, 1300, -372, -1560, -2453, -612, 1783, 2840, 2103, -1463, -2724, -2092, -898, 844, 1508, 2135, -182, -3318, -4524, -544, 1764, 2317, 1714, -684, -1987, -2493, -939, 2166, 3973, 1539, -735, -1887, -678, 181, 2034, 3752, 2836, -632, -3230, -1675, 110, 2003, 2785, 1382, 147, -1567, -2475, -991, 2115, 3009, 2195, 153, -1328, -1851, -868]
1676h68K740K520j716k831k133M85K276J146J349l75k205k502k83J834K735O56
1692B828q93k663j194o67J636L782N03k182k197n33L79J380R98J292N66l183k664
1709b812L55K597J406J875j900j305l209j17K885K578J22j824p69j430j89M61
1725a276K565J451r95k247q65k94O59K057J103j70j546j919o29J986Q63P28l94
1742A077m07j570k234Q22L063K041q63j678j320j339O06J816K468k0j960l186
1758b684J4J730J493J720J10k78l428k713K772K377M29r61l40k887p12L01L394
1775C37J721q53k020j571K09J042P34K478R46k116k592j08J407K111M21j44m15
1792A587l470j38L28K491Q81j153k070q17o93m46K054K187N95k747j608J275L38
$$ y = [-868, 1872, 4392, 2676, -155, -2288, -1803, 473, 1619, 2968, 2593, 388, -2114, -2397, -563, 2172, 2828, 1935, -728, -1922, -2589, -953, 2829, 3332, 1150, -1047, -1580, -1201, 179, 1177, 2469, 3035, -148, -2812, -2457, 140, 1546, 3421, 1521, 216, -2993, -3110, -225, 2353, 2475, 651, -118, -1548, -1737, -1276, 1289, 2740, 1745, -502, -1367, -1661, -1002, 1055, 2158, 1988, 442, -1477, -2106, -120, 743, 1471, 1077, 670, -900, -3134, -2312, 751, 2792, 1929, 251, -1069, -2408, -1802, 14, 2482, 2462, 502, -2684, -2670, -940, 553, 2273, 2383, 2105, -1323, -4036, -1264, 1113, 1542, 581, 241, -2646, -3358, -3057, 337, 2058, 1205, -815, -2386, -2177, -1135, -401, 2077, 3023, 907, -1685, -1793, -386, 1725, 2146, 2002, 1587, -1883, -2021, -1693, 798, 1679, 526, -1544, -2361, -3054, -3500, -1446, 741, 1336, -1411, -3019, -1744, -1406]
1809a406J314J725J016j486k489j076J401L045N59m17j061j217k809P98K275K045
1825B217j236l254q9j50J47J139J609J344j305k352l85J724J123P76J902q16k777
1842c83j527J392J962Q26j141p16j036j589o60K027J658rk121j940J591k26J012
1859h80O18K484j68k331o64J476K315R3K44Q36k045k383n55K475K026j120j856
1876E65j096j240j447J115K948R65l552j401l43J895Q56O89O00J414k065k642
1892b739K237K354M33l91N24r70k734j225K883K620l05k739j942O90j71kK513
1909A036J777k105k427j439K662K015J21M81K38j325j590k26L034J17l78k136
1925a45N66j01k120j77K620M47j645j947M72p40k16J894K406l47l594q69K750
$$ y = [-1406, -92, 1633, 2649, 1163, -1326, -2402, -1001, 2044, 2603, 2186, 1125, -92, -2901, -2103, 172, 2217, 981, -2273, -2362, -2512, -2365, -1226, 383, 1727, 422, -1930, -2315, -591, 532, 1308, 3210, 2394, -383, -1910, -518, 1444, 2270, 1129, 413, -623, -2212, -2872, -845, 813, 804, -1317, -3257, -1666, -1892, -880, -262, 2222, 2054, -277, -941, 535, 2850, 2943, 3187, 4023, 1978, -405, -960, 1515, 3541, 2421, 565, -531, -1771, -3218, -2103, 845, 1810, -1742, -3143, -3486, -1591, -735, -46, 554, 1968, -97, -2739, -502, 1852, 2285, 1894, 2418, 1448, -1286, -2511, 372, 2992, 2687, -52, -1994, -1304, -1475, -1477, 1036, 2813, 708, -1719, -3158, -496, 1519, 1640, 2121, 2359, 1034, -556, -782, 2252, 2369, 1991, -145, 421, 320, -1800, -1977, 643, 1090, -555, -2502, -2030, -2770, -2986, -1092, 1314, 967, -2627, -3496, -746]
1942g46J582R70r44Q01K01k438K67K040K428q95j909n24L97j476j14J930J832
1959C402q79l328l56O64J22K02R38J276j982k909j30L438P51j21r17l47q77j313
1977b366K013J970N12j964o94J44R29j360R43K340O38l579p73K72J218M37N76
1994A256J007l19l364n00K595K344r42q26m91J81j502Q6K739J470j131k808k96
2011e01L33N04P96P78k05k029j968K45J429O99o6o13J3r69j712J349L198J018
2029B299k055j540l30N16J167O28J560n2k402l98J412Q57j210N77J022k17k608
2046g74j189K264J471o97j129r3k9j932N17J370J092o83j201j09r81L73J023J907
2064A200J78j990j435j80J860J062k26l84N6j244j228J021J474J864j100r52K87
$$ y = [-746, 836, 1806, 862, 1663, 1864, -574, -307, 1733, 4161, 3266, 1357, 833, 1230, -246, -360, 1570, 3402, 2523, -805, -1161, -497, -375, -173, 765, 2041, 59, -2850, -2980, 458, 1209, 1088, 171, -176, -1053, -2366, -353, 1617, 2129, 165, -529, -385, 544, -816, 127, 2467, 3105, -474, -1247, -975, 243, 680, 1256, 2263, 1944, -1420, -1920, 675, 3019, 2077, 1251, 760, 941, -561, -475, 2264, 3734, 2603, -205, -501, -168, 336, 1132, 1910, 1705, -324, -2292, -2047, -618, 81, 15, -598, -585, -1554, -3266, -1917, 1281, 2299, 244, -1296, -1626, -1110, 57, 685, 2245, 2193, -209, -607, 805, 1662, 452, 1029, 2051, 1834, -774, -1963, 301, 1772, 1075, -54, -147, -176, -2108, -1591, -221, 871, 188, -1013, -1122, -2103, -1730, -707, 1200, 1378, -612, -2047, -2227, -367, 695, 469, 85, 141, -1103, -2331, -1310, 164, 2028, 928, -24, 263]
2081B63j181p81J195K160j47j332j571R9O26M35O41Q02j91j990j464J469K136
2098A169M21m08r84j293o08O56K197l0q0j728k34N0j50j3J654R28n72k034j428
2117b487J542J519O8n7o27j081j103J253J202J588r25n24n55n91J6R66J843P87
2135B834k466j212k63Q87J065j63k43J14p73j195j98J029Q24m04M91j994r14R08
2153a673J577J565j322j497j58J265m73M96R75L00J38k110RN08Q70O59j70n55
2171D04j372j232O87O36O92r1n86M3p6r75K61K083J972j406k101q76J057J161
2189B81J279n6p75j931J00Q05J00N53K80j59j53k090J40M66K296O2k228j344q1
2208b455J126J600n23Q33J89m63j072m24J540L86J076k44k149j506O84K394J098
$$ y = [263, -918, -1699, -504, 1656, 1509, 177, -1394, -1295, -669, -234, 407, 1209, 1018, -972, -2436, -967, 1169, 1590, 1182, 198, -1095, -1703, -1047, 1150, 1120, 1040, -688, -922, -872, -1022, -1035, 619, 1547, 975, -1059, -2487, -945, 574, 642, 585, -42, -1123, -2226, -973, 229, 1817, 892, 368, -187, -778, -762, 204, 2047, 2834, 368, -844, -1107, -220, 845, 682, 439, 553, -220, -1415, -1613, -584, 240, -164, 327, -1667, -2581, -1673, -96, 1469, 147, -1350, -1508, -243, -716, -220, 755, 1055, 1193, -917, -908, -400, 470, 1129, 959, 404, -968, -2200, -1513, -877, -185, -276, -862, -819, -895, -1870, -1609, 474, 2446, 1040, -1061, -1937, -880, 281, 1560, 1504, 729, -1202, -1102, -297, -197, 356, 636, 477, 324, -1766, -1626, -1160, 1136, 1198, -1030, -2374, -2455, -1329, 271, -252, 581, 770, 307, -765, -1189, 351, 737, 1813, 1569, -580, -2086, -1402, 992, 2090]
2225B090j850n07l51Q8M98K84j01J012j09j410o04m14P41J925m6k30j838p96J455
2244a63J091K31q87j47J71m93q33P42J053J297q02j741q04M66J377R47j10j838
2262d43m14j53O37M37L30P5P82m22j956o19J158K070J104k089j223q0Q57K43N73
2281H67l90m66M48k69K31r46J88J547l51q60k108m4J966J359p04o87o7K17p36
2300h05M35J66P96k12N11j015j903P25J669K508j541k039j060K003p4m52Q06l23
2318A95P66p12j231j062J769J010N42r65j257j088Q85K628n49r89j163O62K49
2335c10L50k22K89Q80L24k549L62j75K317M10p68j100j811R33K287L29j351o09
2353d14M63o7j209N36l2K229L80j666k157J56K162J370r86q78p84Q8J263M8p96
$$ y = [2090, 240, -267, -618, -530, -32, 252, 151, 1163, 1054, -356, -960, -1374, -633, 1292, 1246, 1016, -822, -1618, -163, 928, 1159, 272, 125, 296, -197, -1030, -288, 765, 2062, 1260, -481, -1285, -819, 558, 1505, 1395, -443, -857, -1010, -373, 64, 394, 469, 1251, 829, -1127, -1746, -588, 1482, 2586, 497, -726, -806, 51, 294, 867, 477, 11, 459, 190, 421, -525, -337, 1210, 859, -1, -2109, -2153, -187, 1172, 468, -219, -286, -69, -805, -370, -204, 592, 380, 891, -124, -2027, -1302, 367, 2875, 1334, -705, -1765, 238, 164, -288, 518, 195, 961, 249, -982, -2044, -275, 735, 1277, 312, -945, -2033, -1148, 1480, 931, -58, -1221, -559, -310, 40, -182, 107, 987, 1311, -1238, -876, -1051, 1266, 1676, 908, -192, -2003, -1070, 1217, 1546, 195, -414, 49, -18, -1227, -691, -723, 1506, 1886, 220, -1937, -1781, 381, 1751, 765, -113, -897, -809, 454, 502, -294]
2372b94K31O39M53q29j492o21J147K414r72k274n03O09J990n8l64l08k58L79m86
2391e97M99o04J601L75K95j983j457J476K081nj712j133K15M18j47k92j59J014
2409a15M53j285q82J81J212J525K23j420k729O59K657J024o50j805R39J9l36j013
2427a343j13K413L88p40j427q82J106J171J037j129j445p0R79R13j297N23J237
2444A321j2n77j638o36K174J447n73k076p46N5L98J689J22j616r8J008j6j348
2462a122M00J180J858p30k270n84R85K074J8q19q18J04K9O10L91o98M45P42p82
2481A013j662j008J032J933N46j839j525L32K156l8j30n59l1J040l91r22l03o2
2499d18J942K86j509j719K18J995O95j291o73m87J262r45j158Q54Q39M26P27j819
$$ y = [-294, -63, 576, 1029, 200, -1292, -1913, -766, 1648, 676, -1598, -2101, -1492, 498, 440, 76, -232, -490, -111, -597, -98, -702, 899, 1274, 1569, -414, -1871, -395, 1686, 1681, -31, -1164, -949, -531, -678, -970, -1129, -115, 338, -947, -1829, -1648, -436, 1089, 1312, -108, -2837, -2178, 479, 1503, 853, -952, -13, 6, -330, -1343, -1456, 957, 1345, 605, -822, -1704, -598, 573, 1610, 481, -964, -1034, -55, 858, -439, 84, 1321, 1309, 732, -906, -1542, 632, 2079, 1506, -570, -1316, -1261, -863, 826, 948, -668, -766, 242, 226, -1122, -722, 458, 2316, 1586, -684, -1268, -283, 1791, 1809, 990, 172, 276, 305, 915, 1306, 608, 1053, 1795, 1013, -649, -1657, -625, 1308, 1854, 15, -1510, -1178, 978, 940, 810, 251, 220, 1260, 869, -53, -356, -418, 1524, 1810, 301, -1418, -1200, 795, 1490, 199, -474, -961, 301, -644, -1802, -948, -109, 317, 1044, -775]
2517g75j73J290J408J95l91k203M36Q72J369o20j465J1N98J6j642k0M99J575K50
2536A230k831n58N43J327O50k04j147n11L43J603N8j577J353Q24L34k076j085
2553a724P66K651J7j295j540M3J187J35N25j543j10N06l94L08o39L96J541j9q03
2572Hj969m86K900Q94n15j699l54J487L3m01K04n53J032n56m92j795Q67J226J080
2591I11l63k212n76J765R21l46j270M51J548n01o77k31Q51P52O14p46j364m19
2609h92J019J812Rk304j283K172k15p93n74k42K333j7k271p42O48J554M53p19
2627e2j081j103J536J359K25n98q22J142L67p73j004j36K532L33j481k093P01
2644i48J225J133J01j582q10O33j40Q72j430m30J778M31m08k316M4K235R81j084
$$ y = [-775, -948, 342, 1750, 1945, 1554, -649, -213, 659, 2028, 1408, -57, -46, 552, 568, -1074, -1094, -595, 980, 1230, -1601, -2159, -1616, -289, 361, 157, -990, -1501, -1158, 445, 503, -1074, 279, 1103, 1437, -639, -1724, -958, 1693, 1710, 415, -1125, -1082, 105, 240, 765, -778, -888, -382, -776, -468, -1107, -711, 830, 811, 8, -1961, -2447, 453, 1347, 832, -867, -1221, 266, 299, -102, 102, -451, 581, 25, -467, -2262, -1395, -169, 911, 548, -1664, -2240, -475, 446, 100, -1170, -719, 829, 328, -349, -580, 271, 1023, 1637, 891, -473, -892, 127, 1939, 1948, -356, -1639, 533, 318, -475, -1049, -1291, 1042, 1025, -1246, -1988, -1340, 214, 667, -52, -1133, -2236, -700, 659, 884, 286, -536, 606, 973, 200, -804, -940, 1592, 1925, 444, -1649, -948, 277, 1410, 1511, -71, -881, -248, -388, 484, -946, -1376, 402, 833, 425, -1891, -1847, 388, 1369, 285]
2662B85j599k65J235O53N49o46r64P37J63m69l69M23M10L66l62j054j629K252
2680b84J318p53j481k00J115K71J28n80J02J459L48j359k53m75M48J726m1j421
2698F8j532J005Q19M14j129m68J045l59j10k097J558J014P83j577m27o94J370
2715c17J331l11n68j552Q47R44q7j084O57K82J128r27q57r24J852N70K23j705
2733d98j566J893r2J041O1q77l15J856j978J41p70P81J495n79j153p90J065J274
2751I89P41j189j462M65L66J95p22Q99%O25m17j209J8M38J477J3j586o53L86J602
2771I76P9q98k45o16J022m05k53j112J463R80n33r03p87L04J433J066j396q94
2789g19L6N63Q07m85o23K85N01r8j265j88R37J942j027q87p77L29Q06N13K60j376
$$ y = [285, -1314, -1579, -344, 309, 858, 212, -752, -15, 148, -321, -690, -267, 143, 509, 147, -907, -2536, -284, 1034, 281, -1200, -1400, -285, -14, 114, -466, -364, 1095, 1443, 84, -169, -644, -196, 1530, 1489, 68, -1464, -459, 360, 774, -355, -823, 222, -137, -247, -2344, -786, 228, 1011, -566, -993, -1687, -317, 1014, 703, 135, -1417, -570, 374, 287, -797, -140, 142, 1270, 343, -514, -1438, 414, 984, 1207, -498, -2064, -171, -263, 778, 839, -38, -353, 1503, -475, -334, -1104, -323, 1172, 593, -560, -1350, -285, 989, 1730, 541, -921, -456, -90, 105, -617, 282, 282, 907, 490, -719, -701, -263, 1214, 1227, -359, -1012, -626, 976, 1055, 157, -88, -704, 318, -87, -340, -1452, 11, 991, 458, -445, -1232, -928, 505, 1571, 175, -719, -683, -120, 687, 202, -421, -136, 365, 267, -998, -1186, -249, 1693, 666, -221, -998, -669, 137, 650, 910, -466]
2809d66K50P75K36j110l07J085Q73M04k498K14Q33N66M10o04j300j16N24P27o10
2828a14n46N81K43P00j195l16L47P24J513j861q71j68J011M24o73R6P31k47m33
2847e4m97N82k02J099k46m48j018J9Q74P67m08j021J96J81K1J4K11K7N82l73m86
2868a80k25j71K9J654m72j044j061J071J111k9j301M68M08k95J38r21J295J051
2886A526j175m60o92L57O37M47r4m02j151J053J040o71m14k8P44N07j403n72L64
2905c87J063P59r72j139j70M26M63L31o56J83j58J176j031k68O73M13K03p67r90
2924h48O65M97R63p91m56P3n26M33j40K32m3N60K33o54p78J20R35O40o35j402
2944i22q0P70Q66n95J5N61m01l00L23j228J680l17N66j598n31J09J348P69J59
$$ y = [-466, -216, 559, 795, -315, -622, 463, 1336, 1740, -758, -544, 289, 855, 1265, 661, -639, -755, -231, 496, -114, -660, -79, 164, 864, -331, -647, -300, 424, 1937, 76, -795, -963, 48, 472, -201, -105, 626, 379, -54, -551, 31, -171, 928, 682, 234, -784, -765, 109, 876, 468, -553, -357, -176, -155, -141, 70, 97, 679, 306, -180, -405, -576, -547, 1107, 635, -409, -1470, -399, 712, 683, -618, -150, 258, -37, 101, -820, 475, 1526, 351, -109, -801, -444, 193, 640, 546, 144, -1007, 46, 1086, 415, 1, -27, 717, 1224, -179, -751, -387, 676, 1435, 463, -676, -846, -420, 43, 374, -282, -99, -257, 919, -112, -380, 293, 706, 909, 142, -848, -183, 314, 1277, 486, 30, 103, -423, 10, -130, 102, 59, 619, 852, 198, -580, -460, 475, 1115, 480, -922, -1002, -232, 634, 39, 54, 615, 214, -86, 237, -991, 689, 372, 938, -660, -1191, -1082, 266, 1035, 1194]
2963A194j536p67R49J483j613o7M33j12P67m14j153L81Q72K69p35m37N13m90O73
2982B10O72j118N2K9K61l71R3k13O51l27L89k43o70M63R01o2j064j64N16J22L07
3003D34o12Q58q65L56k12r43L40J92J420q2j497O9j94J261R8j209J096k69m83
3022b42mk66J58K59O70l23q19l00M89J170o11k53j43o1K65K59K86j195J246j72
3042D13n74p42J090K97l62J75n30K43m1R22l90J83l80J85l50j03J12O5P18q59
3062G2N24m73r95O56O38L43r97N31j101J352n62k55J116j079M13J82o02K6J60
3081e1Q84k13l2q48j69P31k03O22r78j93L61j76N82p62m81J831J0j035j89k40
3101e49O76Q72p98j42l62N92J83o27L89l75N46rj318M94M5L93L32o59K70k98P84
$$ y = [1194, -342, -1109, -160, 1323, -290, -357, 76, -36, 731, 317, -836, -455, 417, 686, -49, -486, 27, -463, 210, 882, -236, -184, -155, 106, -265, -172, -385, 266, -61, 328, 85, -585, -122, 779, 717, -347, -511, 5, 127, 434, -178, 680, -185, 171, -41, -984, -644, -452, 968, 886, -611, -542, -736, 525, 623, -586, 510, 241, -242, -246, -512, -354, -95, 575, 252, -567, -867, -378, 792, 181, -72, -215, -276, -11, 248, 534, -661, 585, 413, -161, -903, 187, 484, 122, 297, -233, 10, -31, 891, 501, 684, 304, 489, 139, 36, 148, 213, 931, 72, 596, 123, -872, -216, 422, 765, -232, 299, -802, 550, -12, -267, 849, -230, 183, 365, -237, -211, -51, 833, 620, 588, -260, -429, 302, 99, 721, -257, -450, -89, -265, 317, -445, -926, 905, 915, -120, -309, -549, 127, 999, 201, 59, -303, 289, 472, -155, 234, -141, 405, 396, -922, -428, -383, 10, 342, -317, -47, -345, 439]
3122D39l25k88n88R83l4o61R40q97P83M8k5l28p47J49P49J20j0p78J15M73o15
3143d97N1l51J823n05r63K93j08N71m36J122p18j071L76J91M48J81k12r9L24l90
3163C0k5K90m71P50j45l05m58K05K19J66M17o01k97M64L84l42j00j90l7M77m67
3184c6k79N78K33m59k34j074R56l91Q06J53o35R58j432O31l50R73n2q26Q02k39
3204H3k21N3M22M19o57O7m65K19J94j52J78j32l73M70K3l7j09J37l24k41j1m86
3226i43J137l70P79o6n03N39j126K82l29R21L10r52J8O31o60J54N02M09o16P1
3246A88P2p66J079j12l95k05N03m16j15l1N81K9m18l5l77J91P0N54kn50M07m9
3268B03p96M65O4L08O4k89k13J21Q74l70k31k75K75j22m33k14K06K42j43o2r3
$$ y = [439, 114, -174, -762, 221, 187, -474, 466, -431, 352, 400, 375, 47, -700, -551, 198, 318, 308, -470, -355, 118, -497, -446, -797, 1026, 521, -442, -149, -257, 314, -122, 1000, 282, -789, -413, -222, 226, 407, 195, 96, 420, 30, 5, 295, -176, 574, 429, 124, -334, -129, 90, 256, 673, 72, -225, 239, 623, 281, 181, -9, -46, 431, -36, -315, 263, 496, 37, -197, -1271, -315, -706, 100, 253, -382, 576, -856, -225, -575, 398, 346, -480, 322, 83, -138, -85, 337, 756, 99, 166, -299, -80, 114, -38, 140, 8, -365, 105, 128, 91, -18, 119, -205, -446, -457, -943, 194, -176, 603, 537, 34, 573, -553, -271, -600, 321, 631, -321, -303, 328, -332, -178, 324, 733, 117, 188, 260, -506, 573, 461, 66, -139, 364, -52, -167, -198, 383, 412, -6, -41, -418, -227, -157, 397, 395, -155, 252, 203, -593, -128, -64, 244, 308, 19, -194, -73, 801, 431, 200, -75, 200, 78, -355, -569, -363, -121, -264, -326, -419]
3289d19K00L15m39Q08n86k64j12L72N29K34l10l65k13K07J8L48k94J17M05k57
3309B94m51j87J36L12l06O5k15N45n59P06k33M0r1J59l06K37k36L15k54n30N12
3330d7n38Q68k5k01J09o37O78o43Q47m89N13m06O54p72j27l72O84k66P92j75n03
3351e6l05O59j51m84N40k05rK36j48k07R45j056Q64p84L08m36P36p6l98J0nQ0
3373E8k70q96J195P18r24k40j29k4l09J481p23M07j081R97k62o0Q2j61r7P1J21
3394d6k27k39L8Q79l15q1J00q80R72R5K77n39J07n38j85Q5J202k7j69p04R8j78
3416b75j41R32l85m43K30k86P06l8L31J07o16j00m71P40o62O94R7q04N53m47M58
3437A80o8j23L49m37o8k1N29n66K87K24k65m4j30j95J68L64J3m39M89k31M41m72
$$ y = [-419, -219, 96, -343, 465, -121, -385, -497, -125, 404, 638, 328, -37, -250, -43, -25, 323, 29, 146, 551, 294, -157, -344, -208, 104, -202, -137, -352, 193, -366, 340, 107, 147, 56, 215, -91, 146, -90, 225, -29, -559, -47, -585, 283, 258, 57, 166, -471, 207, -436, 411, -78, 435, 29, 683, -89, -216, -588, 96, -170, 622, 447, -56, -361, 298, 147, -337, 203, -2, -11, 225, 77, -130, 815, -241, 623, -161, 147, -289, 447, 371, -27, -17, -22, 58, -212, -1108, 87, 805, -119, -359, -488, -512, -821, 660, -63, 344, -737, 260, -2, -62, 20, -141, -238, -167, -46, -273, -512, -474, 405, 90, 9, 109, -771, 201, 296, 573, 34, 141, -397, -582, -497, 705, 678, 509, -195, -97, -275, -416, 516, 131, -312, -82, -368, 338, 300, 631, 738, 122, 22, -449, 291, -371, 323, 420, -384, 169, -278, 180, 112, -11, 338, -99, -167, -188, 341, -225, 62, 286, 21, -23, -153, -348, -180, 184, 197, -242, 247, 16, 457, -15]
3459a5J87m43M52l79K03l78P85j69m17P90j306P59j62o5lj87J338q97m90k44J00
3480e41j16Q52K67o22o2j50K13l13J130j87q96N86J49o7j55M29k77M45o07K65
3500C43k33J42k7j13K48o9K01p62L31m3O05q26M81j7o23L23L62n7P3j60jm26O30
3523C82p40P42j7k44k36r49J337L60m51o17K37l9n07Q20O30m62j55k06oQ82j081
3544c20M86J48q4m37L15l93K18M08L15m80p77R31n32M47k35k39Q0m3L0N35j058
3565f85J164m4l95P6K45q63M41j43K85N05r46j89N03n9J00j87j34J47m04J66M11
3586fm41L44K80K66J43l32k51k79j5J57n34K03k07N34M40k32K85m07k08j12J14
3607b58N95j05l93K27o46L88M15m12O76o47k68j56Q99j20j57K83l62k14N29n00
$$ y = [-15, 172, -271, 181, -198, 5, -373, 412, 243, -174, 616, -690, 69, -93, -158, -161, -348, 990, 93, -397, -641, -541, -657, 195, 462, -160, -222, -372, -159, -472, 658, 471, -425, 161, 310, 243, 88, 517, 240, 685, 78, 343, 110, 252, 225, 112, 360, 291, 492, -270, 61, 18, 623, -203, 278, 261, -362, -39, 323, 266, 339, 179, 178, -248, 382, -358, 384, 367, 123, -113, -1062, 275, 635, 184, -433, -196, -235, -742, 78, 708, 246, 91, -115, -121, 761, -320, 166, 314, 230, -207, 108, -285, -67, 341, 656, 176, -601, 330, -202, 245, 10, -229, -149, -192, -162, 373, -685, 479, 435, 40, 116, 361, -502, -61, -204, 81, 586, -360, -549, -46, -105, -5, -192, -326, -179, -583, -417, -6, -447, -103, 177, 443, 586, 254, 3, -276, -291, -134, -668, -465, -672, -138, 302, 70, 355, -52, -260, -372, -258, 337, 232, -161, 66, -580, -192, 223, -189, 487, -160, -428, -584, 315, 195, 38, 321, -41, -255, 274, -226]
3627b26P28m95r1p5M15n47O06l96k09O41l55O1l35j67Q11l12l84L47n15M76K99
3648B77M48l0o85p1k63N01M06m77L72rm41k35R66j205k49Q84l33L03m36l61N59
3669g9L95L67m68q6p3q77Q29m73J018n43o75R96o94M64J94n1J52n49M87m63N97
3690D68q37N45J31m61l60K24L75j88O70o51j6m71J252q10J71n39J372j091P24
3709E08m15L1m2m12L03q32L59M13K5O88p69L06R5k96l87J41o9N29l61N2l03K67
3731a69n66R17k91R21j217O67J22m89j3L78l86K82m5j7q76k27J134m19J89j83
3751b88j07n4O34p02N25J99K06n67q1M03l09J082j12j444P48l05K7N52l04n4o01
3772e52O5L83j37J88M57l66j63m9m80O43M0M54q5j74J48j01n78L81n2K17q56P32
$$ y = [-226, 502, 7, -84, -159, 256, -291, 315, -81, -290, 351, -4, 57, -278, -445, 366, 54, -330, 17, -498, -22, 277, 725, 695, 10, -61, -324, 177, 583, 106, 478, 469, 28, -207, 759, -446, -695, 189, -144, 159, -277, -638, -79, 316, 683, 215, 129, 56, -821, 8, -465, 553, 10, -665, 331, -363, 101, 295, 244, 396, -153, 334, -129, 468, -369, 176, 307, -154, -514, -290, 85, -103, 567, -84, -100, -571, 681, -129, 42, -497, 875, -216, 508, 93, 124, 82, -330, -27, -859, -500, -87, -62, 626, -143, 163, 258, -38, -425, -284, -353, 176, -185, -133, -436, -169, -735, 182, -109, 812, -405, 262, 384, -105, -118, 260, -126, 156, 111, 94, -782, -1009, 125, -294, -105, -288, -395, -449, 185, -517, 8, 207, 413, -154, -235, 168, -141, 941, 829, -615, 133, -172, -145, 407, 103, 49, -552, -487, -104, -241, -53, 404, 38, -125, -174, -654, -11, 29, 483, 398, 224, 372, 271, -307, 74, 22, 239, -617, 115]
3794A15r5k55J09M57m90m68j11Q97J33m46M9q10J412j58m91m1J63O0L41M71l53
3815D89l10J98m36J36N33p28j73O41j008N47L84j70K08k99k31J61J50O38p57l28
3835c55Q8J12K57j79K3p0N4O8j23L76O02l37k52p52L97l98N70j72Qj36j24O96
3857C53j22l50M47r7J5J6k34k86Q12l68K48o27L78k2n69L19M27k86p65L18K36
3878a57N31k92k53P70j001m1M77k02K38l90j17L91K56k00N02m72l86j0R35p97
3898b18M01n35O72k85j94L74k23l33O41m27J143n63q94N89p80M50Q7J77k47r9
3918b64n85R40j14N01r60N96q2J10j009R78J20n93J108q10K83J86j246J220l75
3937DJ12O8q83J177l76l50m16L38N28k66K60j94L28O2l3l60j71M72p37Q2j68L59
$$ y = [115, 20, -235, -126, 331, -159, -627, -738, 159, 292, -154, -105, -915, 497, 339, -152, -193, -30, 30, 371, 842, 489, 179, 377, -59, 77, 610, -118, -291, 350, -658, -111, 273, 103, 311, 12, -219, -58, 92, 730, -27, -355, -267, -155, 102, -77, -54, -124, -70, -2, -125, 251, 853, 516, 264, -488, -91, -489, 81, -91, -83, -219, -343, 353, 231, -119, 328, 231, 246, 262, 28, -258, 554, 186, 434, -193, 185, 163, -406, -87, 340, 54, -711, -393, -157, 374, 82, -171, 599, -402, -443, 34, -168, 70, -320, -437, -46, 210, 10, 512, 40, -346, -356, 579, -218, 183, -352, 320, 35, -159, 215, -8, -341, 300, -127, 1016, 453, -441, 148, -632, -182, -95, 82, -165, -264, -849, 91, -23, 478, -482, 114, 32, 142, -867, 111, 231, -362, 746, -64, 219, 405, -841, 379, 4, 116, 184, -699, 478, 102, -248, -664, -326, 202, -64, 196, 2, 330, 392, 359, -1, -172, 300, -437, -355, -523, -164]
3959a64j0n47R66k38N24m41l34O96j223O62J15J32L99k44l74J93n10L63r0m24
3979e49Q93k95K31k44k9o9k71M96L54m16M47n7n56M12n08K85l26J04J9M88K23
4000F32o07J88l6k46l47L91K70l60P3k44J064r49j41k30P34m78L80n67N95j58
4020c6j21l82R77j83L9J78m57J34l84P12M30o68l09J29k12P89n88m07M24n4n77
4041e66N39n73J084l76N41p54M1M64J95l98j42M5J70l12L82l60o6L83j61L52l1
4062D57M29l84p80j39M21K07l33j2N13l12j16K48m93LK27J96M30r06M00j72k09
4083c25M69L86j80j50K99r36M83J62j4q25Q30n00Q07p0Q1p09j25P81o69K84j60
4104h1K71o6j10J56k56%k28K19K29J59o54N15l43L29J33j57J2Pj15k95j45N42
$$ y = [-164, -174, -721, 245, 7, 531, 90, -244, 452, -771, -109, 6, 138, 537, 293, -81, 112, -398, -35, -125, -549, 344, 49, 280, 36, 7, -62, -333, 163, 517, 101, 548, 491, -65, 347, -161, 124, -202, -98, -79, 409, 632, 25, 213, 177, -69, -416, -25, 245, -115, -42, -286, 778, -171, -312, -542, 192, -286, 94, -473, 122, -36, -157, -539, 438, 255, 294, 472, 15, 149, -235, 477, 907, 239, -70, 59, -153, 636, 48, -359, 65, 11, -566, -27, -600, 484, 108, 649, -105, -64, 400, 595, 197, 55, 100, 270, -42, 340, -20, -86, 297, 136, 488, 457, 886, 502, -278, -417, 4, 211, -122, -134, 379, 67, -49, 199, -294, -291, -64, 132, 562, -344, 56, -116, -325, 144, 530, 350, 200, 499, -437, 46, 208, 194, -631, 199, -301, 506, 436, 517, -192, -317, 464, -205, 79, -81, 190, 124, 14, 170, -86, -86, -314, -95, 134, 293, -361, 154, -189, 140, 273, 116, 128, 135, 20, -275, -420, 122]
4126A22n53K0Q58j022J061q60M70l18L44n08j5j43L11J66M97K08o50q7l27Q23
4146C97m24N23K86J6m08L61n38l8n60N88j72J59m11j52P59K9k80qJ03J27K3q37
4168d57Q82k51m98O05k74j21k05M0J002j204M91n17N07n26O92J142j410K31%j88
4188e9P06j007J54l40N34j30J71P27r60M06q79L07M52N63j173L47m20J118m33
4207H4m91L52K00RN8o3l21J70j53L31r7N77q77j89q8J75J52P33j472O83J76K19
4229A68k13J79o99nO42L28l65j44l68Q22J96o73k76L94J92l20N53l14p57Q26m47
4250b81Q9M01o39K0N73J63p87Q37j3j37k65M13j19J49l23l64M52Mk33L11m71l99
4272f19J197l50j12m29k56N07k02N32o44K82j84Q76o22L69r0l11j80J32J54j44
$$ y = [122, -431, -411, 447, -575, 486, -374, 96, -222, 122, -386, -401, -544, -233, -67, 430, 638, -12, -99, -426, 397, -27, 496, 782, 798, 390, 751, 213, 175, -385, 203, 31, 190, -221, -373, 386, 415, 135, 127, 230, 357, 380, -457, 425, 174, -324, 281, 7, -114, -319, -279, 723, -481, 10, -507, 0, -526, 166, 1308, -102, 129, 129, -59, 647, -360, -206, -546, -12, -142, 29, 756, -204, 202, -677, -370, 82, 645, -528, -181, -601, 517, 84, -407, -55, 145, 154, 212, 149, -172, -2, -155, 176, 79, 656, -221, -410, -498, -323, -171, 562, -910, -227, -51, 168, -45, 134, -565, -570, 72, 400, 35, -109, -477, 345, 541, -132, -408, -14, 178, -142, 411, 97, -660, 166, -281, -192, 209, -430, -410, 163, 326, -461, 376, 363, 226, -39, 374, 255, 404, 81, -283, 169, 173, -60, 251, -220, -619, 578, 228, 116, -313, -569, -62, -264, 268, -376, -94, -278, 598, -24, 345, 255, -56, -236, -104, 50, -94]
4292i4N82L7p17J07N53O58r59N84r46R50q51j82l17N07O27o01M55l56n5k5J28
4313H5l26J009l76k57k06Q01j149P01r16R51r03M60R09m85L5L00L1n74K8L06m58
4334c4o61J436m95n3j47k57J08j97J085r83j44P69o31j96R14q16R1M21k78M63
4354C95m89J46N31m54pN34o09n55J36K51N12K84r81O08qp09J66N9M10l58P73q93
4376b58L24n7k98L12k81N4j24L44k46N91j23m28o0J88l9j02Q09o13J17j4N98j145
4398d51N19j60n0J77L53k15K6o18n17J141o25k38P21j18k80M03K58m59K7L01N41
4419G36j465M09J78j97J42N84p8j85l42q9l08M92O03k57j052R60p4k56l09M37
4439g1L23k34l77N29j2l71O58j90M7m55K45p51P47L18m28o3M75p11Q58p07K1j54
$$ y = [-94, 488, 525, -192, -85, 468, 1126, 167, 751, -195, 755, -96, -278, -595, -88, 539, -62, 393, 37, -18, -43, 85, -241, 768, 392, 135, -71, 730, -419, 282, -634, 317, -586, -126, 783, 298, 333, 633, 664, 90, 118, 424, -34, -695, 741, 246, 193, 46, -211, -103, -300, 785, -198, -342, 427, -204, -400, 514, -302, -211, 210, -68, 395, -94, 52, 583, 129, 122, 656, 47, -508, -372, -121, 391, 675, -306, 302, 294, -415, -249, -190, 220, -138, 635, -258, 66, 9, -289, 23, -258, -204, -328, 16, -230, 361, 238, -190, -250, -62, -101, -203, 606, -7, 110, 96, 694, -451, 68, -92, -142, 35, 388, 173, 199, -419, -936, 205, -420, -658, 63, -55, -335, 68, 326, -133, -106, 195, 736, -729, -320, -142, -339, -197, 387, 309, 124, -218, -307, -615, -123, 480, 223, -829, 131, 57, -199, -508, -71, 252, 18, -359, 170, 158, -213, 445, 255, 302, -153, 92, -659, 88, 406, -22, -85, 390, -321, 537, -170, -149, -303]
4461c03M74k77P04m04j24N0k79l43L92J038q97n38M19J84N46o54K74j4m15P11
4481E44p40K19K84k4j027J330o42J73P5j04L1m43N03k12M04p07p2O32k11J13j42
4502a6M33Nl28m82L36p3J11J34n37P52m16m25M47o5Q7K95p55Q76q98Q79m42J22
4524D0l91Q36q06L85k1J57l84K7pL02l85o3J064j431O17M85J8K19o08j03L35l61
4546g5k99j6M06k50k94O43L09J48n77nM36o23M51%j47m02L8J197q99j91J8J17
4568a5m11N11L24j94j45o80M06M04J18j59p07Q42m13k05Q87n59j42k41J63K14
4588bM70P3j13n56pk4p4L2OL4J38L14K85q04P2K09J18k68j55J05n0k88N47j91
4612a29L22n82j08N39j12J32l89M4J38p4N47l23J56l76O78J60o14P30m78o34M35
$$ y = [-303, 171, -106, 598, 194, 70, 120, -159, -502, -110, 928, 31, -507, -88, 96, 642, -12, 262, 248, -167, 544, -196, 23, 307, 283, -744, 586, -56, 117, 192, 88, 119, -324, 179, -33, 371, -336, -408, 224, 13, 126, -16, 417, 422, 94, -388, -52, -125, -14, 120, -417, 335, -81, -506, -59, -124, -37, 258, -497, 379, -519, 360, -82, 40, -351, 485, -321, 64, 43, 200, -184, -157, -164, 138, -247, -310, 754, -677, -60, 425, 443, 662, 54, -49, 286, -75, -374, -390, 16, -234, -528, 115, 424, 572, -5, -10, 426, -197, 254, 254, 107, -295, -257, 940, 41, -150, -132, -15, -426, 85, 409, 215, 70, -610, -204, 200, 318, 159, -548, 294, -119, -324, 563, 4, -138, -379, -216, -2, 468, 541, 428, -128, -135, -159, -233, -201, -195, -161, -23, 291, 576, -228, -156, 53, 171, -97, -252, -147, -197, -485, 62, -129, 193, -389, -497, 42, -70, 62, -327, -283, -145, -219, 328, 5, 161, -215, 463, 623, 9, 739, 261, -373, 62]
4633F2J47o73J006j15l69J59p1L37o23k93M39L69p1k00k75M0o42J063k6j046N93
4654a89J22L45j58j14O06l19l22k27J047m93n38K58r5P05n17l6M65r92j1L58m06
4675e11NP09K16m45J22J3l20L55j67J53m20R13m62K08p37L56K08k52n25L76p7
4696b82N07p30M12l39k75R70m25j77J80O34o06M82K15r77M49K0L52J16n95l22
4716c91j06P38n67N65k21J43n41M64l01O91m43j4l32J07n55Q91k26j5J97j81J5
4737h2k95O70k03o33N55Q8J43l01j2M14j00k18m18L32j3J64k26J47k43L31l8L44
4759D06o0J21m77l87M69l75J154j048N56n77J95n41J106j92p36M39J94k04K76
4778C19O3p08KL43n09J13M24m70N97m00N18o34K28j33N12n96N46M54m54M3n2l58
$$ y = [62, 209, -464, 542, 427, 58, 217, 146, 483, -140, -433, 6, 375, 304, 104, -171, -131, -773, 290, 264, -782, -189, -67, 278, 120, 6, 612, 293, -29, -256, 791, 298, -240, 18, -77, 628, 111, 75, 540, -452, -463, -105, -511, -506, 203, 419, -26, 96, 109, -211, 144, -23, 130, -290, 623, 161, 369, -368, -12, 196, -56, -581, -205, -282, 225, -505, -93, -432, -707, 263, -162, -339, -159, 475, -131, 351, 566, -411, 38, 58, 410, 526, -69, -391, -497, 241, -326, 239, 18, 161, -380, 84, -217, 474, 31, 17, -315, -208, -763, 128, -98, -113, 84, -97, -82, -377, 293, 90, -543, 12, 100, 243, -58, -70, 344, 244, 26, -392, -60, -73, 91, -135, 12, -231, 100, 62, 406, 346, 467, -10, -397, 72, -303, 851, -197, 359, -218, -23, -564, 542, 350, -386, 53, 247, 43, 319, 382, -326, -324, 19, -490, -377, 47, -423, 174, -226, 292, -342, -114, -247, 265, -331, 215, 669, 215, 258, 206, -152]
4800a52L3L23m89N07n03r0N36n07O17m26M38J66l23j63rL35m32R6J66m0j44N40
4822D79m29J69p58O72n41J041o97j22M22m76M33K70o6j93k60k09M33n53J167j223
4842d41N25r6n25L08R23j21q98K09Q0k1k05N79o84Q59Ko29j90K31M13m11J81R5
4864A84J84m96K78l90K86k48M3m41O30K46j68l52M25j26rrk49L41l39M77k14n98
4886e45K51L03k96l24P45k04n41M76k68R11l26q56R72m74O44n72p3r0M05J37p0
4907B05n80J68p4J167n63l10j93J13j44J92j18P39n1o43k80N17O44j042m69J134
4927D12O4k54k19j57j06j4M57k24j96M49p71J71K53L62k86j74o12P38o3J72J94
4948A96j89K26o20M3J14M33k77K04R36j355l15O69l25O31k19l65J65R6R4M05k7
$$ y = [-152, -119, 204, -285, 222, -281, -371, 165, -342, 275, -151, 287, 453, 130, -33, -42, 293, -139, -43, 123, 83, -61, 479, 50, 219, -539, 133, -408, 633, -64, -186, 236, -240, 193, 463, 397, 204, -56, -265, 168, -385, 782, -441, 84, -12, -537, -229, 694, 573, -325, -116, -36, -57, -262, 317, -367, 492, 494, -135, -325, -94, 319, -92, 89, 184, 368, -128, 150, -240, 46, -202, -159, -600, 30, 276, 108, -244, 181, 55, 46, 37, -212, 129, -210, 267, 53, -545, -294, 9, -287, -611, 134, -70, -611, -135, -403, 508, 182, -674, 298, -176, 468, -104, -177, -267, 138, 275, 205, -375, -207, -281, 886, 323, 13, -180, -67, -211, -19, -137, 602, 551, -92, -372, 145, 789, -253, -722, 412, 476, 222, 3, -154, -260, -274, 183, -41, -237, 212, -559, -388, -135, 227, -59, -233, -845, -107, -170, 2, 196, 7, 233, -387, -344, -230, 203, -74, 130, 1066, -289, -604, 65, -260, 371, 152, -213, -48, 48, 142, 547, 520]
4969E20o39m79Q90l66J19N26j04n50j31K16j16Q34o65m02J75N23o5q5m40R3o3
4990b09N50m35N74j163Q24K94p26J383m21j224N94o43M97P47k21n54P86o25n66
5009e38N83k88M78J09n86J94j66j05k20K84R00k81j33p64L21K43oJ11k95j2l37
5030e08K19J23J16p7m31R44m66O05m11J22k31J06k7m16k9N00p64M79L08L5J79
5051C76Q6k97o60P11o66l34L22M98l30j31O79n77J65k47O15q8l02J5M50l27K68
5072B26P9n33L28m82N96l36l2L45J58n3j67R5j59m23J69Q45o31K94k33p3q1J4
5094e4m12M79j4K60r9m37J80k77Q29m56K3k65L25L2L78n3k1o37N39J5J97J3p88
5117b43M18j30q87O85Q55j70r19Q8J83r2K35R6J6k27J68o2j20O1Q9L25k77j68
$$ y = [520, -119, -598, 292, -74, 45, 571, 467, -83, -214, 2, -114, 720, 55, -347, -172, 351, 286, 201, -239, -146, -209, 341, -94, 480, -683, 141, 435, -291, 1092, 671, -553, 41, -602, -105, 642, 421, -133, 653, 28, -538, 45, -243, 235, 344, -242, -48, -214, -319, -539, -255, 645, 364, 231, -533, -212, 31, 25, 136, -159, -171, -508, -289, -166, -50, -127, -558, 386, -80, 525, 114, 236, 5, 111, 84, -332, -361, 139, -625, -146, 162, 197, 376, 462, 165, -495, 216, -450, -784, -462, 36, -294, -425, 254, -323, -158, -405, 210, 122, -180, -165, 285, -42, 226, 305, -228, 100, -382, 214, -122, -154, 191, 349, 296, 129, 224, 65, -358, -189, 656, 25, 319, 86, 13, -68, -54, -466, 13, -1, 259, 160, -277, -97, -374, 455, -1, 22, -243, 82, 114, 492, 439, 418, -219, 320, 335, 532, 545, -243, 175, 45, -842, -157, 698, 528, -391, -303, -120, -212, 23, 119, 135, -92, 76, 14, -106, -45, 44, 369, 92, -76]
5139g6R96j162Q19o37j16J05J30k43r3L74l21J10l68N24m71L2N44j40m5n1m1K29
5161I9o55M54M58k89L02p06R8J001m62L3O0l01l62j7L35l1m14K82L97J94m29j94
5183a47J60o4k58O66k3p56J50L39L75p81j41L82k87J440j469L9O34K91r43N67
5203A74L44p86K43j77P39l20m11K28j1K08k13L0o02P42k66L9k61L91j75P0K6M35
5225D47L5l10l82K01K45p65P16n60J66N4n24N14M13p95R58m99k43N76j09p29Q16
5246B25n78j3M05J40j36M13n22p1N67p58L20K23p49P15J88k4j83o78M36L35o16
5267c61J008n24k96J14K65j94J20K2j78j92J42P11j356M01R63m10j86J66o20l26
5287g31Q93j22lJ56m52N10m05J80M49j69L4n75M37k08j9K58k94L6l68N37m20Q94
$$ y = [-76, 920, -242, 577, -60, -176, -71, 59, -184, -277, 97, -224, -114, -482, 42, -429, -397, 147, 7, -38, -89, -130, 99, -556, -102, 356, 67, 369, -337, -239, 762, 300, 333, 393, 92, -270, -287, 48, 17, -397, -115, 282, 476, 47, -147, 13, -51, -309, 357, 334, -422, -272, 67, 442, -339, -480, -98, -385, 1055, -414, -375, 259, 550, -393, 174, 518, -268, -25, -202, 537, 217, -194, 34, 23, 231, 18, 48, -554, 188, -78, -39, -300, 91, -84, -14, 12, 447, 482, 172, -210, -9, 236, -529, 187, -373, -207, -153, -677, -163, 250, -545, 413, -86, -329, 247, 138, -591, 225, -353, -366, 39, 179, 43, 456, -66, -137, 430, -328, -8, 215, -534, 181, 369, 345, 162, -516, -80, 255, -361, 647, 123, -173, -59, 206, 12, 132, 154, -24, -216, -74, 637, -719, -318, 645, 235, 49, 215, -405, -731, 162, 40, 37, 193, -259, 251, -154, 26, 475, 306, 340, -235, 202, -6, -25, 233, -61, -25, -393, 144, -276, 618]
5309F18n43m7l84L44k26l83P38k09j98J42N4k76l89O23L81q02J27Q96q00l1J47
5330b18J58%j33O39j55l49l72j48M41K76j81K18l57P66j313N78J41Q03q72K71
5350A93m21J84l4k89N08o06L25J1N89m74K10o6J97M06j259P71l74R7m23J98m55
5371g12P11M75j42m88k26J97M13J2l4r9m46J73n23L01K02j72K46j23L16l70n0
5392c39R27j075J088j50M2o56L08o16L97J70Q34j307O43L99o51j55m40O73n21
5411d29J13P09o07l67M16m67J211j73o03j60M58N0o5L09p04M01l74j76P5O56j99
5432G4P3k07N41j131K71J14P68n94K25o63Q82l71n69R37n51Q90r20N27n87K93
5452Bo62M40J46J94O0q20J265p71j18M64j68l74r2L18l17P17l84L63j30l19j44
$$ y = [618, 75, 28, -356, -12, -238, -621, 117, -92, -290, -148, -94, -370, -759, -136, 245, -557, -430, 466, -334, -365, -218, -60, -60, -193, 446, 291, -58, -430, -578, -137, 139, -42, 176, -181, 585, -728, -150, -9, 794, -78, 193, -228, -44, -78, -367, 141, -465, -140, -129, 460, -14, 196, 130, 327, 733, -526, 245, -129, -32, -455, -257, -712, -1, 474, 332, -156, -382, -185, 228, 240, 206, 107, -339, -166, -689, -388, -186, -358, -112, -235, 81, -289, -339, 588, -487, 601, 451, 493, -163, 145, -471, -74, 96, 930, -377, 266, 665, 14, -141, -581, 92, -429, -316, 393, -214, -581, -165, -632, 579, 406, -197, -357, 101, 151, 86, 395, -309, 92, -282, -458, -383, 273, 74, 147, -60, 481, -650, -379, -265, 503, -91, 134, -529, 353, -18, -587, 350, -201, 689, -231, 296, -291, 2, -660, -220, -74, 120, 180, -640, 625, -146, -264, 200, 32, -342, -434, -116, -433, 284, -100, 263, 133, -186, -330]
5473c30P74m79L87n70L23J3K39q21Q88n99J07j08r0P12m84P2m60K26K54O06o97
5494c7q5J24K55J58n54j08P48p20J301j660Q88J93p55R7J48K51o40M49o25J129
5514E57l80K48m70m14q9M76J3n69J167l42j20o77j37Q12m17R71j168Q34J52j153
5534g06J02N70o7j99j28O08l41l59Q06K49r0q45O38l80L14p55J010n13K36K79
5554D29n07Jj98n42P20j9k82P01o80O52j52l4l48l91J157m83j41J57r4L29j6p17
5576d58J56M17j40Pm85J021o92j22O30m0j27k27N25p04K54l29j24m8O12n38L89
5597b3j58L77j34J59J74j029P78P3j85K3l17P16k63j95j18M12j76k4l29R1K43
5618I5J8j97N33p25j87M47j74o6l66M1M43l88m27K20P89J8l09Q4J66J077j176
$$ y = [-330, 444, -35, 352, -218, 105, 118, 357, -464, 424, -175, -68, -176, -266, 446, -38, 34, -426, -200, 54, 660, -37, -122, 2, 257, 415, -139, -247, 501, -219, 1082, -578, 310, 503, -252, -155, -7, 244, -396, 53, -572, 557, 177, 425, -45, -459, -548, -72, -59, -628, 539, 197, 77, -600, -737, 75, -342, 629, -539, 295, 447, -706, -604, -34, -101, -300, -428, 180, -161, -520, 286, 535, 445, -400, 238, -142, 172, -583, 427, -86, 150, 429, -78, -77, -275, -817, -97, -116, -398, 303, -377, 275, 123, 89, -259, -650, 507, 24, -117, 40, -54, 275, 259, -458, -302, 115, -25, -18, -503, 518, -174, -296, 334, 294, 167, -60, 465, -239, 15, -314, -438, -486, 126, -412, -23, -181, 196, 62, 221, 395, -634, 144, 217, 32, 55, -262, 454, 191, -4, -122, 290, 114, 90, -239, -148, 95, 113, -84, 449, -276, -463, -16, -190, -256, -622, -581, -138, -526, -953, -733, 56, 74, -235, -151, 15, 1092, -84]
5639h4N97j078L24q8N15j25P28j468P45Jl38k03M83m58J105j759P63k8j15R56
5659D73m65n12O12J49n9l5k34J60N93o96J45l85O69m15l49N1q9m1O44m99l72Q17
5681A62P6j18J33k69n00M34N71k96m35k56N71k31J78J87j37m94l3L07M11j56o12
5702e07R49k51m08q4M73m93k3k28P52L95m95L12j53j35l65P62m14jk7k04Q6L57
5724B98n22K80j25l29L88K96J52r82M23K0O54j431P76M03n78M84J89l28n06J111
5744F73r08J48J61J76l38J63J34p4n19j20L47L25J38l98J14l41N41L96j097K72
5764b07K08m70J066r94J04O74k13J17m87J52L37L3L39p58m91R18k16q23O14J73
5784G6m94O04L54q13N92j138J364o42K70p16J50l65J83J56Q57o84p8O95k31m00
$$ y = [-84, 513, -565, -241, -329, 186, 61, 789, -679, 66, 67, -271, -474, 9, -449, 656, -1103, -340, -368, -483, 473, 8, -504, 108, 257, 198, 163, -71, 89, 682, -14, 131, -254, 415, 0, -349, -298, -387, -428, 216, -283, -655, 162, 238, 120, 253, -16, -516, -82, 489, 193, -242, -498, 73, -158, 20, 207, 70, -424, -457, -150, 261, 105, -507, 442, 191, -217, -301, 172, -321, -344, -572, 180, 575, 80, 392, 239, 104, -261, 501, 87, 86, 59, -145, -59, 298, -224, 56, -69, -398, -10, 286, 438, -544, -121, -101, 553, -878, -102, 301, -277, 207, 396, 68, -438, 673, -235, -87, 74, 250, -88, 75, 209, 135, -384, -504, -157, 168, 306, -92, 22, -319, 222, 618, -479, -207, 1, -469, 597, -397, -293, 381, 168, 285, -202, -50, 287, 320, 659, -99, -590, 328, 112, -711, -97, 76, -418, 186, 540, -273, 319, -819, 545, -97, 173, -543, -393, -758, -575, -419, 438, -246, -324, 371, 140, -260]
5804b60j84N50L80j83N64p30m05k46K9J109p72J43M24n2o99J80J24M12p03R55
5824F36o62oL72m12kr1R0n62M48JM69J5m1J19j82p64J058j76l58J76l31P31m75
5847E3K26O2j9o72N70j97k85l4J09n0M92J61n44K39L72q9r46m59J058o15O54p3
5869A3m7K05N21l07n0n7L90j036N81n6p09P04k75n17J063j04q11O58N76p70k74
5890c02L40O83j418J004k31j40p7l01M36j09J37n14J48OL02q48J122l85N60p65
5910c52K86K77J85o44k2K56M25n40L8Qj92M57N16n34j0l3j80J98l43J30N8N68
5932E52r16M44K15K05J95q56J24m76K98o9P09j09j88l48j35N29l37O5J69L79m12
5953C8n18K39N01n25m18J291n19j31M13l67k46J022j031m4R85j384O89j46l4O72
$$ y = [-260, -444, 106, 486, 303, 867, 137, -268, -514, -485, 624, -148, -5, 419, 367, -332, -152, -28, 384, -319, 636, -26, -32, 340, -72, -74, -165, -75, -637, -189, -188, 281, 296, 255, 374, 192, -572, 486, 310, -48, 128, -203, 528, 53, 279, 341, 322, -350, 220, 23, -262, -296, -187, -237, 255, 416, -128, 111, 483, 394, -552, -1011, 47, -568, 86, 13, -34, 171, 692, 385, 335, 278, 668, -368, 213, 157, -552, 152, -123, -640, 423, 319, -492, 166, 742, -28, -302, 38, 721, -697, 307, 76, -64, -141, -442, -6, -115, 22, -492, -344, -338, -36, -884, 238, -147, 413, -352, -66, 211, 396, -248, -270, -14, 411, -129, -91, -83, -275, 182, 698, 164, 154, 121, -59, 139, -204, -74, -16, 552, -364, 80, 295, 500, 695, -161, -37, -513, -215, -284, 425, 316, 128, -220, -355, 174, -163, -98, 71, 450, 38, -480, -241, 260, -265, -683, 608, 89, -42, 371, 4, -242, 780, -251, -295, 690, -694, -5, -151, -185, 487]
5973D87n64M78n38K35k5N05o44k41R22m92J84K04j68k42J86n45l77O64k57M28
5993B00N2n68p35J424j28l78k37O73J03j151M64K79J81N86o26k60J10j63M34l82
6013a22j97J031o80L26m08K90l29K21m48P95n38k20J63J45j97k10M07j84K99l10
6033a66K16o74N36J81m35N12j85j70k77M27J42N8K73l50j74N22o0J12m94K71k2
6054B43P2n49K70k24J9M05l52L90n08m9R24o78o6j76M57k84j89k53J176l27J64
6075D65n00M68l46j98r7N85n72j04L10j82L75O3j56j08P4K1l12j63j93j75J168
6096D23m88j05N95k74r78P44L95k53L37k17M82o60j79j60O18o29l9K81J48P3m41
6117c27O17q55N38k61L69K1L6K48k22j01o09L60j57j36K88L01P7J71k30m7k84
$$ y = [487, -77, 401, -137, 98, 73, 578, -66, -307, 615, 123, 307, 511, 343, 101, 287, -258, -635, 29, -228, 200, 252, -316, -1051, 373, 245, -133, -370, 303, 406, -745, -281, -2, 179, 765, 139, -121, -11, -174, 260, -122, -319, 712, 32, 358, -50, 240, -89, 132, -316, 479, -59, -279, -116, 29, -168, -378, 29, -155, 144, -166, 50, -624, -88, 93, -342, 170, -15, -185, -462, -35, 107, 165, 438, 88, -86, 436, 376, 488, -6, 265, 243, 315, -234, 36, -188, -169, 236, -116, 274, -234, -283, 641, -37, -103, -279, 178, -106, -295, -548, 628, 301, 465, -35, 433, 87, -111, -208, 377, -195, -299, 11, -171, 204, 267, 111, 3, 77, 98, -214, -377, -570, -745, 423, -65, -170, 425, 151, -827, -83, 312, 59, 396, 179, 661, 1, -178, -338, 280, -349, -388, -107, 41, 114, -327, 290, -565, -27, -288, 81, 102, 138, 386, 164, 63, -546, -186, -343, -479, -191, 110, 187, 358, 128, 81, -203]
6138b03N63p82N94j03J59L7p41P3J21L57k34P21q82J105l42n02P06o18q1L02k85
6159c5n03P32l81l42N50l09L94o9p56J81N84k03K48Rl28k77R03l02l23N79m64
6180a12j49O11p18m0L43J6m1N7k51jN22o80oP09Q0n17M20j17j9O8j44p7m98Q01
6204B57O51m99m96N30q72N48%m43J49k6J91r3J56n49O86k88k52N90l37N8j36l83
6226e58R03m44j23J05k80M5Q75n92K02R4o2L09j36J25k0n16m3O12k77k43J96p07
6248e35Q32j06m71P72m43n14M79k25l88Q23L52r17L40M39q52J66O51p15N99k15
6268G2p44J000j04m01M69n55j62N86k88K73K40r71O86q33Q99o79O25J05m41R9
6288a24L58R0J8p58R79n47O38p26K62m56Q54l59n65R51j83j91l97P4l04Q25r42
$$ y = [-203, 360, -422, 172, 69, 228, 265, -476, -403, -282, 75, -159, 562, -320, 785, 443, -59, 647, 29, -52, 250, -35, -538, 194, -187, -529, 21, -288, 106, 37, -719, -538, 46, -157, 91, 100, -228, -505, 398, 96, -227, 352, -112, -261, 350, -368, -408, -65, -49, -90, -33, -284, -285, 237, -443, -449, 260, 340, -177, 243, 126, 107, 175, 31, -46, -544, 257, 908, 409, -87, 443, -429, 119, 119, -324, -175, -201, -10, -103, 53, -496, 190, -98, -350, 240, -97, -39, -175, -558, 345, -99, -222, -117, -397, -352, 523, -69, 133, 227, 165, 474, 338, 463, 443, -73, -116, 496, 219, -24, 172, -535, 297, 191, -280, 492, 49, -465, 14, -211, -599, 224, 576, -341, -1, 438, -414, -248, 403, -312, 287, 72, -672, 328, 224, -177, 292, -263, -425, 161, -127, 146, 386, -585, 101, -732, 167, -512, 113, 218, -223, -124, 234, 324, 342, -416, 563, 16, 654, -72, 190, -266, 588, 229, -336, 615, 432, 241, -156, -82, -386, 439, -503]
6309e03P37m68m2l21N01J93K60l58k12m0R42m21m76K16l5K51l42L47j14k76k6
6330a87K04n96L66P34n07L89o74L07k46L94l18N24R2o71P11j122J073o71l85O22
6350C9j42K62j15L30j101Q49nPM46r16J343j186K08O32j380J161o13P25m51n0
6370D3PQ4K14l29j18K98j5o24J67L76m12Q87o12l24M33Q8q9K1j49K54J6m67K24
6393b7P6j84O6N32q47J46J31L38q61P38j5K8m85n75P55l62R6O70J80n73L14K34
6415C75p92J17J78L31j76j48o30J020o78N37L56n43k78m44R04m07M52o26L33P05
6435E86o30N0l13M39p19O89j30K42l84rK13j64N51o96O03q49P13j73M3k20J61
6456CL5k22N5O42p45L86j33k2N31q84Q98l20P4J83j029N05J42j7q1M34n19M60
$$ y = [-503, 234, -234, -276, -597, -96, 97, 357, -1, -213, -253, 689, 268, -208, 8, -27, 224, -118, 229, 115, -161, -187, 17, -579, -213, 521, 14, 403, -271, 36, -210, 184, -134, 390, 482, -189, 522, -600, 473, -198, -583, 39, -103, 159, 44, 374, -727, 122, 117, 124, 570, -346, 997, -189, 19, 651, -729, 432, -181, 544, 93, 43, 50, 134, 348, 19, -99, 199, 184, -440, -273, 103, -309, 578, -34, -358, 75, 163, 74, 95, -54, 200, 216, -251, -27, 49, -135, -69, 463, -384, -238, -107, 231, -630, 108, 93, 121, -364, -939, -184, -546, -450, 220, 400, -173, 141, 375, -417, -300, -122, 209, 33, -115, -745, 275, -403, 134, 490, -53, -331, -775, 129, -278, 174, -452, -119, 586, -44, 6, -307, 132, -587, 102, -28, 214, -170, -179, 34, -130, 421, -275, 328, -521, 192, 19, 62, -158, 3, 38, -184, -129, 513, -232, 154, 21, -1, 530, -354, 544, 224, 298, 481, -548, -43, 99, 82, 1, 435, -84, 376]
6478C76L02r30J041p83O0qpm93N65l11L53K3m01%M99m06j83P01j16j28j57m64
6500d67K63k06l0L8K89M64n47K17K35L49l06o71N68n57j80L96M51o03R8j64L21
6521d2k06J34K1K04k63L81Q3l16K36n64J10N55j78N2J56r42R09n56Q0j19M45l29
6543a49P36l67K7l2p2p79O19j58N17m29p7l16N48n13L21L62O7k33k82K62K91o04
6565b61J8J29l11K29K86J70J62n15j23m0J20j13l37O90K06q95j99O99k40M68J84
6586C27n18R90m37j99j428M01J157P7p60O44o78Q64l69l56M76k06L41j47p68M13
6606a76R8r1j09K25O0qN26j17j75n18l0K96n20M42K52R1J6k65j6J34o18J94m44
6629g53Q76k10K95L63q96J14N76j98j47m27L61K58j38l05K70K04j52Q8p24Q53
$$ y = [376, 678, -252, 789, 6, 66, 58, 51, -442, 123, -188, 165, 188, -213, -213, 286, -120, -303, 398, 282, 154, -3, -467, -204, -410, -440, -402, -113, 351, -196, 21, 256, 605, 299, -372, 196, -361, -541, -145, 306, -297, -199, -363, -42, -248, -114, -93, 111, -152, 229, 312, -4, 232, -332, -222, 333, 155, 207, 363, -579, 330, -226, -146, -265, 180, -149, 587, 220, 247, 215, 143, -636, -17, -175, 342, -87, -164, -480, 68, -445, -124, 238, 305, 72, -210, 52, 343, -261, -243, -114, -425, -196, 90, 260, 422, -93, -216, -256, -136, -249, -586, 104, 310, -585, -784, -85, -325, 143, 327, -191, 799, 362, 163, -1265, -864, 293, 370, -390, 254, -424, 440, 71, -285, 191, -15, 326, 179, -589, -176, -78, -169, -278, -53, 7, -1, 525, 408, 233, -285, -315, -19, -539, -97, 155, 246, 262, -3, -19, 115, -503, -309, -753, 123, -87, 208, 571, -325, -211, 365, 167, 20, -407, -46, 212, 74, -231, 39, 243, 91, 179, -545, 308]
6649C08p2j38j14N57p73m34k42J195m08P13o42n46N18L37p09m5K12k87J230q46
6669a86j42o9K52J129o28l70j12k60K29P9K6M05k40J80j54q7J74K10m01J32j61
6690Fl22L28N06o90P81p93j65J57k27M46l48j90P14K13o78N08J32k21J06n55Q84
6711E92q00k09M60K89l38k22O41n35Q7k44Q72j107q3R19n81K92K76p33j97J003
6731C82k66N8J09o96Q91o54M40j76K00k30j04K77L3%Pj63L2l03L53Qm58k39R34
6754D35n74N12j23m17L84m72m1K51K36l46L04j98L84m47l6K14l36k92L07l1P82
6775D96q54J007j67m9j54k25L65j46r24M67L93o63N16j66k62k27J022p5K95q46
6795a97M05j01j98l54O90J03p94N87k88L04m27M07j0o95M48j46K51n36O64J28
$$ y = [308, 236, 98, -16, 541, -232, -666, -908, 287, -121, 592, -50, -596, -78, 259, -450, -495, -283, -570, 660, -186, -328, -397, -145, 984, 356, -14, -126, -386, -157, -78, -52, 353, 113, 293, 139, 52, 226, 436, 35, 167, 6, -316, 12, 518, -172, 609, -184, -349, -192, -419, 27, -321, -511, 203, 416, -262, 246, 378, 157, 263, -292, 592, -208, -417, 43, 332, -6, -228, 413, -122, -35, -279, 593, -514, -597, 322, -259, 33, 309, -424, -621, 382, 116, 174, 283, -413, 478, -176, 264, 88, 288, 58, -46, 231, 264, 264, 271, 108, 140, -163, 190, 198, -260, -499, 435, -139, 373, 250, -167, 217, -255, -296, -45, 191, -155, 149, -49, 335, -112, -148, 66, -270, -562, -255, -286, 496, -358, 649, 482, 433, 279, 54, 419, 273, -651, -184, 209, -454, 62, -104, -366, -593, 429, 354, 649, -197, 208, 107, -91, -445, 245, 348, -446, 141, -147, 157, -270, 137, 127, -568, -120, -266, -15, -551, 113, 241]
6815B41j206N17N83m47o6N46j50K05p03P90j86L77o98O62p39m61J136p71J055
6834F85l67m33K25O22q93l74L61n9L02k18K18j72M82m47p1o7k46J31Q62l3o08
6855a00M92m52K10k32J06m51O7P93m50k15N39m90M71M1n58m18O14J57m48K68L5
6876b1P51n32M60q44M92R5q13J13O81j55o89K79q1r1O92j85L30m15R7j67N45j59
6898C83r03R34j066L42j46L07K49k18K31k92l0O00o40M69n09K35L53m27j87J88
6918a27K89k7l21j01N2N42o60k51N79r2P12m28k06L08q60N23K82q75Q07o06O39
6939A79k77P8M30o42K04M00m05j6k75k8J096j151M01J44k44O23n24j10Qj5N70
6960D46m96l56l02L75m7n8M63J34n76L80pR6l75L3n0L05j20K4N17n37K40O62j251
$$ y = [241, -965, -448, 135, -312, -378, 168, 18, 223, -480, 310, 124, 501, -197, 465, -274, -735, 401, -370, 685, 318, -115, 110, 732, -161, -535, -174, -233, 69, -149, 69, -103, 379, -68, -139, -206, -452, -321, 541, 508, -100, 392, -60, 150, -82, 24, -427, -360, 433, -17, -232, 307, -183, 288, 329, -229, -647, -33, 124, -324, -56, -21, 730, 198, 658, -186, 306, 401, -412, -299, 382, 227, -462, -183, -264, -355, 337, 152, 482, 67, 164, -3, 542, 383, -520, 414, -652, -310, -456, -149, 100, -118, 113, -179, -209, 391, -249, 220, -289, -54, 299, -128, -315, -127, 162, 135, -186, -287, -235, 307, -353, -604, -25, -117, 595, 167, -39, 269, -591, -68, 214, -661, 146, -460, 179, -98, -20, 410, -232, -28, 372, -33, -49, -324, -352, 744, -407, -6, 138, -106, 517, -7, -117, -109, -124, 446, -50, -406, -708, -333, -380, -438, 25, 159, -417, -37, -44, 52, -323, -290, -340, -35, -155, -131, 386, -151, 89, 751, -500]
6983e00K88O41o04Q3K29l24k3J5P47l98p12M76k97O40J8j32l01L26p20L77N4K06
7005H9K40l92KK26n70O52l42l03K81M45K0J55q18P82j54j077P64L36o65mj39P6
7027c96M05l91N80n74P67r65Q30o77L21p8l02J68M29J98k5r39O77n1k69K61j67
7048a98L18l86nQ8J56J78r6L11l46m99R57L5m20j83O11n85m16j35J041o46P08
7069D88k62l73k34J51N04l3m7o01L81J28q0p53R90l96O87o78M0J24l04n33N46
7090b55Q57p76k31j23Q02J2l7p76N98N3pn51N12p20O21J70k5M27o93pL29J03j32
7113A51N8l5n44K0O13j89m65R63K15q42O39l60m87R33p66J52L85j206M89L55O0
7134A39k52JK66K96m48j24M72k67j28L56k10n01K59P12m19j72l14J08N98m6k77
$$ y = [-500, -212, 429, -175, -92, 137, -187, -210, -195, 552, 154, -558, -82, -379, 261, 279, 147, -154, 172, -548, -171, -117, 89, 329, -63, -61, 165, -405, 247, -95, -398, -117, 328, 348, 503, -315, 467, 313, -764, 0, 336, -329, -333, -472, -396, 9, -382, 198, -376, 391, -574, 256, -421, -100, -178, -480, -312, 117, 315, 290, -649, 28, -23, -292, -31, -198, 120, -266, -271, -183, -27, 151, 55, 366, 20, -479, 478, 513, 93, -90, 521, -64, -480, -615, 426, -220, 488, 226, -147, -381, -230, 274, 241, 194, -407, -26, 102, 22, -731, 259, -137, 550, -128, -88, 36, -268, -801, -255, 602, -174, -405, -528, 274, 286, 249, -527, 71, 124, 117, -434, 78, -642, -21, 149, 124, 551, -142, -149, 180, 283, 151, 209, 174, -370, -350, 263, 74, -391, 572, 787, -55, 584, 224, -263, 670, -96, 56, 441, -765, -276, 79, 139, -113, -112, 154, 450, 2, -122, 350, 83, -45, 311, 101, -400, -141, 571, 152, -20, -334, -226, 372, 326, 49]
7155D9l85J69M40m53k18J61n53J158k34J23J12j76P1K70j232J001J38l79K03j68
7175I7p14P28m94M42M98rn89k10L89N21o28k01K67K08n90P22J97q06q9O58q8J00
7197D09r1o27J05l24L16L87J97n39m3m99j2J18L02K89l05M3N49j97l77K53P2l31
7219c05O84q9m04M12m18L04pJ36j003J000o94L84j7Q1P00k56l56J96k18P8L77
7240E85r69J105j114K67J70N87l50M52o63J47l36L16l14K50m25M87l70m61J363
7259G27n74k04L17J90n81O8K45n98J15L9K32J157m79K04n99k63R57j219K43k2
7279d5j00J021p77J65m26j97P82q90O94jL21p13O19l19k61K25j43k1l33M12j72
7300a59j15Q89p58J09o0n95L75M7Q63m18j40N71m18J4m43j71N8N04m09l9K9o8
$$ y = [49, -336, -167, 273, -180, -398, -237, -790, 368, 134, 257, 369, 193, 264, 534, -698, 303, 441, 62, 265, 97, -617, 111, -383, 59, 557, 548, -41, -251, 138, 659, 31, -170, 97, 305, -285, 437, 634, -172, -261, 397, 309, 409, 318, -309, -204, -528, -212, 175, 372, -167, -210, -709, -721, -603, -301, -12, -317, -274, 275, 78, -299, -46, 26, -305, 379, 290, -114, 298, -120, 184, 177, 313, -690, 310, -384, 0, -17, 64, 764, 508, 152, 348, 130, 208, 585, -384, 721, -393, -126, 44, 631, 281, 733, 70, 217, -119, 197, -117, 133, -292, 195, -175, -636, 727, 153, -51, 266, 456, -125, -57, 188, -410, -295, -256, -24, 1133, 654, 858, 259, -4, 953, -266, -23, -45, -145, 876, 99, 264, -162, -359, 423, -467, 227, 226, 547, -166, 453, 134, -127, 98, -45, -66, -399, 13, -159, -274, 615, -143, -34, -94, -689, -314, -267, 596, 178, 38, 609, 191, 205, -238, -409, -351, 153, -256, -295, -266, -334]
7322c34N65r20Q93m85M00n12k80Q16o55P07M8n59J66J89j96Mk17j1O10m69KN16
7344B78l22M25k73j11M16l34l26M0M47o39m36R73L9j69Q05j391J97L48J32m32
7364c33O64n03N33o00o0L78l10o6K4K55j81O4q2M84J0k16k23j05M94n10N33k68
7386a8j02N95n29K60k3r8k07j7R3J3J33j28n1O5O81o65m49N25K38k43n58J96J56
7409a33J25j28l48j81M08R9Q20j53k62o02N05L1M32l91k46q0L05k15P6l51j35
7430d24R15q31M51K0l13R71j186R45j046M61k11L22n1l27J86L78k28Q0k55l47
7450d90L70N42n73N74k23m62J67k15O63j84r05M23j5j47j58O48K56k68o26R29
7470C06k71K10l41J46L05J1p65M8j35M9K67l82P05n35K75j85O92n75J29M00J4
$$ y = [-334, 231, -689, 204, -281, 119, -393, -673, 143, -512, 195, 243, -316, -150, 39, -157, -153, -370, -381, 229, -240, -238, 278, -44, 381, 108, -3, 413, 79, -247, -207, 240, -399, -835, 138, 177, 8, 813, -578, -381, -33, 99, -333, 331, -172, 361, -239, -299, 79, -231, -297, -273, -18, -199, -135, -217, 267, 277, 61, -162, -267, 227, -283, 250, -18, -120, 475, -54, 206, 183, 85, -122, -139, -46, -33, 100, -28, -79, -14, 667, 2, -447, 78, 316, 73, -485, -289, -133, -8, -136, -484, -665, -257, -158, 662, 509, 247, -355, 150, 181, 613, 222, -24, -104, 201, -14, 62, -289, -424, 491, -340, 111, 131, -182, 789, -397, 548, -498, -37, -248, 74, 23, -304, -118, 260, 32, 112, -143, -490, -120, 422, -151, 423, 200, -262, -95, -310, 353, 169, -736, -313, -328, -475, -633, 15, 271, 3, -623, 306, 35, 245, -96, 50, 355, 366, -399, -351, -486, -437, -170, -552, 153, -382, -107, -292, 400, -175, -46, 354, 368]
7491C68l60j9j12o61K07O81J51m85LL06L43j097P00p21J045m19K83l00n7J45j0
7512iL6J24m65k96O06M9M6n61M81J29l56K3K49j90P08m42m59K8N53q03O42n2J20
7535A61m94K9K66mK30K08J95p07L85k32j22J9N38n10J16J51j47J80p5k90j19M22
7557B00N3n41J46j68M83k03L26R3n00K85J01j39o60R00m23m9k99m3N74k01k70
7578c35O77j039Q77k79K09M30p28J13k11Q5J6j65P18n11Q29q81M33n08J55M91
7598C76q6p14N90M85m71L74o69p0O4J65l45M78m1j23k01k09L75Q56m58j29L76
7619F23m91m31N10r4l34J006r48j4Q0m18Q76n10M23J7m17J77j34K92J55%m26J25
7641F7k36j88M38m76Q95K99j244J98m3N48n89N12n05m8O86j90K37l57M56m77K73
$$ y = [368, 8, -11, -123, -784, -577, 104, 255, -230, -227, 79, 422, -675, 25, -696, 349, -70, 213, -87, -144, 1, -9, 27, 151, -314, -610, -4, 45, 91, -470, 11, 140, -216, -193, 56, -134, 574, 132, -327, -299, 254, -549, 93, 41, 161, -333, -304, -38, -42, 188, 396, 591, -116, 269, 37, -85, -66, 472, -38, 78, 229, 82, 262, 187, -103, -222, 200, 253, -288, -142, -310, 173, -30, 296, 389, -111, 174, 275, 136, -524, 376, -47, -96, -395, -438, 136, -65, -335, 342, -697, 180, -99, 110, 540, -188, -75, -286, -201, -185, -350, 368, -143, 686, -195, 238, -270, -115, 376, 290, -424, 166, 651, 180, 554, -115, -185, -121, 44, -301, 177, 136, 13, -188, -397, -22, 834, 376, 247, 623, 132, -299, 211, 117, -217, 789, -159, -173, -93, -511, 365, -145, 278, 295, -122, 55, -79, 213, 368, 368, -58, 67, -169, -357, 81, -395, 500, 799, -445, -247, -290, 258, -331, 181, -324, -372, 314, 124, 361, 4, 460, -17, 256]
7662B56J48J8m47L19Q7l76q0l95K09P9Q07m24m62P92q82L09k61q0L35o67O79L83
7684C47j60l04N48k22m95J55%K49o15O71J00K41r63L16M39K32j095J44N42N70
7704G00o58Q4J10j62J22r6k95L24k54J45J40n02l90O59J71L8k34j10j40K69L72
7725B93o03l88N25J09Q3j47L24j4m6L4J01J9j7q34L75R5L47K70j065L82j5j55
7747c27M86n49M69K02n29L09j02J39m88L34N32o33J83m5j70Q6R1J60n88K05Q36
7768F01n78M5K10p9M57p55K16N08l77j46N4k74L06O9j10Q0L52n27K28n91L1M44
7790A64m55P99m17K12o98N48l01k41O03q0q60J029l49M1L7L95m35J95j93k9K76
7811B41p19L12N10j89nm88Q49k06m08N95J9l04p24J099q08O58P23j082n1J06L22
$$ y = [256, 404, 422, -25, 294, 381, 5, -75, -470, -261, -182, 625, 201, -261, 531, -351, -42, -303, -383, -48, -715, -36, 347, 187, -117, 431, 209, -286, -131, -131, 118, -497, 174, 274, 515, -448, -132, 307, 539, -556, -412, 130, 700, 42, 126, 236, 74, 196, 100, -195, 129, -125, 20, 160, -342, -732, -73, 98, 136, -98, -208, -348, -79, 293, -310, -698, -173, -64, 19, -128, 196, 182, 136, 170, 271, 290, 273, -561, -186, -91, 256, 526, -539, -157, -172, -327, 159, -390, 79, 281, -248, 61, -41, 98, -390, -56, 476, -157, 26, -19, -189, -103, -12, 148, -440, -235, 601, 23, 68, 278, 199, 656, -99, 117, 625, 248, 102, 156, -118, 188, 257, 147, 227, 579, 52, 280, -311, -280, 164, -291, 508, 91, 303, -395, 153, -148, -389, 214, 134, -726, 303, -46, -5, 32, 427, -8, 187, -6, -35, 241, -478, -166, 344, 155, 150, -338, 511, 305, -103, 492, 511, 207, -517, 582, -226, 432, 1155, 73, 22, 128, 450]
7832D50K51j228J211r11L06N56o31N30j45m15K33n43O87p49l62P97M60o26L77
7851B48k20j5j69k87M15M24L2J13n08J09l34P08o32K9Q0l64O24J23p71N58m2j29
7873hp0j7N8K94J44l53l45L08m9k6j63P08j189K49M98j60K11K5O7k00J67k5k53
7896a29j97O94L00j193Q89k85n51N06J62o9o31r5j54L21N31N0p13R86q02Q09l70
7917E9J36l60P2l77J038p71j14N39k19K58q2R2k47J37J58k90J85Jj58n6J6J79
7939A96k22P29m79M59m11J24j78n31P30l7m55m35P29m18L26j67j72n34J000l66
7959a12N40l66m01K35K34N54o80j94L82l33N91j36j80k23k72j26K95K15k6K2k71
7980b52J33J73J77Po17O03l12l44j25N35J47j58q5M97k00qM42j130O14J71j36
$$ y = [450, 701, -527, 684, -227, 79, 635, 4, 534, 389, -26, 207, -336, 351, -398, -760, 37, 497, -129, 248, 28, 13, -156, -443, -28, 396, 428, 541, 33, 142, -192, 516, -116, -87, -7, -371, 253, 376, -395, 163, 121, -8, -78, -95, -37, 257, 401, 48, -297, 11, -38, -64, -227, 481, -708, -459, 39, -121, 90, 115, 182, -18, 149, 124, -129, -326, 368, 668, -525, 364, 79, -472, 34, 196, 127, -504, -599, -753, -432, 99, 149, -564, 422, -380, 429, 59, 195, -165, -93, -470, 568, -203, -317, 222, 3, 261, 179, 271, 24, 161, 319, 29, 214, 215, 57, 1, 17, 196, -26, 703, 224, 683, 272, 396, 218, -313, 417, 380, -75, -510, 219, -199, 127, -40, -212, -746, 254, -112, 428, 62, -339, -104, 130, 684, 4, -190, 192, -141, 450, 314, 134, -89, -361, -487, -192, 23, -3, 19, -252, -119, 54, 231, 238, -379, 224, -88, -432, -557, -22, 125, -33, -118, 379, 179, 171, 613, -517, 97, 268, 132]
8001A32l08N9J19J57n21R10r50N67n6J16l15N6M77r06M68j72K88j67q7L12l33
8022a54m17Q70j120M00M35L01J25r98Q25k30K63j79pP3J17k19m76L07n65J029
8042C80j46J09k36l47R94n87l30J18M50p83M88K9k8m55N49o00K75k3L57m20p14
8063i20J411n84K0L04P0n93N7K91l53k2M8K26M2R6r5M17p50j06K06J05j48L11
8085C3k6PJ69m26l17l66R92L89j057L45N62k53j78K14M20j32l49k80L79K93q74
8106d55O90r16N88J38q8j31K37l68P62p58P98j038L40J69j83J40K63l82k13O37
8126B30q76J307j018N64o9j12M17O6R3p30K52K45n01N50j171J347l91L9l31m2
8146a31K37l91M13j60M9K56n53J85J37m39Q16n3m10r4l98L36K97k63K37k31O9
$$ y = [132, -176, -117, 2, 159, -362, 548, -402, 165, 109, 225, -90, -34, 443, -463, 5, -167, 121, -46, -133, 179, -154, -571, 299, -821, -421, 14, 315, 440, -558, 267, 37, 300, 121, 114, 187, 304, 85, -391, -84, -649, 380, 234, 343, 107, -240, 754, 167, -163, -45, 405, -378, 110, 139, 111, -344, 205, -395, -120, -143, 214, -206, -920, 491, -93, -73, 231, 301, -292, -235, 56, -297, -319, -271, -45, -3, 93, -2, 415, -335, -441, -235, -130, -278, 33, 7, 14, 183, -243, -560, -926, 66, 455, -602, -257, 305, 52, -126, 88, 508, 376, 27, -253, 126, 419, -455, 235, -681, -93, 45, -43, -174, 63, -305, 457, -301, 497, -541, -201, -32, -215, -75, 188, -194, -407, 230, -646, 661, -357, 207, 138, 26, 443, 509, 602, -128, 124, 369, -132, 418, -753, 594, 203, 242, -89, -131, 106, -285, 128, -32, 17, 273, -280, -95, 42, -397, 419, 366, -44, -138, -536, -200, 97, -166, 71, -160, -91]
8167i1n8m11Q25l32j68P37m97J72l06L81j02o99J223k1r55N93j41k34L44j62n1
8188D7K15m36j22
$$ y = [-91, -149, -560, 265, -67, -235, 502, 5, 177, -129, 252, 150, -549, 674, 653, -302, 291, 150, -84, 260, 98, 47, 262, -174, -296]
8191b96
$$ Imaginary data points
##PAGE= N=2
##DATA TABLE= (X++(I..I)), XYDATA
0@%%%%%%M0q0Q0q0J20j60J63k03K78l19L62m42N24o34P53q80J026j180J355j552
26h29J775k019K293k597K928l292L695m135M618n150N730o368P071p843Q688r618
42e053J0652j1796J3067j4488J6086j7904J9976k2372K5192k8555L2639l7739
54b0295M4327n3192O5851q5553J20788k03274P53692N38342j082345k17332K89513
65A50522L94433o1935l5731j49201k14231j57290K22288J84661r0526k04733P2795
76A11052R8732j03381j54907J48850K28056l0484k40247l3911J83819J03405j35295
87A75689j15229P9324J45864k2844j48484r7323K3720P3353Q7822K1340j38707
98H4525k01937J8151K45172J10669k04915j84696J31056K16566o3887k22705j1649
$$ y = [0, 0, 0, 0, 0, 0, 0, 40, -40, 40, -40, 80, -80, 83, -120, 158, -161, 201, -241, 283, -351, 402, -478, 548, -632, 723, -829, 946, -1073, 1220, -1377, 1551, -1741, 1954, -2181, 2437, -2713, 3017, -3351, 3720, -4123, 4565, -5053, 5599, -6197, 6870, -7618, 8468, -9436, 10540, -11832, 13360, -15195, 17444, -20295, 24032, -29160, 36691, -48862, 71926, -131348, 622344, 1160686, 78341, -138991, 150522, 544955, 483020, 447289, 298088, 83857, -73433, 148855, 333516, 242990, 38257, 111052, 209784, 106403, -48504, 100346, 328402, 297918, 57671, 23760, 207579, 310984, 175689, 60460, 139784, 285648, 262804, 114320, 16997, 40717, 114070, 201892, 223232, 84525, -117412, -99261, 145911, 256580, 51665, -133031, -1975, 214591, 150704, -72001, -83650]
109h3650K03404J02403r2499j05821l3527j1343M6001J25234L0604j70099j47143
120a36436Q4064J35311o4197j29626O4300J39090q1107k15285m616K18076J03112
131A12686j26427j18614L3331O5311J0981K1240K1246l9250k7045P7458O1038
142I1955j06195j28748R6413K28731J7501k40401j62999J23823J99846J2453j20941
153A1438o4608J5561J3227J627J8664J1201j4425L915J8417m0148q5560J0961
165i9730J46397Q4375j19861j54141L9125J48100K0375r6733j7576Q6778K8548
176F5657q1108o3975L5662Q1692N6195l618q0028j08638o142J45757J24837p4104
188I2187j68041k0005J25965N2214q5097n0234P4957P0809n1287r7716j6649O8797
$$ y = [-83650, 119754, 222157, 129658, 23837, -9690, -21033, 24968, 150202, 180806, 10707, -136436, -52372, 82939, 18742, -110884, -46584, 92506, 11399, -203886, -208502, 9574, 112686, -13741, -132355, -99024, -33713, -22732, -1492, 19754, -19496, -46541, 30917, 91955, -14240, -142988, -46575, 182156, 199657, -40744, -203743, -79920, 119926, 132379, 11438, -53170, -37609, -24382, -22755, -4091, 7110, -7315, -3400, 15017, -25131, -110691, -99730, 46667, 131042, 11181, -142960, -103835, 44265, 64640, -32093, -49669, 37109, 65657, -15451, -79426, -43764, 37928, 94123, 90505, 10477, -98161, -104303, 41454, 166291, 92187, -75854, -95859, 30106, 82320, -2777, -53011, 21946, 92755, 41468, -56248, -72897, -4100]
200d100O9831J8275m1252p9705m2838O4369R6011j1092r3876j8451P9512K1254
212E7938r5495n6934Q5002J12588j8222j21520p0317M8609R0708L7922l5481o0397
224b5599k5395L4225M5488r587m8719M063P2304L0776q2605r5440L1177J28272
236E8960N5093q5217j02850N887P0959K9787k2786j9376N964J0074m376k8901
248b6782l0940K2265P9998M3417p4256j14480k997J15351Q0670m8563q8808p803
260e2928N0434J8108k8796j5287K9532M1021j50n6343o0120J6939R2021O5670
272A00101m4567j01900l5732O7850P2262j2686n7279p158M1039Q168m9215l6424
284e5541L5210P3944K3072o2542q0812p139P6974O8754j1522o7741l5690L1328
$$ y = [-4100, 65731, 84006, 42754, -36951, -79789, -15420, 80591, 69499, -24377, -42828, 36684, 57938, -37557, -94491, -9489, 103099, 84877, -36643, -106960, -58351, 32357, 70279, 34798, -25599, -50994, -16769, 28719, 19132, -29587, -25524, 46780, 77556, -5049, -100489, -69312, 58960, 114053, 28836, -74014, -68127, 2832, 32619, 9833, -9543, -3579, 6495, 2119, -26782, -57722, -35457, 44541, 87958, 13702, -100778, -103775, 11576, 92246, 43683, -45125, -52928, -2494, 15614, -13182, -28469, 1063, 42084, 41934, -14409, -74529, -57590, 34431, 100101, 55534, -46366, -82098, -14248, 58014, 45328, -11951, -19109, 21930, 30098, -19117, -55541, -20331, 53613, 76685, 14143, -66669, -73808, 3166, 71920, 60398, -7343, -43033, -11705]
296a1705M5753r431l7556R045N6102J8096o0400o8350J4767Q7598N6418m0607
308E9730q5730l1772M5289N6977N709l5039k3109J7923K0469k2274m0358J3764
320a8421O8991L6819n1451q0518j3040O9691O6498j0264o3614l2654K5244L4230
332C1511p046k8987Q99L7671K1112m0867o3195j673O8528N9946k1330p5051l8757
345e7239L5327N7769O590l7551j6770K7446J6259k7951m0064R085N9183M1278
357G3362l5328p5755k8815M9910O5406P630m9951m2745J1561L3122M31k7191J783
370a6580L8815J8112m0349n8189l448O1638O1173j1891o9381m4618K3942N3734
382A2958J9211k5123k4481R414J7017j5196l3335O812N0623L5333l1496o6193
$$ y = [-11705, 34048, 24617, -12939, -3894, 52208, 70304, 9904, -58446, -43679, 43919, 100337, 59730, -26000, -57772, -12483, 44494, 50203, 15164, -7945, 9978, 30447, 8173, -32185, -18421, 50570, 87389, 35938, -44580, -57620, 12071, 78569, 68305, 4691, -27963, -2719, 31511, 24465, -4522, -3623, 34048, 55160, 14293, -48902, -50575, 17953, 77899, 56569, -18482, -57239, -21912, 35857, 42447, 4896, -11874, 15572, 31831, 3880, -36184, -27099, 32084, 73362, 38034, -37721, -66536, -16626, 48780, 56410, 6459, -36286, -24725, 8397, 8828, -18363, -16580, 22235, 40347, -2, -58191, -61639, -1, 61172, 49281, -20100, -64718, -40776, 12958, 32169, 7046, -17435, -8021, 8996, -6200, -39535, -32723, 17900, 53233, 21737, -44456]
394d4456k8161M4106O1474R963m6636m2099O340L0694Q766j7818p550K3779K1717
407B0119k3131m8204j0314M8962N3677l925n4673m0088J7060M7836J7141k2446
419B014k0163R180J4434j3150k8073l279L7671L7237j6617o0364l4504L1670N5934
432A1990J7559l4508l8389K432K6747R047j4102j592K4482J8104j7014l9894j2494
445d7632L6751M9440O983m6147m3399N818L9550K2431j4944k3609n62J4395p310
458h235k5130m354L3947L1454j1473m4117k8755J9654M5350K2057j9222k9285
470a8109p257J5931J3148n056o110J5798K1674j2323m4469j8963L5097M9298M656
483D3315m0257l9066K035K8232K1825j341j2122p415J677R64q628p648K0643L8118
$$ y = [-44456, -72617, -28511, 32963, 42926, -3710, -45809, -39469, -8775, -9, -17827, -25377, -1598, 20119, -3012, -51216, -61530, -12568, 41109, 37184, -17489, -57577, -40517, 7319, 24460, 2014, -18149, -8969, 5465, -7685, -35758, -39037, -1366, 35871, 19254, -41110, -75614, -43944, 11990, 29549, -4959, -43348, -40916, -14169, -5122, -19224, -20816, 3666, 21770, 4756, -35138, -47632, -10881, 38559, 45542, -605, -44004, -38186, 1364, 23795, 8851, -14758, -15320, -925, -8235, -33365, -37719, -3772, 27682, 16209, -27908, -56663, -37009, 8341, 30398, 11176, -18109, -25366, -9435, 3713, -1343, -7453, 8345, 30019, 17696, -26773, -45736, -10639, 38659, 43315, 3058, -36008, -33973, -5741, 16084, 14743, 2621, -4794, -3117, -2153, -10781, -18429, 2214, 40332]
497D0332L827m5593l8503J9617N0660K0567k1694k8001m613O914M264J998O616
510A6391O202k966j0861k0440j6668J3992M0068J6349l5349m7639R97M0280K2845
523B3201j4270j7300O486J1502q249j4167P416K3766J4259n75j6392k4158p080
536a5561L0320L6389m519l9215k0702J8332J6156j1896j1919J6824J7016j9494
548A1731l6022m037K6463J9546J790r365j6915j6663O582K8235J5887j5320j6675
561d763J0911J1977j9920k2000K4762M5098m470m8834k7111J9399K5971O811K97
574A8128o447k3704j3914J5029K4706k091j2835O779J4320j6743k9944J0512M7548
587C1344J6533l1099k9819O373J7116M38m47J0955K901j7351j8675L735J0888
$$ y = [40332, 44159, -1434, -39937, -20320, 30340, 50907, 29213, 1212, -3401, 3513, 7777, 9775, 16391, 22593, 19627, 8766, -11674, -28342, -14350, 25718, 42067, 6718, -40921, -39924, 356, 23201, 8931, -8369, -1883, 9619, 1370, -12797, -5381, 18385, 32644, 32069, 15677, -8481, -15561, 14759, 51148, 46629, 7414, -13288, 5044, 21200, 9304, -2615, 14209, 31225, 11731, -24291, -28328, -1865, 17681, 19471, 10106, -6809, -23472, -16890, 11345, 27232, 11912, -4763, 6148, 18125, -1795, -23795, 967, 46065, 41595, -7239, -34350, -14951, 11020, 17831, 18128, 11681, -12023, -25937, -10908, 13798, 11707, -1128, 5651, 19971, 3228, -26716, -16204, 31344, 47877, 16778, -13041, -6668, 10448, 10886, 10439, 21394, 24295, 6944, -11731, -7996, 2892]
600B892J962P392J5958r054m2686j7150M1895M5019j3912m0260l131K1983j095
613I813j3954J3045K6880n598k7942o371J4182J46k603K1986J7603l0115l8909
626b1837J4338M2622M321k5655j332K1975q411l4278J083M2186J9362k7694k6247
639D33J640K292l069J7025K2500j7033m1895l783L5835J3086k4629p444K7418
652B2376J1981k8657k1062K4007L1706j703j5316K969J821j5203o137K6422J8686
665E1890j7631k7686M71J0434j3836j0832K3132K2970k7515m8573L022M3816J3521
678B3183k5513o449J8006o095k0238R748L0944J949j9418M852J5946j8217l0070
691b1372J8863M8484M24n0017k6235K1067J5401j0207K026J5792j0182l5122p364
$$ y = [2892, 4854, 12246, 28204, 19150, -23536, -40686, 1209, 46228, 32316, -7944, -11075, 10908, 9813, -4141, 8904, 35784, 30186, 2244, -4127, 10055, 10201, 7598, 29584, 47187, 17072, -21837, -7499, 35123, 39444, 13789, 12457, 34432, 26021, -8257, -7174, 35012, 54374, 26680, 433, 2073, 4365, 1296, 18321, 40821, 23788, -18107, -21890, 13945, 27031, 2402, -5042, 22376, 34357, 5700, -15362, 8645, 40351, 38648, 23332, 26301, 28122, 12919, 6782, 33204, 51890, 34259, 6573, 7044, 17478, 3642, -7190, 15942, 38912, 11397, -37176, -34154, 9662, 23183, -2330, -8779, 9227, 3132, -17106, -7358, 23586, 25535, 6117, 10969, 26915, 8698, -21372, -2509, 45975, 46399, -3618, -29853, -8786, 6615, -3592, -1566, 14226, 4044, -31078, -38442]
704c8442L2822K1532j2155j2103Q745J562j8228K487L2839J6577k5980k3042J6252
717B866J5669j8581j7911K0819K3122j7543l6787o247J6885O943j795Q169j42
730d533k9777k2418K7280M2554j928l1522k900K0251K379j2304J0472K7127M71
743B5152k4993o147J9497M124j6216L140K3592k006l2727j3467J8657J1009r317
756B98J929J2578j3821l3865j5M1371K2369k2897k7115L370J3484n79L126J5836
770A6069k97k0845p622J6296Q195j2862n450J8164J0758j8495k3464O489K2540
783I476N781q392k1K138j5417j1435J9617K8322j680k3397r994Q403M630P31J1643
798B0405J2387j3591k5405oK1471O705j5048k895J1289k845k0967q398J5906J3639
$$ y = [-38442, -5620, 15912, 3757, -8346, 399, 1961, -16267, -13780, 19059, 35636, 9656, -13386, 2866, 18535, -46, -17957, 2862, 25984, 8441, -28346, -34593, -17708, -10765, -12560, -4391, -4533, -34310, -56728, -29448, 13106, 11178, -20344, -23244, -2993, -614, -12918, -2446, 24681, 25152, 159, -5988, 13509, 17633, 1417, 4557, 28149, 26143, -6584, -20051, -1394, 9615, 298, 2227, 14805, 984, -32881, -32896, 8475, 30844, 7947, -19168, -15798, -2314, -2893, 233, 16069, 15772, -5073, -12695, 3601, 11796, -1066, -6516, 11648, 22406, 3911, -19553, -13064, 9476, 15257, 6865, 6844, 8982, -6435, -17870, 1747, 30069, 28389, 4992, -5002, 3401, 8031, 8762, 20405, 32792, 19201, -6204, -6210, 15261, 21966, 6918, 4023, 15312, 12467, -8500, -16898, -992, 12647]
812A2647l656p428m317r485r812J0013K7100Q925k2410k3329P361J7701N143O12
826I065P816k060j7977q703J5493J7430l126j0069L89k1r228o135J0892J2863
840A6629m991j2543j215J87o126n73J4477J1248r479j7442n629R408J1428L678
854I057O89k760j0500q377M112J4603M618p640o363J156l090n851K171J1826M860
869H511p038r399j174J597J899O425J1158K350j3994j0685M551J3407O417J416
883A5441q34q174j0037j949J1261J1689j274j1488p863p53q15J102O731P517n119
898E435j1700n082M371M147N439O034Q38r275q896N98J0235R786K131m341o261
913C459n969l201O610J1525L855o813j0286n733J867O010O781K157j896p950q146
$$ y = [12647, 8991, 1563, -2754, -12239, -22051, -12038, 15062, 23987, 1577, -21752, -14391, 3310, 8453, 9065, 16881, 14821, -3156, -11859, 3634, 21064, 17938, 7869, 8258, 8237, -991, -7126, 3766, 16629, 11638, -905, -2120, -1933, -8059, -8632, 5845, 17093, 7614, -9828, -15457, -6049, 5379, 9057, 9746, 6986, -3514, -11891, -7779, 6824, 11442, 3802, -2561, -1405, -4495, -10346, -8175, 3651, 8511, 1473, -7926, -9100, -7503, -5604, 821, 11979, 14329, 335, -10350, -5799, 7608, 14025, 15441, 14607, 6433, -3604, -5553, 5708, 17397, 16123, 4635, -3228, -3981, -4796, -3694, 3037, 10554, 5435, -6265, -11347, -6976, -2829, 2610, 8644, 9482, 207, -8689, -8091, 2144, 11930, 14061, 9720, 3459, -2510, -5711, 899, 12424, 16279, 9466, -820, -6553, -4686, 1324, 8105, 10262, 8366, 416, -7730]
928g730l63P945Q451K282k281n548p872l978Q034J2407L748o381r438m920J417
943d227M261P416N417l861j0969p913L419O245O513K238k255q458q369K420P252
958h71P024O41l614n852l345p69L332P527N018l738p223m629K58L892N713L738
974G102r13o675n894j712M808O912K368k063m936n349l785L431Q613N351l628
989C630o855m345j451L113O973N166o29n355p129j664M258O074M712M99m910r622
1005g535l550N535Q855M310k824n788o604j979L051Q232O294k486p311o545m81
1020h826M069O707N819o42p591p349j291O000O669M040k308o496n498k403M737
1035d363P004N354l255n866m707j300K456P044N425m06o109o331j785M326O434
$$ y = [-7730, -8093, -148, 8303, 10585, 8304, 2756, -5116, -9094, -1060, 11347, 15095, 8714, -724, -5644, -4227, 34, 7450, 12867, 9006, -1963, -9876, -6457, -212, 6301, 8539, 6284, -2174, -10543, -8123, -871, 6153, 6794, 3180, -2672, -6017, -6786, -3454, 4073, 9091, 5353, -1870, -6499, -6241, -2349, 3364, 7102, 6189, -486, -6380, -8092, -3284, 3628, 5996, 3933, -1003, -6352, -10137, -6706, 1907, 7258, 3630, -3225, -7570, -9021, -5908, 1065, 6231, 5602, 247, -6882, -8546, -4288, 1786, 6498, 6997, 2087, -7535, -11085, -5550, 3305, 7615, 4791, -997, -7601, -9580, -6529, 1703, 7997, 5511, -1800, -8345, -8826, -4757, 1950, 7769, 7127, -464, -7813, -9104, -3104, 3565, 7605, 5297, -1199, -6697, -9100, -4363, 2641, 7995, 4740, -1126, -5833, -7133, -4677, 2367, 7792, 7386, 1277, -5054, -6839, -2513, 3921]
1050C921L564L22n054o153m091L553P619M200j744m552o421k664K811P078N543
1065G932j946n635n606p85M710N826L458L12m349o849j609N038N679K076p9m057
1081D116o368l246L643O023M390k894n477l914j450J034M346N321R41n237n087
1096c859q52K307N455L782J018k170m806l598K435N840L207J10k768l169n399
1111b467j943O284O534m89o258n408k671N15L681N838J578m453p017k942M093
1126e125O000M176M67k77n706n443K601Q352N280m18m117m668l081p86N678O147
1142I080J538p134p819j963K711K130M445K291m356q808l763N988P176J597j602
1157A511j458k099k954J304O306M938j422m717j890J60k148J068N424L025n022
$$ y = [3921, 7485, 7807, 2753, -3400, -7491, -3938, 3681, 7881, 6137, 1585, -4836, -7500, -4689, 2389, 7932, 5986, 351, -5255, -6040, -1330, 4496, 7954, 8266, 3917, -2932, -4541, 497, 6176, 8252, 8173, 4116, -2252, -5498, -1855, 4168, 8558, 5664, 187, -3727, -5177, -4143, 203, 5524, 6465, 1228, -3859, -4711, -2404, 3051, 6833, 7851, 5681, 875, -2723, -288, 5552, 8759, 8869, 6101, 2932, -2467, -4410, 1874, 8408, 7919, 1661, -3747, -6418, -5903, -2222, 3616, 5194, 741, -6276, -9218, -5125, 875, 5051, 5518, 5241, -465, -5908, -3307, 5045, 10325, 9907, 5790, 1122, -1959, -2745, 2933, 9080, 10618, 3484, -4335, -6298, -3587, -1457, 2988, 5279, 923, -7885, -11648, -5660, 1516, 3113, 1511, 53, -2046, -5000, -3696, 2610, 7548, 6126, 1409, -481, -321, -2469, -1401, 4023, 7048, 2026]
1172B026q475j436K593K606K177J877M50n842o615K385Q915O088k558j992J20
1187B319k233j606N838P249J067o946m403J987q92j745K120N956l021r848o849
1202a1007L840M282L24J009L54l232q410O28R044O859j472l884l30Q99q33K026
1218I7P105L856m254p919N32M881j477m63L860K249o440q111R82P423K151j568
1234B904L81L09o735m305N829J1139R64q407l527J917J13j998M656O393k867r616
1250b850n462M982L910j516O0L954l893q784k061R367O895l482k110J717j155
1265d28m841J557J1112O411o910q788Q99M709J13J166M194k73q832o255N917O526
1281F277l049l802K508R76n412n995N230P843J65o070j649K013k128l471N282
$$ y = [2026, -6449, -7885, -5292, -2686, -509, 1368, 1818, -4024, -10639, -8254, 661, 6749, 4191, 2199, 2319, 86, -1520, 4318, 11567, 12634, 5688, 1285, 3272, 2380, 635, 2755, 8711, 5690, -4158, -11007, -7167, -2885, -2561, -1552, -1198, -4430, -12840, -12212, -3168, 3691, 2219, -1665, -1995, -1096, -1929, 97, 7202, 11058, 6804, -1115, -583, 4298, 2821, 2358, 6218, 8467, 2027, -6084, -5102, 2321, 4472, 2904, 3285, 3594, -3141, -7446, -1617, 9522, 10486, 2079, -1448, 469, 582, -1416, 3240, 9633, 6766, -2850, -8312, -3330, 580, -936, -876, 3078, -815, -9599, -11660, -2293, 4602, 1120, -990, 727, -428, -5269, -3712, 7400, 13811, 6901, -1887, -988, 3721, 3834, 5000, 9194, 8921, 89, -6166, -249, 6277, 3228, -574, 1934, 2910, -2502, -8497, -3267, 4576, 4741, -1329, -2978, -965, -3093, -6564, -1282]
1296a282Q154k632r269k747M593J906j989K316N183m112r330r36J0385M970m069
1311A141k552L688q79o274J402R430L501n121l518J882J16m816L758P004J342
1326A0104j0268p063L162N652o75k151K586R6p326n280O680Q282j120n047q2J526
1342i24l128j610P284O530l517q978P59N380p57k976M389M609m150q640j053O456
1358c26L877r99o64J208l579n978K859R670K731o119m246K345J275l549J951O778
1374G234R79p933o076L519L547p41n81K005K20o737k570L841O148j264j917J376
1390A050M7n184j051P257P680l022p459k552L006K778N5K446J632m163o079J723
1406a836N349K51k523j142L557l866o073J910O197K585l844j596Q59O84m759K146
$$ y = [-1282, 6872, 4240, -5029, -7776, -3183, -1277, -3266, -950, 4233, 121, -9209, -10145, 240, 5210, 1141, -1411, 2277, 1398, -4876, -3474, 5956, 9457, 4336, 818, 2700, 2816, -2000, 1758, 8762, 10104, -164, -7227, -4065, 1587, 912, -1239, 1347, 1443, -5883, -11163, -4483, 3799, 2679, -2368, -2450, -924, -4052, -5662, 1622, 8152, 4635, -4343, -3584, 1796, 1039, -1937, 2452, 7061, 2911, -5729, -6782, -326, 3551, 2552, 1888, 3096, -483, -6461, -3602, 6068, 8799, 2680, -1566, 779, 2054, -1495, 456, 7234, 8213, 280, -5796, -2277, 1270, 529, -52, 1953, 2173, -4564, -7134, -3293, 2855, 1591, -326, 1050, 1097, -4087, -5138, 2119, 9799, 6777, -682, -3234, -228, 2550, 2605, 5051, 6683, 2520, -3559, -1836, 3513, 3764, 1241, 99, 3656, -210, -6283, -4373, 1824, 4409, 565, -1031, -172, 512, -4247, -2101]
1422b101P164K177n589l743J291M91L86L171M377l372p632j823N133M660p23l396
1438D71L04R2k800j211L898L134l25k588j202l72r46J270M870L472k679p709r53
1455c274M468K647k19P12K16m826n857K710O304J575k709l374j324j228L23L660
1471a96K286k13m463q66K191R70l93L112L737p28m493k843K100M065J624K47j335
1488D802m052k897l42M209K988j932l906j114o59n32J016L878L66l445k854L03
1504d171K149K974K02Q03J048o71l134j325M565K580M98j997j693l173j459K784
1520b0L954Q39m809m111P32J703N75O15K021p18l272j607K759K172P39J181P72
1537C525k551j714P2K534K800J26m45l473j800q54L55L037K582j496n031k273
$$ y = [-2101, 5063, 7240, 1651, -2092, -801, -310, 76, 3247, 7624, 4252, -3380, -5203, -70, 4590, 3867, 471, 775, 867, -1933, -3144, 754, 3888, 3563, 975, -227, -599, -1545, -275, 4595, 8067, 5388, -2321, -3274, 1194, 3841, 3622, 4334, 4550, -276, -6133, -3423, 2881, 4456, 1747, -1627, -2951, -4179, -3856, -196, 2090, 1877, -2586, -3452, -1261, -291, -684, 2428, 6165, 5437, 944, -1899, 201, 4266, 5890, 6137, 4802, 750, -2147, -2489, 1720, 4708, 2776, -1130, -2244, -2903, -3435, -2419, 1459, 1825, -1620, -4474, -4171, -2022, 952, 1154, 1957, 3005, 2334, -800, -2125, 2440, 5020, 5518, 3521, 1828, -1345, -2804, -20, 3934, 4773, -36, -4147, -3415, -1712, -1137, -522, 1499, 781, -2491, -4098, -1339, 833, 1572, 2753, 3525, 974, -740, -668, 1866, 4666, 4792, 4347, 874, -926, -1780, -1425, 1612, 4194, 2698, -2333, -4606]
1553d606N57K841K368N46j100k237k181M66L466L194k21p20j981q87j198J974
1569B81M033J833l118l200k048K42K847J317J894j419l700k322k95K938J896O96
1585A875j090k380k773O85K764L485N70k344k585K43K51P05J776K129n57l280
1601e26j803M27K432J477N85l69k797k822m0K598K913q08j463j089j213k77L58
1618b417K341K702p48l862j240N4J921J852J718k60j871k839q9J864J590J196
1634A912P2j480k911k256K675K941K108j394l107j865K35J556J782J952j174j570
1650e24k393N36J917J404J196J74k151k113j592K978K464N22p15j320j799j640
1666c056N71L039J978k53j855k848K22L21K061K404L67l074j876p08J928K688
$$ y = [-4606, -4049, -1208, 1160, 1706, 606, -1631, -3812, -3346, 120, 3314, 3093, 2373, 392, -495, -1693, 281, 4314, 6147, 3029, -171, -2219, -1977, 870, 2187, 4081, 2662, -1038, -3360, -3655, -717, 1179, 1875, 785, -1595, -4368, -3683, -919, 2566, 3136, 792, -1793, -1550, -1299, -594, 1182, 3311, 2754, -526, -2329, -1902, 530, 2007, 2592, 2223, -574, -3396, -3436, -838, 2075, 1267, -196, -1285, -2498, -2775, -2417, -76, 2626, 1878, -1984, -3224, -3170, -1249, 603, 2321, 2061, 190, -2649, -2738, -874, 716, 1912, 1984, 504, -2407, -4663, -1988, 953, 3061, 1667, -1440, -3305, -3070, -1514, 268, 2220, 1046, -524, -2917, -2381, -464, 940, 2136, 2310, 159, -1954, -3546, -568, 1896, 2418, 1703, 383, -1416, -3056, -2485, 554, 2532, 2279, 424, -2424, -2202, -1881, 180, 2584, 2951, -123, -1999, -2707, -779, 1909]
1682A909M20l3j419j696j638J198K904J947j675j745k000J94N12K300K817j214
1698B781l734j814P42J610J881N26L17j488j618j771J912K858N87o09j537j560
1714i17j072O48K715J732j324k052j093O47K32J227M33R30j454k349k93J741J221
1731I72J065o00K33j889j737P84K219J491q12j47r40j913k32J320K400J210k473
1748I51j612j212j40K034K366Q30j646l484n44Q84K907Q38l53J71j800k566K33
1765b143K926K507l18k580m83j709J370Q03K109N19j892k766j742K507L78J647
1781A133Q50o74k759k342J201L747J676o26q98j731p87K96K463J844M17j812k648
1798f50l85N17j40K307O92k40l782k226J693J834J189l50J71j654k767J094K459
$$ y = [1909, 2329, 2296, 877, -819, -2457, -1259, 1645, 3592, 1917, 172, -1828, -1634, -1122, 1178, 3995, 2781, -953, -2767, -2025, -415, 1466, 1992, 2309, 821, -797, -2568, -656, 2202, 2789, 2180, 643, -917, -1989, -1341, 1374, 3106, 1782, -270, -1363, -716, -484, 743, 1176, 2106, 652, -1697, -1990, -249, 972, 2037, 1437, 1670, -219, -1956, -1172, 1047, 2538, 1726, 1579, 639, -1274, -1506, -186, 2214, 3424, 951, -661, -1873, -2013, 21, 2387, 3217, 1571, -1913, -2457, -1573, 1334, 2172, 1819, 1990, 190, -2376, -2143, 783, 3290, 2972, 392, -91, -1800, -430, 373, 2482, 3001, 1109, -1657, -3399, -892, -514, 1133, 1983, 1309, -1450, -3792, -2591, 1156, 2832, 2206, 1308, -423, -1210, -914, 1549, 3393, 3810, 1998, -650, -1035, -518, -658, 1649, 2341, 2101, -1681, -3907, -2214, -380, 809, 459, 630, -1024, -3791, -2697, -238]
1815b38K803n91j908m88l35j86Q46L238M95k165k217j207J205Q10K97J064l04
1832A119k989j423K37K317J795q48K29q45j279j102K646K303J146j604k455N43
1848b10K13k24J912J531j188l450j274J707J27R5K26O42j425l034J18K898J128
1865b08O72p32P1k11j544J130L882J441j908j279l54n25K27J522K549j468l344
1882g9k648Q46J909K75p07M35o04k447q45K074L529l02j856k4p4p07J66L123K433
1901D497j589l286j090J054P99L82J169j20k581k470Q37K408J013q15n42Q7j057
$$ y = [-238, 2565, 1974, 66, -422, -757, -943, -97, 3141, 3636, 1471, -746, -1953, -748, 62, 359, 1423, 1119, -1870, -3293, -3056, -739, 1056, 208, 437, -408, -1687, -2789, -143, 2160, 3306, 1702, -753, -210, 3, -221, 1691, 3222, 2034, -1416, -2690, -983, -856, -761, -535, 107, -1318, -4352, -4234, -1336, -208, 464, -268, -197, -408, -1952, -822, 3060, 4501, 2593, 1314, 960, 435, 662, 2184, 4733, 3265, -79, -2727, -1881, 28, 303, -404, 31, -573, -3020, -3865, -1791, 1738, 1436, -420, -444, -518, -1225, -1059, 2064, 4497, 2908, -378, -1468, -414, 385, 767, 1936, 1816, -765, -3235, -2398, 10, 1023, 208, -334, -247, -1304]
$$ [...]
8191a94
##END NTUPLES=NMR FID
##END=
