##TITLE=1H_SA_24.216
 DMSO, 108 sc, 
 27.7.2020
##JCAMPDX= 6.0         $$ Bruker NMR JCAMP-DX V2.0
##DATA TYPE= NMR FID
##DATA CLASS= NTUPLES
##ORIGIN= UXNMR, Bruker Analytische Messtechnik GmbH
##OWNER= root
$$ XWIN-NMR		Version 3.5
$$ Mon Jul 27 12:09:57 2020 Russian Standard Time (UT+4h)  she@DPX200
##.OBSERVE FREQUENCY= 200.1315
##.OBSERVE NUCLEUS= ^1H
##.DELAY= (6, 6)
##.ACQUISITION MODE= SIMULTANEOUS
##.ACQUISITION SCHEME= undefined
##.AVERAGES= 108
##.DIGITISER RES= 18
##SPECTROMETER/DATA SYSTEM= spect
##.PULSE SEQUENCE= zg30
##.SOLVENT NAME= DMSO
##.SHIFT REFERENCE= (INTERNAL, DMSO, 0, 15.7039)
##AUDIT TRAIL= $$ (NUMBER, WHEN, WHO, WHERE, WHAT)
$$ ##TITLE= Audit trail, XWIN-NMR		Version 3.5
$$ ##JCAMPDX= 5.01
$$ ##ORIGIN= Bruker BioSpin GmbH
$$ ##OWNER= she
$$ F:/spectra/data/she/nmr/H-F/1/audita.txt
$$ ##AUDIT TRAIL=  $$ (NUMBER, WHEN, WHO, WHERE, WHAT)
(   1,<2020-07-27 12:04:41.75 +0400>,<she>,<DPX200>,
      <continue with go, POWCHK disabled, PULCHK disabled
       configuration hash MD5:
       00 E9 B6 7A A2 85 ED C7 34 08 36 98 17 FE 4E 26
       data hash MD5: 16K
       85 A3 EC AA 88 95 52 3D 95 8A 27 98 8D 85 DD 95>)
$$ ##END=
$$ 
$$ hash MD5
$$ 2B 4A 6C 2D 12 DC D9 93 A0 BC 97 CF 32 1A B8 4D
##$RELAX= 
##$RELAX= 
##$RELAX= 
##$RELAX= 
##$RELAX= 
##$RELAX= 
$$ Bruker specific parameters
$$ --------------------------
##$DU= <F:/spectra>
##$EXPNO= 1
##$NAME= <H-F>
##$PROCNO= 1
##$TYPE= <nmr>
##$USER= <she>
##$AMP= (0..31)
100 100 100 100 100 100 100 100 100 100 100 100 100 100 100 100 100 100 
100 100 100 100 100 100 100 100 100 100 100 100 100 100 
##$AQSEQ= 0
##$AQ_mod= 1
##$AUNM= <au_zg>
##$AUTOPOS= <>
##$BF1= 200.13
##$BF2= 200.13
##$BF3= 200.13
##$BF4= 200.13
##$BF5= 200.13
##$BF6= 200.13
##$BF7= 200.13
##$BF8= 200.13
##$BYTORDA= 1
##$CFDGTYP= 0
##$CFRGTYP= 5
##$CHEMSTR= <none>
##$CNST= (0..31)
1 1 145 1 1 1 1 1 1 1 1 1 1 1 1 1 1 1 1 1 1 1 1 1 1 1 1 1 1 1 1 1 
##$CPDPRG= <>
##$CPDPRG1= <>
##$CPDPRG2= <>
##$CPDPRG3= <>
##$CPDPRG4= <mlev>
##$CPDPRG5= <mlev>
##$CPDPRG6= <mlev>
##$CPDPRG7= <mlev>
##$CPDPRG8= <mlev>
##$CPDPRGB= <>
##$CPDPRGT= <>
##$D= (0..31)
0 1.2 0 0 0 0 0 0 0 0.06 0 0.03 0 0 0 0 0.0002 0 0 0 0 0 0 0 0 0 0 0 0 
0 0 0 
##$DATE= 1595836732
##$DBL= (0..7)
120 120 120 120 120 120 120 120 
##$DBP= (0..7)
150 150 150 150 150 150 150 150 
##$DBP07= 0
##$DBPNAM0= <>
##$DBPNAM1= <>
##$DBPNAM2= <>
##$DBPNAM3= <>
##$DBPNAM4= <>
##$DBPNAM5= <>
##$DBPNAM6= <>
##$DBPNAM7= <>
##$DBPOAL= (0..7)
0.5 0.5 0.5 0.5 0.5 0.5 0.5 0.5 
##$DBPOFFS= (0..7)
0 0 0 0 0 0 0 0 
##$DE= 6
##$DECBNUC= <off>
##$DECIM= 24
##$DECNUC= <off>
##$DECSTAT= 4
##$DIGMOD= 1
##$DIGTYP= 9
##$DL= (0..7)
0 120 120 120 120 120 120 120 
##$DP= (0..7)
150 150 150 150 150 150 150 150 
##$DP07= 0
##$DPNAME0= <>
##$DPNAME1= <>
##$DPNAME2= <>
##$DPNAME3= <>
##$DPNAME4= <>
##$DPNAME5= <>
##$DPNAME6= <>
##$DPNAME7= <>
##$DPOAL= (0..7)
0.5 0.5 0.5 0.5 0.5 0.5 0.5 0.5 
##$DPOFFS= (0..7)
0 0 0 0 0 0 0 0 
##$DQDMODE= 0
##$DR= 18
##$DS= 0
##$DSLIST= <SSSSSSSSSSSSSSS>
$$ [...]
##$SUBNAM2= <"">
##$SUBNAM3= <"">
##$SUBNAM4= <"">
##$SUBNAM5= <"">
##$SUBNAM6= <"">
##$SUBNAM7= <"">
##$SUBNAM8= <"">
##$SUBNAM9= <"">
##$SW= 24.9337058887773
##$SWIBOX= (0..15)
0 0 2 0 0 0 0 0 0 0 0 0 0 0 0 0 
##$SW_h= 4990.01996007984
##$TD= 16384
##$TD0= 1
##$TE= 0
##$TE2= 300
##$TE3= 300
##$TEG= 300
##$TL= (0..7)
0 120 120 120 120 120 120 120 
##$TP= (0..7)
150 150 150 150 150 150 150 150 
##$TP07= 0
##$TPNAME0= <>
##$TPNAME1= <>
##$TPNAME2= <>
##$TPNAME3= <>
##$TPNAME4= <>
##$TPNAME5= <>
##$TPNAME6= <>
##$TPNAME7= <>
##$TPOAL= (0..7)
0.5 0.5 0.5 0.5 0.5 0.5 0.5 0.5 
##$TPOFFS= (0..7)
0 0 0 0 0 0 0 0 
##$TUNHIN= 0
##$TUNHOUT= 0
##$TUNXOUT= 0
##$USERA1= <user>
##$USERA2= <user>
##$USERA3= <user>
##$USERA4= <user>
##$USERA5= <user>
##$V9= 5
##$VALIST= <valist>
##$VCLIST= <CCCCCCCCCCCCCCC>
##$VD= 0
##$VDLIST= <DDDDDDDDDDDDDDD>
##$VPLIST= <PPPPPPPPPPPPPPP>
##$VTLIST= <TTTTTTTTTTTTTTT>
##$WBST= 1024
##$WBSW= 4
##$XGAIN= (0..3)
0 0 0 0 
##$XL= 0
##$YL= 0
##$YMAX_a= 1722988
##$YMIN_a= -1022279
##$ZGOPTNS= <>
##$ZL1= 120
##$ZL2= 120
##$ZL3= 120
##$ZL4= 120
##$ABSF1= 10
##$ABSF2= 0
##$ABSG= 5
##$ABSL= 3
##$ALPHA= 0
##$AQORDER= 0
##$ASSFAC= 0
##$ASSFACI= 0
##$ASSFACX= 0
##$ASSWID= 0
##$AUNMP= <proc_1d>
##$AZFE= 0.1
##$AZFW= 0.1
##$BCFW= 1
##$BC_mod= 2
##$BYTORDP= 1
##$COROFFS= 0
##$CY= 11.3945322036743
##$DATMOD= 1
##$DC= 2
##$DFILT= <>
##$DTYPP= 0
##$F1P= 16.9975609425685
##$F2P= -3.02152046262296
##$FCOR= 0.5
##$FTSIZE= 0
##$FT_mod= 4
##$GAMMA= 1
##$GB= 0.15
##$INTBC= 1
##$INTSCL= 1
##$ISEN= 128
##$LB= 0.24
##$LEV0= 0
##$LPBIN= 0
##$MAXI= 10000
##$MC2= 0
##$MEAN= 0
##$ME_mod= 0
##$MI= 1.114404
##$NCOEF= 0
##$NC_proc= 0
##$NLEV= 6
##$NOISF1= 3.799351
##$NOISF2= 2.8
##$NSP= 1
##$NTH_PI= 0
##$NZP= 0
##$OFFSET= 15.70392
##$PC= 1
##$PHC0= -9808.731
##$PHC1= 31.00092
##$PH_mod= 1
##$PKNL= yes
##$PPARMOD= 0
##$PSCAL= 0
##$PSIGN= 0
##$REVERSE= no
##$SF= 200.130013532006
##$SI= 16384
##$SIGF1= 3
##$SIGF2= 2
##$SINO= 400
##$SIOLD= 16384
##$SREGLST= <1H.CDCl3>
##$SSB= 0
##$STSI= 0
##$STSR= 0
##$SW_p= 3612.71676300578
##$SYMM= 0
##$S_DEV= 0
##$TDeff= 0
##$TDoff= 0
##$TI= <>
##$TILT= no
##$TM1= 0
##$TM2= 0
##$TOPLEV= 0
##$USERP1= <user>
##$USERP2= <user>
##$USERP3= <user>
##$USERP4= <user>
##$USERP5= <user>
##$WDW= 1
##$XDIM= 8192
##$YMAX_p= 0
##$YMIN_p= 0
$$ End of Bruker specific parameters
$$ ---------------------------------
##NTUPLES= NMR FID
##VAR_NAME=  TIME,          FID/REAL,        FID/IMAG
##SYMBOL=    X,             R,               I
##VAR_TYPE=  INDEPENDENT,   DEPENDENT,       DEPENDENT
##VAR_FORM=  AFFN,          ASDF,            ASDF
##VAR_DIM=   8192,          8192,            8192
##UNITS=     SECONDS,       ARBITRARY UNITS, ARBITRARY UNITS
##FACTOR=    0.0002004,     1,               1
##FIRST=     0,             0,               0
##LAST=      1.6414764,     0,               0
##MIN=       0,             -1022279,        0
##MAX=       1.6414764,     1722988,         0
$$ Real data points
##PAGE= N=1
##DATA TABLE= (X++(R..R)), XYDATA
$$ [...]
2728b065N98K506k14o55j364o9J901J425n04l063o75K571Q05j62j616j750K780
2745D49K144k011j784o3K432J122k366j189k96J370J947K3k514L59J36J640n56
2762H43k337L21J941J535j566k312J013O14J419m62r66j266Q40J616k91n37l56
2779D9M83N93p15j243j50J444J728m54k463n32O94J624nj588j130R82K040j025
2797C32p80p76K382l39o8m40j797J681J808k21k757M73j39L346l080k72n84O42
2815e89K262k274p3j861K380K513j363k621J17J340K226j524j071l12J097J062
2831A309l97j193j05M60K721j558j645o38M77J452N72j177j727J065M09J103j897
2848g69P55l64P93k16m58j811K978L4J321l297l34M7O47K127k008k04N05J540
$$ y = [-2065, -1467, 1039, 825, 170, -1194, -1263, 638, 2063, 1559, -1504, -2179, 392, 1197, 1035, -581, -2331, 449, 2593, 582, -1202, -1265, 1167, 2289, -77, -1266, -1562, -192, 1755, 1778, -736, -377, -241, 1399, 843, -1494, -1173, 768, 2303, 737, -1575, -562, 52, 1471, 1009, 43, -1223, -383, 1233, 942, 405, 49, 532, 1125, 410, -833, -983, 461, 2189, 1735, -728, -1260, -566, 1058, 1053, -535, -1665, -683, 1357, 332, -448, -1224, 1158, 819, 751, 311, -1486, 195, 2003, 1782, -975, -502, -641, 2705, -375, -647, -1231, -589, 1673, -601, -674, -2535, -155, 2358, 995, -1626, -1509, -169, 2057, 533, -538, -850, 247, 1309, 912, -281, -386, 74, 2795, 1237, -408, -1046, -569, 883, 1455, 278, -1449, -384, 25, 1128, -769, -14, -378, 415, 199, -259, -2070, 908, 942, 2263, -1034, -1368, -1321, -674, 1453, -555, -759, -254, 1286]
2866A286j041q49o32J064N82Q24j826o8L27J981l87j782l70l83K172K04j375n30
2884h03J398N55p91j000L4J131L29k3j049j756P14K379K12p79j749R88R46J062
2902A798j197j561J237K79O94j278j817K219Q84M38k011j238P16J308O40j478
2918c67j409R72J825Q3o55j890L34K111N31j033j389M35J218L34r16r94M41L67
2936bj74n04n56q1K282K62j353p56L6J595J167k774M04p07R58Q83l16K39j055
2955d52P63N1J064k500N11K296K44j349o16k91L44P53m13p14q63J093k31P67j132
2974f75M91R50p18P06j258Q36J0O88j279q21r72K232Q16k70j281r1J568l28j624
2993a020m66k4J685J133j103r80J15Q65l14J475j560L38J131j274p2K33j88N29
$$ y = [1286, 245, -604, -1236, -172, 410, 1234, -592, -660, -333, 1648, 1261, -521, -891, -1274, 898, 1102, -273, -803, 595, 1150, 359, -641, -607, 524, 853, 830, -219, -1975, -1261, 1118, 1330, 551, -1198, -210, 736, 1798, 601, -960, 277, 556, 1250, -28, -1845, 374, 1258, 1696, -315, -1553, -837, 471, 1111, -367, -1776, -804, 1021, 1104, 449, -1441, -1107, 1004, 1535, 502, -887, -452, 766, 1100, 184, -810, -369, -2, -176, -680, -1236, -1317, 965, 1227, -126, -882, -846, 749, 1916, -858, -454, -1161, -203, 680, 364, 603, -452, 311, 362, 1426, -1074, -563, 1733, 1977, 628, 12, -279, 65, 818, 405, -309, -1172, -79, -310, 457, -675, -184, 766, 48, 754, -504, 332, 342, 1030, -249, -1070, -2042, 190, 1006, 736, -545, -636, 932, 604, -1020, -1486, -1510, 175, 1308, 205, -775, -660, 205, -109, 1366, -194, 144, 1275, 1, -71, 162, -26, 503]
3011E03M03j376j202J244N82Q96r10j609j58K057L96j37j228j074K085M0j406
3028h94L94k6K49J583j593j286P09J034m3p17J193j666J978l08p5j756J285O57
3046G18L28j042j128j65J696K86m43j286R31L06j3l56J06p64M51K53o58M31K89
3065f0R18L5j03j278r3L22J396O5j533j183K231o64Jj856J849J00L92j373r1J30
3085g95K00K032n27r49r92J318O82J81j989J73J82R69M74j181N73o05J656p44
3103F58j130N4N49J093p64j081j344K432J492j878k11J7P5P82n78k94m89J212
3121E95K56p23L94o61j19J393j186l96l00J077J63M06n69r69J087n3M30j128l29
3140f32M97K40m5j54k30J3M03q03k12q9J809J80o61p80L09J78R09N31j457j051
$$ y = [503, 906, -470, -1672, -428, 154, 1050, 140, -1469, -1627, 430, 826, 689, -539, -1613, 472, 512, -894, -500, -526, -277, 1306, -287, -1573, -864, 170, 127, -590, 603, -1063, 915, 607, 532, -1224, 61, 718, 1046, 4, -1124, -1289, 407, 693, 250, -1036, -105, 201, 188, -168, -62, -826, -375, -122, -780, -349, -60, 858, 893, 790, -488, -581, -259, 1137, 1202, -331, -1514, 717, 53, 54, -1802, 47, 147, 539, -834, -925, -795, -595, 1437, 910, -39, -1031, 287, 969, 1150, -839, -666, -484, 485, 959, -222, 351, -254, 1402, 658, -472, -418, 131, 1224, 460, -621, -1965, 467, 1959, 81, -130, -113, -38, 744, 166, -128, -617, 595, 851, 128, 522, -139, -258, 1135, -51, -447, -747, 330, 493, 899, 330, -639, 448, 395, 825, -303, -632, -135, 105, 60, -94, -324, -311, 92, -711, -923, -1012, 797, 977, 316, -464, -155, 23, 932, 1463, 6, -1045]
3160a045p15J568N17L84j640J072N28l31l51r99Q22J480q35q71l7K52L42O70k26
3179E85p12j449J107K17N2r94K056M85q41j342J632j432pJ122o05q54P05K54l12
3198c33J322j373O49j498K418j303Q39l73O34r32O33j254Q6J614l13p21k49L36
3216A82j57k71J011m88P8j380J562j295O50N90J23M60q11q54Q35p9J225j231k07
3235e7O24l56m61J072j073O24j569R03J034q49m6m62R29m1j43n76Q78M03j028
3254a94O89q6q40j50M67q80K87J598m84o60K26n69L98O68j90k83K41o07P30l18
3274D3l88O79J52N29j017L36k79M40Q25r64j056O37J32J64N54O65j553p6o8Q9
3294a56J54k32Q18J75j456N84o1L71J01m42n51K3J166j236p5K16O12J015m60o04
$$ y = [-1045, -1760, -192, 325, 709, -931, 141, 669, 338, -13, -1012, -190, 1290, 455, -416, -453, -201, 141, 811, 585, -127, -1576, -469, -252, -200, -1194, 862, 1347, 506, -836, 796, -636, -643, 479, -126, -980, -275, -21, -333, 989, -384, 265, -1233, 1185, -118, 721, 348, 982, 50, 683, -571, -485, 1129, 816, 95, -154, 182, 25, -246, 765, 277, 355, -1025, 537, -758, -108, 482, 605, 1065, 254, -600, 235, 156, 1381, 150, -57, 567, 211, -250, 822, -251, 373, -1196, -293, 741, -108, -154, -616, 313, 272, 129, -447, 431, 834, -194, 495, 409, -431, -581, -114, -994, -707, 891, 407, -253, -27, -596, -198, 470, 280, -3, 238, -369, 361, 43, -345, 334, 486, 1015, -2, 334, 55, 495, 1320, 356, -700, -63, 69, 233, 787, 1452, -101, -177, -245, -156, -2, -234, 584, 759, -697, -113, -174, 197, 298, -144, -695, -672, 494, -742, -817, -601, 11, 1026, 566, -38]
3314c8L2p77J347N26j413J039j753J238m78r80Q02K13l59R48m13J159j472L09
3332g0j08N14J10j4J16L95n25j068J571o74j106P49N11k27O94j197M22K66q22
3351d63k67K10L74M84QM07k47m11p96L128k280l34q03Q5L51R73k62j79m71o70
3371a163J417N54k81n92M40j189N63n06J69P9J80J116n17k57P72o27o01J150o59
3390D8N7R1j41J55L69L75j409m30Q24q98J028K72p82l62R24j9k76O53M58o80J94
3411D51o85J75J9K98j48m2J6j26M20m4j093O32J65O5l16p05R01q45J244j090J91
3432e17q8Q2n98P20J013K04q80O61j066J91N33l18j9K06n37J010j51m33m02j92
3452e81L78n54P19l83J93N15o02Q45o2K07O55q07q8k17Jo84k25J056r98R62j78
$$ y = [-38, -6, -783, 564, 1090, -323, 716, -1037, 201, -277, -1257, -455, -242, -601, 347, -66, 1093, -379, -70, -178, 336, 446, 432, 548, 943, 418, -650, 921, 247, -859, -110, 401, 174, 868, -329, 93, 359, -463, -730, -520, -146, 338, 346, 753, 506, 95, -701, 2427, 147, -187, -990, -905, -554, 419, 157, -22, -493, -1163, 254, 808, 527, -65, 375, -814, -251, -757, -588, -509, -329, 787, 270, 13, 785, 158, -443, 707, 48, 105, 196, 55, 210, 579, 954, -455, -885, -61, -959, 69, 341, -441, -803, 121, 102, -174, 479, 937, 257, 451, -234, -59, -40, 258, 110, 68, 84, -42, 378, 334, -759, -127, 38, 103, -213, -918, -17, -862, 382, -708, -517, -605, -523, -1121, -401, 612, 816, -64, 597, -469, -278, 255, -63, -82, 124, -413, 597, 446, 13, -389, -581, -203, -757, -38, -421, -228, 287, -315, 530, 468, 675, 1330, 523, 435, 218, 219, -465, -690, 366, -632, 330, 152]
3473A52J7n99j30O50P2L60k37k12l41J005j009lP83p76Q85m51r01N93j67oL50
3494C5q7J65l4K37l83j191O54N40L61n08K99p67N22L02N13j93j726O67O01M79
3514D86n66M55l82k09j31k00J233j37j293K74N25p31J455j181J046l16n00j17
3532b89L72K65j50r1o22N41K36p94M03j38n40Q21q10N59m1l56l09J194n24k75
3552e48j7P17q21L86P09j35k82L6J31J23K11K76o00k57N71p65Q19j205J77M52
3572b2M01R1q94J430l097K953q74k33l01P76K73m56P26n87m66j1J007n82N86n42
3592A78J52Q7P60j052L41o66J069q33r8J00j73n10L78P67J17q74L37K35j15q1
3612A19j219Q14L87O3o42q42J374M62j176M01J249pj701O11J722q06m55r09L07
$$ y = [152, 169, -430, -560, 90, 162, 522, 285, 73, -268, 737, -272, -275, 508, -268, 617, 166, -735, -142, -309, -315, 35, -52, 113, 79, 316, -67, -1258, -604, -64, 297, -211, 88, -679, -157, 145, 658, 465, -1261, -594, 7, 486, -80, 375, -7, -216, -347, -547, 686, 549, -744, -470, 55, -676, 779, -402, 644, 328, -172, -289, 83, 348, 198, 107, -515, 26, 262, -532, -129, -267, -807, 14, -796, -237, -278, -634, -943, 251, -273, -548, -565, 152, -669, -283, 426, 291, 9, 45, 176, 299, 510, 786, 186, -71, 500, -265, 554, -651, -474, -22, 379, 470, -424, 1006, -2091, 862, -12, -245, -546, 230, 503, 47, 773, 186, -280, -291, 716, 134, 720, 178, 330, 417, 1177, 125, 466, -200, 869, 36, -62, 38, -135, -645, -267, 500, 617, -257, 80, 315, 200, 119, -1100, -286, 101, 164, -478, -1320, 54, 516, -660, -259, 990, 983, -718, -107, 1615, 809, 354, -555, -248]
3631b48N21q96j99K204j059l58O44j594J713o89L35L0m66N4O90m14o85M47l37
3650c07P5L00k44m49O59k70P6o76J132j463J068K16l28R82j309k88O32p83N8J200
3670B81n05P24j127Q61J28l9o26Q68j001j37Q8R78q50O72o83J050k29j115J226
3689E64j032O21p70q9N95j26K9J8J08K1o41J242j194J098j81m73q59J289j01P0
3709A89K53N7j027J031n01r96J412j336J080N55q17o35J292j118N48o19P5L36
3727b21K34l56L97L93k59m3Q70o65n93M95p87P44k06o74P80o80N44N32K26k26
3747E05K03m99j46o14O01R76o48n31l32K56P53j6p47J218q46o38J49J64l43K06
3767c29J261j310M8M92l74q35J559K91m80j366M52K23P2K38k81l27R41j218J813
$$ y = [-248, 273, -623, -822, 1382, 323, -35, 609, -985, 728, 39, 374, 404, -62, -8, 682, 268, -417, 30, -307, -232, 68, -176, -625, 34, -236, -160, -836, 296, -1167, -99, 117, -211, 771, -538, -826, -194, -977, -919, 281, -224, 500, -627, 234, 362, 323, -303, 565, -436, -573, -485, 493, -357, 315, -368, 682, 453, -662, 564, -468, 153, -617, -706, -111, -237, -208, -190, -82, -61, -702, 540, -654, 444, 263, -210, -1069, 220, 119, 189, 442, 499, -528, 503, 2, -994, 418, -918, 162, 717, -100, -735, 557, -561, -13, -632, -557, -221, 13, -343, 54, 447, 188, 145, 1015, 350, -243, 252, -535, 209, 3, -671, 109, -571, -27, 505, 731, 505, 708, 209, 63, -551, 50, 1026, 378, -153, -485, -229, 524, 508, -239, 979, 133, -505, -356, -192, -535, -329, 932, -378, -330, 162, -212, -1047, 512, 803, 323, -1043, -591, -368, -296, -58, -339, -666, 275, -943, 870]
3786H70j252k89J518k041J389j078J46P67L29N79q18l26N71J57Mo54J506j008
3804C70L93j274L83O47m31j72q6L42q05QJ75N89n61O40m54j53O55M03l2p63N0
3825g6Q66p08r53O58R6J82n97L71P49j926J001K80Q31n16K72o50O03o52J352j779
3845e96k15Q93Q7K10l04j342J404k57n6P58n06O55r03K4L13K89j007N68o08P70
3865A77m33k27j90P40k08n26k87J078m50K90M08k5o83Q40l14m6p26J057J87J86
3885H48o38m59L00N07p88k88m9l0J32J177j647j5J429o17M45r54J672j203k84
3904d62J219L7q49j51j34P93j657R56K28j453K202n83K9O9o25L08P49L07r17R55
3924A021j167M00L71q7J5m99j082J287r63R76m98j051J553Q24j169l97j02K73
$$ y = [870, -382, -671, 847, -1194, 195, -883, -737, 30, 359, 938, 120, -206, 365, 522, 526, -128, 1378, 370, 763, -511, -128, 519, 88, -84, -170, 172, -633, -625, -450, 139, -422, 218, -236, -389, 266, 669, 637, -126, -76, 790, 82, -871, -213, -117, 65, -532, -161, 588, -1338, -337, -57, 774, 258, 530, -120, 483, -169, 1183, -596, -811, 82, 169, 379, 75, -1267, 137, -120, -176, 582, 76, 731, -172, -148, 165, 454, -553, 15, -593, 177, -256, -483, -673, 67, -141, -667, -954, 124, -326, -36, 372, 347, -336, 504, 190, 144, -582, 475, 662, 848, 210, -249, 51, 558, -230, -518, -567, -597, -465, 712, -935, -950, 479, -138, 307, -647, 1025, -178, -462, 757, 794, -55, -206, -340, 453, -1204, -248, -20, -1473, 729, 146, 175, 244, -381, -73, 676, 983, 66, 1021, -146, 254, 625, 538, 553, 54, -1028, 259, -704, 272, -226, -1277, 276, 1100, -69, -466, -568, -295]
3942b95J280k041Q03p59M05O50k04K41n87M86M01j16q14J562k89o93J62N10j372
3961f70R95K71o82J739k215J010o9k26l45j33j83J035O79j346R85k3j684J560
3979F98o50M27q67R24o54p33N81n92L39l23J654j431M60J133j532O33m09j72J332
3998H18j293O69m18j65N38R9r18P92k60N27j99p86M68Q74K80l78q14K52R77j008
4018E5N92j277R69l41J50K1j159Q73q28P51R19r26j02M00N6K83j006M48P72l43
4038C07j751N93J119j155J013o85p8O84o4j0O6J65j45R24j302j97O30r8L18R26
4058A260j622K9N62q41P15J42n33L51n03O19J45j058O12l6J309j3j635j60J035
4077C78o84P39J37J86j529N13Q91n6n88j8K37r31J45P47P05r11j09J513j843K09
$$ y = [-295, 985, -1056, -253, -1012, -607, 43, -161, 80, -507, -21, 380, 264, -550, 1012, 723, 30, 192, 702, -670, 325, 596, -86, 1653, -562, 448, 379, 153, -192, -325, -508, 527, 1206, -140, 845, 822, -862, 698, 48, 475, -392, 532, -122, -855, -274, -866, -527, -850, 804, -627, -167, 966, -566, 67, -342, -514, 818, -475, 194, -224, -389, 149, 248, -670, 122, -138, 389, 190, -596, -128, 746, 1026, 648, -166, 86, 1063, 55, 647, -630, 339, -2, 148, 169, -990, -117, -945, -194, 725, -201, -303, 97, 153, 436, -570, -122, 650, 307, -1444, -851, 268, -887, 126, -559, -637, 47, -17, -27, 39, 204, 59, 983, -319, -516, 114, 16, 334, 1260, -362, -333, 229, -612, 103, 245, -288, 63, -440, 179, 324, -734, -122, -158, 1151, 1138, -497, -657, 378, -306, 433, 570, 756, -773, -260, 631, 575, -13, -31, 206, -725, -580, 167, 872, -39, -148, 1365, -478, -269]
4097b69R92j136K66o1p92J041K85n26R44j499Q35J4L69R32k178J429p12r7P85
4116F22j728q1K057n32o90J406j418J118q88K20K44r99J09P03O1p75N93q01N61
4135b18Q65j729K998j163j217r6Q87m73m7J407j206q07M70J150m00j279L08M61
4153h9M75k19j018R30L93r32L5l89J37l03P26p37J028P86%j181j30N43J48P0k503
4174b230K543M37p51j194J779p88l77J067q80N00r14R81r33N76J148j879J395
4191D80k42p24M45P40j07r54P76n78L03q8q4M1M62j87o05m64J31K81O57N40j28
4212F95j461P63o19K08O50k03p69J104r90J320r67p93L48J45N96P55o09l15j111
4231a253J423j254M67K4L57P93l11l9M38o15k06N2M81m87J28J36n43P2o37J236
$$ y = [-269, 723, -413, -147, -208, -1000, 41, 326, -200, 744, -755, 80, 94, 463, 1395, -783, 646, -66, -163, 622, -1106, -1187, 870, 338, -352, 1054, -364, 754, -134, 86, 330, -669, -560, 143, 204, -571, 22, -779, -218, 647, -1082, 1916, 753, -464, -560, 327, -146, -193, 1214, 8, -799, -329, 821, 421, -858, -550, -89, 386, 167, -851, 79, 472, -460, -425, -814, -677, -980, -254, -991, 37, 823, 823, -358, -488, 55, 203, 273, -2230, 313, 750, -1, -1195, 584, -204, -581, 486, -394, 106, -808, 173, -760, -184, 964, -915, 480, 238, -486, -41, 699, 592, -362, 414, -164, 139, 51, -33, 8, 470, 283, -322, -786, -655, -374, 283, 823, 695, -766, -3, -622, -414, 236, 33, -736, 368, -622, 698, -269, -1062, -714, -569, 27, 782, 173, -142, -1253, 170, -1084, -617, -593, -236, 557, 246, 207, 645, 30, -176, -124, 357, -130, -2, 134, -409, -337, -974, 262]
4251B62j32k68j158J208N79k80k88K25k39l34q9J310o81o5K91q34L67J196j480
4270d10R73r7O73n90j390J260R3j046Q08M23q21o14N87P43q36P54L54j361J289
4289G92j161N44o9K9p3j042K326k383J292j503J718J54r27K109k208K02n11J22
4307e89K26j10R34m87n48L03M32m19j76j42M65R90j417R31j049J236M08k286J320
4326B2p37J347n27J81K20j901J775j088J035L94o10k89j540J383O08n00o16R80
4344A37m17J27j72P6j99J443j620N33L93n27J31j009O03P61K3n34K71q88K18Q90
4364B40O91j656R07L7o33O44j49M12n12J474k062M1J145j006K83Q82j00l84K41
4383D95o20L12K82k97r20J150p3K09n95L89l26J92J85m11N43m35L26Q57l84j314
$$ y = [262, 130, -138, -1296, -88, 491, 211, -77, 148, -91, -425, -514, 796, 115, 50, 341, -493, -126, 1070, -410, 563, 466, 1139, 549, -841, 419, 512, -534, 274, 697, -124, -738, -151, 592, -244, 510, 864, -497, 792, -369, 175, 106, 135, 62, -980, 1346, -1037, 255, -1248, 470, 624, -303, 1806, -402, -200, -711, -589, -363, -473, 461, -26, -574, -271, 161, -258, -434, -576, -111, 879, -538, 393, -656, 580, 988, -1298, 22, -715, 632, 105, 286, 506, -1395, 380, -708, 327, 721, 111, -178, -1718, -335, 273, -227, -843, 137, -280, -153, -325, -249, -448, 995, -625, -92, 301, -226, -95, -1104, -501, 260, 283, -251, 20, -868, -650, 240, 931, -725, 182, 219, -414, 230, 81, 493, -19, 1455, -607, -566, 579, -427, -144, 738, 638, 254, 495, -125, 187, 469, 172, -748, 402, 329, 538, -57, 332, 6, 198, 383, -28, 515, 80, 406, 1263, 879, -435]
4403d35J5P69n5k96j59k85M27K52m5J022j583p2J192j231R8J55P1N84j136R45
4423B33j380P35j3O78l05N04K15p38j88l68J51L72J60j013J489j106j39N54n50
4442g09lM5L40k28M25q87Q87O8m50L80L63o90k15O19R55p55k11M26j017J06O4
4463d87O57jN70r06O95j532Q01k53L30n91J677q79P12j117J90M29l87n2o54O98
4483a00L41o60J02J08j48l5O40q81J090q32J934j629K1L28N43j289K80L71L0L19
4503E33o57Q66o16Q68j150K72M67J71r66l78J026k33j115L15L1N97m08Q20j65
4522B78o64K86k43n00Q82r92l6J795r31L02l92J387j736N22K43m81N98q51K56
4541b77l80O72R40k67m00Q72n11j90j579Q60M60j46k90M61K14r55O30m97Q25k56
$$ y = [-435, -420, 349, 294, -2, -161, -446, -19, 233, 188, 1210, -373, -445, 747, -484, -386, -231, -160, 424, -712, 233, -1147, -412, -425, 253, -52, 452, 667, -71, -259, -627, -476, -104, 56, -957, 532, -574, -713, -159, -709, -712, -667, -327, -555, -130, -1017, -130, -62, -512, -132, 231, -459, -674, -55, 900, 145, -66, 360, -657, -551, -487, 170, 169, 739, -167, 528, -1004, -203, -456, -126, -717, 960, 81, 793, -324, -134, 295, -92, -144, -798, -100, 241, -419, -317, -209, -357, -392, 248, -633, 457, -375, 1559, -70, -49, 279, 822, -467, -187, 184, 214, 533, -124, 742, 126, 994, -156, 116, 583, 754, -212, -590, 436, 203, -912, -597, -566, 31, -377, 443, 278, -386, -100, -343, -843, 39, -953, -989, 806, -125, 177, -215, 1172, -564, -42, 201, -280, 318, -533, -277, -657, 15, 955, 688, 288, 1160, 649, 459, -1120, -260, 200, 54, -236, 225, 439, -516, 114, -383, 442, 186]
4561A86l48O05k58j403J260n67o2L72k83N16P78J96j783O1O74O60n55L12q06M14
4581c1K16k46N41p60K78j11K43L10P8j022J015r08n70J034o55Q22l26j76r5k62
4601f25J645p30q41J047p16nM89N65j462K03j22N81m20O97q3M31r21L88j75R79
4621I25j385J077n11L8P72o24l88k94Q4J89K62Q05o70j6j2k68J97j62J154j143
4641C0R8j426J021k50m17N81o1P96j330M09M87k80j28j00M42j16K97K87l88M02
4661C54n51M12k83J05k51p83J447j07l61L4N22j177J317p19q24J628j128j90Q34
4680B79M31p77j92O40O6j374N4O60l59l9Q30l55N48o70l03K00L01m65jK4q5P59
4702A72o10L79K6J90j54L92n74K71l83rL36L27l05RN2k40l21N49k92K34Q88j342
$$ y = [186, -162, 443, 185, -1218, 42, -525, -587, -215, -498, 18, 796, 992, -791, -730, -56, 604, 49, 361, -445, -31, 185, -61, 480, -280, -2, -113, 130, 440, 518, -504, 511, -397, -967, 67, -588, 234, -92, -268, -363, -625, 1020, 290, -551, 496, -220, -225, 264, 829, -633, -430, -552, 29, -391, 306, 223, 654, -267, 121, -54, 925, -460, 617, 106, 144, 916, 292, -96, -390, -306, -117, 145, 950, 280, 264, 252, -16, 181, 19, 1173, 30, 128, -1298, -277, -527, -944, -363, -424, 372, -958, -549, -62, -342, -470, -570, -128, -244, 53, 340, -48, 354, -197, 215, -68, 37, -214, -997, 450, 343, -18, 16, 538, -639, 678, -41, -865, 763, -365, -555, 279, 710, -67, -259, 381, 447, -927, -873, -213, -572, -611, 219, -136, 412, -258, -561, -361, -60, -525, -526, -502, -587, 172, -438, -59, -33, 157, 3, 395, -179, 92, -291, -300, 36, 363, 58, 67, 119, -121, -442, 107, -185, 49, 937, -405]
4724d05R00N99m55j484J196j353J916K1m3r09j38J286o07o87n25J09j18R02k43
4743c8n52N86M84m08m77J93j65m16K34O20Q14j104N97k56n1j149J260L42N3n1
4763E16p69j8K19O44o93P89J02l0Kl86q28O37m72O01j36j286J832j7j039P40l16
4784I2m52M7K32N1j067J192k0K08L43l19o89j72Q51p45N28j91l17p71K480j103
4804A78o63L82L79m41P2L20P70j240P50r63P18O22o85J14j16k43j197K220j000
4823b3M23p53j02K36j62J97P50o78j80k69N80k10O07o49Q7K45o74Q23p64O98q58
4844f76N80o46L10K14r6O91O96l43n25r1j53M40l48N07K52j131k66n9N52J081
4864I89j290J279j341n36K13P52N27l24m1k01P59j008P10p39K05J053j494K80
$$ y = [-405, 495, 1094, 639, -845, 351, -1002, 914, 935, 892, -17, -155, 1131, 524, -163, -688, -579, -697, 205, -38, -590, -4, 480, 72, -405, -212, -377, -793, -559, 61, 875, -229, 368, 112, 61, -1088, 172, 514, 567, 516, -253, -271, -52, 592, -101, 688, 790, 760, 762, 376, -452, 185, -287, 314, 178, -1108, 724, 707, -332, 408, 92, -360, -313, -81, -30, -1097, 95, 75, 283, 626, 307, -382, -554, 297, -448, 80, -111, -428, -1199, 1281, 178, -485, -103, 276, -165, -93, 227, 997, -243, 507, -456, 262, 884, 199, 313, 197, -46, -1243, 977, -23, 400, -353, -455, -219, -381, -184, 566, -112, -292, -561, 19, -191, 416, -233, -146, 99, -575, 248, -516, 182, -676, -96, -742, -432, -218, -314, 377, 1073, 730, 205, 114, -39, 401, 53, 560, 812, -319, -585, -644, -92, 989, -301, 978, -363, -899, -686, 66, 593, 269, 228, 27, 786, -222, 488, -251, -46, 1007, -487, -207]
4882b07N45j351J990l56n70N6k72l70K10M94M87j18j094R53j21n73M18l48J108
4901H81j317N91j07k29Mro21J647j095m65L25O18l92oj295K024j041J316o87p45
4921f03J488j343Q31k5RN01q67M33M40m44m41Pm14J011j012O10q4M16k16j262
4941i65j06J453q02k79N17j72RJ35j327J534j18J9Q22j246L67m82J139N8n79l73
4961c96N92j84m24M83k72j97l3L13N72n03l87p30J832j447N47K93p37R44L38j851
4981a247Q23M42j95J715j421k80j21p68M20P25K40l12O51j474k98Q08P46l84r44
5000h74M70o80O63O76O01j471K43R6L84J75N58j546L18J112M4j024J488j474j10
5019c51m15O13j13O46p81p96O23l6M85K61n49j69l03N13J203j665J259nP24n07
$$ y = [-207, 338, -1013, 977, 621, 51, 107, -165, -535, -325, 169, 656, 538, -556, 397, 276, -297, 121, -227, 881, -436, 155, 48, -181, -177, -186, -807, 840, -255, -720, -395, 223, -169, -175, -1470, 554, -487, 829, 142, -603, 885, -458, 373, 348, 357, 858, -9, 424, 864, 420, -21, -14, -428, 583, -429, 181, 97, 513, 297, -965, -1071, 382, -420, -699, -182, -354, -345, -210, -1537, -3, -121, -102, 720, -526, -159, -641, 498, 556, -23, -396, 196, 12, -412, 71, -201, -398, -431, -118, 454, -49, -436, -1166, 666, -781, -234, 59, -678, 266, 604, -1247, -424, 18, -177, 1538, 117, -163, -284, -1052, -632, 93, 333, 21, 672, -802, -1100, -292, 454, 70, -874, -404, -1084, -421, 255, 856, -615, -372, -276, 108, 283, 841, -705, -387, 725, 769, -255, 1233, -241, -351, -766, -153, -266, 380, -401, -1197, -574, -610, -125, 136, -413, -582, -885, -372, 831, -834, 425, 420, 1144, 637]
5039F37j045P65j005L37o2P58J48p84P61J95N3p69p05N34K43k58k26K18l33L05
5059b33P07k41p60L72q86J343n43R18q68J024Jj288J163k24m17M92p55j39l32
5078f66Q58K46k5l37L44o99L08L43j319k34J584r09M98o4N10n79Q7Q20M83j478
5098b29m56Q95k98j21L3q97K776j585l41l97O35P05j052J02j72L65o32R65j85
5117A11k58N91k64J18kj277M59M46l10K71o78J126k077J880K2l88J584j683M72
5136A43K52j12J70p61k81J232k59R29q45r81N87k8nJ97R85o94L11j186K71O6k19
5157b28M73p95q3K25J067j159J009l47O01j305J254r6l33o10N79j03j92O70l76
5176B51r4K95k31M66K50q48m43J231J98r27q27J255R4q27m61J116l57j427O20
$$ y = [637, -408, 357, -648, -311, -373, 385, 533, -251, 510, 705, 758, -11, -716, -182, 61, -197, -423, -205, -538, -233, 474, 233, -527, -155, -1041, 302, -241, 677, -191, 833, 834, -454, 709, 485, 68, 560, -195, -334, -666, 192, 438, 413, 76, 420, -279, 29, 372, -947, -1181, 403, -506, -8, -72, 438, -141, -54, 766, 1249, -229, -685, 210, -88, -209, -176, -1073, 1703, 118, -223, -620, 15, 720, -332, -230, -402, -37, -669, 296, 111, -147, 444, 180, 298, 296, -981, -522, -76, -386, -115, -793, 333, -1744, 136, 158, -230, 1354, -329, 143, 395, 283, 453, -308, -589, 643, 384, 1313, 468, -513, 74, 46, 41, 238, 1223, 529, 840, -346, -75, -9, -228, 245, -550, -633, -408, 659, -500, 509, 162, 763, -542, 712, 616, 283, -327, 252, 149, -43, 627, 251, 157, 452, 221, 687, 937, 89, -354, 877, 1075, 148, -679, 576, 670, -157, -618, 498, 141, -1286, -666]
5195f66r4M05Q80l49j249P82j50J95L34R51j163j167J183p34P81j116J358M05
5213E86j1L03q97P6o3l68Q20M36j471J125j010M63M47q8M8m60o79J291j85O38
5233A001k86p52P80Q26j716r2m50M56J573j863M35P65J31j407n48J068J15K93
5251C29o50K29j58j24J294j352L10J23L65l14j01J43P21j142J690n86p12J67m48
5270b16N55n36J16k89R33m59r25J242J70J34r35k82J026p02L3j161J158J028j523
5289f33J069O41j260m14O92l74L27N21m89L32l57J68j161Q58N24j029Q50M90j685
5308i30O17K06J38R72q44k41l69l81Q26k50J19R71j167K92J217j885K52r2J046
5327D97N7o47L7P05P58k049J13N14n28M27K09n71J094m31R16r65N48L3j63q4m88
$$ y = [-666, -760, -355, 525, 176, -1073, -291, -441, -246, 88, 1039, -124, -1291, -108, -842, -61, -1177, 181, 586, 575, 878, -19, 57, -6, -374, 446, 882, -589, 536, -474, -11, 436, 348, 396, -64, -743, 548, 363, 1001, 715, -37, 743, 1569, -147, -239, -689, -233, 1340, -523, -88, 677, 808, -599, -1147, -79, 36, 329, -321, -92, -250, -374, 920, -432, -122, 1, 366, 52, -49, 94, 815, -327, 1363, 777, 65, 232, -216, 339, -197, -81, -370, 563, 104, -821, 421, 591, 725, -210, -492, 534, -168, -135, -1296, -138, 890, -633, 436, 1077, -183, -597, 95, -279, 48, 569, 80, 412, 55, 223, -938, -80, 444, -585, 265, 755, -930, -313, -107, 31, 1003, 159, -82, -451, -832, -6, -256, -137, 834, -333, -41, 1176, -709, -457, -549, 497, 554, -93, -56, 649, 1407, -642, -529, -15, -543, -116, 93, -478, 616, 185, 1101, 136, 684, 717, 554, 470, -18]
5348a8l16L37P19p87J55k1M44j128J085j97l4O89q97J2M93n14j133P12l49J520
5368G72n50j48L63m71J35l64P32J97k86j19m51N22P57n78p15P95n1m77m07l5P42
5389C63n18O36m84J31p05L27J239j791M3P75n63J293r33p16K03J023J52j379O77
5408b27j07P29N50j048k72P98k87j1K80Q95j199m96P24j58n16P83k40j64N74l44
5428B64L14n77J23l98o91Q54k81r9J490j023N22N14o32r97q1K24J563j288J29
5447g0Q24j477J364j580K27O19L38q77J007j093Q70p24j07J049j078P91j070Q17
5465a70k3P38q49j97j01J389r48j22Q54j397Nj79J179R2k90J96k79j61K35L58
5485C30n35M43Rl03Q50n5j30j50k82J0j244J540J15j46Q25j772R64q10L97j498
$$ y = [-18, -334, 3, 722, -65, 90, 69, 513, -615, 470, 273, 239, 928, 31, 43, 536, 22, -1111, -399, -748, 772, 222, 74, 437, -34, 101, -263, 469, 666, 380, 261, -190, 332, 1089, 511, -204, 591, 540, 63, -344, -379, 363, -155, 481, -3, 128, -577, -250, 989, -802, -759, 16, -547, 746, -187, -903, -700, 323, 475, -904, -227, -334, 395, 945, -103, -375, 423, 136, 125, 405, 1300, 101, -395, 329, 171, -345, 438, 198, 34, 608, 264, 578, 1, 124, -274, -965, -111, -392, -491, 999, -24, 498, 1012, 380, -617, -698, -474, 1089, -199, -70, 754, -723, 641, -939, -712, -93, 245, -632, 375, -718, 152, -572, -679, 370, -708, 83, -987, -170, -193, 545, -304, -501, -602, 787, -161, -283, 571, -826, -821, -1000, 179, 271, -19, 177, -102, -263, -28, 330, -205, 238, 247, -56, 794, 739, 609, 459, 177, 187, -1057, 483, 598, 452, 1277, -495, 469, -341, 56, -1442]
5505a442M36O37l5K06MO12q59R30j358J056K66q36M13O23q47R34k06k98o26J14
5525b76k51R52O25j371k36R72k33L96k43j379J067q12P8O60J08l78K67M41l81
5544Fp54O55q7J332j686N6K54N31l97L88n08P62j269Q65j40J75k16j345J006k44
5564f16L81K21k58n67Q86J327j210n80k41J89o21J210K77K24j429N97J373k102
5582i39J787j266K79k64L45k10R7R72o98Q3O5p77l50K257j353r38J335j079R15
5601B61j15J56j0O85l62l03J2o20J012r64M66J69l94Q60j287N29Q91j322j91o32
5621a159N13M86k24K77J007l48j207J127J40K57o48n50l60l96L3O13n5L25o66
5640h35J245p06K75n68M78M84l40K81o58K11O66K45n31k43j18N80o70J99M70m74
$$ y = [-1442, -1006, -369, -404, -198, -194, 418, -441, 489, -869, 187, 453, -383, 30, 653, -194, 740, 534, 236, -390, -276, -527, 425, 1050, -321, -557, 415, 182, 578, 335, -1044, 23, -789, -711, -51, 57, -321, -54, 387, 6, -748, -93, -180, 1152, -534, -478, -224, 307, -90, 298, -210, 552, -717, 148, 8, 183, -33, -1378, -372, -616, -235, -14, -272, -839, 47, 1374, 164, -416, -657, -468, -1089, 121, 398, 622, -807, -210, 1163, -939, 848, -418, -139, -403, -58, -268, -171, 801, 103, 186, 251, -526, -876, 1381, 28, -910, 425, -654, 261, 146, 302, 292, 977, 615, 312, 324, -296, 716, -248, 218, 387, -7, 853, -434, 95, 986, -336, -527, -1159, -646, -160, -384, -107, 900, 552, -655, 472, 612, 869, 221, -329, -689, -1085, -1052, -439, -494, -169, -835, 410, -296, -21, -589, -111, 373, 33, 314, -344, -133, 533, 778, 247, 4, -114, 466, -204, -5, 465, -9]
5660ik7R60j048K04K56P68j020J2n89K23j51k63N64J08j092J154n28J29N47j524
5680a326R84m1K25L05n68o1l25J112r51L32K00K02j56k70K8J047J18J18o36l81
5700d4K96k25j0q0M75m53J01M31m9q64P86L3j30M56q24j108J307L8r41M66M02
5721F3k86j6J277j328j32K79o03J282m47o78P19j79n55J187r52K83O07O41l7j298
5741a73m53O09J48q11J399j702J723m46M76m76o51L19Q57j162M00L95Q6r57J011
5760E92j518J571l77r39J21J384o67o20N79m3L36o46O29r23L74J203j090jL2R99
5780I96r22N8n3p46J74M30m74k62P83r19Q07n70L91J35J258o17j58q89K36k73
5800f15NJ057j95j588J054k05O49mp20O49P05J35m95o90l31K27M84m58Q80j365
$$ y = [-9, -36, 924, -124, 80, 336, 1104, 84, 96, -493, -270, -421, -684, -120, -12, -1104, 50, -478, -349, 198, -1326, -342, -383, -158, 147, -421, -482, -807, 305, -646, -314, -114, 88, -68, -338, -310, 737, 855, 973, 337, -44, 252, 27, 17, -63, 412, -41, 60, 491, 442, -422, 364, 397, 267, 723, -101, -1209, 98, 136, -805, -339, 63, -223, -239, 1038, -290, -422, -143, -746, 536, 89, -589, 130, -49, -604, 583, -369, -86, 521, 1162, 1125, -173, -626, -17, 131, -680, 719, -983, 740, 294, 770, 294, -357, -38, 819, -343, 57, 452, 538, -419, 592, -926, 645, 268, -671, -550, 834, 167, -453, 126, 83, 419, -227, 402, -521, -147, 1056, -34, -35, -3, 996, 74, 132, 79, -667, -493, -63, -537, -799, -16, -935, -128, -698, -307, -172, 1086, 469, 311, -578, -342, -615, -610, 447, 252, -1336, -282, -487, 162, 158, -562, 87, 792, 927, 432, -258, -589, -362, 122, -336, 544, -821]
5820h21K494j354k13n2j594J573j11l27K43n5M79p27K96L25M22m29k21pL02P35
5840I58j524o72P54O57P44J67r24p22J419j352j89N70N44j11N8n42N18N22m78
5859C97l40p08J51J81J73m30J738j578J24M94j163J115j77P44j483N38K99l15
5877b40l74J54K37L43J54k67N57p90R91j072L8R09p21P30r1L65j076J196J94j157
5897H0L47q17J070j316N17K32q2o96P03n12M12O14l76m24k56J98O39j9j20j145
5917i51K16Q39L9o56Q12J13j5p72P4N88l60J36k63q5r94J812j626K263J59k034
5937g05J154m30R9n10M4j53K34j52J72J331n18j594J227o64J411j721M25j4L54
5956a0k15Q69m28m00Q21M2O2k98m55j8j63K86k18N23M14r43K64J29J1q12J19L86
$$ y = [-821, 1673, 319, 106, 54, -1540, 33, -78, -405, -162, -217, 262, -465, -169, 156, 578, 149, -72, -79, 223, 958, -566, -1238, -484, 173, 917, 1084, 160, -562, 857, -495, -684, -114, 430, 319, 377, -165, 353, 875, 397, 57, -651, -500, -319, -146, -576, 1162, -416, -292, 202, -961, 154, -23, 721, -762, -224, 75, -240, -614, -460, -223, 120, 274, 7, 564, -226, 765, -307, -269, 640, -81, 649, 558, 923, -153, 1043, 1237, 80, 427, -390, 680, -636, -119, 113, 31, -665, 38, -474, -62, 552, 176, -248, -504, -306, 333, 314, 194, -951, -735, 104, 143, -513, 299, 412, 397, -375, -301, 287, -73, 63, -200, -285, -1279, 533, -1093, 1170, 1329, -705, 449, 19, 118, -392, -348, -501, -267, -419, -247, 1084, 566, -1028, 199, -465, 946, -775, -350, -364, -10, -225, 644, 216, -184, 637, 679, 741, 443, -12, -30, -193, 93, -125, 398, 812, -131, 133, 262, 273, -539, -420, -34]
5978c4q67O9Q68K87RL20j081k46J096k12q04N87O60K9p26L82K82n77P29j041Q68
5999E98m85o9k9Q3J70m93m57J840j458k51J32J050l23p29J184j350O54L42j17
6018B92p41J364o75j57K58j65m93N38n5j238R56n57R31n52N41k69m4L71q43P10
6038A72k93J194n42q60Q26Ql35L28O65j335L41J73J0m27N21K4o26K22n17r8K34
6059c15n4J116m00j102M69k10Q60N46m88j039K99l05j85P72j01O7Q52j055k1O87
6079C93k119J944J48j227J319K27q89P55o1q5j181L57N83m9J31o37N99o34R58
6098E32j39O96j345J353j996N79K45o6M40j010OM96o62j24J460m49K65n7l62r11
6118a049L20R74J26o5L00j574J184p70q2M89l55O4N54J264j402m11Q7Q4O47K70
$$ y = [-34, -901, -832, 36, 323, 332, 652, -429, -675, 421, 209, -595, -8, 652, 681, -45, 337, 619, 42, 771, -270, 598, 113, 44, 15, 98, 268, -225, -682, 1158, -300, -551, -419, 631, 308, -421, 763, -587, 67, 409, 292, -449, 915, 240, 83, 341, 176, -317, 221, 166, -1072, -116, -673, 258, -294, 247, -22, -66, 305, -538, 172, -121, 1073, 531, -329, 497, 505, 170, 498, 1163, -172, 169, 342, 352, -75, 446, 470, -156, 66, -451, -549, -315, -369, 747, 347, -755, -286, -496, 364, 910, 422, -617, -318, -623, -808, -36, -137, -70, 782, -273, -294, 393, -1726, 218, 366, -861, 458, 685, -204, 551, 490, 405, -776, -419, 164, 115, 246, -391, 208, -426, 532, 393, 1089, -256, 1097, -899, -320, -75, -141, 299, -711, -705, -209, -871, -995, 465, 16, 281, 224, -138, -1049, -729, 245, 371, 306, 606, -968, 216, -554, -636, -147, -502, -438, 116, 1380, -22, -433, -346, -262, 385, 655]
6138F55L25p69R72j828j72K23M22M36j73j5P46j83O3j242N54J174j598K279j186
6157F83j480J469j048N30n66N14j10N96J83q59J220n42m84j03J430j745J55M91
6175C34q62Q85Qj4j14L48p0j659Q47l11J37j1L04M5P38j34j208K57O80q96Q58
6196A62N78k58j043L60Q08j160K57N18L44n94L38N04j683J533n77j71M40n41M56
6215B71r72j215K274p55J45o38J219N47q23l85L73l66J222m79n19o3k19O15j401
6234a169J543p01J462q61l83K65q03L19j20L36m04N49O4j002R26l82n42Q93J3
6253CQ07o71r89J562q65L29J00J105k258R90K41J69j83L64m46K44j067J46J460
6272A041j385J052j782J273j2o66O14K5K46kr41O52p30K02Q76J00j433J380l60
$$ y = [655, 980, 211, 1183, -645, -817, -594, -172, 264, 91, 76, 822, 639, 702, -540, 14, 1188, -410, 1869, 683, -797, 672, -376, 154, -412, 102, -8, 588, 771, -88, 1132, 590, 106, 3, 1433, -312, -157, 334, -528, 357, 365, 351, 237, 585, 515, -1144, -297, -608, -471, -482, -178, -133, 605, 471, -737, -480, 200, -696, 162, 740, 482, -561, -201, 607, -553, -296, 222, 566, -28, 310, 814, -869, 664, 87, -84, 356, -185, 271, -701, -1916, 358, -397, -252, -890, 329, 876, 53, -332, 41, -325, 897, 418, -101, -164, -383, 232, -1169, 374, -327, 1135, 274, -109, 156, -647, -328, -448, -112, -516, 33, 97, -905, 21, -361, -903, -10, 3, 810, 139, -850, 712, -153, 176, 276, 1381, -877, 113, 354, 523, 340, 704, 258, 502, -565, -419, 1041, -344, 708, -1074, 199, 187, -479, 135, 160, 406, 404, -537, 115, -615, -413, 463, 563, -870, 510, 150]
6291A50k22J091p94Q3n21N25R3r83m79J451k00p66Q7k28o9J105M52j303J252p35
6311a1M04p41l87Q57M51o86L7P14o12N65r62Q83r58J34J226j053L07q4M28m13
6331I9k62o93J115j148K247j720n54K41L67Q09Q4l33m88K62K31m06M57r10k1O65
6351D2j075M84K89l86L2J022K12n52K10l38J94K88L04p01l33L60p05L70k15K33
6371b65K30L65j170J061j86K19J87r07N01M44L17l35k63m64l13Q80o12L15m16
6390d12O4K08j68N99M28j285R66P42q00o4m34k2L59o20R88p56j62P1P98k91j093
6411h84K82M14K35P88q46r2O27r61J208j037M95N64j75K64m96o1j01r14L85N74
6431B69o45J151n3m07n74J14o4p2Q50l06j018N91j313P41K72J001M33j061m47
$$ y = [150, -72, 1019, 225, 308, -213, 312, 405, -578, -1057, 394, 194, -572, -485, -713, -782, 323, 775, -528, 724, -11, 393, -348, -735, 122, 573, -113, -76, 638, 26, 591, -371, 512, -446, -312, 914, -139, 168, 84, 512, 99, -163, -856, 259, -889, 1358, -362, -916, -675, -308, 501, 585, 252, -236, 26, 257, -149, 308, -602, -623, 42, -1033, -549, -260, -646, -614, 408, 620, 68, 278, -60, 134, 422, 726, 25, -308, 52, -653, -283, -498, -265, -35, 330, -840, 221, 35, 254, 441, -466, 35, 479, 796, 461, 198, -266, -579, 301, -311, 4, -412, -348, -140, -308, 291, 719, -566, 400, 1142, 342, 278, -156, -178, 181, -439, 549, -207, -369, -298, 500, 209, -884, -602, -188, 47, 835, -11, -103, 524, -437, 771, -266, 229, 793, 618, 882, 386, 325, 224, -690, -305, 269, -376, 775, 722, 315, -259, -145, -209, -281, 569, 263, -755, -164, -1477, -736, -464, 537, 970, -91, -538]
6450e38R88j132L73Q22j341P57L94l56N68p46o09O05P17j464O05m71J505j188
6468e11Q14J092j750N06J02k84R08r64j21P8l76R72n99K62l43n12J488j323M02
6487a59K43K05j085J441m63N6m24N81N2q21n06J769m95R6l58M94J72j375P26O94
6507H43k85l33n95j96Q59M10o56l26J412q20j030R06q53P17L16m83N87R01j228
6526A46r7j06j3O20q71K15N82l95o22J024j212L05K76L98n06QN75l43k66J14q92
6547a060R85k6L2o43P64J06p36R47q02P74m05j035J4Q04K18N46o81J245m30p36
6567a19j69m72K47Q44n10J373j081l38P12j061J055j005J44q0M00O24j343J275
6585D96k25J133q75j52L89q87n28J035k24k44p82O58J863j595J96r71J192N80
$$ y = [-538, 450, -682, -309, 513, -828, -71, 323, -33, 535, -211, -820, -215, 502, -962, -357, -828, 677, -511, 303, 1395, -355, 151, 253, -31, 877, -87, -208, -130, -506, 466, -133, 129, -214, -726, 762, -561, -159, 84, 289, -796, 645, 182, 238, -186, 395, 447, -374, -880, 889, 394, 490, 132, 626, 798, -577, 149, 843, 558, 225, -370, -566, 293, 703, 47, -279, 1133, 313, -717, 189, -664, 53, 369, -114, 473, 1374, 146, 49, -57, -70, 550, -321, -106, 476, 81, -541, 483, -729, -424, -148, 250, -256, -248, 327, -16, -282, -168, -1060, -75, -101, -69, -712, 52, 158, -578, 369, -433, 341, -64, -1099, -1085, -281, -63, 483, -198, 1047, 617, -119, -288, -760, -513, 331, -179, 1194, 113, -225, 487, -574, 481, -524, -380, -460, -60, 564, -779, 496, 271, 1404, 529, 377, 766, -121, -649, 386, 162, -82, -864, -206, 1657, 62, 258, -713, 479, 1059]
6603A059M05k023P95M65q96p2J44l39M33J89l97J70m10K36J69m35K606j874k60
6622c5J194k180M88R71q60L20r7Q6j92q4R69j015pR6J19M45l12P77j023M90K49
6643C99o88N73p84J378k60O46o11j339J66Q73l56N20m35K15k29q09J112j84l60
6662a73J18R96j095KlJ83L22m93q60J592j163m95K187L78j230j31j12J52r38J175
6682D12j21j75K4j036K140j071k63p52o3P91J44k61L73l68L49j66o4m40P51O67
6702H71r92k03M38r34J69J286m4m60k26M3n81J557r03k21J428l38j021J314o47
6721E36l63j23l44R43p61J77N2o77Q93M07j156Q96j32l99R9o88R84RK49l18P14
6742I98J49j120M15r56K82l6n87J474p33M18j29K29r66J104j383J549j132M84
$$ y = [1059, 1464, -559, 236, 701, -195, -267, -123, -462, -29, 160, -237, -67, -477, -241, -72, -507, 2099, 225, -35, 1159, -1021, -533, 438, -422, -102, -199, -113, -305, -389, 580, -435, -442, -346, -227, 218, -94, 683, -340, 150, 399, -289, 284, -500, 878, 618, 1264, 653, -686, -520, 353, -3, 517, 82, 297, 68, -741, 371, 187, -173, -55, 941, -154, -152, -155, 28, 350, -143, -1003, 589, -574, -1069, 1118, 1496, 266, 135, 23, 175, -763, 412, 291, 116, 140, -896, 1244, 173, -90, -842, -905, -114, 30, -231, 142, -226, 123, -43, -107, -547, 204, 871, -121, -324, 114, -820, -651, 635, 591, 131, -95, -52, -633, 924, 21, -200, 1228, 890, -131, 1183, 536, 173, 50, -294, 649, -112, 65, 117, -560, 333, 740, -416, 480, 348, -51, 48, -640, 344, 353, 602, 284, 998, 1147, 27, 442, -514, -232, -268, -855, 619, -114, 304, 175, 404, -562, 542, -841, 708, -424, 60]
6760F0r73J775m09j104j76P30L24K52j645J123q81M48L50K9k52O79o67N49k94
6779h2J94L30M32l72nj570J036r2l22Q25r1k63k54N95Q02o06k34L04p35k34O40
6800B98m1J4n56M29N61j208L70o0R83j574M67k79r41O83L94n28N90j461J472P46
6820C59q11Q16r05P86J57o51R80n84j94k1N16l7j069O98l4p33K47J202j590J08
6840g60N16q86R30L51o54J276j90j7j93n56L70o36L83l38j62K25K0j95l27J15
6860g28J090q46M75o5j8j075Q30M81p87P67K17Q80j517L63k49M90p68N37N26p92
6880a89m0k53R33K32m53j313J304J40j297P10O32l72k94P21q36J17O58l08q39
6899g47J746o86r96k60J573o48l58J367n99j064J38j00j4J658j411L07k7O15l81
$$ y = [60, -913, 862, 453, -651, -827, -97, 227, 479, -1166, -43, -924, -476, -126, -97, -349, 330, -337, 212, -82, 112, 442, 874, 502, 497, -1073, -37, -129, -451, 374, 283, 20, -234, 361, 1163, 557, 323, 627, -108, -342, 298, 257, 271, -285, 144, 705, -503, -133, -193, 790, -784, -317, -596, -1537, -854, -460, -988, -398, -1859, -387, 359, -452, 364, -541, 245, 402, -249, 731, 147, -47, -68, 448, 411, -658, 40, 6, -727, -480, 722, -868, -760, -244, -1130, -200, 151, -503, 773, 583, 566, 373, -183, 187, -449, -66, -404, -566, -341, -321, -516, -843, -728, 362, -484, -9, -74, -92, -1167, -337, 144, -643, 124, 341, 1221, -296, 67, -182, 308, -460, 77, 603, -189, -229, -482, 451, 683, 230, -1083, 221, 361, -936, -226, 406, 34, -260, 461, -375, -258, 400, 92, -747, 999, 313, -683, -943, 630, -18, -376, 991, 392, -672, -534, -634, -648, 1010, -401, -94, -121, 494, 113]
6918A13R01j572J510j121o36J035m67P7j24Q94m77q91J199k36K18O15L79k423
6936a006Q93K57M24n46J11l39L58o12J55J580k515J181J90M05m35n67K61k54R87
6955E28J308k304O17n74o2J152O2o86k94k91P6Q48o18k5J198j615Q37q59L08J686
6975A292j406q73R49Q08j121J061j251J158K57L19j946J70J935k446J381%q22
6992e35J340K4j001O92p86L67J34P9j33n97L19K49j19l05M37r77J175j46L1O53
7012I01r00p91J046J92j221O54r4J5Q05r93r3K98O17l79J87m45R07N8m78K86j805
7033a233R20J207r77O29j196m3J465j087R04N9p0k94j339J151o23N75l7J0O87
7052G08n58Q69j381N5j00P48r12J465j377J95R68m72l22J12k56J07k70M29R78
$$ y = [113, 1014, -558, 952, -169, -805, 230, -237, -160, -284, 610, 133, -758, 441, 205, 423, 1038, 1417, -1006, -113, 144, 568, 22, 133, -206, 152, -460, -305, 1275, -1240, -59, 131, 536, 101, -466, -205, -459, 528, 1836, -468, 149, -425, -487, 665, 727, 41, -253, -544, -468, 380, -238, -263, 935, -680, 157, -702, -394, 1292, -114, -987, -38, 770, -351, 710, -541, 617, 874, 1193, -753, -583, 1352, -1094, 287, 287, -535, 805, 829, -172, 520, -266, 101, 235, 314, 181, -416, -97, 152, 33, -272, 165, -812, 363, 217, 248, 901, 1, -790, 256, 448, -773, -119, -213, -198, 607, -386, -479, -181, 436, 57, 244, -201, 706, 764, 286, 572, -1233, -313, 894, -83, 546, -650, -693, 772, -315, 589, 648, 578, 284, -1055, 96, -527, 48, 11, 21, 708, 150, 1019, -362, -307, -407, 341, -571, 894, -483, -288, 680, 208, -114, -2, -258, -151, -421, 8, 986]
7071I86r05k16N77P43j081j382P57Q09p38l85N21L33m03M15l98N30K82o37J67
7090b5r26O29P38j385J007m76l86R55J61l71P79r27M97n02K2q8M47r95Q21N64
7110E39q3n78l78J74k81K61J65P3j354K013j65r02L57k71m43J837j364J15O96
7129D11m17J016j260k77J388p93n27J418o41j074L32q03R29J67N60r50O82k05
7147d4K51q27Q48q81k19J75J194n38j87L6N08n80O27J81l02j39J074j281o5M98
7167C29j378J595o88j23J446j466J9R47q86R09j192l6R6L20k60Q97p99N47j319
7186a042J114l94m5j94k86K15J88J683j063j20L15j769J229Q61j107P67J009j625
7204b64p0L37l07N79k61j92n34R26N14j064K75j66P14j186k20J69J30O93K50j482
$$ y = [986, 81, -135, 442, 1185, 104, -1278, -521, 288, -450, -835, -314, 19, -384, 31, -367, 163, 445, -192, -25, -951, -322, 416, -969, 38, -438, -824, 131, 292, -79, 700, -227, 270, -232, -210, -298, 149, -846, -25, 539, 456, -122, -500, -326, -607, -346, -181, -108, -1462, 551, 386, -516, -159, -430, -873, 964, -400, -285, 411, -6, 1010, -250, -527, 861, 68, -459, 959, 318, -756, -424, -1227, -298, -131, 429, -521, 161, -44, 207, -620, 228, -653, -872, -697, 497, -41, -228, -192, 316, -264, 363, 544, 242, 103, 1177, -104, -169, 329, -1049, 546, -142, -265, 1181, -285, -266, 681, -205, 704, -488, -524, -428, -108, -368, 529, -270, 277, -1042, 72, -322, -367, -561, -847, -632, -444, 1239, 176, 56, 371, -1398, -169, 692, -415, 352, 1361, -264, -334, 3, -304, 275, 14, -178, -712, 214, 728, -336, -61, -227, 487, -699, -919, -750, -620, 73, 323, -1159]
7224a159J338p59J102K88q4r09L35p15M03j96r9R43M00j195Q47m1l49j866K605
7243H89p08j009J632l24p10l31P87l09P64p51j20O98m92J62q91J551j229r0J089
7262F08j550P03M7j71J18Q74q19K21j13l92N95r97J073M43m65n29N63J06R28j254
7282a1m9L85o01L54j70j7L3M04l37o3q64N7M49L80j77N50n88m36Q60o45O82M06
7304F02o39O25j84p83J5M52M59p7j221J729n22j246P17j89M30l97o5J911k082
7323d65p76J559P56j547K50j26K35k64p2Q05k14l30J32j24O54m86K81J34m56J20
7343F6L04j648Q71N98k80l70J358j080N12j031J86N56j37n50J50R69M3n87K58
7362A88J48l19O0k5K51j47j4n51Q65j141J490j432O33r5M60m57O23l60K35q38
$$ y = [-1159, 179, -580, 522, 810, 726, -183, 152, -563, -160, -356, -455, 488, 888, -307, 540, 499, 150, -1716, 889, 181, -828, 804, 480, -230, -561, 226, -83, 681, -70, -190, 508, 16, 178, -713, 838, -391, -481, 608, -942, -239, -192, -363, -245, 629, -190, 31, -82, -474, 121, -876, 197, 640, 175, -354, 209, 315, 1243, -11, -60, 325, -276, 78, -92, -109, -76, 328, -9, -72, -936, -879, -430, -50, -227, 323, -265, -701, 159, -486, 196, 602, -37, 588, 404, -379, -364, 88, 547, 470, -751, 978, 456, -790, -73, -262, 168, -229, -294, 1617, -465, -1241, 318, 1074, -473, -223, -349, -114, -378, -450, 355, 141, -189, -57, -181, 473, -13, 268, 402, -54, 66, 370, -1278, -407, 191, -89, -459, 899, -181, 331, -700, -514, 42, -95, -645, -495, 474, 517, -70, 188, 336, 17, 77, 52, 303, 156, 142, -409, 456, -685, 805, -627, 6, -89, 371, -86, 537, 177, 412, -426]
7382d26J029o14k54j84R04n12o99J059J80o73Q12M62j065O04o03j138K66N67M90
7401B05j2Q4K7k05n06P07j074J073j005n1O14K30J05l66L97Q48j403p87J492j91
7421A82Q6m16M48m23l77P26k84K18q8j05J94m13K38P15J55p76k46o25J848j283
7441b26M80k22k65N17o04K11R86l86r10L71L39n71O33P44j682O73O85k82l58l33
7461b00r9P3k78O48K94j023J672j185l77J047j734J440m78l66M18L27j775J298
7479b98J454j361l57k81J400j033J531j403o80N16O69O21m37p86O25o02P32j56
7497A54o89J228j038M43o27j7J079k51j63k86l72J46o9M31r3l72Q06q16n08N79
7517d35J431lk27p34J11l42J320j747o14M91Q84k66L17o24n56J484K2k76m58M67
$$ y = [-426, 603, -11, -265, -449, 455, -57, -756, 303, 483, -190, 622, 1084, 19, 623, 20, -1118, -852, -285, 205, 193, 277, 304, 99, -407, 300, -774, 299, -706, -757, -143, 87, 192, -174, 223, 1071, -332, -1119, 373, 182, 268, -148, 300, -123, -500, 226, -58, 160, 72, -33, 161, -252, -14, 701, 856, 80, -166, -791, 1057, -226, 254, 32, -233, 284, -320, -109, 877, 491, -419, -48, 291, -280, 353, 1097, -585, 88, 773, 491, 133, -200, -299, -226, -504, 144, 438, -585, 1087, -98, -475, 572, -1162, 278, -200, -566, -148, 179, -1596, -298, 1156, -205, -562, -843, 557, -476, 1055, -348, -1028, -512, 157, 778, 341, -445, 180, -422, 310, 154, -535, 693, -345, 98, -529, -546, 533, 282, 119, -167, -539, -393, -462, -31, -124, -496, 310, -506, -1014, -435, 996, 993, 766, 32, 143, -199, 1121, -626, -1240, -749, 135, -131, 186, -438, -994, 490, 512, 236, -222, 245]
7537B45m95J298j360P2N04j222R49l35M18r26kJ209%L51j529J743r47l48J170
7556G95o79j15n93O3N50o51n6P52K40J008r16R83j366M7P63J23L8q6n27j331N64
7577c94J114K72r89Q52r38l94L2P14M97Q83k049J71M17q60J393o53p68J011R21
7596A232l59j426j1P77o6L6k30k31j54P95M70j159P81M11p39n8L81L45j699O57
7616b47l17K87L56K3k70p21K94J109k73o07J25K46j03k82J5L82L76n75l02Q09
7636C25j068P72j092J215p32N66j01P99l34l95k69J343q64k38o39K224j136o48
7654b72J47k26P94p9l1j205R19m71k70J202j35q28L72M68j626J153K18j66K84
7673B48k04j804J979Q40j371J24j26L84n7L73n48L91J46j36j511J464O51o88N42
$$ y = [245, -250, 1048, -312, -240, 264, -958, -9, -344, 74, -852, -854, 355, 355, 706, -823, 920, -27, -375, 795, 116, 1, -592, -529, 21, -630, -686, 66, 306, 1314, 398, 1381, 15, 62, 825, 948, 986, 900, 373, -958, -394, 720, 992, 3, 855, -83, -477, -445, 269, 766, 1649, -400, -229, 188, -672, 721, 68, -700, 311, 1232, 873, -553, -564, 213, 147, 183, -47, -278, -432, 363, 833, -326, 455, 866, 127, 69, 450, 795, -904, -247, -564, -277, 79, 102, -168, -889, -595, 514, 241, -366, -241, 5, -98, -380, -365, 17, 393, -182, -484, 325, -743, 29, -1063, 152, -580, -14, -115, 684, 350, -45, -314, 1029, 165, -73, -712, 1512, 376, -272, -125, -351, 443, 364, 333, -872, 47, -424, -694, 508, 373, -455, -83, 385, -1241, -88, 130, -36, 248, 44, -1760, 219, 1059, -312, -188, -314, 70, 13, 386, -162, 229, 375, 239, -1272, 192, 843, 155, 697]
7692F97j059n70J325L18j066o5J666k030o7P48q8L11k49Q51j313M36J4j15P75
7711E19O0n83j36o31P9N61M2p55J652L97k125R44N75p42N32o01N53k24m83P9j19
7732d06m59J404j539M58J277j361P41Q29j448O87m35N60K47j333J146j150N68
7749b14R22q26K56o01L60jN75r12N96j074J025l2K17r0n66N37Q8r3q2l87p48L89
7771f61O18P7m3nO85R4n52m06J784j725M55j31j456J154j87j36K91J3N73m67j21
7792a46J32J221p25n23k18k76O88k99J17O32j458J765j235L99j211j82J421n28
7810d26N45m19M96N34m73k60J59j008R43K65j35r88P69J444j378j57J09L11O4
7829C95q3p72J256p44m73r23P82P49J74q28J141j25l5N66n10j983J317J9M28R9
$$ y = [697, -362, -932, 393, 711, -355, -420, 1246, -784, -851, -103, -191, 120, -129, 722, -591, -155, -141, -256, 519, 579, -4, -140, -771, -692, -131, -89, -844, 808, 1205, -920, 24, 599, -143, 389, -212, 341, 117, -366, -287, -406, -865, 539, -1000, -542, 735, -626, 115, 944, -504, 183, -252, 308, 555, -778, 368, -782, -214, 708, -118, 138, -463, -103, -104, 471, -441, 155, -919, 106, 74, 291, 201, -365, 172, 260, 167, 85, -302, -1050, -661, -43, 34, -9, -14, 671, 765, 213, -193, 1591, -134, 321, 190, -1266, -112, -299, -435, -144, -131, 442, -25, -146, -14, 1207, 482, -41, -259, -535, 153, -146, -29, 603, -855, 910, -325, 74, -1137, -1319, 102, -426, 119, -300, 196, 730, 257, -3, 156, -852, 91, 356, 221, -767, 2, 1446, 68, -89, 20, 331, 395, 312, -460, 796, 52, -421, -1344, -562, 187, 361, -467, 674, 549, 514, 1080, 570, -1413, -96, -77, 351, 450]
7849D50j537J184l25l48J032J83j798J282k92o01J145k42o36J225n60n10l89J494
7867G57n97J071r26p68Q37n18K44L78R3r49R21j666P27O27m82j88O49r45l79J029
7887h5n37J411q94k06J41R18n59p39J180n27o82L21PP93j378J242p03J120j76
7906F47j076N0j91Q7m92J229m12M2kO68j109Q30k60m52J73J46L71j69j69MK50
7927A65K70q24M08J29J45J56j240J12M62K83K69n92m65J218Q1o11J94m70K81J66
7947A37j157J039P1N75j053J316j669J415q35n9P08j112P80j87j6J81n05J9J29
7966b23j81M88k92N7q02J382l42j129N52J306r86K63l74p4J002p14Q02j117L29
7985e3R3K32n23J86J47l65l34O68O68m15L70L29j083p05M23R05L92r43K90o04
$$ y = [450, -1087, 97, -228, -576, 456, 639, -1159, 123, -169, -770, 375, 133, -503, 722, 162, -348, -737, 757, 160, 1231, 305, -463, 374, -144, 100, 478, 571, -378, 543, -1123, -396, 231, -251, -439, 210, -735, -1114, -85, -622, 789, -105, -311, -170, 748, 189, -550, 630, 103, -579, -258, -251, 542, -836, 406, -297, 823, 647, -429, -379, -570, -483, -975, 254, -158, -116, -118, 550, -559, 271, 11, -441, -268, -122, 249, 80, -89, -85, 165, 435, -389, 19, 148, 293, 449, -791, -679, -217, 66, 335, -257, -722, 496, 577, -34, 160, -310, -29, 137, -1020, 19, 90, 665, -388, 928, -741, 674, -161, -220, 488, -624, 156, -31, -47, 134, -371, -352, -223, -404, 84, -208, -151, -953, 429, 87, -1042, -490, 816, -170, 93, -281, -355, 647, -67, 735, -382, -53, 40, 272, -251, -65, 82, -283, -617, 51, 719, 304, 674, 1003, -80, -785, -362, 543, 935, -8, 282, -322]
8005c22J490j654M60l33k3R6L38K45P66k057J756j860J419L9q84L07N34k66L30
8024C81l88k2M55Q57r12j50n39J167K11j242K83l51Q77p97P48K06j036J61o74
8043g65P61M83r91N60M63Ol75o2l31K70k82Q85j896J117J15l75j091J170P01Q66
8063A229j062m92O44Nj53Q28r89q55J369j151J161r63n75O12Q76j21n93j42J59
8082b13O84K13j5k12q58M02o03O59j28k42j158K901j346l48M81N9L86o49o99R01
8102B15L73o90l31O80J7j316N29L11Q85n96J08r86J088n57K59K57q45P43M57j14
8122D87j63o71J185p33m81R61p3n2M74r90Q49m07j542J095j042J234l91L4J80
8141d6n88P24M64j067Q00K07k23J093q45j177M72Q30n79j5k09J58N05j071O84
$$ y = [-322, 1168, -486, -26, -359, -382, -286, 52, 297, 1063, -994, 762, -1098, 321, 360, -524, -217, 317, 51, 381, -7, -29, 426, 1283, 371, 221, -318, 849, 1060, -182, 101, -250, 627, -170, 578, 784, -252, -91, -765, -4, 479, -512, 48, 511, 517, 142, 80, -251, 19, -263, 622, -1274, -157, -42, -417, -1508, -338, 363, 1229, 167, -325, 319, 324, 171, 999, 10, -845, 524, -627, 534, -429, -1004, -392, 484, 363, -230, -372, -213, 471, 684, 669, 457, -401, 1, -602, 57, -71, -313, -1471, 1430, 84, -264, 217, 276, 662, 13, -686, 215, 588, -102, -433, 247, 264, -1052, -523, -212, 673, 77, 185, -801, 287, -270, -11, 246, -599, 144, 601, 487, 324, -347, 838, 105, -376, 585, 512, 460, 934, -56, 793, 386, -1156, -61, -1103, 131, -260, -226, -46, -634, 90, 554, -513, 287, 494, 271, 1364, 519, -658, -186, 644, 65, 50, -159, -1, 504, -567, 117]
8160A17n09k68M15l86R24pJ61P3j161J304r32N96M29o56p69J320r69q67J132j600
8180a653J733n38L06N72N1J25q93J24J132Mk002
8191a039
$$ y = [117, -392, -660, -245, -631, 293, 286, 447, 520, -641, 663, -269, 327, 756, 100, -669, 651, -318, -1185, -53, -1653, 80, -458, -152, 420, 471, 596, -297, -173, 959, 963, -1039]
$$ Imaginary data points
##PAGE= N=2
##DATA TABLE= (X++(I..I)), XYDATA
0@%%%%%%%%M0j48K16k16K16l24M32m36N44o61P69r72J175j345J533j786K045k313
26a231K640l025L446l887M371m919N524o190O916p700Q571r531J0577j1730J3000
41F832j4398J5930j7635J9543k1671K4066k6783K9892l3485L7699m2723M8839
53B6106n6481O6351p9634R8602j28160J81078l05255J144924P75457j757802o15580
64f50394L94746R45282K23785k03531n88738l74456J0366M98070K75789j37886
74C93033l37308m3146K5118m3306K6634L50755J89583l41716n20497P7505N88484
85C65139L67255l27308n76908j52943M32503M55564l3324m60104l57030Q0590
95b06566M21191K85718j95181m50077j19946L07362K29678j35662j59809J13282
$$ y = [0, 0, 0, 0, 0, 0, 0, 0, 0, 40, -108, 108, -108, 108, -216, 216, -220, 324, -337, 432, -540, 635, -710, 823, -963, 1082, -1231, 1409, -1616, 1830, -2057, 2314, -2605, 2919, -3271, 3645, -4055, 4516, -5015, 5562, -6168, 6832, -7566, 8364, -9271, 10272, -11399, 12667, -14116, 15776, -17709, 19990, -22733, 26106, -30375, 35976, -43658, 54944, -73216, 107862, -197393, 947531, 1722988, -34814, -650394, -255648, 689634, 913419, 709888, 121150, -253306, -242940, 255130, 530919, 393033, 55725, 12579, 37697, -5609, 21025, 371780, 561363, 219647, -300850, -223345, 365139, 732394, 405086, -171822, -324765, 107738, 563302, 529978, 69874, -287156, -206566, 214625, 500343, 305162, -144915, -264861, 42501, 272179, 136517, -23292, 89990]
105H9990J40769j68510k71821P8822M03583J96244k85763m07363p1270K97718
115B399L49556N7896l40511m04534L9455M55642K48756k93166l93844M1555L44697
126A07901J16134k33453j86234J21566J79619m1167j42441o618J09147P0904m4278
137E1080j29057o5429J56365K46975l1102l51482k22526K52636M42975N8305m20126
148a1386l64295J39579M15691J51865k26955k53680j6621J57020J08604m6715
158E3107r8169J9467J07418R51j44252q8755J29132K28036K6225k55247k11758
169b33845J49726L22846L9495k85540j99060J39981K65082M2294k33261k10433
179b02715P9926K70406J13614j80594k46642j6609K24170J82231q5207k13491
$$ y = [89990, 230759, 62249, -209572, -130750, 272833, 469077, 183314, -224049, -295319, 2399, 351955, 409851, 69340, -335194, -295739, 159903, 408659, 115493, -278351, -236796, 107901, 224035, -9418, -195652, -74086, 105533, 64366, -78075, -84693, 24454, 95358, 51080, -77977, -143406, 12959, 259934, 228832, -122650, -345176, -92540, 350435, 408740, -11386, -375681, -236102, 179589, 331454, 104499, -149181, -165802, -8782, 99822, 53107, -45062, -25595, 81823, 82774, -61478, -150233, -21101, 206935, 233160, -22087, -233845, -84119, 238727, 278222, -7318, -206378, -66397, 198685, 240979, 7718, -202715, -122789, 147617, 261231, 80637, -166005, -182614, 41556, 223787, 138580, -74911]
189g4911k6103J68447P2712j26619j01184J06050J73210k1393k26703j49639J40763
200f5370K64112M3496k29708k16118L6903K29284J39468j23461k18012p902K02576
211E5268J05752j36654j65800N1876K08339Q8255j65824j98957M7961K31317R0662
222B12195j54580j69719K8279J65824P1086j26549j57041L3839J89025Q1821j49929
233B4251k04080J639K18652J64335j12737k42737l8131J91114J26007q6985j28203
244h6875J6019J10042L5345r8543j04556N4551J66952O0311j39504j79280O963
255a58575K00995J48727j00815k18984l0112J86210J20777j02209j57328J2835
265i8479J57341Q3102j11313j68023L832J74791J14347q5546j68365m8632J23350
$$ y = [-74911, -101014, 67433, 140145, 13526, -87658, 18392, 191602, 170209, -56494, -206133, -65370, 198742, 242238, 12530, -203588, -166685, 62599, 202067, 78606, -139406, -147308, 55268, 161020, 24366, -141434, -89558, 118781, 207036, 41212, -157745, -109784, 121533, 212195, 57615, -112104, -83825, 81999, 153085, 26536, -130505, -96666, 92359, 174180, 24251, -179829, -178190, 40462, 204797, 92060, -150677, -188808, 2306, 128313, 41328, -86875, -70856, 39186, 74531, -24012, -128568, -74017, 92935, 153246, 13742, -165538, -158575, 42420, 191147, 90332, -128652, -158764, 27446, 148223, 46014, -111314, -98479, 58862, 141964, 30651, -137372, -133540, 41251, 155598, 70052, -98313, -146945, -23595]
276b3595J32982l5780j50504l0724J36664Q8305j02492j43601K6410J75556R8460
287A71681j18614j90530j1688J76247J29052o5128j52950n5184R4600J15782k6149
298F7119j29575l2266J23294R2865q4961j50387q121J56642J23208p6308j74415
309i2905l9340J38388J11481m3298j16819l3491Q7104Q8899m3361j29177k4447
320i6966J33724J11020o9722j60666m9402J24619J38862k8447j48993o0484R6668
331i787R5001l6212j01435j8711R4212Q2052n5206j39419k8556J31852J20872
342A34663m2593j47851o8246R0565J30460n612j24593n4439Q9888Q8033m5175
353D5100j11501k3410J04197J03289m3769j43787n6954J01438J18668p915j11412
$$ y = [-23595, 109387, 73607, -76897, -107621, 29043, 117348, 14856, -128745, -102335, 73221, 171681, 53067, -137463, -149151, 27096, 156148, 91020, -61930, -117114, -22514, 93268, 67119, -62456, -94722, 28572, 121437, 36476, -113911, -122032, 34610, 157818, 81510, -92905, -132245, 6143, 117624, 74326, -42493, -75984, 11120, 100019, 56658, -72519, -96966, 36758, 147778, 78056, -82610, -132012, -7393, 131469, 103022, -45971, -106455, -9787, 85214, 49002, -52433, -71144, 23068, 105120, 49914, -89505, -118061, 13791, 134663, 92070, -55781, -124027, -33462, 96998, 91386, -33207, -87646, 2242, 90275, 45100, -66401, -89811, 14386, 117675, 73906, -69881, -126835, -25397, 93271, 85356, -26056]
364b6056o9326N5288R6635n408r9553l4708R2944Q1570n3231j22054l2875J03631
376a3143J22068j8709j37640p7312P2741J12012J1559q3216o0468L9788P7873
387D5553n975r4148l2553Q8202Q8463l7661j17959n3308P7882J16884N770j09135
399b7985p2946N2235Q6619L720o9587m4563N0217Q2031j2107j05154n1319Q4202
411b4637J06970p789j04657p2235M5284J00578K0602p8718n6156M1111O3110j0301
423B3162p0318l3684N7015Q7855p224j07837o7241O8810J08014J4574q2529p2159
435h1562L0085Q2153J9557o6346m3179M7740O2683j1157p5411m6429M7419R3814
447E9367J4969r0901p6635L4289Q5303K5075n5429n3138J8194O2987Q335o6030
$$ y = [-26056, -95382, -40094, 56541, 51133, -48420, -83128, 9816, 91386, 38155, -83899, -116774, -13143, 108925, 90216, -47424, -124736, -51995, 60017, 71576, -11640, -72108, -32320, 45553, 39578, -54570, -87123, 1079, 89542, 51881, -66078, -119386, -41504, 75380, 81150, -27985, -100931, -48696, 37923, 41643, -27944, -72507, -22290, 59741, 47634, -57520, -108839, -24637, 82333, 74544, -30113, -102348, -57064, 43514, 64116, -14602, -70758, -29647, 33463, 23162, -47156, -80840, -23825, 64030, 56806, -51031, -118272, -49462, 58552, 73126, -9403, -81562, -51477, 30676, 50233, -16113, -59292, -11552, 51131, 39974, -35437, -81866, -34447, 59367, 74336, -16565, -93200, -58911, 26392, 51467, -3962, -57100, -38906, 24081, 32416, -33614]
459c3614l5969N3897P3265k279p6396n8572L1902R1072L3049o3761o9133J6786
471c9753O1263J8018m1544l9324K3376O1065M231p5989n0508M6851Q4791J4669
483F7146o8102o8525J3073P6457L8500m3595m8375J3569M4497R790l8308l1793
495c5666K6849O7492J5355p4376o3974K9392Q0137K8500m9886o4109j483N3215
507A1446K3062l7079l5074K2989M1274j049m6308l7094K4548P0893L1059n3833
519A4834o5394P900O6361M1619k7150n0434l735M6330J8514m3410l4692K7049
531b208M4427J496m8230m4698L349N2101L4376k8018n1381r554L6338L0478j4003
544D473l5237Q755N0659J6597n4752m2835L7021O7861J3757m6733n0341l194M4481
$$ y = [-33614, -69583, -15686, 57579, 55300, -21096, -79668, -47766, 43306, 76355, 12594, -56539, -39753, 21510, 39528, -2016, -41340, -17964, 43101, 47332, -28657, -79165, -32314, 52477, 67146, -956, -69481, -56408, 20049, 58549, 14954, -33421, -19852, 24645, 34435, -3873, -35666, -8817, 58675, 74030, -346, -64320, -34928, 45209, 73709, 23823, -40286, -41769, 11446, 34508, -2571, -37645, -14656, 26618, 25569, -20739, -57833, -33285, 37608, 68667, 14834, -50560, -42660, 23701, 65320, 38170, -12264, -15999, 30331, 48845, 5435, -29257, -2208, 42219, 43715, -4515, -49213, -45864, 6237, 40613, 12595, -38786, -48340, -12002, 18476, 4473, -30764, -22009, 28650, 45247, -9505, -52340, -15319, 52542, 66299, 19566, -30775, -33969, 10512]
557A0512L2005j3796l7472j5974K0152K3219j2342m0288n516N5409L5493n0712
569F90o2306J4317O1822K7008k4642l5171q420J8416J3688m059p667K782O798
582C256L689j6743l1406o60N1496L8358m2111o5454K963N7882L2239k5780l4968
595b7239P918L4030L369k7755r088K0240K2424J0873q316l8395k9996L7809O3268
608E9142L52o6355l4121L6426L7986j1953l0254O602K8166q390l6576n684K6894
621B235J3175j250o53j8321k8047P913M6552J2900l8803k2224K6276K7971k2985
634D739l4819J7319N4065P179n2001k8904K4498K9214J0234r40j6089k8037l478
647a7020L4817K0535k2094k8195J5307L1511p110m1703p812M7814K8636k8106
$$ y = [10512, 42517, 28721, -8751, -24725, -4573, 18646, 6304, -33984, -39500, 15909, 51402, 690, -61616, -47299, 14523, 41531, 16889, -18282, -26702, -8286, 5402, 1343, -6324, -3542, 3256, 6945, -9798, -41204, -41864, 9632, 47990, 5879, -59575, -56612, 1270, 33509, 7729, -27239, -19321, 14709, 18078, -9677, -18765, 1475, 23899, 34772, 26456, -11939, -41935, -4126, 59142, 59494, -6861, -40982, -4556, 33430, 21477, -8777, -2175, 25991, 17601, -18975, -24659, 2235, 15410, 14160, 13507, -4814, -32861, -24948, 21604, 34504, -4299, -26523, -247, 27724, 4739, -30080, -12761, 41304, 48483, -3518, -32422, -7924, 21290, 31524, 30584, 14495, -13542, -17020, 17797, 38332, 16238, -11957, 3350, 34861, 27751, -13952, -21764, 26050, 54686, 26580]
659B6580l7280P177J9480J82k364N890l011j4819n794M618O64r004N523K4403
673B2245r79m8258k7547M6321M9153k1710m4165L133K4897r34q999J1341J1709
686A6207n130j0692Q60J58r496K332K8954J1859l7107m0066K0208M0665l554k7773
700a2575j603J4490o262j9116k500K1787J8526o541k1944j1345m29R574K0954
713C016J8151k2016l9057J099L8345J1876k4622j1327J8473J3005j4875j9483
725b7415P968K3574Q845j1659n967m578j1223M693K5462J0141k5057j7598O578
738a6236N163q589P42J5968P911k0177k9454K856L1968J5817j5910j4180M106
751b0015L765L24J0519O610p834l45J4735n01j6981j1669J4448K6443N467k6803
$$ y = [26580, -10700, -3523, 15957, 16139, 13775, 19665, 16654, 1835, -3959, 659, 1323, -7681, -2158, 22245, 21266, -26992, -54539, -8218, 40935, 19225, -24940, -21807, 3090, 2156, -6843, 4498, 16207, 11077, 385, 1245, 1403, -8093, -5761, 23193, 35052, -2055, -42121, -21913, 18752, 15198, -12575, -14178, 312, -5950, -25066, -27566, -5779, 12747, 6206, -15738, -27083, -27512, -17938, 3016, 21167, -849, -39906, -38807, -462, 11414, -13208, -24535, -6062, 6943, -7932, -27415, -19447, 4127, 12972, 1313, -4654, -9232, -20455, -15762, 9700, 19841, -5216, -22814, -16236, -11073, -19662, -18920, -2952, 4959, -15218, -44672, -41816, -9848, 5969, -9941, -24121, -20015, -16250, -15926, -5407, 1203, -6631, -6976, 7759, 7258, -9723, -21392, -6944, 19499, 24966, -1837]
765a837k6380O315K1938P603k186n070j0114p570N520J1217K916K577q60m318
779b49l738q24K291Q768J0577n427j4754k436Q419j508p489O813R863l359j6439
794i492j4181L797J9017J2247o635j5695r137l883J3160K0842K674j5285r509
807a2080P030M905P56J10Q683Q646m049j5414p947J2425J3124o20l751k672j0367
822a221j2727R103J6365q20j0902n194m162o046r68J0251J4722j382j7542j4476
836b4999R919J7654J326m138L378j669p501r40O205P047R34k918k041l197q104
851i044n382J2091J6858n536k0516l139R423k59k613J0817P947q189j3763P67
865a0538R163P312K541m1m34q753j2261N798J9889K541j5567o368N947m900p305
$$ y = [-1837, -28217, -21902, 36, 7639, 5453, 383, -9731, -17301, -11781, -564, 2352, 4929, 4069, -249, -3987, -4811, -2520, 6248, 16825, 11398, -3356, -5792, 2627, 1119, -6370, 443, 10306, 6947, -9492, -23673, -19876, -859, 11388, 4753, -10942, -20079, -23962, -10802, 10040, 12714, -2571, -12080, -5050, -145, 611, 721, 9404, 18050, 14001, -1413, -9360, 3065, 16189, 15569, 11818, 9146, -1221, -13948, -4845, 11520, 10700, -202, -5396, -9558, -15604, -16572, -6321, 8401, 7019, -10523, -24999, -15080, 2574, 3900, -238, 3140, 1471, -6030, -6970, -765, 6282, 7216, 4298, 2257, -940, -9044, -14426, -2335, 14523, 8987, -11529, -14668, -5245, -5504, -8117, 2700, 10647, 2458, -11305, -10538, -1375, 5937, 8478, 8437, 8003, -750, -13011, -7213, 12676, 15217, -350, -6718, -771, -5671, -12976]
880a2976P203J2158L96r840p948m93N887N730M984P182m37j7231p626J4746J3846
895A5581m078k893K264o893j2122K100J4432P746o145j2240o924M018J247m46
909d353Q050O197r875j3468M267J1634j026J583P946r80j0313p233N097J2098
923I624O307n442p347k122k309n066Q582J4267l397j4627n404L412j7K525P621
938F607L886q097j0308m466J0435P018K168k056l28n057q602K475J3473P055o136
953H067o228k073l769J631O748M525p54n124r209j619O590L836k127L672M50q512
969c896p195M383R061L95O69m18n693m584J935M253P496K193o628p616J081K028
985b536p64Q016N113o058r597j853K841M028M615J880m453n361o045J82O871R002
$$ y = [-12976, -5773, 6385, 6781, -3059, -11007, -11500, -5613, 117, 5101, 12283, 11846, -5385, -13011, 1735, 15581, 11503, 8610, 10874, 3981, -8141, -6041, 8391, 16137, 9992, -2248, -9172, -5154, -3907, -4353, 3697, 9894, 19, -13449, -9182, 2452, 1426, 3009, 10955, 9975, -338, -7571, -2474, 9624, 15931, 10489, 3142, 1020, -1289, -6355, 2227, 16494, 13097, -1530, -6934, -3522, -3539, -1014, 6607, 10493, 2396, -7912, -12378, -1943, 5075, 7243, 5187, 4859, -198, -8800, -6325, 7148, 14203, 8067, 1839, -234, -4003, -2372, 4376, 8901, 8147, 3023, -6186, -7805, -1215, 2621, 494, 4166, 4616, -3896, -11091, -6708, 2353, 2748, 3417, 2999, -2694, -7278, -5343, -1090, 6406, 8599, 1971, -5645, -4564, -2536, -3300, 4716, 9829, 3771, -5826, -7679, -4838, -810, 3805, 5685, 1232, -4129, -10174, -9992, -3121, 5881]
1001E881n20n803l170l952r56N334R571J683o335n203m613J53P784O590J340k865
1017D919p302o209N49R343M294k19l129n781o740J099Q313M399M55l239o555m217
1033a0020L628O549M360J681k542q010l256L920O113K791K059j754q138m059K439
1048d239L419M655K922n591o450l247K041K034Q153L709n236p420j060J153K708
1063b449Q524L153n627o654l487J220O812N547p86n442k609l133p83M469P116
1078E871o80n637j732l124r18O189L881N82k538l238n026J402O277K503P44m71
1094D085k967p715L37N375M732R77R4n964o641K903L968M623K562j722o266m503
1110f122K464K698L568L231O8o562n098J381L210M882K796l178m904k050j742
$$ y = [5881, 5361, -442, -3612, -7564, -8520, -3186, 6385, 8068, 1733, -3470, -8083, -7930, -146, 6444, 7784, 4919, -2383, -8592, -8043, 1300, 5594, 5375, 2246, -3535, -10275, -9176, -863, 3536, 3991, 752, -5803, -10020, -6392, 157, 4517, 6198, 3656, -4354, -7610, -3690, 2423, 5214, 7273, 5519, -2619, -6678, -4239, -820, 3835, 6757, 1166, -5284, -8531, -6490, -4456, 3697, 7406, 2170, -5250, -6310, -5157, -2449, 6075, 9228, 3601, -3053, -6540, -5320, 1492, 7039, 6253, 811, -1798, -4931, -5714, -1245, 5871, 5191, -446, -2178, -5302, -6220, -31, 3850, 4432, 1894, -1344, -6370, -4968, 1309, 3812, 4556, 4085, 1118, -6597, -6260, -885, 3847, 4824, 4918, -1046, -7687, -4784, -816, 3807, 6369, 4647, -1619, -6122, -3658, -960, 2608, 5839, 5907, -655, -5753, -4372, -1162, 3720, 6516, 3338, -1566, -3616, -5358]
1125e358J128O904M790m364p247k141m02Q83R105K823k183q531l233j44M753O844
1141C627M05l784j456l434l545O690Q246On211k336k124k797M437P334J780l351
1157D487o159l473K524M700R67j288K820l792q615J26Q409K675j952o33j130m932
1173e266j147L283K582L328q05n509j640K138k660R82Q683J466r576o555M171
1188f525N255J356L826N5m505k617q69N359O687K19l710r74l97m126j968Q883
1204E949N671p824p706n35K498o86Q19J637N67k854p293J55M701O199K79p50L461
1221D288n752o978P466J1042J338p043k531Q18j602m51K471N003P4r692o393L102
1237d840M254j701R57M961m090q813p7Q197N406m832J707L464k073m509k172Q109
$$ y = [-5358, -4230, 2674, 7464, 3100, -4147, -6288, -6690, -5807, 3298, 6121, 3938, -4593, -7826, -7970, -3217, 3627, 4032, 248, -1208, -4642, -8187, -1497, 6749, 6755, 1544, -792, -2916, -5713, -1276, 6058, 7838, 4487, -1672, -5145, -2621, 2079, 3046, 1758, 4578, 786, -7829, -7703, 706, 3381, 1429, 796, -334, -5266, -6413, -3130, -548, 2780, 1975, -3534, -5174, -3036, -5696, -4714, 3969, 5435, -4141, -10696, -6525, -1270, 86, 3912, 3967, -538, -3155, -4024, 1335, 8022, 8241, 4531, 3557, 3160, -966, -2934, 5949, 11620, 3796, -3910, -4445, -1947, -2633, -1814, -177, 390, -2464, -9757, -9602, -4901, 1298, 1577, 827, 4288, -1464, -8442, -976, 10066, 11404, 4361, 1830, 2648, 1046, 595, 3066, 8069, 8143, -1549, -7942, -4840, -586, -2287, -1330, 3631, -459, -9272, -9349, -1152, 4254, -578, 1129, 4593, 2520, -1989, -4161, 3948]
1253C948R264j967j0924l313J996l81L117P106o72j2148n256M647M370n97k86
1268a096J829m4m289m289L535R714J792o261m76L242l086j771O434M673l833n256
1284H18k29j473L60R55J667L904m107j1166k002Q784O215n132m728J934m67m255
1300h922K762L861J955j440Q87Q67j706k477J766Q618M173p150q623L377N481
1315C429k35R08K504m689o203j134K657M997J878j624m905k276J429k065M572
1330g57N552l299l681Q63K289k364k08M170K446j545o373n381J086O296K834l137
1346a209j572o248k463L231Q333J955n152k501K569r8M89L719L676K566j552m012
1362A731k426M628L241j181k90j86m796j951r46K587J363j101l35m759l237j282
$$ y = [3948, 13212, 11245, 321, -2992, -996, -1377, 1740, 8846, 8174, -3974, -9230, -4583, -213, -810, -1096, 733, 689, -3600, -7889, -4354, 5360, 7152, 891, 415, 3657, 571, -1200, 5234, 9907, 6074, 818, 589, -884, -524, 431, 2098, 6002, 1895, -9271, -11273, -2489, 3726, -1406, -6134, -4200, -4667, -8922, -6160, -2299, -344, -1784, -897, -30, -1736, -4213, -2447, 6171, 10344, 3194, -5429, -2052, 3429, 3194, 4102, 6606, 1917, -4286, -5420, -2763, 2234, 4112, 2488, -2417, -4693, -3264, -5329, -757, 4795, 1496, -2185, -1322, 967, -1397, -1605, 2565, 5011, 3466, -2907, -8288, -7202, -906, 1928, -1209, -2781, -9029, -11492, -8261, 72, 2027, -3125, -5626, -3057, -3155, -2666, 1053, 4729, 7295, 5743, 1731, -695, 3933, 7174, 5993, 5703, 5517, 721, -1230, -2176, 411, 1774, 673, 338, -4421, -7658, -8940]
1378h940M876N459L439p121n889J721P369R34J472N61j339k278n47P48K318M076
1394F859j878l451p27j817k066K883M993j392p580l84L510k46j754K688M678p58
1410C558m541m134K951N934K545k159j053j790m912L996N876J319m064j855J31
1425A802k70k950M13L482K701j546o634j589L539J883kJ530K294n102m357L605
1441a201M637k07L99J488l71m989k075M352P276J540r885k492K070L724l449J930
1457B747L234m598n016K445J065m03j005L071K344l133o213q74P312O343k613
1472D706n126R44J814j617J17O423P32n175l942L74L836l40O27K491r96m300l914
1489c346L495M927j750m492M345K041n370m435M145M851R69k824k858j915L78
$$ y = [-8940, -4064, 1395, 4834, -2287, -8176, -6455, 914, 1848, 3320, 3881, 2542, 264, -283, 465, 2783, 6859, 4981, 1530, 803, -1014, -3080, -197, 4796, 3404, -4176, -4560, -1050, -1296, -3050, -362, 4316, 3558, -983, -5117, -2166, 3768, 6313, 4154, 3101, 1311, -3601, 395, 6271, 7590, 3526, 1671, 1802, 1532, -1418, -1005, 2477, 5178, 3632, -3002, -4591, -1052, 831, 829, 2359, 4653, -449, -4806, -1201, 3436, 3229, 3628, 5116, 4745, -244, -2319, 2033, 9309, 10849, 964, -1528, 542, 4266, 817, 2747, 5981, 1383, -3633, -1188, -123, -526, -1531, 1540, 3884, 751, -5462, -6336, 976, 7319, 4706, -420, 524, 2338, 721, 838, 7261, 7993, 2818, -1124, -750, 3086, 2746, 3373, 5864, 4868, 568, -3346, 149, 5076, 3326, -1166, 3179, 5220, -150, -4585, -440, 4411, 5380, 2556, -302, -2217, -1839]
1504a839J61O018K263m182p188Q07O834N42m449J960L414l602m819N12O753O27
1520C812n48j683j171p13r78Q98M221K787n337l622K879k13k333K336O189j167
1536E357p790j480J499M662K018k169q20K32l659j492M867L846k402k035M98p42
1552C90l998J978M922J746j183n847j084L030J381m13P88K287l030m371J245M644
1568B485l95k11J672k187n261K94M203M107o31k801l562M45J309l44J282L331
1584C736p6m412k709L255J468N31J594j4m596k82l30L119K119j448j885K63P08
1601A041k720J085J788K644j782k852o62n97K68L542J405j818k222r69L71J226
1617b52K141n51O11N75l446k960K308M141j4o29k197k395N81K000J542J35q50
$$ y = [-1839, -1678, 4340, 6603, 2421, -4767, -3960, 2874, 3416, -1033, 927, 4341, 739, -4080, -3568, 3185, 3812, 3264, 1581, 410, -303, -1281, -383, 3838, 6625, 1288, -2334, 545, 332, -2001, 335, 6524, 5357, -2433, -3913, -2414, 2248, 4266, 2097, 1277, 1509, -2150, -3642, 1225, 5071, 2669, 634, 1132, 390, -3608, -1630, 3292, 5038, 3855, -1992, -3076, -46, 1335, 922, 1710, 3997, 967, -3404, -2159, 2485, 2090, 1879, 3551, 1364, -3897, -3603, 600, 4707, 4076, 1275, -2287, -1842, -533, -877, 405, 3736, 3660, -752, -3461, -206, 1262, 1793, 3387, 3373, -1223, -1505, -1835, 1284, 3403, 1955, 70, 333, 1041, -1679, -594, 1194, 3838, 2056, -796, -1458, -2055, -1787, 1755, 3160, 1342, -880, -1849, -1478, -252, 1889, 1338, 1949, 2524, -922, -3882, -1574, 2567, 2553, 1924, -273, -2668, -2087, -87, 1455, 1590, 740]
1634G40m20k816O74J316P07K359N93k008l357m67K507J614L55J284k991j813N65
1651a158R28J264J160O86k680k801J308L08J415L013o46k931k509R07Q20L044
1667B128J275k350j559j055j75P90L111Q16p67k128j393q28J973J947J188j266
1683A707j905r82r25P51L719L94l81n60k234j000J594K844N32j70k768j356m8
1700g88M51K082M26R9j703l949J552J544J012J143O63j788k139q11K527K716M19
1717C456r13q70k666J063P31j58K939j407n57k243n84q48K658J700K2j913j237
1734h27r14R01J098K758n92j321p82j511R47K412J814J96j928j045j876K34K571
1751B135M58j24p02j664j937J456J785M96J81r03k184j798J605K165l97R08m17
$$ y = [740, 320, -2496, -1822, -506, 201, 2560, 3153, 1145, -2212, -2679, -172, 1442, 1797, 3081, 90, -1723, -1158, -230, 1034, 2194, 2880, 200, -2601, -1293, -985, 430, 3443, 2797, -134, -2643, -1736, -916, 2128, 3403, 1053, -506, -1561, -1736, -946, 2165, 2981, 2214, 86, -1307, -2135, -162, 1785, 2973, 1707, -198, -1180, -2105, -1354, 2365, 2759, 2378, 1818, -416, -1416, 178, 3022, 3554, 3384, 616, -740, -788, -337, 1745, 2171, 2270, 567, -3382, -1830, -286, 726, 1869, 2532, 744, -1395, -2206, 321, 3037, 3456, 2543, 1673, -993, 70, 801, 643, 3582, 2175, 1618, -625, -1209, -2057, 601, 2301, 2323, 410, -827, -1741, -840, 258, 3016, 2424, 1103, 321, -1190, -243, 2169, 3983, 4179, 2251, 1206, -670, -436, 2135, 2593, 2469, 1767, 103, -1834, -378, 1407, 1903, 2084, 1181, -1003, -2801, -1196, 969, 572, 1480, 1063]
1768A063j677o95J3L870m26K86j033j728p0R81M77J168J981k319l288J22Q86R28
1786E39O40J245k009k195R83j27J803J193j140l60p71m97j124J586M140j000k914
1803hq56M02j80L84J504J224j035k759o55M36Q66K795j198k40j420j207P05K386
1821A144k7l34q39J481k350J69J930J865M78j499j585j175J280L49k86J265j347
1838E19j696k561K420O87n27O09q57j121m87k68J620K383L93q85j581J058K66
1855b8L96P41K668k073k439K11J48J225R41N24j023j713j458P70R23K174j080
1872I07j612J64j038r82K323K616p12j379j751J204nm4R97O72M96k825j553L85
1890b137K343m5P69J55j197k234M2J994Q67J68r15j86K19l99J896M76M80q45k078
$$ y = [1063, -614, -1309, -1296, 2574, 2148, 2434, 1401, -327, -397, 584, 1061, 2229, 4210, 1891, -1397, -1275, -389, 539, 1179, 2424, 415, -1780, -797, -924, 879, 2072, 932, 572, -199, -696, -1820, -234, 3906, 2906, -8, -864, -462, -642, -258, 1246, 2470, 1435, -1324, -1979, -1543, -677, 2118, 920, 680, -740, -1947, -1242, 1144, 1117, 783, -56, 1425, -925, -756, 1174, 3039, 3517, 2018, 433, -742, 538, 887, 601, 1866, 519, -1177, -3738, -1318, -631, -1158, -549, -1406, -2527, -3014, -3282, -1662, 721, 1114, 229, -1352, -294, -28, 368, 1109, 3777, 1704, -735, -524, -376, 849, 1790, 2314, 1291, -422, -1880, -1110, -187, 1987, 907, -705, -541, -1579, -2561, -238, 2378, 1666, 287, -1464, -260, -265, -309, 688, 1360, 1856, -969, -2522, -2137, 206, 161, 930, 1085, -112, -2346, -2304, -310, 557, 725, -190, -376, -157, -556, 1340, 1816, 2296, 1451, -627]
1909f27J05Q33K031j685R67J130k132j729J560R86l62J40N57r06m38k024J260
1926c34P25R42n12j538m79R37J7m92K610k030l58m27m80J082P20K61j311J449
1944G82j030j543J887J573N32j122j453Q43n14J81R37J088r80j142k446J681J110
1961C84O53O02p4j631j301J36J495J51J25j16o14j293M56J176N48N89K38k193
1979f69n8N39k57P66J097M74j187j536J106LR66J216j05j711j140R6k79K439J764
1998C524l815j208J712k83n17J658M56j712Q95q82O86n27J052j02Q66j027o37
2015A39k634K834K442o95k033n68J42j198P33R88J967K07k480j528J864J725N40
2032B445l63J692j614k476J288J327J32j426M85J7j406k006J145J604Q12n0k573
$$ y = [-627, -522, 311, 2342, 657, 1624, 2754, 622, -1107, 453, 1439, 1077, 1217, 1774, 868, 430, -1594, -334, 391, 1333, 821, -717, -1196, -259, -242, -734, 1876, -154, -512, -939, -1419, -337, 383, 644, -667, 782, -248, -1791, 96, 1669, 2201, 1079, -374, 469, -45, 136, 1073, 2161, 1181, 39, -2407, -726, 384, 1037, 1639, 1565, -66, -1367, -1231, 264, 415, 540, 424, -190, -1483, -1027, 149, 697, 1286, 1524, -669, -727, -188, -445, 321, 1418, 1892, 705, -831, 275, 278, 1244, 2460, 2355, 644, -496, -400, -679, 1760, 3524, -291, -1499, 213, -70, -587, 1071, 1527, -185, 710, -172, 514, -13, 1039, 937, 1803, 776, 139, -2495, 339, 2781, 2086, 53, -515, -373, -1571, -838, 150, 2117, 2324, -156, -1684, 180, 1905, 2445, 2082, 3774, 2160, -316, 972, 2299, 2431, 1005, 1490, 1507, 101, -1905, -760, 844, 1656, 1606, -967]
2049i67j224J780J4N38N92K97j652j510J222K196j954J135R00R94j378j735J396
2066F44K016K86k834J57Q88j49j545P80J292j107j571R78N10j352J231J501M66
2083B191k256j874L11K416J915j668j664J215k30q94o66K382k09j477N59n70j617
2100b136J90K050J073k46l387l37J813N28p80j15L153j219k575K94K326l99J526
2117A759L13pj860j220J333J252N03r63j446j41J091r55j396K315P73j908k586
2134c143O05Q33K721k22j190l5j214N45P34J953l69j427J129J80j883l10N90L122
2152B619j239j369k293J631Q00J471j340j321L84m8l2L17J26n98J478k9J19k658
2170a982P77J198J794J57k310n44J297O37j645j05J478L21j503J79n32J29P20
$$ y = [-967, -2191, -411, -397, 141, 733, 1030, -622, -2132, -910, 1286, -668, 467, 1367, 2361, 983, -752, 644, 2660, 2946, 112, 269, 1157, 1008, -537, 243, 1535, 428, -1143, -165, 345, -1007, 224, 1725, 2191, -65, -1939, -1628, 788, 2703, 1035, -629, 586, 356, -538, -1204, 1178, 969, -508, 51, -519, -2136, -1946, 104, 1177, 931, -2456, -2793, -980, -452, -1232, -1347, 1806, 587, -1988, -1694, 632, 233, 1759, 2072, 2065, 205, -1015, 318, 1570, 2073, 1110, -336, -477, 614, -341, -1737, 578, 1351, -557, -3143, -2538, -1705, 1016, 794, -396, -431, -1645, -1100, -366, 1587, 1218, -209, 920, 1100, -783, -1093, -503, 2619, 1380, 11, -2282, -651, 149, 1620, 280, -1041, -657, -705, -737, -420, -294, -892, 586, 557, 676, -1982, -1205, -7, 1787, 1944, -366, -910, 387, 1024, -621, -726, 752, 1073, -430, -251, -783, -654, 66]
2187F6K480j811m601K079K112J165j660k72q99J328K494k996q65K771M31j62j958
2204b98j399N9K626O35j95k156q31J013J062K5j145n37K591o26j405j691K336
2221F4K174j030j208j724j01J333K563l51k124m52O60J142p52m50o29J726P30
2238A571p53l270J695J755m3Q0o51k464J734J033o53j086O12J513o11K78j557
2255h17n30R34K747o78k383k717M047J138M20j461j343J18O57K86j876O25J781
2272I48N14o36j610j255L041P21l68r82k373N47L081J30k356j007R54L357j313
2289A393k356q92M392m41p12j558j905J584J284K008j766l201K672R25n37p52
2305A38j568J224J819j036k694K7K894O28L42k321m41M11K100n74j6o69k8Q86
$$ y = [66, 2546, 735, -3866, -1787, 325, 1490, -170, -442, -1341, -13, 2481, -515, -1380, 1391, 1822, 1660, -298, -1697, -1638, 988, 1623, 1428, -728, -1559, -546, 516, 541, -604, -1141, 1450, 824, -581, -2272, 64, 2238, 1208, 0, -1724, -1825, -492, 2071, 1720, -404, -856, -196, 946, 194, -256, -885, 841, 1571, 818, -2452, -757, 998, 955, 1035, 384, -2080, -346, 687, 34, -1052, -440, 1073, 462, 740, -817, -1347, -413, 2334, 1656, -727, -3444, 603, 1741, 2161, 700, -643, -525, 132, 418, -1458, -833, 948, 1462, 826, -784, -2039, 1002, 1723, 1355, 373, -2000, -1453, 1628, 1758, -598, -1605, -651, 2706, 1393, -963, -1855, 2537, 2096, 1384, -174, -2079, -495, 789, 2797, 1031, -2170, 502, 1427, 890, 138, -1430, -206, 1613, 577, -2117, -2090, 804, 1432, 1774, -547, -988, -577, 1523, 949, 933, 264, 236, 1122]
2323A122q43J68k832L275J232p51k297n89N4L133K74j727l021J455J120R36r72
2340b63L51O54j86P67k136j138P28M432k38l295k559K648J787K55j696k061Q55
2357a095L041m64k044r14J361J423L67r29k620P46K484N04j729r42J06K546k76
2374A565j396j439J729K421k531k152k14Q92K160J062j450l630J220K282J762
2389B281k329k66R0L40L44m34k030J312L386p77k717k129K608J815O11k223k069
2406b187R94K240L2j974O0J619Q88N39k170k655J660L079R22l362o63M2J370K149
2424B583j846j783o3K379n76j354j667K014J389R96l263j328m9L531J770l693
2440i60k33r18J794R38r70j155K4K261N98k241r32J224J409J846j605l606J325
$$ y = [1122, 279, 447, -2385, 890, 2122, 1371, -926, -1515, -1461, 1672, 1946, 219, -2802, -1347, -227, 709, -263, 88, 742, 556, 1323, -813, -1951, -1223, 3209, 2971, -324, -2883, -235, 1552, 1807, 111, -1950, -1095, 1946, 1482, -562, -1476, -115, 1308, 1675, 746, -1874, -1128, 1356, 1860, 131, -811, -705, 1841, 1565, 169, -1270, 459, 2880, 349, -1803, -2017, -1125, 1035, 2097, 647, -2983, -1763, 519, 2281, -48, -314, -224, 116, 460, 26, -2004, -692, 2694, 1917, -800, -2929, -321, 1494, 2105, -118, -2187, -1193, 1047, 1079, -895, -835, 784, 1672, 2211, 41, -2614, -954, 2125, 3047, -315, -978, -936, 434, 2583, 737, -1046, -1109, 1270, 694, -660, -2327, -313, 1076, 2072, -1191, -2519, -2568, 963, 2733, -960, -1193, -2111, -317, 621, -349, -1504, -1480, 781, 1379, -862, -1794, -570, 839, 2685, 1080, -2526, -1201]
2457a201J473K112j333k148l51J837J275j799k632J718K896o3k513k335J653J212
2473a99J750N39n196k94L747J553k210j173J560L93J131j459k820J403K617K99
2489A641j636k075p98K545K579r32k986L44K445P21q95k727J199J865J016j230
2505A076k931M70K241J221ol041k25J312Q93n18l044J575Q24L058l364r37j606
2522c002K732K405L4m083m21L572Q18j686r26N20J426P34j617j211o78L487K21
2539B325k021k937Q29J707K912j101k781j340J994K469j644j328r45J921J823
2554A883n13l216O77J790J886o15k620j176J291K184J070l263j021J504J272j224
2570i1k060J90K807Q06j183k702l87K704J734j72k605j580K128J756O6k474J38
$$ y = [-1201, 272, 2384, 1051, -1097, -1448, 389, 1664, -135, -2767, -1049, 1847, 1784, -729, -3064, -1411, -199, 1551, 2090, -3106, -3400, 347, 1900, -310, -1483, 77, 470, 1601, 142, -2678, -1275, 1342, 1641, 5, -2070, -2868, -323, 2256, 1324, -1662, -1318, 1127, 1848, 953, -1774, -575, 1290, 2306, 1076, -1855, -1385, 856, 2077, 2071, -970, -1195, 117, 1010, 492, -2552, -977, -153, 2905, -459, -1396, -3002, -270, 2135, 2169, -1914, -2335, 1237, 2055, 369, -557, -37, 1389, 2123, 506, -705, -1383, 2104, 2325, 304, -2633, -1804, -97, 2815, 1714, -1067, -2407, -413, 2056, 412, -916, -1861, 60, 1883, 1370, -1846, -1169, 621, 2507, 1892, -728, -1904, -613, 1571, 2641, -622, -1643, -139, 1133, -91, -2151, -1961, 846, 1652, 469, -2233, -2620, 84, 1818, 1646, -959, -2539, -411, 1345, 1411, -1063, -925]
2587i25J598J063p78k283Q0L61K476M54m166o91K167P92q6j155q03K752O27n29
2605I54j965j600K200J874p25k280p49R99L478O2l502j170J630K895j407j163
2621d69n22J88K055l09j562k057J669K128J388l210j660j89M605P97l200k190
2637b538K304J577p4k159j544K499J842j023j552j159K83K519J314k606j909L07
2653a919K898l12j758p69K476N98n87j546j100K196J885Q24k893j492L34R08J406
2670A149j397o32l16K299J458l322j753J815K563k10k859r05J154K527L1j878
2686b76k142J362J585R34j107j761J041K232N18l457k061L206J702M03j891l338
2702c050K422J322R78k315l87J464J311j263l54j365J460O63K26n33k548K56K384
$$ y = [-925, 673, 1736, 958, -1325, -1245, -884, 1592, 2046, -2120, -2811, -644, 148, 62, -1093, -1896, 856, 1483, 954, -1011, -2611, -411, 1463, 738, -1542, -2291, -1292, 2186, 2248, -1254, -2424, -794, 2101, 694, -469, -991, -803, 1252, 943, -619, -2676, -1007, 1121, 2509, -701, -2361, -2550, 2055, 2852, -348, -2538, -234, 1343, 1269, -890, -2434, 65, 1907, 884, -668, -1827, -1544, 975, 2289, -317, -2226, -1919, 979, 667, -1091, -1860, 616, 1214, 627, -919, -2019, 177, 2062, 2886, -7, -1499, -1165, -257, 1149, -248, -880, -1196, 1103, 2561, -761, -2514, -699, 1864, 1654, -1205, -2110, -956, 1571, 1602, -276, -2418, -1056, 529, 1463, 356, -1405, -364, 1868, 2386, -1071, -3132, 74, 1776, 2179, 288, -3050, -628, 694, 1672, -643, -1030, 434, 1745, 482, 128, -1237, 223, 886, 1112, 579, -1969, -1713, 671]
2719F71J912k571k463J466J646J101k595j757J171K124l74j060l57RK071M46l38
2736A102k935P09R72J243j191j698n9K175O23j281k318J669K136L9j572l1q44
2753a261K646J298r60k066p00N04J379j295j112M17K187J367l634p83M55J997
2769D39J667l629j56J170Q04K018k241j087J023K14K26p40j238n79K676J562k415
2786b86j601k79K383K180j428j658n09J300J574m86k407r2J585J194r94j917J061
2803c80R02J325j852j465J167Q27O32j145m09o49J897J01m11j753K82J700O4m59
2821C74j734M22R90K841k245p14o52J363R62k175L67M95Q57J75k338j020N08K378
2839H54J588j202k028j391J734K758j354q98j113J635O62j360p11k47R75J856
$$ y = [671, 2583, 12, -2451, -985, 661, 1762, -833, -2590, -1419, 705, 331, -729, -1086, -1077, 994, 1440, 1102, -1833, -1124, -152, 1091, -100, -1798, -1857, 318, 941, -340, -2658, -989, 1147, 1186, -386, -417, -1261, 1385, 2683, 1723, -343, -1043, -539, 840, -455, -1567, -1150, 1037, 2404, -1230, -2013, -1558, 439, 2106, -1523, -1679, -509, 295, 2313, 72, -1015, 8, 222, 448, -292, -1530, -2109, 567, 2129, -286, -1887, -2166, 217, 2397, 969, -689, -1198, 102, 1676, 1190, -1217, -1309, 276, 1470, 476, -1441, -380, 522, 1847, -5, -1470, -303, 524, 1156, 11, -398, -1047, 850, 951, 540, -1213, -931, 769, 833, 374, -1360, -938, 52, 2893, 648, -66, -718, 645, 1607, -568, -201, 294, 1151, 1326, -1012, -2032, -1524, 854, 2442, 1240, -788, -2179, -445, 2313, 959, 61, -1052, 583, 1245, -115, -826, -1073, -98, 1758]
2855A758j726j901K63J196K026n30j523j112J16L146j950n09O60j33J581j189
2871A73k336R58Q60J490j021j116m43J311N09P82j942j49J866R1n16j495r1N67
2889e02J309lj952q04J457K277l64j460n14m75J872o7n93j344J330P01r26j266
2907a324j52J111L312k350j226j013R21J781j118l06j036J282L39J093j488l29
2923e03J388J103j363j997P09m5J972j276l88m98L14J788M52k505O6O84O75k26
2941C50k55j243J312R28k10j026n67O28P82l01m13o67K98J286j92k80r25J01J753
2960A359J30k201o75P14P08K91P24j638j70J484K67j058Q5o65J139P97k183L34
2978e58n95K369M9k302j348J750K396p23n53q79m18J685j50j783M79J690J10l74
$$ y = [1758, 32, -1869, -1606, -410, 1616, 1086, -437, -1549, -1433, 1713, -237, -746, -86, -219, 1362, 173, -2163, -1205, -345, 1145, 124, -992, -1435, -124, 385, 1167, -775, -924, 942, 1033, 517, -978, -1069, -502, 807, 804, -1148, -1952, -495, 1782, 1418, -42, -556, -1031, 841, 774, 181, -1163, 167, 868, -58, -1324, -1476, -365, 2947, 597, -629, -1642, -721, 1060, -58, -364, -1400, -118, 221, 1314, -174, -503, 885, 1988, 625, -1372, -663, -708, 1264, -12, -400, -898, -584, 1204, 1656, -849, -783, -99, 576, 350, 95, -1148, 164, 1092, 882, -144, -711, -83, 699, 398, -15, -682, -384, 902, 710, 430, -495, -394, 1359, 1489, -712, -1387, -673, 35, 326, 1050, -588, -758, 726, 993, -65, 20, -645, 494, 1291, -892, -558, -1153, 1216, 1265, -1037, -2385, -635, 1761, 1038, 485, -394, -812, 873, 723, -1060, -581, 1109, 1219, 845]
2996H45k255o2J024J791j60q3j665o38J333J99K02j794Q59J256j0o36j46o92P78
3015A46L32o96R44n81N23Q81k076m46P25L6P99j254K51k20Q89O45q00j731Q12
3034h21K143j84r14r74J22N62J498k063J34l14J611K6r43l71O82J17R57j275o24
3053f31O0O17M33n86j93J69Q14j289j03L69K78M89O3J00q59J3J345J19k57j926
3073i75R1J318R39j763K86q97K455p73j09j640N81J070K69Ll50p23j108J314O48
3092F36j142J42K45m47k26Q58j082J745L79j181r84K56R78O5j58j59p08Q84j73
3111g2n62L2O15K06P08j839P73j053J628M62m29l20q40J116K29m85K31ql20J504
3131A576p48r64o19J036r7N76o84q16R62L82q26m53L09P80k77q2l22J40P92J010
$$ y = [845, -1410, -1472, -448, 1343, 1183, 1100, -565, -1203, 130, 329, 531, -1263, -404, 852, 842, 206, 60, -632, 146, 478, -218, 726, 145, 668, 1549, -527, -973, -248, -212, 587, -667, -416, -636, 253, 898, 98, -1633, -821, 1322, 1138, 224, -750, -628, -66, 1432, -631, -497, -811, 800, 826, -117, -488, 194, 311, 1268, -7, -631, -571, 46, 479, -107, -300, -131, 683, -606, -709, -340, -62, 427, 490, 590, -269, -256, 1089, 1208, 951, -975, -884, 434, 1373, -390, -104, -1001, 1454, 681, 572, -1068, -487, 583, 852, 855, 505, -218, -1326, -12, 636, -506, -364, -119, -566, -792, 66, -1016, 729, 1108, -73, -1057, -801, 177, 242, 84, -75, -783, 101, -72, -634, -602, 13, 219, 927, -912, -139, -1192, 436, 898, 469, 149, -691, 425, 654, 169, 400, 392, 72, 1576, 828, -136, -755, 281, 184, 760, 76, -740, 222, 604, -222, -675, -366, 414, 137, 55, -267, -127, 665, 1675]
3151A675k208q70Q81K031j373j46O34j222J638m70j55j94j335J177N3kN41n23
3169A32j17l24O4o75M00L62R18j072J84R0K79q9N0L03p06O55p64k0j5n7J098o27
3191F9P36n15p52L45K69l71o1j36N56L71q38K87n33J006n04N26j558Q75m35J257
3211E94j09p85K94K72q87N24J74K27N3l19p36l9L92M3N97J56m38j002J513O64
3231A188k43k037K46K88J297p85k65j84K11M15r69O24m06J000L15o02o8l67l51
3250f93P47J30O22m31P72k91R6j019n73J004J3n4P3q22O38j633J630k64m04n23
3270i82J027j97k93m68K116j319K69q37J574l97o92kJ460j006o54K25q99N77N72
3289G4M82m93k25J21k67l46J019N89j341q84P94K09L25j21j02J31p53P68Q31M98
$$ y = [1675, -533, -1403, -522, 1509, 136, -10, 624, -598, 1040, 570, 415, 221, -1114, 63, 116, 114, 655, 132, 15, -309, -245, -920, -520, -158, 760, -312, -128, -38, 241, 152, 202, 505, -201, 454, -310, -330, -345, -402, 696, 69, 805, 290, -462, -117, 152, -219, -280, -416, 140, 511, -327, -40, -573, 433, -71, 455, -1103, -228, -663, 594, 485, -300, -6, 266, -621, -97, 77, 304, 357, 38, -698, -737, -345, -302, 295, 451, 13, -989, 524, 1188, 945, -1092, -846, -558, 739, -46, -311, -495, -284, 131, -838, -214, -620, 380, 695, 93, 25, -342, -693, 54, 184, 806, 375, 1147, 856, 952, -67, -640, 364, 377, 323, 396, -426, 212, -1421, 209, -55, -459, -982, 45, -152, -445, -913, 1203, -116, 153, -684, 890, 493, -199, -201, 1259, 253, -401, -176, -1075, -498, 74, 556, 63, -162, -41, -308, -654, 365, 954, -387, -1271, -477, -268, 57, -64, -166, -35, -788, -20, 811, 1309]
3309A309q59K68o94J04q35K24J506r30l00N83j273J337K68k49q24M53k02K37q00
3328f77J65N40p85J641j423J141l34l30L56kn27p07J609k40k88N55l95j520J505
3347B84L94Q2r36J4P05r82M56q40k19J929p24K16o43N20K37j524M69M98J432m02
3367I66j274O81j76j78O45k94n42l13j60O12Q6r76J070l20k10M07k51P76o92K2
3387a21k35L26n35l24J437lq80J269r59k90O59o10R40k73L01p91M10m01r5M62
3407B87o57l5n58J081p67j37J685l72M42j070K51K48j31l80j51j46L39k61N15
3426A83p44O88l62r83Q26m29J122j207J372j49o37Q1J036j094J88N96j095J275
3444F67j643N05J95O93O76l36r01j22l51J59N46J032j733P10K43r16O15p82J219
$$ y = [1309, 450, 718, 24, 128, -707, -483, 1023, 93, -207, 376, -897, 440, 708, 459, -365, 88, -114, 123, -677, -512, 28, -757, 884, -539, 602, 268, -62, 294, 292, -235, -942, 667, 427, 139, 694, 299, -1221, 284, 678, 760, -176, -162, 543, -439, 17, -823, -1042, 887, 163, 379, -264, 256, 493, -1031, -562, -64, 1368, 966, -308, 373, 197, 19, 664, 370, -172, -485, -645, -33, 53, -923, 147, -173, -383, 24, -227, 549, -143, -121, -356, -30, -565, -889, 548, 545, -335, 934, -25, -315, 344, -266, 674, 401, 702, -89, 321, -80, -175, 287, -370, -405, -963, 118, -649, -786, 899, 527, 969, -101, 150, 398, 267, -113, -264, -410, -71, -332, 183, -561, 127, -235, -1218, -392, -821, 301, -906, 466, 317, -320, -239, 797, -297, -109, 487, -608, 667, -976, -471, -276, 417, 1093, 757, -144, -266, -617, -458, 88, 1120, -613, 97, 340, -576, 39, -743, 476]
3463D76j473J547m35n77m67Q02K4O21n96J526k512Q34M68L80r15O13r15O28rq5
3483f5n6J052o46l2R44r01o96O94N58r40n1J000l74J2jj319M84N09L9Q37j164
3504a16K29J099j121N53m45n88Q01L25j073k88K58n95J125l48L19q12M9N47P20
3523F39q30R18j29l61j31N4p78J001o94l8L26l87N27r02J095j744J295O31Q76
3542A368j379O66O46j199n6m48K14m12L90J55P72j035R0Q2N53k70m23k08J097
3561F03n32j40K51r69n5m75O48J16l59J389j63o11J354m55R4r27O01q02j30L45
3581b17L45k56p93J700k94n06mj09L37r1J234j772J08J9K17O57j494Q33Q75r02
3601a13p8O43J018j417m04m3j16N48L4l68P1J516j147m53J79N2o79J301m07q2
$$ y = [476, -997, 550, 115, -462, -929, -127, -103, 518, -78, 1448, -1064, -230, 238, 618, -297, 316, -599, 29, 20, -65, -121, 931, 285, 253, 1197, 296, -400, 294, 852, -88, -139, 861, 487, 499, 498, -821, -337, 172, 211, 1048, -116, 113, 1212, 91, 644, 199, -389, 412, 737, -336, -624, -366, -961, 164, -184, 135, -677, -628, -81, 639, -191, 727, 598, 237, 106, 160, -618, 383, -311, -349, -23, -410, 117, -785, 310, -1434, -139, 492, 1368, -11, 655, 1301, 102, 46, -402, -188, -600, -210, -55, 717, -318, -228, -146, 407, 137, -286, -494, 603, 71, -69, 182, -787, -842, -1317, -669, -553, -912, 477, 314, -297, 1057, 602, 696, -231, 370, -432, -562, -217, 128, -128, -921, 779, 485, -21, -25, -134, 203, 112, 1346, -426, -318, -299, -82, 575, -919, -86, 789, -113, -191, 452, 1470, 53, -351, -394, -510, 38, 72, -296, -225, 1291, 144, -309, -130, -78, -757, 544, 137, 55]
3621E5Q88j373l34Q55J17j104P63k14R26r26M71l00M74m64K96q79L59J0j96J265
3641F89q85O68j103O90N52N98r68L40p72M01j23k01J305q06r24q50R88K30p12
3660h83J27J583j536J106r8l80k83O82l66r10J230M93j428j25J473q26o16J265
3678E08j70o74K01l59J675j065K81p70j5J107p54l3n27R58n80J3K52L98l65M31
3698E12l18L7P80j478O62p24P62n15K33k41K37j54O58l94j114K491j322l95J73
3717a10R06q15L04P37j372N70K76k97k75J064q04J44l60j054N68L96J070m2j335
3736d29P99K27M23j038P7m75Q67l88o2j71l18P69k08j32N25j205R20N27o35N0
3756A23l42J037j371Q54l96O79j449J360J75r21M56p73O06O42q39Q70p96p77J292
$$ y = [55, 943, -430, -764, 91, 208, -896, -133, -347, 579, -347, 124, -176, 298, -166, 130, -749, -390, -380, -576, 689, -196, 472, -631, 59, 611, 1209, 241, 581, -191, 210, 87, -114, 1191, 385, -539, -1389, -401, -171, -883, -756, 827, -709, 397, 299, -81, -364, 318, -48, -958, 272, 765, -663, -788, 685, -141, -757, 508, 338, -336, -135, -494, 1181, 116, 397, -373, -388, 719, -35, -68, -595, 363, -217, -204, 48, 446, 81, 512, 194, 231, 1011, -467, 195, -529, 233, -282, -49, -290, -53, -207, 451, 57, -1057, 1434, 112, -283, -110, 796, -19, 285, 1022, -350, 220, 496, 199, -76, 988, 184, 328, -32, -1086, -518, -122, 948, 906, -429, 370, 597, 1020, -18, 59, -416, 451, 63, 1, -170, -488, 281, 73, -59, 466, -739, 181, 708, 73, 123, -219, 818, -553, 301, -95, 584, -865, 495, 670, -251, 205, -568, 38, 680, -159, 711, -85, -862, 430]
3775D30m97o7k53L04K2l45K19n28Q70O71p50J1Q47n59j049J5J183p86j11L95o84
3796f62Q62J5L03n65q01J618P9K63k66n09L21k12N7k11l65O86j898Q25M45M03
3816C88M48L7j296P09j022P60m48l49J120m66L11j25O77o73p0l82j389K048M03
3835F81p89j53J323j698O99j473J234R6M95q72J392q81j178J525j098P72r4L0
3853A1q01j03K17J33J207j25j942R23p12J933q48L01l07M1k25p59Q19Q5J361k42
3873I67k18o95j048M59pR16l98K86M81r79K21k0p77J423j228L18Q69j537R78K41
3893B52j493J901j092J396p43j125O21L80j6m89j38r9R14p86j65M64r0l70O70
3912hj63O13o80J349j3J39r84q33J589K62j061j073J045l05Q74j050L10k67m3
$$ y = [430, -67, -134, -387, -83, -61, -406, -187, -715, 155, 826, 76, 87, 934, 375, -674, -659, 524, -262, -373, 22, -662, 200, 215, 518, -47, -848, 770, 849, 1112, 846, 337, 658, 446, 503, 292, -73, 613, -1285, -460, -15, 388, 836, 873, -423, 286, -736, 24, -424, -773, 347, -119, 192, 67, 744, 71, 1, -381, -1770, 278, 681, -108, -261, 1062, -636, 63, -1410, -176, -80, 415, -457, 935, 54, -1124, 401, -697, 75, -19, 11, -790, -893, -676, -543, 664, 539, -1403, -480, -1192, 741, -107, 194, -113, -72, -297, -1056, -237, -152, 1209, 967, 749, 54, -994, -535, -542, 374, -24, 262, 743, -236, -15, -35, -812, 611, -617, -299, 570, -967, 11, 252, -1241, 660, -432, 964, 221, -904, -283, 97, 81, -408, -546, -645, 269, -517, -682, -218, -308, -678, -8, -171, 442, -238, 1111, 1098, 1237, 253, -580, 1009, 1271, 210, -863, 182, -123, 751, -299, 11, -256, -299]
3931b99m46N46O5m93J023M67j323J024o66Q83o61K96Q09j350l29M07m50Q64o62
3950b95R34j052j47L77k35J33K11k77Q31q02J021N79j545N59q86M31N01j00j133
3969h95P38k04R22n06k25L27P6j66N27k67j130r72J588N48k56J07m70n32J116
3988C26l92l68P78m44j01m47O5P98j152J113M41j884O94J228j135O65j08J233
4006A310q00k22n55L29N47j027r44J076M04P72j548Q10K76m15O05j419J415l86
4024B28j25j51n66J553o23R62o72L64m14k25j390J736p33p24Q45l86M94p05J90
4043c42o62R28J51L35M71j196j27J421p69M52r44M89n03j8o00R10l74l0J247r17
4063g8L47M14j129N10M03q72N38m56K54o87P7K227j247l94P64J61r96N65M12j555
$$ y = [-299, -745, -199, -134, -627, 396, 863, -460, 564, -102, 781, 120, 416, 1225, -125, -454, -47, -497, 367, -295, 639, -413, -560, -183, -418, -285, -74, -351, 480, -322, 699, 1278, -267, 292, -594, -163, 338, 238, -895, -157, -361, 561, 55, -170, 157, 233, 67, 594, 327, -803, -1775, -187, 361, 105, 212, -258, -790, 326, -66, -434, 344, -100, -201, -648, -583, 215, -937, 176, 617, -1267, -573, 655, -480, 185, 77, 1310, 510, 288, -267, 62, 609, -418, -1362, -286, 118, 890, -658, 152, 428, 13, 618, -801, 614, 228, 103, -48, -614, 939, 316, 1278, 606, 970, 556, 331, -1059, 677, -56, -780, 65, -321, 173, -532, -342, -1004, -76, 75, 410, 881, -315, -442, 979, 210, 662, -282, 207, -296, -314, -914, -4, -378, -408, 839, -78, 269, 683, -446, 64, 467, -405, 133, -323, -69, -756, -679, 1548, 301, -93, 671, 832, -164, 401, 813, -742]
4083g42L90K80o56O89L92j079J537n25q41n92J378j72N75j651P91n9J811j682
4101a56K44j19K484j453r04Q80j418j13n83J275L71k4p35L15m12K04k73R9k2J85
4121a55R31n08n32M34J85l52j14r6M6J15jj167J551m13N7J19R21j449j71N62J00
4142F3K67n97Q50j242M12Lr69P68K39k65P52r48J696n50M63K3l49j445Q48m3M44
4163D20l23j074J326q59M32j0J59R01m56n78J49O62l88o59n09R58m85J278l60
4182E84j25m13j371K231p94N16m36J11p61P96M91k293P23l0J289k60Rj502R42
4201b93J00K54L41j415J337O29q81L57q31R72j02r10P15m54M83l58l80k21q10
4220a467K159k83n00m54O33O5m18J42L68r4L9k37l78P00L08j105J459J34j435
$$ y = [-742, -352, -72, -728, -39, 353, -726, 811, 286, -555, -1147, 231, 59, 634, -1017, -226, -285, 1526, -156, 88, -31, 2453, 1000, 96, 976, -442, -555, -1138, 137, 508, 484, -251, 64, -348, -144, -417, -318, -340, -155, 776, 268, -264, 170, 355, 3, -111, -207, -161, -46, -47, -1214, 337, -76, -19, 100, 1021, -428, -599, -37, 63, 330, -267, 583, -659, -247, -244, -1213, -445, -206, -471, 281, -667, 1029, 479, 942, 965, 616, -829, 19, -24, 420, 97, -977, 349, -510, -78, -88, 71, 972, 516, -62, 87, 749, 361, -298, -807, 151, -334, 944, 584, 459, 46, -1325, 906, 112, 628, 192, 303, -458, 338, 829, -1464, -741, -771, 518, 258, 267, -1235, -293, -193, 61, 402, -1013, 324, 953, 72, 429, -402, 570, 468, -442, 273, -181, 302, -56, -436, -657, -1467, 692, 409, -91, -545, 88, 153, -265, -123, 245, 151, 190, -47, -425, 275, 583, -522, 937, 1071, -364]
4239c64q3O67j06o05l5O42j07j320J507K22l4r78J144r29j50J233j208o3R48j84
4259A97P48j502l3M99L96j24J66J01k10r90L21M09m39J219m59M3m99K46l71K75
4279gM86o96P19j582J399o09J074q02q81K055j520Q53l36j006O47KL16O8l00o56
4299g76J391k92n23m41O45k89J374q09J58K20k07N1q00l37J450k87j359J849j010
4318HK00m52J67J10N47j303R17j243J805m83j237Q8J28J497j069l34N17o92P88
4337d1l52K22J235j211p95J577p1k27Q11p4j000p03J56J051m75j211J480q38Q52
4356C86j131J727r76j9o10M6Q55K30o84Q58l23K41J85j350N20M97j289J750m41
4375D72j143J000l10J243j832K39N07o72M11p05J965j573J60j18j36J18J047o23
$$ y = [-364, -447, 220, 114, -491, -526, 116, 9, -1311, 196, 418, 384, -594, 550, -379, -529, 704, -504, -567, 381, 197, 945, -557, -590, -91, 305, 181, 347, 448, 238, -752, -431, -22, -461, 758, 299, 342, -157, 89, -282, -7, 479, -217, 502, -1080, 319, -290, 784, -18, -899, 1156, -364, 489, 153, -853, -206, -204, 112, 180, -120, -776, 615, 323, -200, -641, 4, -285, 1089, 280, 438, 658, 451, 502, -298, -635, 815, 528, -831, 1018, 8, 208, -244, -77, 33, 580, -723, 194, -1049, 756, 273, -964, -876, -748, 749, -320, -654, -137, -829, -41, -393, -171, 1064, -147, -942, 635, 564, 337, 1148, 1074, 74, -629, -473, 578, 103, -1108, 372, -466, 386, -745, 982, 6, -13, -623, -577, 278, 508, -176, 682, 359, 600, 785, -565, -45, 452, -837, 913, 472, -671, 329, 19, 1262, -570, -331, 176, -496, -85, -790, 1175, -398, -238, -356, -492, -374, 673, 50]
4393E0n4J00N58j393J85J382j019o9j149K081j03p5j648M03R14m91M78n68K00
4412b18L77j267J461r28O61j180J322j92O70O00j608m36J351q41J19M84J34l69
4430A40K09j02L65J79j002n41L24O52o7o11O26J87j15m99K97M8r24J042r75J097
4450C30N0j159L32j34R00l3l84J657j815N24Q01j287N90o51q6Q51j71p08R9P62
4470D68j481P96N23j584J455K85N79j392P26j099O06K60l44J7k83J21l36m75M37
4489g21J21J56j80N77j384O29J933j345J06k47J617j381r3k36O08l23Q02j1J64
4508G92k62q23M66p86k08M36J157j271Q12o0m5m78K28M74N05j062O54L54j842
4527i59P30P69o53J754j871j22M58q73k37K06O92N42j144Q30L06r9q01J475j032
$$ y = [50, -4, 96, 654, -739, -554, 828, -191, -260, -1409, 672, 569, 494, -1154, -751, 163, -328, 150, -418, -218, 159, -1108, 353, -575, 86, -1094, 228, 36, 706, 1306, -302, -738, 613, -228, -109, 375, 509, 140, 349, 247, 612, 791, -211, -752, -428, 224, 157, -454, 172, 359, 244, -255, 42, 90, -834, 208, -767, 330, 380, -779, -447, -581, 319, 286, -98, 1559, -256, 268, 1069, -218, 372, -279, -365, 486, 315, -393, -294, 468, -1013, -217, 306, -1278, 177, 462, 1041, -351, 375, -724, -118, 142, -202, -185, -468, -347, -683, -1158, -721, -600, -444, -624, -47, -1431, -802, 1131, -214, -108, -355, 1262, -119, -212, -448, 160, -163, 639, 628, 792, 530, -293, 173, -613, -821, -385, 772, -499, 313, 253, 208, -270, -42, 432, 937, -125, 529, 883, -959, -229, 540, -113, 1641, -230, -352, 106, -767, -1004, -798, -106, 436, -708, 122, 428, 329, -472, 1003, -29]
4546b9P64R1j155o2N21r36Q08n43Q48M5l87M63K22l44J44Q04j323r72J341j8n82
4567c00j05R71j551J187n56J120k33k181J136k96Q95j8k7P89k35j69n47M94K67
4586F41j21L40j523R96l43j176J598r06L19L06M12j272Q7K266j490n90M69j062
4604a049J092Q0L41m77n03Q58J03j38q92O98r32J174J002q76q82N50M03K18j008
4623b38J086Q5j261M96q38l13O28j0L01o46Q76K94k36P5o51L10M62L65j584P55
4643d4o2J69L43j93j20k22K49P97o75M61j49j240j50Q15K06j639K207r89J016
4662G80j93k29m40n52N39l18P36J07j059R84q20J401j490J88J24k47Q21o12N61
4681B81j198Q93R94j478P15n76l49N92k91K59M9L30k89L32j46k32L71m47J48P41
$$ y = [-29, 735, 826, -329, -391, 130, -806, 2, -541, 307, 352, -35, 428, 650, 306, 450, 1254, -69, -1041, 300, 282, -300, -405, 566, -985, 202, -354, 766, 533, -1648, -512, -808, 87, 69, 42, 831, 596, 427, -120, 374, 641, 520, 860, -663, 333, -10, -1186, 412, -494, -175, 131, 543, -729, -642, 1624, 134, -456, 13, -1049, 43, 123, 464, -13, -516, 342, 445, 307, -585, 113, -819, 355, 1357, 481, -401, 149, 552, 770, -238, 848, 933, -328, 168, -670, -983, -355, -365, -64, -710, 166, 460, 224, 299, -352, -42, 420, 785, -799, -44, -106, 63, 406, 213, 93, -129, 120, 917, 242, 703, 554, -686, -836, -21, 185, -1454, 753, -236, 780, 587, 358, -82, -634, -95, -413, 323, 430, -629, 355, -465, 936, -554, -366, -242, -489, 332, -280, 281, -917, -24, 970, -508, 207, -369, -718, -126, -417, -158, -109, 221, -68, 264, 118, -114, 257, -190, -42, 699]
4701F99l36K5m79l91P54m14J761k562J265j030n59J779l68J352p29m17l34Q11
4719H27p43L31j224J037m80N57j53OM99q98n10o3P69n76Q55k27M6J177k024P52
4739d2n81J928j935J005R9o22J21l68L99J57p15L52N0q79j020J790J197r80J110
4758A066o25j349J72P44N80l8L33n18j625J981p20j9P57l77k10j64j022k18O68
4777e84N63K75M93n70m79J45N37o09J40l13L88l19L79K11k24L92q70o07R73J76
4797I7l12L24Q01m81l45j08m29P02m43Q0J077q15l70k85J081j516O3J112o98J45
4817c20L7n00K298r39Q8k99O8p07K65n74L87J03l95k4l98J305r07Q92n1K32p29
4838a68L62m63P7J095l27j643J353l35R4R52j119O30l38k86o67P10k14O47l3o2
$$ y = [699, 363, 388, -91, -482, 272, -142, 1619, -943, 322, -708, -1267, 512, 144, 1496, 767, 350, 16, 827, 84, 415, -809, 228, -252, 305, 152, 158, 657, -241, -751, -814, -45, -621, 234, 7, 53, 1230, -794, -42, -623, 1305, -630, 375, 474, -148, -27, -395, 4, 161, -554, -202, -152, -1031, -2051, -261, 936, -44, 1066, 441, -908, -736, 8, 588, 550, 883, 365, -1260, 721, 1, -18, 739, 362, 152, -12, -1034, -1252, -584, -21, 254, 747, 177, -302, -157, 380, -229, -89, -402, -14, -333, 46, 257, 33, 425, -445, -1052, -79, 97, -215, 109, 910, 429, 84, -24, -453, 249, -194, -114, 963, 148, -222, -507, 574, -942, -879, 233, -465, -320, -283, -783, 1515, 576, 664, 365, 433, -274, -9, -583, -196, -93, -488, -512, -910, 395, -512, 380, 329, 561, -168, 194, -269, -192, 903, 576, -1067, 286, -49, 45, 997, -122, 508, 170, -116, -783, -73, -287, 360, 327, 265]
$$ [...]
8191C37
##END NTUPLES=NMR FID
##END=
