##TITLE=1H_SA_21.213
 D2O, 8 sc, 
 7.7.2020
##JCAMPDX= 6.0         $$ Bruker NMR JCAMP-DX V2.0
##DATA TYPE= NMR FID
##DATA CLASS= NTUPLES
##ORIGIN= UXNMR, Bruker Analytische Messtechnik GmbH
##OWNER= root
$$ XWIN-NMR		Version 3.5
$$ Tue Jul  7 13:03:38 2020 Russian Standard Time (UT+4h)  she@DPX200
##.OBSERVE FREQUENCY= 200.1315
##.OBSERVE NUCLEUS= ^1H
##.DELAY= (6, 6)
##.ACQUISITION MODE= SIMULTANEOUS
##.ACQUISITION SCHEME= undefined
##.AVERAGES= 8
##.DIGITISER RES= 18
##SPECTROMETER/DATA SYSTEM= spect
##.PULSE SEQUENCE= zg30
##.SOLVENT NAME= D2O
##.SHIFT REFERENCE= (INTERNAL, D2O, 0, 15.7039)
##AUDIT TRAIL= $$ (NUMBER, WHEN, WHO, WHERE, WHAT)
$$ ##TITLE= Audit trail, XWIN-NMR		Version 3.5
$$ ##JCAMPDX= 5.01
$$ ##ORIGIN= Bruker BioSpin GmbH
$$ ##OWNER= she
$$ F:/spectra/data/she/nmr/H-F/1/audita.txt
$$ ##AUDIT TRAIL=  $$ (NUMBER, WHEN, WHO, WHERE, WHAT)
(   1,<2020-07-07 13:01:42.71 +0400>,<she>,<DPX200>,
      <created by zg, POWCHK disabled, PULCHK disabled
       configuration hash MD5:
       00 E9 B6 7A A2 85 ED C7 34 08 36 98 17 FE 4E 26
       data hash MD5: 16K
       2F 74 39 B0 52 B2 68 4C 4F 9C 8F 19 03 30 72 81>)
$$ ##END=
$$ 
$$ hash MD5
$$ 01 EF 4F E1 7F D3 37 16 A2 03 1E FE 91 76 78 D3
##$RELAX= 
##$RELAX= 
##$RELAX= 
##$RELAX= 
##$RELAX= 
##$RELAX= 
$$ Bruker specific parameters
$$ --------------------------
##$DU= <F:/spectra>
##$EXPNO= 1
##$NAME= <H-F>
##$PROCNO= 1
##$TYPE= <nmr>
##$USER= <she>
##$AMP= (0..31)
100 100 100 100 100 100 100 100 100 100 100 100 100 100 100 100 100 100 
100 100 100 100 100 100 100 100 100 100 100 100 100 100 
##$AQSEQ= 0
##$AQ_mod= 1
##$AUNM= <au_zg>
##$AUTOPOS= <>
##$BF1= 200.13
##$BF2= 200.13
##$BF3= 200.13
##$BF4= 200.13
##$BF5= 200.13
##$BF6= 200.13
##$BF7= 200.13
##$BF8= 200.13
##$BYTORDA= 1
##$CFDGTYP= 0
##$CFRGTYP= 5
##$CHEMSTR= <none>
##$CNST= (0..31)
1 1 145 1 1 1 1 1 1 1 1 1 1 1 1 1 1 1 1 1 1 1 1 1 1 1 1 1 1 1 1 1 
##$CPDPRG= <>
##$CPDPRG1= <>
##$CPDPRG2= <>
##$CPDPRG3= <>
##$CPDPRG4= <mlev>
##$CPDPRG5= <mlev>
##$CPDPRG6= <mlev>
##$CPDPRG7= <mlev>
##$CPDPRG8= <mlev>
##$CPDPRGB= <>
##$CPDPRGT= <>
##$D= (0..31)
0 1.2 0 0 0 0 0 0 0 0.06 0 0.03 0 0 0 0 0.0002 0 0 0 0 0 0 0 0 0 0 0 0 
0 0 0 
##$DATE= 1594112501
##$DBL= (0..7)
120 120 120 120 120 120 120 120 
##$DBP= (0..7)
150 150 150 150 150 150 150 150 
##$DBP07= 0
##$DBPNAM0= <>
##$DBPNAM1= <>
##$DBPNAM2= <>
##$DBPNAM3= <>
##$DBPNAM4= <>
##$DBPNAM5= <>
##$DBPNAM6= <>
##$DBPNAM7= <>
##$DBPOAL= (0..7)
0.5 0.5 0.5 0.5 0.5 0.5 0.5 0.5 
##$DBPOFFS= (0..7)
0 0 0 0 0 0 0 0 
##$DE= 6
##$DECBNUC= <off>
##$DECIM= 24
##$DECNUC= <off>
##$DECSTAT= 4
##$DIGMOD= 1
##$DIGTYP= 9
##$DL= (0..7)
0 120 120 120 120 120 120 120 
##$DP= (0..7)
150 150 150 150 150 150 150 150 
##$DP07= 0
##$DPNAME0= <>
##$DPNAME1= <>
##$DPNAME2= <>
##$DPNAME3= <>
##$DPNAME4= <>
##$DPNAME5= <>
##$DPNAME6= <>
##$DPNAME7= <>
##$DPOAL= (0..7)
0.5 0.5 0.5 0.5 0.5 0.5 0.5 0.5 
##$DPOFFS= (0..7)
0 0 0 0 0 0 0 0 
##$DQDMODE= 0
##$DR= 18
##$DS= 0
##$DSLIST= <SSSSSSSSSSSSSSS>
##$DSPFIRM= 0
$$ [...]
##$SUBNAM2= <"">
##$SUBNAM3= <"">
##$SUBNAM4= <"">
##$SUBNAM5= <"">
##$SUBNAM6= <"">
##$SUBNAM7= <"">
##$SUBNAM8= <"">
##$SUBNAM9= <"">
##$SW= 24.9337058887773
##$SWIBOX= (0..15)
0 0 2 0 0 0 0 0 0 0 0 0 0 0 0 0 
##$SW_h= 4990.01996007984
##$TD= 16384
##$TD0= 1
##$TE= 0
##$TE2= 300
##$TE3= 300
##$TEG= 300
##$TL= (0..7)
0 120 120 120 120 120 120 120 
##$TP= (0..7)
150 150 150 150 150 150 150 150 
##$TP07= 0
##$TPNAME0= <>
##$TPNAME1= <>
##$TPNAME2= <>
##$TPNAME3= <>
##$TPNAME4= <>
##$TPNAME5= <>
##$TPNAME6= <>
##$TPNAME7= <>
##$TPOAL= (0..7)
0.5 0.5 0.5 0.5 0.5 0.5 0.5 0.5 
##$TPOFFS= (0..7)
0 0 0 0 0 0 0 0 
##$TUNHIN= 0
##$TUNHOUT= 0
##$TUNXOUT= 0
##$USERA1= <user>
##$USERA2= <user>
##$USERA3= <user>
##$USERA4= <user>
##$USERA5= <user>
##$V9= 5
##$VALIST= <valist>
##$VCLIST= <CCCCCCCCCCCCCCC>
##$VD= 0
##$VDLIST= <DDDDDDDDDDDDDDD>
##$VPLIST= <PPPPPPPPPPPPPPP>
##$VTLIST= <TTTTTTTTTTTTTTT>
##$WBST= 1024
##$WBSW= 4
##$XGAIN= (0..3)
0 0 0 0 
##$XL= 0
##$YL= 0
##$YMAX_a= 438518
##$YMIN_a= -232594
##$ZGOPTNS= <>
##$ZL1= 120
##$ZL2= 120
##$ZL3= 120
##$ZL4= 120
##$ABSF1= 10
##$ABSF2= 0
##$ABSG= 5
##$ABSL= 3
##$ALPHA= 0
##$AQORDER= 0
##$ASSFAC= 0
##$ASSFACI= 0
##$ASSFACX= 0
##$ASSWID= 0
##$AUNMP= <proc_1d>
##$AZFE= 0.1
##$AZFW= 0.1
##$BCFW= 1
##$BC_mod= 2
##$BYTORDP= 1
##$COROFFS= 0
##$CY= 11.3945322036743
##$DATMOD= 1
##$DC= 2
##$DFILT= <>
##$DTYPP= 0
##$F1P= 16.9975609425685
##$F2P= -3.02152046262296
##$FCOR= 0.5
##$FTSIZE= 0
##$FT_mod= 4
##$GAMMA= 1
##$GB= 0.15
##$INTBC= 1
##$INTSCL= 1
##$ISEN= 128
##$LB= 0.24
##$LEV0= 0
##$LPBIN= 0
##$MAXI= 10000
##$MC2= 0
##$MEAN= 0
##$ME_mod= 0
##$MI= 1.114404
##$NCOEF= 0
##$NC_proc= 0
##$NLEV= 6
##$NOISF1= 3.799351
##$NOISF2= 2.8
##$NSP= 1
##$NTH_PI= 0
##$NZP= 0
##$OFFSET= 15.70392
##$PC= 1
##$PHC0= -9794.223
##$PHC1= 13.60086
##$PH_mod= 1
##$PKNL= yes
##$PPARMOD= 0
##$PSCAL= 0
##$PSIGN= 0
##$REVERSE= no
##$SF= 200.130013532006
##$SI= 16384
##$SIGF1= 3
##$SIGF2= 2
##$SINO= 400
##$SIOLD= 16384
##$SREGLST= <1H.CDCl3>
##$SSB= 0
##$STSI= 0
##$STSR= 0
##$SW_p= 3612.71676300578
##$SYMM= 0
##$S_DEV= 0
##$TDeff= 0
##$TDoff= 0
##$TI= <>
##$TILT= no
##$TM1= 0
##$TM2= 0
##$TOPLEV= 0
##$USERP1= <user>
##$USERP2= <user>
##$USERP3= <user>
##$USERP4= <user>
##$USERP5= <user>
##$WDW= 1
##$XDIM= 8192
##$YMAX_p= 0
##$YMIN_p= 0
$$ End of Bruker specific parameters
$$ ---------------------------------
##NTUPLES= NMR FID
##VAR_NAME=  TIME,          FID/REAL,        FID/IMAG
##SYMBOL=    X,             R,               I
##VAR_TYPE=  INDEPENDENT,   DEPENDENT,       DEPENDENT
##VAR_FORM=  AFFN,          ASDF,            ASDF
##VAR_DIM=   8192,          8192,            8192
##UNITS=     SECONDS,       ARBITRARY UNITS, ARBITRARY UNITS
##FACTOR=    0.0002004,     1,               1
##FIRST=     0,             0,               0
##LAST=      1.6414764,     0,               0
##MIN=       0,             -232594,         0
##MAX=       1.6414764,     438518,          0
$$ Real data points
##PAGE= N=1
##DATA TABLE= (X++(R..R)), XYDATA
0@%%%%%%%Oj4J6j6J7k5L2m0N1o0P4q9J04j21J41j64J91k22K54k91L34l78M26m84
$$ 0 0 0 0 0 0 0 0 6 -8 8 -8 9 -16 16 -24 27 -33 41 -48 56 -65 76 -88 103 -119 135 -156 178 -200 226 -258
31b58N47o13O86p66Q55r52J058j175J304j447J601j773J965k173K408k674K973
$$ -258 289 -324 362 -404 451 -501 557 -618 686 -761 840 -933 1032 -1141 1267 -1407 1566
48A566l314L708m167M710n365O175p205Q568j0474J3343j8224K8756r4309R2026
$$ 1566 -1748 1960 -2207 2503 -2862 3313 -3892 4676 -5798 7545 -10679 18077 -76232 15794
62A5794Q1240j80752j8429N1430n6683j25194K9496Q0183L5773N0856R7220k6888
$$ 15794 97034 -83718 -102147 -50717 -107400 -232594 -203098 -122915 -87142 -36286 60934 34046
74C4046j37106q2317J3026O475M3089J06519N2816m4087Q947M8106q8436j63097
$$ 34046 -103060 -185377 -172351 -165876 -122787 -16268 36548 -7539 1408 49514 -38922 -202019
86b02019K8229J82312P4339l8082L2110L7293j04599j19477L2119N6687l8853
$$ -202019 -173790 8522 82861 44779 76889 114182 9583 -109894 -77775 -21088 -59941
97e9941J6608J54255Q4058j06996j27540j8983J2091J305M5362O3969K0766J0985
$$ -59941 -43333 110922 194980 87984 -39556 -58539 -46448 -45143 219 64188 84954 95939
109I5939P583q0810j38208l7934O1790K2550n59Q0560O0763j02403j35560J6454
$$ 95939 103522 22712 -115496 -153430 -91640 -69090 -69649 10911 71674 -30729 -166289 -149835
121a49835O4444m5269l1492J29086J46969j0246q7868l8378k6416m1686K2809
$$ -149835 -85391 -130660 -162152 -33066 113903 103657 15789 -22589 -49005 -90691 -67882
132f7882Q3077L7467o768K1954M909q5842j01921j7879L4809M2095P7224P7027
$$ -67882 15195 52662 45894 67848 72757 -13085 -115006 -132885 -98076 -55981 21243 98270
144I8270k0144p9377j5848J9010m5031m1047P7558J14116J4899l8592j3192n3373
$$ 98270 78126 -1251 -17099 1911 -43120 -84167 -6609 107507 122406 83814 70622 17249
156A7249j17905m5751P7975N8822k6960k15O0698j886r9923q2239p76M3303P0223
$$ 17249 -100656 -146407 -68432 -9610 -36570 -36785 23913 22027 -77896 -160135 -160911 -117608 -47385
169d7385Q1168K5257l6146j8356L060n4267p5545K1351R5814M5823m463J3189
$$ -47385 33783 59040 22894 4538 7598 -46669 -122214 -100863 -5049 40774 36311 49500
181D9500j5205r4971p3715L5738N8108P657K7523Q3207L2856n8890n9750j9565
$$ 49500 34295 -60676 -134391 -98653 -40545 -32888 -5365 77842 110698 51808 -7942 -27507
193b7507j9967M672P6435P4929j3554m6608j0779k9610q4738n1932L3506N4944
$$ -27507 -47474 -42802 33633 108562 95008 48400 37621 8011 -76727 -128659 -95153 -40209
205d0209L7307L8284N852o5236o6673L618J9231j2480K8658R6540N4098m4795
$$ -40209 -2902 35382 41234 -24002 -90675 -87057 -67826 -80306 -51648 44892 98990 54195
217E4195n4832j8689m1089n2855J9652P7836L9323r263n748j6245n3875m3159
$$ 54195 -637 -19326 -60415 -113270 -93618 -15782 23541 14278 8530 -7715 -61590 -104749
229a04749P670K9502L9622P4295O7517j4401o4797k8509K714j6582l817N2791
$$ -104749 -97079 -67577 -27955 46340 113857 99456 34659 6150 8864 -7718 -11535 41256
241D1256O2515Q615k5418l3187n7498o3410r012M3293L8449K5742L3729Q121m8180
$$ 41256 103771 112386 86968 53781 -3717 -67127 -76139 -32846 5603 31345 65074 73195 25015
254B5015n6149j1526R519O708L5578O7287L4813l2660n7369m5331l3328j2478
$$ 25015 -31134 -42660 -33141 -26433 9145 76432 111245 78585 21216 -24115 -57443 -69921
266f9921K0698L3588K3531K2446J0307l8435p3995l6490K8125M4875L0814L6958
$$ -69921 -49223 -15635 7896 30342 40649 2214 -71781 -108271 -80146 -35271 -4457 32501
278C2501L8786L44m1389m5082k7995p950K3055N0685M1834M823k0321l3999m8235
$$ 32501 71287 71631 30242 -14840 -42835 -50785 -27730 22955 64789 69612 49291 15292 -32943
291c2943l8704L398L8002L7349L1176K9986M878m2517n9474k5511J5065L1840
$$ -32943 -71647 -68249 -30247 7102 38278 68264 73142 30625 -28849 -54360 -39295 -7455
303g455L3278K9989J2554j3445l5646n0209m6117p664M1733N2635K4975J220m726
$$ -7455 25823 55812 68366 54921 19275 -30934 -77051 -84715 -42982 9653 34628 35848 31122
316C1122k0517m3414l7364M939M1906M9508L5059R079j8199l6416l9027l1334
$$ 31122 10605 -32809 -70173 -65234 -23328 26180 61239 70318 52119 15703 -23324 -54658
328e4658r816K5657M9592L6669K370k0375k9228l5120k8697K188L9111N0431L6055
$$ -54658 -64474 -38817 10775 47444 49814 29439 211 -34909 -63606 -61418 -22307 28124 64179
341F4179J1254j3346l3506m1536k8864j936K7797M3855L1594j679k7737l4177
$$ 64179 75433 62087 28581 -12955 -41819 -43755 -15958 27897 59491 57812 30075 -4102
353d102l3173k9577o840L2739N6258L9719L365k2555k9322k6571j8540j765K3957
$$ -4102 -37275 -66852 -73692 -40953 15305 55024 58389 35834 6512 -20059 -38599 -40364 -16407
366a6407M5409L9441M393l4090m6887l3999j7106j922J9039M0930M0414J1196
$$ -16407 29002 68443 72836 38746 -8141 -42140 -59246 -61168 -42129 -1199 39215 50411
378E0411k4225l8875k9552r876J0036K9258M2779L7919R865k5204m4835l8526
$$ 50411 26186 -12689 -42241 -52117 -42081 -12823 29956 67875 77740 52536 7701 -30825
390c0825j6475L921K0961L3852L0534M717k7399m3737l3660r409J2914K9366M1146
$$ -30825 -47300 -43379 -22418 11434 41968 46685 19286 -24451 -58111 -67520 -54606 -25240 15906
403A5906L8187J3486k2292m2416l3484q589J1515K2005K9107K8701P604k8169
$$ 15906 54093 67579 45287 2871 -30613 -39202 -27687 -5682 23425 52126 59730 31561
415C1561n0754m2086j0747J6689K8945L0835K8133J4185j4320l9306l9238q908
$$ 31561 -19193 -61279 -72026 -55337 -26392 4443 32576 46761 32441 -6865 -46103 -55011
427e5011K4281L6307L0095K0304N800j9441m3429m4635j8198J4733L2472L1016
$$ -55011 -30730 5577 35672 55976 61776 42335 -1094 -45729 -63927 -49194 -16722 14294
439A4294J8597J494j7296l3750l5216j2017K1437M1806L7068K0232L538j5592
$$ 14294 32891 34385 17089 -16661 -51877 -63894 -42457 -651 36417 56649 60187 44595
451D4595l6673l9956j5807J7389L3751K8866J4665l030k1814l6051l5452j5728
$$ 44595 7922 -32034 -47841 -30452 3299 32165 46830 43800 21986 -14065 -49517 -65245
463f5245J8437M3031M0122J6819l020j3292k5322l5285j9103J8098M1471L3765
$$ -65245 -46808 -3777 36345 53164 50144 36852 11530 -23755 -42858 -24760 16711 50476
475E0476R385j1225k6013l3988l1754j7249P671L4213M4382K2836j1602k7528
$$ 50476 59861 48636 22623 -11365 -43119 -60368 -52697 -18484 25898 48734 37132 9604
487I604k2782j9169j1466J3744M1005M0614J5234p783k4459l5971l4089j0921
$$ 9604 -13178 -32347 -43813 -30069 10936 51550 66784 59001 34542 -1429 -35518 -46439
499d6439J4463K9185L1483J9081j1238l3942k8118j3586q770N766L8422N3240
$$ -46439 -31976 -2791 28692 47773 36535 2593 -25525 -39111 -47881 -42115 -3693 49547
511D9547K2350j8658l0012k5089k0590r537J2703K6415K5797J9625l259l8410
$$ 49547 71897 53239 23227 -1862 -22452 -31989 -19286 7129 32926 52551 49292 10882
523A0882m9276k1365O997J3488K2845L8711K5936j2708l0357k0886j6022j2235
$$ 10882 -38394 -59759 -52762 -39274 -16429 22282 48218 35510 5153 -15733 -31755 -43990
535d3990J4805M2525L4849P361j1302k8335m2426k6381Q864J9572J1779K3719
$$ -43990 -29185 13340 48189 55550 44248 15913 -26513 -52894 -44030 -24458 -12679 11040
547A1040L4697K299m2415m1867q748J0350J8928L3267L1192P165q890j5288l2898
$$ 11040 45737 48036 5621 -36246 -44994 -34644 -15716 17551 48743 55908 47018 31730 -1168
560a168m1964o526L4358L0343R922J0930K164l5409m8596j0472K0026J3213J5625
$$ -1168 -43132 -49658 -15300 15043 24965 35895 38059 2650 -45946 -56418 -36392 -23179 -7554
573g554L7796L0324j1886l4921k9949k0561j852K9790L7158Q325p635J758j3184
$$ -7554 30242 60566 48680 13759 -16190 -36751 -38603 -8813 28345 36670 29035 30793 17609
586A7609m6651l8007R632L2820K5793K6414K1230j3995l7107j6356L045m464N624
$$ 17609 -29042 -67049 -57417 -24597 1196 27610 48840 34845 -2262 -18618 -15573 -20037 -14413
599a4413M1881M2308j133k4816j8896k8883l9306m163M0244L1979k259l205L913
$$ -14413 27468 69776 68643 43827 24931 -3952 -43258 -47421 -7177 24802 22543 19338 23251
612B3251j8572l8203k2641L625K2673M2646M0231l709l7170j8045P70k1966k7974
$$ 23251 4679 -33524 -56165 -52540 -29867 12779 53010 49301 12131 -5914 -5144 -27110 -55084
625e5084K1851N1325J7556j6698j0179j6949m5514k9442K3488L6756J1674J0791
$$ -55084 -33233 18092 35648 18950 8771 -8178 -53692 -83134 -59646 -22890 -11216 -425
637d25K2590j561l4919k7224m773J051J7368M6813L2946j5138k9279j0627j4388
$$ -425 22165 20604 -14315 -41539 -46312 -45261 -27893 18920 51866 36728 7449 -3178 -17566
650a7566k8278k086L0216K4393J3187J9902m424n3636m4449J8420L1813n711K761
$$ -17566 -45844 -47930 -17714 6679 19866 39768 35344 -18292 -62741 -44321 -12508 -18219 -15458
663a5458M5128K4993l8122m3869q118o273j4134K0954M7800J8453j6475j5330
$$ -15458 29670 54663 16541 -27328 -35446 -41719 -55853 -34899 12901 31354 14879 -451
675d51j5825k6644r695J7025J3090J3043L9472K8172l8693o0798n747K3652q218
$$ -451 -16276 -42920 -52615 -35590 -22500 -9457 30015 58187 19494 -41304 -47051 -23399 -31617
688c1617p711L9798L6655j6155k6166l819k0646l8135J1896N9807L0592j0730
$$ -31617 -39328 470 37125 20970 -5196 -9015 -29661 -67796 -55900 3907 34499 23769
700B3769J884J0398k4478l7233l154J4952R433K3856L3004o892m1894k5963q712
$$ 23769 25653 36051 11573 -25660 -28814 -13862 -4429 19427 52431 45539 3645 -22318 -31030
713c1030k0921m834L9412L1762j1729m330K2511j5908o3337j7749N7176M2768
$$ -31030 -51951 -56785 -17373 14389 2660 -1670 20841 4933 -58404 -76153 -18977 23791
725B3791q723O69K5079p590m3831k5310J379J56J1719L5313J9433j8676k1964
$$ 23791 15068 15737 40816 33226 -10605 -35915 -34536 -34380 -22661 12652 32085 13409 -8555
738h555j3082k3339j6122K6494L8254O926L839K8780K243n1350l7167J9402K6679
$$ -8555 -21637 -44976 -61098 -34604 3650 10576 14415 43195 45438 -5912 -43079 -23677 3002
751C002J020J4617L0639r361m3422j8447K573k1731k0401L3442N2300O026k6346
$$ 3002 4022 18639 49278 39917 -3505 -21952 -19379 -41110 -61511 -28069 24231 30257 3911
764C911j5015j0908j9284l981J9145J5447J3517K6675Q359l6192l9144m287L247
$$ 3911 -11104 -22012 -41296 -45277 -26132 -10685 2832 29507 37866 1674 -37470 -41757 -38510
777c8510q757J8787M6154J0294l5366j5966J3337j5247l6378J1413N6577L3280
$$ -38510 -47267 -28480 17674 27968 -7398 -23364 -10027 -25274 -61652 -50239 6338 39618
789C9618n925o943p876k5528j8565Q688J0552K983K2481L1169q236m0473k3523
$$ 39618 33693 26750 18874 -6654 -25219 -16531 -5979 -2996 19485 50654 42418 1945 -21578
802b1578k835p319N289L5943K8278n322q078M230j8837l8511m027L4526K0461
$$ -21578 -24413 -31732 -26443 9500 37778 32456 24378 28608 9771 -28740 -32767 1759 22220
815B2220L14J3780Q034l4944m3938l162J4287m708L429L4624K4130j6610k6446
$$ 22220 22534 36314 44348 9404 -34534 -37696 -23409 -28117 -24688 9936 34066 17456 -8990
828h990j3551j3181l702K5334L1532O329K918J2698j1130m3478k2935J9969J6690
$$ -8990 -22541 -35722 -39424 -14090 17442 23771 26689 39387 28257 -15221 -38156 -18187 -1497
841a497m96J8231K7794j1167m0538j8275M092l476L133L0697K8884n80p719m268
$$ -1497 -1993 16238 44032 32865 -7673 -25948 -21856 -25332 -22199 8498 37382 36802 29083 24815
855B4815k4315l1384O130L5023J6147k459Q675N663k6157l4602r174M258N482
$$ 24815 500 -30884 -24754 10269 26416 23957 32632 38295 12138 -22464 -31638 -27380 -21898
868b1898K2402L0021K076k2512j2932m816j9203j1191K4998L4416P573m529L096
$$ -21898 504 30525 32601 10089 -2843 -7659 -26862 -38053 -13055 21361 28934 24405 27501
881B7501j2244l5747k0071J4153K0338J1386J4939J2278j0625k2790j3679q678
$$ 27501 15257 -20490 -40561 -26408 -6070 5316 20255 32533 21908 -882 -14561 -23239
893b3239p481J5712L8068J9649j1705j3886m473j6790k5757j053K4059K1412R581
$$ -23239 -30720 -15008 23060 42709 31004 17118 12645 -4145 -29902 -30955 -6896 14516 24097
906B4097M815q249k5767k0667k178L974O897K3477K8525K278k2040j7012q065
$$ 24097 28912 20663 -5104 -25771 -27949 -23975 -17078 6399 34924 37202 15162 -1850 -9915
919i915j3688o351J8733K7998J0237m044q310j8094k4311j0946R797J5102J7161
$$ -9915 -23603 -29954 -11221 16777 27014 22970 14660 -3434 -27745 -38691 -28894 -13792 3369
932C369K1402Q963j5941k4008r228k99j983J0742K8357K1868m998j9224j7939
$$ 3369 24771 33734 17793 -6215 -15443 -15742 -17725 -6983 21374 43242 38244 19020 1081
945A081j6860j1458L948J5944J5367J2944Q619j0813k7998k0349L601J2268R896
$$ 1081 -15779 -27237 -23289 -7345 8022 20966 29585 18772 -9226 -29575 -25974 -13706 -3810
958c810J6917K1822O045j7275k2722j5470p812K593J6640J8793Q519k205j0508
$$ -3810 13107 34929 40974 23699 977 -14493 -22305 -19712 -3072 15721 24240 22035 11527
971A1527k1502k2213n018J2570J5705J4678J7825R517j3451k5348j4871Q23Q795
$$ 11527 -9975 -32188 -37206 -24636 -8931 5747 23572 33089 19638 -5710 -20581 -19758 -10963
984a0963J3816J6891J2020q53j2845k1330k2885j0430J2134K1049J2820O092M156
$$ -10963 2853 19744 31764 30911 18066 -3264 -26149 -36579 -24445 -3396 9424 15516 19672
997A9672o176k0546k0271k030J4432J8888J7319J1385k87j2745j8928j8715r322
$$ 19672 13496 -7050 -27321 -29351 -14919 3969 21288 32673 32386 19641 713 -18002 -27324
1010b7324P579K0689J5906L359m907q971j6551k0133o864J3037K2573J8652Q953
$$ -27324 -19745 944 16850 20209 15302 6331 -10220 -30353 -37217 -24180 -1607 17045 25998
1023B5998n99j1488j6405j4052n356P329J8713J8825O402p727j4161j7332j8121
$$ 25998 25399 13911 -2494 -16546 -21902 -14573 4140 22965 29367 21640 7479 -9853 -27974
1036b7974q115J0654K2011J7563M670m326r253j3570j4204o000R384K2909K1838
$$ -27974 -36089 -25435 -3424 14139 18809 14483 5230 -8340 -22544 -28544 -19160 3749 25587
1049B5587O463j0935j6630j2881j0615p699K468J7666K2146R561q395j8354j5763
$$ 25587 32050 21115 4485 -8396 -19011 -26710 -24242 -6576 15570 25131 16736 -1618 -17381
1062a7381q367K48R053J6538J9099J1900l605j6795j8255j1399j176Q415J6032
$$ -17381 -25748 -25500 -16447 91 19190 31090 27485 10690 -7565 -18964 -20140 -11725 4307
1075D307J6885N984q144j7136j6088j0037k823P976J8218K0664R408p204j8449
$$ 4307 21192 27176 19032 1896 -14192 -24229 -27052 -19076 -858 19806 29214 22010 3561
1088C561j6062o040J819O634J2654J7121J0932o833k1798k0402q560L134R110
$$ 3561 -12501 -18541 -16722 -10088 2566 19687 30619 23786 1988 -18414 -26974 -23840 -14730
1101a4730J2320J4146J0057k162j6281k0448r404O661J4471J4695J1648Q288k816
$$ -14730 -2410 11736 21793 19631 3350 -17098 -26502 -19841 -5370 9325 20973 29261 26445
1114B6445j6300k0774j1194K714J1919J4528J2269N115n969j4925j7426j0231
$$ 26445 10145 -10629 -21823 -19109 -7190 7338 19607 24722 18753 3828 -13598 -23829
1126b3829K946J4909J6394J1924O026l799j5702k0203j0567N307J2617J1896R744
$$ -23829 -20883 -5974 10420 22344 28370 24571 8869 -11334 -21901 -16594 -3977 7919 17663
1139A7663M671n896j6132j9296j1711L007J6541J8330Q894Q81k915r268j7684
$$ 17663 22334 16438 306 -18990 -30701 -27694 -11153 7177 16071 16952 14037 4769 -12915
1152a2915j3720M112J8222J6129P823J290o691j4578j5934j0682K67J3017J9899
$$ -12915 -26635 -22523 -4301 11828 19651 20941 14250 -328 -16262 -26944 -26677 -13660 6239
1165F239J3531j725r473q782j0579j1319M39J7983K0392R583n34p292j4493j6634
$$ 6239 19770 18045 8572 -210 -10789 -22108 -21669 -3686 16706 26289 25755 18463 3970 -12664
1179a2664p881K232R873J4234J2846M39j3349j4965j0267p742m64J5802K2097
$$ -12664 -20545 -18313 -8440 5794 18640 19079 5730 -9235 -19502 -27244 -27708 -11906 10191
1192A0191J0430l856p236q136j3611j1187L196J4432J5836J0679k63j4949j8554
$$ 10191 20621 16765 9529 1393 -12218 -23405 -20209 -5777 10059 20738 20475 5526 -13028
1205a3028p963j099k356N411K0016J9667J82j5709j3907p568l273N794J4084J3017
$$ -13028 -20991 -22090 -24446 -19035 981 20648 20830 5121 -8786 -16354 -19627 -13833 251 13268
1219A3268Q375M350o609j9993j8323k247P597Q301J1399J3751O30j6693j5411
$$ 13268 21643 25993 19384 -609 -18932 -21179 -13582 -5281 6118 19869 20499 3806 -11605
1232a1605m874k490k108J1138K1664J3056k902j2009j5273j3353j904R585R116
$$ -11605 -16479 -18969 -21077 -9939 11725 24781 21879 9870 -5403 -18756 -20660 -11075 -1959
1245a959N208R824Q964j0554k4820j4518L182Q035R459J4988J1171k903j0075
$$ -1959 3249 13073 22037 11483 -13337 -27855 -24673 -16638 -7179 7809 18980 16077 6002
1258F002q031j1065j0416O077K0222J4264R62n00m056j8902j8822N47J3681Q290
$$ 6002 -2029 -13094 -23510 -17433 2789 17053 18015 17515 13459 -5443 -24265 -23718 -10037 -1747
1272a747O199J1867N645j1797j7582j0142l260O758J8595J5689j137o856j804
$$ -1747 4452 16319 21964 10167 -7415 -17557 -20817 -14059 4536 20225 19088 12232 10428
1285A0428q532k2319j0443J4948J7189M129L229O217j0026k2843r942P453P256
$$ 10428 1896 -20423 -30866 -15918 1271 5400 8629 14846 4820 -18023 -27965 -20512 -13256
1298a3256O270J5751J2795m848j1843q401j1454j1379R223K3879J0062o750k788
$$ -13256 -6986 8765 21560 16712 4869 -3532 -14986 -26365 -17142 6737 16799 10049 7261
1311G261k374j4894j5848k9Q995P962J6294J7373o348k3791q572O070l035n948
$$ 7261 4887 -10007 -25855 -25884 -16889 -8927 7367 24740 18392 -5399 -13971 -7901 -10936 -16884
1325a6884J5287K3577K049j2199o934q361j8604p451J5792J7169M241J852N54
$$ -16884 -1597 21980 24029 11830 4896 -3465 -22069 -29520 -13728 3441 7682 9534 10088
1338A0088j0630j3592l442r93j345J5252K8067O858k0739j4071K710m927j3552
$$ 10088 -542 -14134 -17576 -18569 -19914 -4662 23405 30263 9524 -4547 -1837 -6764 -20316
1351b0316N210K0968R972j435M52o854k1979j3983J0944J4999L377O912J4135
$$ -20316 -15106 5862 15834 14399 14851 7997 -13982 -27965 -17021 -2022 1355 8267 22402
1364B2402n58j6325j2933k886k615M258J8264J4761l121q596n516j3681j4619
$$ 22402 21844 5519 -7414 -10300 -12915 -8657 9607 24368 21247 12651 7135 -6546 -21165
1377b1165K966J5802N628K264J3446O941k1224k5297K218J4252K006J989J6103
$$ -21165 -18199 -2397 3231 5495 18941 25882 4658 -20639 -18421 -4169 -2163 -174 15929
1390A5929J1569j0267j6574q943o775l737R865J5462O899Q13l83j0246j9791n879
$$ 15929 27498 17231 657 -8286 -15061 -18798 -8933 6529 13428 14241 13858 3612 -16179 -22058
1404b2058J1567Q977K430J1938J4997o611k1975j0842J160j580L550J7145J2555
$$ -22058 -10491 -1514 916 12854 27851 21240 -735 -11577 -10417 -11997 -8447 8698 21253
1417B1253o984r084j458r304j8397j573K0665J6875J775j53K89j1253j4379k845
$$ 21253 14269 5185 3727 -5577 -23974 -25547 -4882 11993 13768 13615 13904 2651 -11728 -14573
1431a4573M199M220J1556J5838J250j4898j0234m910j1777n178J7755J9917j362
$$ -14573 -10374 -6154 5402 21240 22490 7592 -2642 -7552 -19329 -24507 -6752 13165 11803
1444A1803p345N044o84k0750j5602J1836J9434P010M544N085p269j4854p016j839
$$ 11803 4458 9502 8818 -11932 -27534 -15698 3736 10746 15290 20375 13106 -1748 -8764 -10603
1458a0603n005M757K0601J3015q296j1762l603q696j1682N009J7353R282J614
$$ -10603 -15608 -10851 9750 22765 14469 2707 -896 -9592 -21274 -16265 1088 10370 11984
1471A1984O949k68j9031j5528L686P253O46R888J6889m95j8780j0101J68o785
$$ 11984 18933 18665 -366 -15894 -12208 -4955 -4309 5579 22468 21973 3193 -6908 -6740 -13525
1485a3525o364J3138K0531N644m669m231r481j3291j641J0031O389M127J3637
$$ -13525 -19889 -6751 13780 19424 14755 10524 1043 -12248 -13889 -3858 2531 6658 20295
1498B0295O877j5529j9918k923K847l932M406J8668J1530q233j0308n268q066
$$ 20295 27172 11643 -8275 -11198 -8351 -12283 -7877 10791 22321 14088 3780 -1488 -9554
1511i554p685O907J4992P543L903N568o112j9774j2423N173O455J228Q257J3015
$$ -9554 -17239 -10332 4660 12203 16106 21674 15562 -4212 -16635 -11462 -5007 -3779 4478 17493
1525A7493o11j4910j0938n167m666K798J5336J2890J031j435j060j1567j5406
$$ 17493 16882 1972 -8966 -14133 -18799 -16001 -665 12225 13256 11821 10761 -806 -16212
1538a6212j175J2632P859L203Q170M418j2053j8016o920K047K851Q559J2783N448
$$ -16212 -17387 -4755 3104 6307 14477 18895 6842 -11174 -18094 -16047 -13196 -4637 8146 13594
1552A3594m194n150o755j2207n989J1793J6152N363m87K387m253j5788j2550Q25
$$ 13594 9400 4250 -2505 -14712 -20701 -8908 7244 12607 12120 14507 10254 -5534 -18084 -17259
1566a7259P778P054R029O925l884j0468q077o074m587N895J6417J1947p41l970
$$ -17259 -9481 -2427 6602 13527 9643 -825 -8902 -14976 -19563 -13668 2749 14696 13955 9985
1580I985k529q980j3505j952J0397J1433N524L342j265r985j3116n482j92L884
$$ 9985 7456 -1524 -15029 -16981 -6584 4849 10373 13715 12450 2465 -10651 -16133 -16325 -12441
1594a2441J1757J4299L618q232o627m642p872n508P971J5510Q841k09m226q002
$$ -12441 -684 13615 17233 9001 2374 -2268 -10140 -15648 -7677 7833 16674 16465 12239 4237
1608D237j1603o980M71M561P657J2332P320p696j3143o095j255k345L347J3318
$$ 4237 -7366 -14346 -13875 -9314 -1657 10675 17995 10299 -2844 -8939 -10194 -12539 -9192 4126
1622D126J2905J496o485p463r065q812q0P957Q853P828L836m163j2166r713k066
$$ 4126 17031 18527 12042 4579 -4486 -13298 -13378 -5421 3432 11260 15096 10933 -1233 -10946 -13012
1637a3012J205K334J0543J4118M749r054j0533o942l616l89O118R282O707M039
$$ -13012 -11807 -9473 1070 15188 19937 10883 350 -6592 -10208 -10597 -4479 4803 11510 15549
1651A5549k769j2049j4389m399N837O516N762Q041O480l812j1823r382k957K182
$$ 15549 12780 731 -13658 -18057 -12220 -5704 58 8099 14579 10767 -1056 -10438 -13395 -11213
1665a1213O406J0356P573J782m734r406j1935n930L949Q513O891N087M626k146
$$ -11213 -4807 5549 13122 14904 10170 764 -11171 -17101 -13152 -4639 2252 7339 11965 9819
1679I819j1797j1695l003N571P881Q604P064K504m123q809j0076o890K649R482
$$ 9819 -1978 -13673 -16676 -11105 -3224 5380 12444 14948 10825 2016 -8060 -14950 -12301 -2819
1693b819R640L428L61k875r086j1305n410N126R738Q538O029J994l500q449r748
$$ -2819 6821 10249 10610 7735 -1351 -12656 -18066 -12940 -3202 5336 11365 13359 9859 1410 -8338
1708h338n222K951J0045J0638L971k567m729o183r648p851K279J0734J1180M945
$$ -8338 -13560 -10609 -564 10074 14045 11478 6749 566 -9082 -16933 -14654 -3920 7260 12205
1722A2205r40n191p055o987l925K410R026J0929O933j873o535q222q174n013J316
$$ 12205 11265 6074 -981 -7968 -11893 -9483 -457 10472 17405 15532 8997 775 -7399 -12412 -11096
1737a1096Q972J0571M207k201o115o721p333m733K153R870J1673O774j825p671
$$ -11096 -2124 8447 12654 10453 4338 -2383 -9716 -14449 -12296 -2426 9247 16021 14196 6525
1751F525p684n239l523O28O693J0867P105k996q673q982o274k415K055P708J0118
$$ 6525 -1159 -6398 -9921 -9293 -2600 8267 15372 12376 3703 -5279 -11553 -13968 -11913 -4205 5913
1766E913P186l00p348r387n402j025K743O605R741P436k109r104j0104n805j797
$$ 5913 13099 12799 5451 -3936 -9338 -10363 -7620 -1015 8726 16162 14053 4949 -5155 -10960 -12757
1781a2757J763P024Q406O953j99q144r917n930O26M727O072P538P323J175q533
$$ -12757 -10994 -3970 4436 11389 11190 3046 -6871 -12801 -12175 -7448 -1376 6162 13485 14660 6127
1796F127j1590o512r5L834O471P080M632j59o916j0101p875l54O637Q314O453
$$ 6127 -5463 -11975 -12070 -8236 -1765 5315 9947 9788 2872 -7229 -15104 -15458 -8821 -507 5946
1811E946N227J372o525j0741o947M79N930O043O702M956j454p523j0250p462j023
$$ 5946 11173 12545 6020 -4721 -11668 -11189 -5259 784 7486 12442 10988 3465 -6785 -14247 -15270
1826a5270O364R047N906K507J025l967j0339r189Q07Q649Q464M992K872p50o332
$$ -15270 -8906 141 6047 8554 9579 5612 -4727 -13916 -13109 -4460 4004 8996 11868 11118 4786
1841D786r124p454k642N086J0120P742R10l616m067o520q587j477Q065J0443O365
$$ 4786 -4338 -11792 -14434 -9348 772 8514 9424 5808 1741 -4779 -13366 -14843 -6778 3665 10030
1856A0030K201q02n987r175o389n57M667Q317Q463J610n136o793n495o549l498
$$ 10030 12231 11429 5442 -3733 -10122 -10679 -6012 2305 10768 12378 7242 449 -5046 -11595 -15093
1871a5093N466J2737Q237j37l507m427p796o190j13N750P993P106L443n014r428
$$ -15093 -9627 3110 11347 11210 7703 3276 -4520 -10710 -10823 -5073 2920 10026 13469 8455 -973
1886i73p003l426k090K561J0731J0406K59o492n450m124n408k203O610J0078P254
$$ -973 -7976 -11402 -13492 -10931 -200 10206 10465 3973 -1477 -5601 -11009 -13212 -6602 3476 10730
1901A0730K679l573r600r056j811K176J621N363J0068N073o534j0104n448k599
$$ 10730 13409 9836 236 -8820 -10631 -8455 -6834 -1471 8597 13670 7136 -2968 -8416 -11015
1915a1015m60N872J0607O349K47j969n604r351o419L459O166M597O392M830n045
$$ -11015 -11475 -5603 5004 11353 11600 9631 4027 -5324 -11743 -8284 -2118 2479 8871 13701 8656
1930H656j2813p997J272J468R04P661J0812K115n334o927p623m647L799R249N171
$$ 8656 -4157 -12154 -10882 -9414 -8510 -849 9963 12078 6744 -183 -7806 -12453 -8654 595 5766
1945E766J315L893J260j0519j3736k248O658L848M055Q085M102p091q931l050
$$ 5766 7081 10974 12234 1715 -12021 -14269 -7611 -3763 292 8377 12479 5388 -3543 -6593
1959f593k730r30P574J1384M802j728j545n751j1389n832P042Q243J513K860N112
$$ -6593 -9323 -10253 -2679 8705 13507 11779 10234 4483 -6906 -12738 -5696 2547 4060 6920 12032
1974A2032l490j1626p436o75O20N508J1447O924m797n433n84n632r592J216J2954
$$ 12032 8542 -3084 -10520 -11195 -10575 -5067 6380 13304 8507 3074 2490 -3142 -12734 -11518 1436
1989A436Q308j468L99M3q851j1842j651N853M987O102P361n6p044n361k270o230
$$ 1436 9744 8276 8675 8718 -133 -11975 -13626 -7773 -2786 3316 10677 10621 3577 -1784 -4054 -10284
2005a0284j749J2050J3020O71n885j084k815j0610o167O521P329L456M937L767
$$ -10284 -12033 17 13037 13708 7823 6739 3924 -6686 -12853 -6332 997 4453 9390 13157
2019A3157o968j2198l807K591K0L567J1146P958m868p255k617n052p417J478J1255
$$ 13157 6189 -6009 -9816 -7225 -7205 -3638 7508 15466 10598 3343 726 -4326 -11743 -10265 990
2034I90P239M10m99l856r865o222K180L333M12Q258J2789j11j3594q032K306l75
$$ 990 8229 8639 8140 4284 -5581 -11803 -9623 -6290 -5878 2380 15169 15058 1464 -6568 -4262 -4637
2050d637k894O394J1658L047m678l570n699r387k995P549O378L248N021K699p632
$$ -4637 -7531 -1137 10521 13568 8890 5320 -379 -9766 -12761 -5212 1166 4414 9435 12134 4502
2065D502j0562j492K717m63L432J1776P566o479q689l623m641m997L894R622L454
$$ 4502 -6060 -7552 -4835 -5298 -1866 9910 17476 10997 2308 -1315 -5956 -10953 -7059 2563 6017
2080F017m41K505k183j2706r753N171Q455K108L185Q356J093r433p802j882j286
$$ 6017 5576 8081 5898 -6808 -16561 -11390 -2935 -827 2358 10714 11807 2374 -5428 -7310 -8596
2095h596J909Q921P775j099l082j149o533j1858l68J0773O950j83L437N026o429
$$ -8596 -6687 2234 10009 8910 5828 4679 -1854 -13712 -14080 -3307 3643 3460 6897 11923 5494
2110E494j2184k864M103K228M153R588M053o516o202k974o135n132N859J1343
$$ 5494 -6690 -9554 -5451 -3223 930 10518 14571 8055 1853 -1121 -7256 -12388 -6529 4814
2124D814K583k374J903j865j0706q351M309P508L422M657N751l111q490m164k308
$$ 4814 7397 5023 6926 5061 -5645 -13996 -9687 -2179 1243 5900 11651 8540 50 -4114 -6422
2139f422m298J784J1859Q805m188n953k07l901q753k199Q981Q191L571K894j94
$$ -6422 -10720 -8936 2923 11728 7540 1587 1380 -2521 -11274 -13473 -4492 3699 7270 10164 9970
2154I970p810q312m42K122M22N657J0194K190p990o323k069m845m236N775J1031
$$ 9970 2160 -6152 -6594 -4472 -4050 1607 11801 13991 6001 -322 -2391 -7236 -11472 -5697 5334
2169E334L441j185j174l221q244m611L477M385L667P108N083o240j0533l054J75
$$ 5334 8775 7590 6416 3195 -5049 -9660 -6183 -1798 1869 8977 14060 7820 -2713 -5767 -5592
2184e592l133N1R494R218j762o010m041m195m786J146O473N683M141M577k001
$$ -5592 -8725 -8674 820 10038 8276 2266 -1775 -5970 -10756 -9610 -3137 2546 6687 11264 9263
2199I263r994p660O43L317O57M030Q283K549o348p069l915l490m56O887Q191K947
$$ 9263 -731 -8391 -7748 -4431 -3774 256 8539 11088 4740 -2329 -6244 -9734 -10190 -3303 4888 7835
2215G835p8j11m846r305l618N380N139K553M795M325m845j0124n912L65Q25K756
$$ 7835 7757 7646 2800 -6505 -10123 -4743 396 2949 7744 12069 7224 -2900 -8812 -8447 -7622 -4866
2231d866O822M904N25k313m975q058m446N749Q594K674J213L202L80q285r913
$$ -4866 1956 6860 7385 5072 97 -7961 -12407 -6658 1936 4610 5823 9025 9405 1120 -8793
2246h793j447M287M331M250N183M15n126n219l647l890O44P665P952K295m55p57
$$ -8793 -10240 -5953 -1622 2628 7811 8226 3100 -2119 -5766 -9656 -9012 -1347 6605 8900 8445 7688
2262G688n092p951l386M619O067L717L075J052m278p172n153k151L69O028Q917
$$ 7688 2596 -5355 -8741 -4122 1945 5662 8737 9789 5511 -1661 -6814 -8965 -8596 -2568 6349
2277F349L551l496l017k264m941n701K385Q641O302J658p15l238o390n955j869
$$ 6349 9900 6404 3387 1123 -3818 -9519 -7134 1507 7809 9467 8752 5514 -876 -6831 -8700
2292h700J440M669P253M081k279n637l459k607l778J70P670R234K560k880l500
$$ -8700 -7260 -2591 4662 8743 6464 827 -2632 -5239 -9017 -8847 -1177 8057 10617 7737 4237
2307D237m637n238j636K310M072N473M705k19o304p480l277j79J143M629P532
$$ 4237 -400 -5638 -7274 -4964 -892 4581 9286 9067 2763 -4717 -7994 -8173 -7030 -2401 5131
2322E131M171k174m469m464m070k181K404N906N730L488j087o458o952l678J191
$$ 5131 9302 7128 2659 -1805 -5875 -8056 -5652 254 5984 9472 8385 1927 -5025 -8703 -7512
2337g512R95K658O195O296q90p157o790k211P05K759M507M954L685l9m093p750
$$ -7512 -6517 -3859 2336 8632 7742 585 -6205 -8416 -7711 -4952 -445 4509 8194 8155 4062 -3688
2353c688n604N16M875M093L857K980N9n343o674l421K40L075M571O365L228r84
$$ -3688 -9292 -8776 -3901 192 4049 7029 7088 1745 -4929 -8350 -8110 -5035 -464 5901 9129 8145
2369H145n215o244m366M28M146M973L273K361L43m555p927n521J733M975M799
$$ 8145 2930 -3314 -7680 -7252 -3106 1867 5140 7501 7844 3289 -4638 -10159 -8426 -3451 1348
2384A348L234K672l57m220o190m766k31M408O817L728L46j418k794o286n872j50
$$ 1348 4582 7254 6897 2677 -3513 -8279 -8510 -4102 2715 6443 6789 5371 2577 -3709 -9581 -9731
2400i731N100O273L858J197j197l339n721m153l7M203O660N085M21k563m313m440
$$ -9731 -4631 1642 5500 6697 5500 2161 -3560 -7713 -7750 -3547 3113 8198 8619 6056 1743 -2697
2416b697n045j284M431O654M420J1j917m249m889m172m8M687O716M481J214k825
$$ -2697 -7742 -9026 -4595 2059 6479 6490 4573 324 -4565 -8737 -8785 -4098 2618 7099 8313 5488
2432E488m412m149l634j829L668P285M689p46m129m119l844l624j334L520O712
$$ 5488 1076 -3073 -6707 -8536 -4868 2417 7106 6360 2231 -1888 -5732 -9356 -10690 -7170 -458
2447d58N664J721l987n587l288j237K89K394N727O224J414m219o037m491k206
$$ -458 5206 6927 2940 -2647 -5935 -7172 -6883 -4489 1238 7462 8876 4657 -1380 -5871 -8077
2462h077L35L117N335M418J731k831n549m851k060J706L542N818N560J663m390
$$ -8077 -7742 -4625 710 5128 6859 4028 -1521 -6372 -8432 -6726 -3184 2634 8194 9857 5467
2477E467o211l529j375J24K602N129N265J202m233o270n290j359K633L836L335
$$ 5467 -744 -4273 -5648 -5524 -2922 2207 7472 8674 4441 -1829 -7119 -8478 -5845 -2009 1326
2492A326M074L106k115p374n477r02K833L600L931L730R38k707n474o143k510
$$ 1326 5400 8506 6391 -983 -6460 -7362 -4529 -929 3002 6732 7670 4963 -511 -6654 -9164
2507i164K337N165M864K385J272j726n289n516j665K969M745M066L470J368l290
$$ -9164 -6827 -1662 3202 5587 6859 5133 -156 -5672 -7337 -4368 377 4443 7913 9281 5991
2522E991o107n299k190J992M873M469K152J52j837m484o381k406L450O588M014
$$ 5991 -116 -5415 -7605 -5613 -740 3729 5881 6033 4196 -288 -6669 -9075 -5625 963 4977
2537D977K189N66k330m875n115k142J689M950N207K400k004l220l770m557l876
$$ 4977 7166 7732 5402 527 -4588 -6730 -5041 -91 5116 7516 5512 2292 -1478 -6035 -9911
2552i911J835P053N812J079q29j526m019m785j864K757N143M980L097j181m731
$$ -9911 -8076 -1023 4789 5868 5039 3513 -506 -5291 -7155 -4398 745 5725 8822 7641 2910
2567B910m071l002k475K12N028O741K049k634l329l086m389k419K921N927M583
$$ 2910 -1161 -4163 -6638 -6426 -1398 5343 7392 4758 1429 -1657 -6046 -8465 -5544 383 4966
2582D966K230J28m101n466k660k81j73L704O695M130l797n616k849j937k232P47
$$ 4966 7196 7324 3223 -2243 -4903 -5184 -5357 -1653 5042 9172 5375 -241 -3090 -5027 -7259 -6512
2598f512N337N712K468m61l677o308l544J743K413K365M353N194q01o757m888
$$ -6512 -1175 4537 7005 6544 2867 -3441 -6985 -5242 -2829 -464 3889 9083 8282 1525 -3363
2613c363r33o32N70N215O375J758k376l279l626m390n65L890L948K659L583K02
$$ -3363 -4296 -4928 -4358 857 7232 8990 6614 3335 -291 -4681 -5246 -1356 2592 5251 8834 9036
2629I036n753p658j504K050J015K056N485L820k018m538m384l336q79M599N658
$$ 9036 3283 -4375 -5879 -3829 -2814 -758 4727 8547 6529 1991 -2393 -5729 -6608 -2009 3649
2644C649J639P94R39k426p442n648K316M480K088K387L616r68n520n319j640K1
$$ 3649 5288 6082 7021 4595 -2847 -8495 -6179 -1699 389 2776 6392 5424 -96 -5415 -7055 -7034
2660g034K651N597N032L03j403j296n122n566O02O465M215J65J624J096m942p394
$$ -7034 -4383 1214 6246 6549 5146 3850 -1272 -6838 -6236 229 4444 4609 6233 7329 2387 -5007
2676e007k346J851J940L450N150J736l525l102k409l279k468M985P387K358j561
$$ -5007 -7353 -5502 -3562 -112 5038 6774 3249 147 -2262 -5541 -8009 -3024 4363 6721 5160
2691E160p26r15o597n189J276M435L401L222K052l148n606j914r40k191J089Q088
$$ 5160 4434 3519 -3078 -8267 -6991 -2556 845 4067 6119 2971 -2635 -4549 -5489 -7680 -6591 1497
2707A497O348j821m460n57k757m809o91N731M839J288R64qn422n645n09J360J161
$$ 1497 7845 6024 1564 1007 -1750 -6559 -7250 -1519 3320 4608 5572 5564 142 -5503 -6012 -4652 -3491
2724c491M201O633O67n144l389n33k989k552L852P622K377j417j366l240n756
$$ -3491 710 7343 8010 2866 -523 -1056 -4045 -6597 -2745 4877 7254 5837 4471 1231 -4525
2739d525k633K829K696J304M449M389l770q433j935J808m27N53N849N847j180
$$ -4525 -7158 -4329 -1633 -329 4120 8509 4739 -3694 -5629 -3821 -4248 -3695 2154 8001 6821
2754F821l755k651l726l735J326N269L105O52K685q27p109n289J663K827L11L200
$$ 6821 3066 415 -3311 -7046 -5720 -451 2654 3306 5991 5164 -1945 -7234 -5571 -2744 -2433 767
2770G67O587J609n030m929j380k009l83M344N639Q38q81N2m199p617j955N034
$$ 767 7354 8963 3933 -996 -2376 -4385 -4768 -424 5215 6053 5172 5224 1025 -6592 -8547 -3513
2786c513L421N23L049L729l068o937l118K92O94K952N193K933j805k568j209n706
$$ -3513 -92 431 3480 7209 4141 -2796 -5914 -5622 -4928 -1976 3217 6150 4345 1777 568 -5138
2802e138m529L025O662K701r54J866K20n756o157Q27L515K103L650M415k4m439
$$ -5138 -9667 -6642 20 2721 1767 3633 3853 -1903 -8060 -7233 -3718 -1615 2035 6450 6426 1987
2818A987k828k607k552M33N539N253l29j526k30k550o497k420M416M684K081K722
$$ 1987 -841 -3448 -6000 -5567 -28 5225 4896 3370 3140 590 -5907 -8327 -3911 773 2854 5576
2834E576O78l225n263j379q05n44L318P089K353m270l333j109l137m346J316O525
$$ 5576 6254 3029 -2234 -3613 -4418 -4962 -1644 5445 7798 3528 195 -914 -4051 -8397 -7081 -556
2850e56M281M33o00j530m508l686M2K301K441M988M124k198n146k436p35k360
$$ -556 3725 4158 3558 2028 -2480 -6166 -6124 -3823 -1382 3606 7730 5532 386 -2050 -2785 -5145
2866e145r47N604O264M81k667j993k451m489o62L707L591K583L091O03m854n523
$$ -5145 -6092 -488 5776 6257 3590 1597 -854 -5343 -6005 -2298 1293 3876 6967 7570 2716 -2807
2882b807q24J337o73K002N889L243l005m909k522k564j430J990M403K975J085
$$ -2807 -3631 -2294 -2967 -965 4924 8167 5162 253 -2269 -4833 -6263 -4273 130 3105 4190
2897D190J036l050o686k903K807K744N44L180M678r87o004m061r59m77J250M122
$$ 4190 5226 2176 -4510 -7413 -4606 -1862 -1318 1862 6540 5553 -451 -4512 -5471 -5948 -4698 -576
2913e76M465J037j479k322m255l300N91M198L005J690L056J109m993o299q18J499
$$ -576 3889 4926 3447 1125 -3130 -6430 -5839 -1641 1364 3054 6110 7219 2226 -4073 -4891 -3392
2929c392J362K452L769J900k370k733l532l714p59M487N079J084q8M87j786n471
$$ -3392 -2030 422 4191 6091 3721 988 -2544 -6258 -7017 -2530 2549 3633 3545 4032 2246 -3225
2945c225m250J406L757L214J906J551j626l433l566k313q20K652N144L062m83
$$ -3225 -7475 -6069 -2312 902 2808 4359 2733 -700 -4266 -6579 -7399 -4747 397 3459 2976
2960B976j124j368l702m468R24M888M176J231O28P1l417m171k407N87K197M704
$$ 2976 1852 484 -3218 -7686 -6762 -1874 2302 3533 4161 4232 815 -3356 -5763 -5176 -2979 1725
2976A725L353L44l103k211k236k725j288M171N268K384o37j582k951l254k625
$$ 1725 5078 5422 2319 108 -2128 -4853 -6141 -1970 3298 5682 5045 3463 512 -2742 -5367
2991e367L02K536L529L370O19l057m116j867j306n51J920M920M251l50l274k724
$$ -5367 -5065 -2529 1000 4370 4989 1932 -2184 -4051 -5357 -5908 -3988 932 5183 4833 1559 -1165
3007a165k283j907J07L234L768K786L93j697m714l444m91O18J891M184L995Q73
$$ -1165 -3448 -5355 -5248 -2014 1754 4540 4933 3236 -1478 -4922 -5413 -4795 -2904 1280 5275 6148
3023F148l526l770j580j205K03K658M067L327N59k510m559l516o17J333J696J989
$$ 6148 2622 -1148 -2728 -3933 -3730 -1072 2995 6322 6881 4371 -188 -3704 -4321 -2988 -1292 697
3039F97L363J573k782n404l265M57J086K488L050K946N76k408l507l489j213J554
$$ 697 4060 5633 2851 -2553 -5818 -5361 -4275 -1787 1263 4209 4785 2377 -1130 -4619 -5832 -4278
3055d278L422K799J058Q99j394m403m085n94K106K858K370K977R70k465l556l540
$$ -4278 -856 1943 3001 3900 2506 -1897 -5982 -6576 -4470 -1612 758 3735 4705 2240 -1316 -4856
3071d856q88K439L507K580J405N42j240l767m575j264K984L334K385J348J73j626
$$ -4856 -5744 -3305 202 2782 4187 4729 3489 -278 -4853 -6117 -3133 201 2586 3934 4107 2481
3087B481l411l862j193K015L922L682J099j144j759k676l584j849J675M011L524
$$ 2481 -930 -4792 -5985 -3970 -48 3634 4733 3589 1830 -846 -4430 -6279 -4604 -593 2931
3102B931O10m71j832l282l021p15J262L821L976J628o89k406k397k730j588J537
$$ 2931 3541 3070 1238 -2044 -5065 -5780 -4518 -697 3279 4907 4218 1812 -585 -3315 -4903 -3366
3118c366M023L901Q16j346k533k020l262j658J537M133L791J222j005k904j937
$$ -3366 657 4558 5374 4028 1495 -525 -3787 -5445 -3908 225 4016 5238 4233 1329 -608
3133f08j986j155P14L811M291J599j899l417k203k061j460R53L335L252J669j002
$$ -608 -2594 -3749 -3035 776 5067 6666 4767 1350 -853 -2914 -4374 -3421 -86 3166 4835 3833
3149C833l451l411j730J09J355K824L763K302j127l358l090j328M6R37K870L639
$$ 3833 382 -3029 -4759 -4650 -3295 -471 3292 5594 4467 1109 -1981 -3309 -3263 -2326 544 4183
3165D183J562j413l013l370j530j50J660K460K965K629j264l421m107p59Q29J285
$$ 4183 5745 4332 1319 -2051 -3581 -3731 -2071 389 3354 5983 4719 1298 -2809 -3568 -2739 -1454
3181a454K175L003K419j152l505m029j708N99K589K601J293K027m35k979m581
$$ -1454 721 3724 6143 4991 1486 -2543 -4251 -3652 -1063 1538 2831 4858 4423 1444 -3137
3196c137j880R23K398K191K508J262j037k908l250k234K52K484K975K434Q24o72
$$ -3137 -5017 -4094 -1696 495 3003 4265 3228 320 -2930 -5164 -4912 -2428 547 2981 3805 3133
3212C133k347l804k471J354L057K261J823J607k72l319m033j808P26K731K943
$$ 3133 786 -3018 -5489 -4135 -1078 1183 3006 4613 4341 1022 -3011 -4819 -4093 -1362 1581
3227A581K024j0r14j531l373l291L25L685M136J579n73L9j876l667k181P98K461
$$ 1581 3605 3595 2681 1150 -2223 -5514 -5189 -1504 2632 4211 3638 3677 1801 -1866 -4047 -3249 -788
3244g88L100K595L83k402k531k506k263o31K500M772J806p69j280j771k682j944
$$ -788 2312 4907 5290 2888 357 -2149 -4412 -5043 -2543 2229 4035 3266 1986 215 -2467 -4411
3260d411K11L324L026K211O61j987k690k445j332l33J447M633K785j248k339j874
$$ -4411 -4200 -876 2150 4361 5022 3035 345 -2100 -3432 -3765 -2318 2315 5100 3852 1513 -361
3276c61j713k629k39K785M180K365j09j656k681k707o11O20J098L540L667l4l242
$$ -361 -2074 -4703 -4942 -2157 2023 4388 4279 2623 -58 -2765 -3376 -2756 -1658 1882 5549 5515 2273
3293B273l420j511p17l98J657L914K370J63j567l446k930r82J766K377K013K216
$$ 2273 -1147 -2658 -3375 -3773 -2116 1798 4168 4331 2764 -682 -3612 -4594 -2828 -451 1562 3778
3309C778J818k568m408k013R4L09R20L825K911k94k770l007k264j058J528K742
$$ 3778 5596 3028 -1380 -3393 -3299 -2990 -2070 1755 4666 4372 1602 -1405 -3669 -4727 -3199 -457
3325d57K062J865J117j264m696l179N28K197J048J534K984J016k904l532k471
$$ -457 1605 3470 4587 3323 -1373 -4552 -4024 -1827 -779 755 3739 4755 1851 -1681 -4152
3340d152o90J159K577L354R45k53n26k959l727j179K560L237Q60J630R29j922
$$ -4152 -4842 -3683 -1106 2248 3193 2940 2414 -545 -4272 -5451 -2891 346 1206 2836 3765 1843
3356A843m039k594kQ41K314L447J458q20j815j496l533j489K160M408J973l14
$$ 1843 -2196 -4790 -4792 -3951 -1637 1810 3268 2448 633 -863 -4396 -5885 -3725 683 2656 2342
3372B342L91J02l810l985p0K550K472J786K010l65k497k252j540k006O41M799
$$ 2342 2733 2835 -975 -4960 -5030 -2480 -8 1778 3788 3423 926 -1326 -2866 -4872 -4231 568
3388E68L544R0j794o55j467l460j412K531L173J670J455L27l054l565j050k49
$$ 568 4112 4202 2408 1753 286 -3174 -4586 -2055 1118 2788 4243 4570 1516 -2049 -3099 -3348
3404c348j22K804L958J847k631k422j095j918k140J385M366K899j24p43j651l003
$$ -3348 -3470 -666 3292 5139 2508 86 -1009 -2927 -5067 -3682 684 3583 3459 2716 1065 -1938
3420a938j992l3J207J780L264K845j939l808j611k95p89k69L547M472M97j803
$$ -1938 -3930 -3963 -2756 -976 2288 5133 3194 -614 -2225 -2520 -3309 -3578 -31 4441 4938 3135
3436C135k079k335k222J5K058J899J625K475r7l446m428m06J097K68J773L926
$$ 3135 1056 -1279 -3501 -3486 -1428 471 2096 4571 4474 1028 -3400 -3806 -2709 -2441 -668 3258
3452C258J352j693k569j964k070m77K163K848J441O26P0k178m612j502J895J422
$$ 3258 4610 2917 348 -1616 -3686 -4163 -2000 848 2289 2915 2985 807 -3805 -5307 -3412 -1990
3468a990O63K659L025j200m512k293k38M04J014K779K688M92l94j943l537k703
$$ -1990 -1327 1332 4357 3157 -1355 -3648 -3886 -3482 -2468 311 2999 3491 3097 1154 -2383 -5086
3484e086J054L381K058K5J439O97k763m142j023J217J635K314K713M68j930j430
$$ -5086 -4032 -651 1407 1432 2871 3568 805 -3337 -4360 -3143 -1508 806 3519 3987 2057 627
3500F27j601l173p89L272L697Q38o69P3j476l852k487J797K661J552J710J278
$$ 627 -974 -4147 -4936 -1664 2033 2871 2202 2275 799 -3053 -5540 -3743 -1082 470 2180 3458
3516C458j018k886k148j107j16K018M124J712j317j136k72k827l383M09M184K453
$$ 3458 2440 -446 -2594 -3701 -3817 -1799 2325 4037 2720 1584 1312 -1515 -4898 -4489 -305 2148
3532B148P14M96o37k508k545l17J80R35L455L245k57l062j876r33j820r18K618
$$ 2148 2862 3358 2721 213 -2332 -2649 -2469 -1534 1921 5166 4909 1847 -29 -962 -2782 -3700 -1082
3549a082L515J400o24j182k080k843j358J595R50K124K977Q30k778l173n38l79
$$ -1082 2433 3833 3209 2027 -53 -2896 -4254 -2659 -1709 415 3392 4222 1444 -1729 -2267 -2646
3565b646p66J159L952K790j707k300j198j899j830P66K834K435J427O39j766l331
$$ -2646 -3412 -2253 1699 4489 2782 482 -716 -2615 -4445 -3679 -845 1590 3017 3656 1890 -1441
3581a441j761Q52O65L08K695L387K29l478k249j198j117L74K277K502J034j16
$$ -1441 -3202 -2350 -1685 -1377 1318 4705 4934 1456 -793 -1991 -3108 -2734 -457 2045 3079 2963
3597B963n03k676l624k00K197J782P12J910J565k055l811j687k57Q50J846K328
$$ 2963 2460 -216 -3840 -4040 -1843 -61 651 2561 4126 2071 -1740 -3427 -3684 -2834 -988 1340
3613A340J667l25j971j983k763p23J965K623J138Q85J591j280l461k975R24J923
$$ 1340 3007 2682 711 -1272 -4035 -4758 -2793 -170 968 1853 3444 2164 -1297 -4272 -3348 -1425
3629a425J252J720J869Q5j672k562k188r25J464L084K077L7j5p38k251k980p29
$$ -1425 -173 1547 3416 3501 1829 -733 -2921 -3846 -2382 702 2779 2816 2801 2063 -188 -3168 -3897
3646c897K306K438J376J081M9j747k535j931n36P60K508K409P84r43j637j225
$$ -3897 -1591 847 2223 3304 3353 1606 -929 -2860 -3396 -2636 -128 2281 3065 2122 485 -740
3662g40k424j123J728L333K021L8l46j070j894k797k53J237K647K556Q55j192
$$ -740 -3164 -4287 -2559 774 2795 2833 2487 1417 -477 -3274 -3527 -2290 357 2913 3768 2576
3678B576k138j164j112j417N05L510K993L48j632j325j328j945n32J399J861K789
$$ 2576 438 -726 -1838 -3255 -2750 760 3753 4101 2469 1144 -184 -2129 -2661 -1262 599 3388
3694C388Q38r31k463j958j076n20N82K135K526J179j319k261j307j618n54J139
$$ 3388 4226 3295 832 -1126 -2202 -2722 -2140 -5 2521 3700 2381 120 -1187 -2805 -3359 -2220
3710b220K813K342R35j419k013k437j502Q44M84J584K875J509j085l451j751j00
$$ -2220 593 2935 3870 2451 438 -1999 -3501 -2657 -2173 -589 2286 3795 2710 -741 -2492 -2592
3726b592l69J034J963K402J609j044k527k153j204N50J493J683J568J384l19l067
$$ -2592 -2961 -1927 36 2438 4047 3003 476 -1677 -2881 -2331 -838 845 2413 3797 3478 411
3742D11k548j048Q24Q98J850J934J011r71k046k399j339N14J651K201J349P13
$$ 411 -2137 -3185 -2361 -1463 387 2321 3332 2361 315 -2084 -3423 -2909 -1258 943 2292 3005
3758C005o70j976k768j127Q02J705J730R04J397o62k417k441j122O65J985J741
$$ 3005 2335 359 -2409 -3536 -2734 -1029 701 1605 3002 2340 -77 -2518 -3640 -2975 -990 751
3774G51J257N51j26j514k557k249O70L068J788O79N60j84j716k602j579O10J992
$$ 751 2008 2559 2433 919 -1638 -3887 -3217 -149 1639 2318 2878 2694 978 -1624 -3203 -2593 -601
3791f01K525J320p9q78j336k128j459k51K198K696J264l26p44j659k659j370P07
$$ -601 1924 3244 3165 2287 951 -1177 -2636 -2887 -689 2007 3271 2945 2201 542 -2117 -3487 -2780
3808b780J828K538J601l22j101j490j652j621j23K318K927J447o63j580j093j554
$$ -2780 -952 1586 3187 2865 1764 274 -1378 -2999 -3122 -804 2123 3570 2907 1327 234 -1320
3824a320j876J37K204K395J880m84j493k225j138r44K81J499K847K139l51j858
$$ -1320 -3196 -3059 -855 1540 3420 2936 1443 -782 -1920 -2864 -2583 -1084 1763 3902 3551 1693
3840A693j966j176o84n31J793K597J410p1j722k063j820l30M31J372J702J831
$$ 1693 -273 -1449 -2133 -2664 -871 1726 3136 3065 1343 -720 -2540 -2870 -2439 -1067 635 2466
3856B466P98k121k549j135K8O8J535K280J985j72j879k170j309p40O26J136K077
$$ 2466 3264 1143 -1406 -2541 -2513 -2445 -910 1370 3355 3183 1304 -866 -2175 -2915 -2289 -1153 924
3873I24J620Q62j824k972j472N9J054J180J772K154j5j647k472j678l50R29J928
$$ 924 2544 3406 1582 -1390 -2862 -2803 -1749 -569 1203 3357 3342 1695 -777 -2455 -2805 -1876 52
3890E2J554R38K70o29l006k278O5J406J610J405J509R8j564k368j820j30Q62K000
$$ 52 1606 2544 2814 2185 -821 -3099 -3034 -1628 -18 1387 2896 2994 1430 -938 -2758 -2888 -2026 -26
3908b6J916P32j53j391j701k355o56K125K248J028M97M67j097k452k083l87J576
$$ -26 1890 2622 2469 1078 -623 -2978 -3634 -1509 739 1767 2264 2731 1634 -818 -2901 -3288 -1712
3925a712K249J283Q87n34j169j582j742j583J382L229J872M7j088k69j866k307
$$ -1712 537 1820 2707 2173 1004 -578 -2320 -3903 -2521 708 2580 2627 1539 1270 -596 -2903
3941b903m76J764J883K035L42j78j842j301j312m42L49K204K563J95j199n18j804
$$ -2903 -3379 -1615 268 2303 2645 2467 625 -676 -1988 -2430 -2081 123 2686 2881 1682 1164 -640
3958f40j949o81J360K609J311O53m62j639j596j331l97Q55J555K773J380k041
$$ -640 -2589 -3270 -1910 699 2010 2663 2201 562 -1034 -2365 -2762 -1907 -352 2421 3801 1760
3974A760k323q09n75j102O32K504K340K63j159j559j708j097N46O06J483J763
$$ 1760 -563 -1372 -1947 -3049 -2417 87 2427 2690 1531 -28 -1736 -2833 -2287 -1681 -198 1565
3990A565K003j023k558k044P0p9M04J770K625L97j216j559j544j592K01J366J876
$$ 1565 3568 2545 -13 -2057 -1987 -2066 -1662 108 2733 3130 1914 355 -1189 -2781 -2580 -1214 662
4007F62J237J099m40k162k246o34O11N18J416K025J374j507k530j383n38r7J269
$$ 662 1899 2998 2558 396 -1850 -2484 -1873 -1355 61 2086 3460 1953 -577 -1960 -2498 -2595 -1326
4024a326J927J172K07M43j781k998j366J513J992O60Q68J399m80k630k254l02
$$ -1326 601 1773 1980 2423 642 -2356 -3722 -2209 -217 443 1311 2710 2230 -400 -2654 -2956
4040b956M37J567J294J631L26p58j251k072j458O81K295J370R85L47J9k028k336
$$ -2956 -2519 -952 342 1973 2299 1541 290 -1782 -3240 -2559 -264 1106 2091 2438 2457 429 -1907
4057a907q63R85J185J515J501K60j062j643j746j275k8K402K653J29o02j7r46
$$ -1907 -2770 -1785 -600 915 2416 2676 1614 -29 -1775 -3050 -3078 -676 1977 2106 1504 1487 541
4074E41k175j571P06K263J394O60O39j170j788r50j049k59J574K887J393n66j601
$$ 541 -1634 -3205 -2499 -236 1158 1818 2457 1287 -501 -1451 -2500 -2759 -1185 1702 3095 2529 928
4091I28o23j523j603K73K271K293O18q8p58j810j794l45N53J041J719J564K60
$$ 928 305 -1218 -2821 -2548 -277 2016 2634 2546 1788 -22 -1816 -2161 -1608 -567 1152 2716 2976
4108B976k276j031o30r26o22J929K548J410j467r35j198j489r53O58J510J258
$$ 2976 700 -331 -961 -1887 -2509 -580 1968 3378 1911 976 -222 -1711 -2664 -2006 -496 762
4124G62J622N16k112k200q78R15q68O95K645J968p47j680j369q64n69K09J595
$$ 762 2384 2900 788 -1412 -2290 -1375 -2243 -1548 1097 3065 2318 638 -731 -1595 -2164 -1955 -360
4141c60J601Q75N98j108k395j583L06J173J84J797J678J18k003j922o70J95m02
$$ -360 1241 2116 2714 1606 -789 -2372 -2066 -893 -709 1088 2766 2884 881 -1041 -1711 -1516 -1918
4158a918J962J861P58j10j005j850k027oJ497J062M29J432R03j696k817j042M82
$$ -1918 44 1905 2663 2553 1548 -302 -2329 -2335 -838 224 653 2085 2988 1292 -1525 -2567 -2085
4175b085Q30P74J571J139J02j364j173j962n09J183K368N09K60O97m48k603j959
$$ -2085 -1255 -481 1090 2229 2331 967 -206 -2168 -2677 -1494 874 1383 1643 2340 1892 -711 -2670
4192b670M48J265J269J428P60q5j151j649j068n42R80K189J190K49l81p50j497
$$ -2670 -2222 -957 312 1740 2500 2415 1264 -385 -1453 -1995 -1015 1174 2364 2613 2232 1482 -15
4209a5k202m88J964J231R13M94L87j293j853j088k70O33J904K136k43j109r65
$$ -15 -2217 -2705 -741 490 1403 1897 2284 991 -862 -1950 -2220 -1587 317 2453 2210 1101 136
4226A36j70j600j350J108K363J381J89o97r67j106j600L4N06J984J665J067r85
$$ 136 -34 -1634 -2984 -1876 487 1868 2057 1360 393 -713 -2313 -2279 -1773 211 1876 2943 1958
4243A958k032l47q40o62N04K078J916j60n78j346p17j873j15J197J426J527O95
$$ 1958 -74 -421 -1261 -1923 -1419 659 2575 2415 1837 491 -226 -2099 -2214 -1017 409 1936 2631
4260B631n18j808j437n78L03K3J617K057O52j304k095q60j51m39R7K143J546N15
$$ 2631 2113 305 -1132 -1710 -1407 -1384 233 2290 2942 1638 -457 -1317 -1468 -1907 -1810 333 1879 2394
4278B394n46j933j747n57P90P37O02J812J086j51k432j338k9r5K14J646J540M94
$$ 2394 1848 -85 -1832 -2389 -1599 -862 -260 1552 2638 2487 55 -1283 -1312 -1407 -1193 453 1993 2487
4296B487o85j196j528j219L98J397J207R37O95l72j827k041k89P86O11J212J223
$$ 2487 1802 606 -922 -2141 -1743 -346 861 1798 2493 2121 294 -1747 -2036 -1250 -639 573 1796
4313A796Q92j050j635j594r78M91J408J502M10N06N9j413k512m74Q83J498R34
$$ 1796 2688 1638 3 -1591 -2569 -2078 -670 832 1242 1748 1807 394 -2118 -2592 -1709 -211 723
4330G23Q46N97n58j499j458j190M8J777J997O90m41m34p23j501j746O73J956J450
$$ 723 1569 2166 1608 109 -1349 -2539 -2491 -714 1283 1973 1532 1098 375 -1126 -2872 -2199 -243 1207
4348A207N16J29l20j538j324r29M42J427J833P96l44j009q78j352j040K38J756
$$ 1207 1723 1852 1532 -6 -1330 -2259 -1817 -390 1443 2239 1895 886 8 -1344 -2384 -2146 -390
4365c90K035n8j94n51p27j251j620P46J659J602P14L9j118j393p26p62k20J262
$$ -390 1645 1587 1393 842 115 -1136 -2756 -2010 -351 1251 1965 2004 886 -507 -1233 -1995 -2215 -953
4383i53K307J090k51j457j301n65p10J6J243J858J018k83j005j291j327o5K37
$$ -953 1354 2444 2193 736 -565 -1130 -1840 -1824 -581 1277 2295 2012 1007 -284 -1611 -1676 -1439
4400a439P99J728J459j6j859j143q49m08j44J590J393J395n55r77j253j171m01
$$ -1439 -640 1088 2547 2531 672 -471 -1320 -1728 -1872 -282 1111 2506 1951 974 -279 -1450 -1851
4417a851M69J117J445J072L26j640k018j009K99N72O80J089J439L29j559j828
$$ -1851 -1382 -265 1180 2252 2578 938 -1080 -2089 -1790 -1218 -538 551 1990 2319 760 -1068
4433a068q00J52M10J561R05O44M50j074j803j397J30Q62P94J178J022j63j170
$$ -1068 -1868 -1716 -1306 255 1160 1804 2254 1180 -623 -2020 -1890 -1028 -234 944 1966 1803 633
4450F33j679n26n64J017J141Q40P32J04m90j846j179k20J136J081Q20N80K40q26
$$ 633 -1046 -1572 -2136 -1119 22 862 1594 1698 1208 -638 -1817 -2037 -901 180 1000 1580 1820 994
4468I94j685j278n0N68J928P57O04l73p40j218j540n88J501J716J034k54q5p17
$$ 994 -691 -1969 -2019 -1451 477 1234 1838 1465 725 -493 -2033 -2621 -1120 596 1630 1376 1291 574
4486E74j310j099m73J578J370O66N88j72j243j083j154l40Q04J600J454j17o70
$$ 574 -736 -1835 -2308 -730 640 1306 1894 1722 479 -604 -1758 -2098 -1294 306 1760 1643 973
4503I73k90j029j615k11J315J719J009J61o28r55j185o68o15Q03J504J624M81
$$ 973 683 -346 -1961 -2172 -857 862 1871 2032 1404 449 -736 -1404 -2019 -1216 288 1912 2393
4520B393p92j030q07r36p13N51J704J552N63r90j683j041P2n35N17J046J559R97
$$ 2393 1601 571 -236 -1172 -1885 -1334 370 1922 2485 1495 -188 -1229 -1157 -1692 -1175 -129 1430 2427
4538B427j025j485r43j94k61P94O86J818L79p37j255r75j067J90R50Q04J518N23
$$ 2427 1402 -83 -1026 -1220 -1481 -687 -1 1817 2196 1459 204 -771 -1838 -1648 -698 106 1624 2147
4556B147p19j584j076j04N5r9J594J442O28p45j700j159l73L64P22J081J134J90
$$ 2147 1428 -156 -1232 -1336 -1281 -1380 214 1656 2284 1539 -161 -1320 -1693 -1329 -607 474 1608 1798
4574A798M2j751j803l80J109O62J60J157P28L7k053j553K7P3Q46J683O56oj58
$$ 1798 1840 89 -1714 -2094 -985 -323 -163 994 1722 1759 -294 -1847 -1820 -1747 -901 782 1438 1432 1274
4593A274j269j727m54N86J178O20P64Q80o57j458j830K61M97P33P86J209M58n64
$$ 1274 5 -1722 -2176 -1590 -412 208 972 1852 1195 -263 -2093 -1832 -1335 -602 184 1393 1851 1287
4611A287j088j696q00O83J552J170J09j4J47r13j589j231M54J849J005M13K57
$$ 1287 199 -1497 -2297 -1614 -62 1108 1217 1203 1350 437 -1152 -2383 -1929 -80 925 1338 1595
4628A595q00q69p90p48k66J306J430J065r26m64p14r08j049M13J377J166O47J56
$$ 1595 795 -74 -864 -1612 -1878 -572 858 1923 997 533 -181 -1089 -2138 -1725 -348 818 1465 1621
4646A621q20j037q47n59K41Q60K041N95p94n73m72j105n96j64J231J854J35j07
$$ 1621 801 -236 -1083 -1642 -1401 -541 1500 2095 1301 728 256 -849 -1445 -1609 -378 1476 1611 1504
4664A504n46q88j215l61K41Q22J534J343k35j585j012k38o19k91R52J731J080
$$ 1504 958 70 -1145 -1506 -1265 -443 1091 2434 2199 614 -398 -636 -1255 -1546 -594 1137 2217
4681B217o02r01r42j186k71M12R83Q91R68L26r41j915o21J5O95K57J182J478k72
$$ 2217 1615 714 -228 -1414 -1685 -1273 -290 601 1569 1895 954 -961 -1582 -1567 -872 -615 567 2045 1773
4700A773j143j203o44l98N29R96J118M53R3p06j903p41M72P33M10O79J557J59
$$ 1773 630 -573 -1217 -1615 -1086 -90 1028 1481 1574 868 -1035 -1776 -1304 -571 -161 518 2075 2234
4718B234j527j782l72o1N58R12P87R27J12p22j771j496K74J401Q18K80P46N82
$$ 2234 707 -1075 -1447 -1508 -950 -38 749 1676 1788 1066 -705 -2201 -1927 -526 292 572 1318 1900
4736A900q90j972j024L06O12J214J027M48l68m73j307j154l66R76J614N39K0N57
$$ 1900 1010 -962 -1986 -1680 -1068 146 1173 1621 1253 780 -527 -1681 -2047 -1071 543 1082 1102 1659
4754A659m50j709j409K33J390M26J064K49K60r57j088r19k73Q74J420Q80m01k44
$$ 1659 1209 -500 -1909 -1676 -286 140 1204 1453 1713 756 -332 -1251 -1524 -650 770 1650 1249 1005
4772A005l52o59j577p17J683J276Q38j39j25o98j090o62N7K11P63J796M68r18
$$ 1005 653 -6 -1583 -2300 -617 659 1497 1358 1233 535 -555 -1217 -1160 -949 -186 1610 2078 1160
4790A160j025n39n80p54N16J536J152j51M2q50j218o39k11P90J116J170M54p49
$$ 1160 135 -404 -984 -1738 -1222 314 1466 1315 1357 507 -711 -1350 -1561 -771 345 1515 1969 1220
4808A220j166r00k05l39J90J328K253l99j213n46q38m50l24P53J147P15O67n41
$$ 1220 54 -846 -1051 -1390 -1200 128 2381 1982 769 223 -615 -1065 -1389 -636 511 1226 1893 1352
4826A352j792j097o8P57O3Q52R96O25n92j468o86M4o95J067J062M35N76p1q66
$$ 1352 -440 -1537 -1605 -848 -785 67 1063 1688 1096 -372 -1058 -1014 -1709 -642 420 855 1431 1360 494
4845D94j786n40M28J241J48J050Q15p55j439j123Q0Q3L23J009J388R3n26j025
$$ 494 -1292 -1832 -1404 -163 -15 1035 1850 1095 -344 -1467 -1387 -1304 -981 28 1416 1509 983 -42
4863d2j006o00L96J161M83N59M18Pj499j285n81Q56Q75N48P00L15m42q96r87p00
$$ -42 -1048 -1648 -1252 -91 392 951 1369 1376 -123 -1408 -1989 -1133 -258 290 990 1305 863 -33 -1020 -1720
4883a720K18J462O20M79R5j17o90j296j078N89J564M98K95M95m70j038j239M9
$$ -1720 -1502 -40 580 1059 1154 1037 347 -949 -2027 -1438 126 624 919 1414 944 -94 -1333 -1284
4901a284K40P30J640Q2R8q47n26p03j221N47J438Q32M12n77L26j108j236n69O21
$$ -1284 -1044 -314 1326 1408 1506 659 133 -570 -1791 -1244 194 1026 1438 861 1187 79 -1157 -1726 -1105
4920a105J053R23N71l09n88l67j023j057R0J567J419M47j80j201l71r98m53K88
$$ -1105 -52 871 1442 1133 545 178 -845 -1902 -1812 -245 1174 1621 1441 240 -131 -1129 -1582 -1294
4938a294R79J256O25l08o31j370m64J17k42J095Q68R23k66j048n52n10n78J31
$$ -1294 -315 941 1566 1258 627 -743 -1207 -1090 -1332 -237 631 1554 1288 240 -312 -822 -1400 -1269
4956a269J130O82Q73k71n18j084o77n3J55L20J743P13r8j221j308m47L99N2N88
$$ -1269 -139 543 1416 1145 627 -457 -1134 -1187 -1032 -712 1031 1744 1646 425 -883 -1330 -931 -879 -291
4975b91J346M84j15j076q91q13k39P66P81M99P21N06j187j416m95M13L84M71Q10
$$ -291 1055 1539 1424 348 -543 -1356 -1595 -829 -48 451 1172 1678 491 -925 -1420 -1007 -623 -152 658
4994F58P34q9r51j001o67l11R03Q14Q17N00k41k60j515j001K75O30M32J180K76
$$ 658 1392 1303 352 -649 -1316 -1627 -724 90 907 1407 1166 906 -609 -1610 -1335 -705 -273 907 1183
5013A183L73r45j467r02N88N54J182M62q7K14m49j216j251J51J256O55N73O0J61
$$ 1183 1556 611 -856 -1758 -1170 -616 566 1028 941 1155 706 -510 -1761 -1610 -354 301 874 934 1095
5032A095m22j250o54k75O50J062J021J99m92k63j205n81l08O60J232O45l04K55
$$ 1095 673 -577 -1231 -1506 -856 206 1227 1426 934 671 -534 -1115 -1423 -763 469 1114 810 1065
5050A065m28j119r96K99R17P34Q26j74j55o10q94n27o86J022J093R82k36l69m67
$$ 1065 637 -482 -1478 -1179 -262 472 1298 1124 969 359 -535 -1062 -1748 -726 367 1349 1113 744 277
5069B77n20o79p29Q52J017R75J53o03n65o68l79k29M48J129O08O87j031q44l39
$$ 277 -243 -922 -1651 -799 218 1193 1346 743 178 -490 -869 -1098 -650 479 1087 1774 743 -101 -440
5088d40o03J51J94R43J023K58o52q66n64p02K54M90Q18O89M52o41j173l87j63
$$ -440 -1043 -892 -698 245 1268 1526 874 8 -556 -1258 -1004 -514 304 993 1445 804 -369 -756 -919
5107i19j30M31Q22J009M67r67r37o62l20j5P99N21J150M10n45r48j291qL80M85
$$ -919 -1049 -618 204 1213 1680 713 -224 -886 -1206 -1221 -422 99 1249 1659 1114 166 -1125 -1133 -753 -268
5127b68L54P60N27l85j060r22n15L79N93J124M79L67m14j005j129n18Q67M11M85
$$ -268 86 846 1373 988 -72 -994 -1509 -1130 -537 587 1066 1433 1019 14 -1115 -1633 -766 -355 130
5146A30Q94L48n52o16j206k72L63Q87N08M18K93j65r95r63o14Q96P54O11K79l5
$$ 130 1024 1372 820 204 -1002 -1274 -911 -24 484 902 1195 1030 35 -928 -1542 -646 108 719 998 963
5166I63k33r36q59m48P01P07R00m9K19O2p72j037q62P65O79J578r9l95o6o99j039
$$ 963 730 -206 -1065 -1513 -812 -105 795 746 965 1027 255 -782 -1644 -879 -200 1378 1279 884 818 119 -920
5187i20l06L90Q07R30J44L34m61j164n18o04L51P20J255M08p15K75j178k57p69
$$ -920 -1226 -836 -29 901 1045 1379 918 -246 -764 -1368 -1017 -297 958 1366 651 926 -252 -509 -1278
5206a278J36Q90J187K32l21k90o16p75k02j87P55J358J83j68o93m38l52n26K14
$$ -1278 -1142 -252 935 1167 846 556 -60 -835 -1037 -1224 -469 889 1072 904 211 -227 -579 -1105 -891
5225h91L81J529K16l42j87q69q36q2K78N05R22O36k93o64j133j77R0O6O82J024
$$ -891 -510 1019 1235 893 706 -163 -999 -1081 -803 -298 624 1260 967 303 -830 -1007 -917 -851 -169 855
5245H55M94m71p85o57o37K37K38N64Q50M78L01j376r13J00k47L88j79J355R37
$$ 855 1349 878 93 -564 -1201 -964 -726 -162 688 1166 1467 91 -822 -722 -969 -581 -760 595 1532
5264A532l11q64r57k43m2K84N77N49N54M15p69j145o27k0P80K84M47P86O1q85
$$ 1532 1221 357 -600 -843 -885 -601 -24 525 1079 1494 725 -420 -1047 -1067 -287 -3 444 1230 1291 406
5284D06p84m73j72K61R83Q19R8j04o03q08o65j8N96P66K14N58lj14j267q09k51
$$ 406 -378 -851 -1023 -762 221 1040 1138 1034 431 -377 -1042 -1060 -464 302 516 1074 1071 957 -310 -1119 -1370
5305a370R06Q60L85K14Q6m62j056n80j24Q75P25J73pJ22j77j199o21r8R06P91
$$ -1370 -464 396 781 995 1081 619 -437 -1017 -1141 -266 459 632 625 747 570 -629 -1250 -1348 -442 349
5325C49L79L65k48n60n74p30Q8L09J179Q15j31p15m90l41j016M50L05R30N27J79
$$ 349 728 1093 845 285 -289 -1019 -931 -622 557 1372 1241 526 36 -305 -1321 -871 -566 364 891 1070
5345A070j7j099m56m48k36M62O65J279j51o91j47o06n70k17K48J403O22K48p87
$$ 1070 1053 -46 -502 -950 -1186 -724 -59 1220 1069 378 231 -375 -945 -1162 -914 489 1111 1359 572
5364E72p57m56l95j48O15Q03P83M53q19r67l28O1m70N54O15Q55M51q71n27p96
$$ 572 -185 -641 -1036 -1184 -569 234 1017 1470 651 -316 -644 -583 -1053 -499 116 971 1422 551 24 -772
5384g72rl07O34N67O62N49p31o97q22l67M20K02P69J218K02o21j282j88l16j69
$$ -772 -781 -1088 -454 113 775 1324 593 -104 -926 -1293 -873 -671 98 1316 1518 897 -385 -573 -889 -1058
5404a058O92P55N59R9l63q76q61J66K59L46N69L47M51o7j256o75Q1j06J071K47
$$ -1058 -366 389 948 1047 684 -192 -1053 -887 -628 -282 287 634 1085 1018 -238 -913 -832 -938 133 380
5424C80N07M9r1o71p63p28M33P74N23K34K11K97j104j003k05P37L10P12O17q8
$$ 380 887 936 845 174 -589 -1317 -884 -110 413 647 858 1155 51 -952 -1157 -420 -110 602 1219 1131
5444A131l37r23p79m78P19O08Q83k3J22j60o91o21p61N56O89N99J11J94k86l92
$$ 1131 794 -129 -908 -1386 -667 -59 824 801 923 763 72 -549 -1310 -754 -65 534 645 839 553 161
5464A61r00k93M32N85Q41M39n53l98r5p48q52L91J074N26L27l15l42n17n71j87
$$ 161 -739 -1032 -600 -15 826 1265 712 314 219 -529 -1381 -990 84 610 937 622 280 -237 -808 -995
5484i95R8O96Q66O11m26q32k17l99l91q6J115N27M53k51o55j36r40l65L77R54
$$ -995 -897 -201 665 1276 850 18 -199 -598 -989 -1075 40 567 1020 769 114 -22 -962 -1327 -950 4
5504DO15N70j88q05o34l08J93m20O76J058O58p00p55n07j23k20K34M68M87L75
$$ 4 619 1189 1001 196 -438 -746 -553 -973 -297 761 1419 719 -36 -543 -666 -886 -652 -184 303 678
5524F78R6n26p88k95M6L59L82L97P94n1q44p33l73K69N6O35L85M94k74n18o01
$$ 678 774 248 -540 -835 -789 -430 -48 349 1143 1092 248 -485 -858 -589 -533 102 487 981 707 189 -412
5545d12p46L76L99L05O62K15J32m81j136j19J74J51K60J173K18l03l78p57p63
$$ -412 -1158 -782 -383 -78 584 799 931 450 -686 -805 -631 -480 -220 953 1171 868 490 -267 -1030
5564a030K26P34L19L59J71o2m70r00l92J92N84P46k5N53k99o55m42k42l14M89
$$ -1030 -804 -70 249 608 779 717 247 -653 -1045 -853 -269 477 452 1005 706 51 -391 -633 -947 -458
5584d58P44O88J18n26o4p71r88L31N35M84K44M02k36l43m19o28R1N13N87L90J23
$$ -458 286 974 1092 566 502 -269 -1257 -926 -391 93 337 739 503 160 -259 -887 -796 -283 304 694 817
5605H17m62k20l36p64Q5L09J071L91l10j17n12k55m53o6J27J224N12j26l31q81
$$ 817 355 135 -201 -965 -880 -571 500 891 581 464 -48 -303 -756 -822 -695 529 1041 915 584 -297
5625b97k4j90q9L05O69N22L1o28j49j35q17l42O98O90O11J38n24m08o55k15J0
$$ -297 -321 -511 -600 -295 374 896 927 299 150 15 -802 -1144 -446 244 855 993 469 61 -594 -809 -799
5646g99K16P36O19ml58n37k89k97j25N22J167J0m3j64n94m62o37M22J46N05O23
$$ -799 -583 153 772 768 410 -127 -416 -713 -838 -316 851 861 818 654 60 -402 -1039 -617 -471 34 657
5667F57N55p06n72o34j26K62m7R38M80Q5k85n11p47j81L55K14M78M96J23m03l57
$$ 657 1212 506 -66 -700 -826 -564 -611 327 807 892 607 96 -651 -832 -477 -263 215 711 834 431 74
5688G4q23p7J47L40O52P28j24m10m51p92j49L46O50K95L50O5p1q95q12j45O08
$$ 74 -749 -826 -679 -339 313 1041 917 507 56 -736 -885 -539 111 406 756 821 750 -145 -957 -1102 -494
5709d94O24K73L27j6q4o39n80m30M40M18N75K0M20m54l16o70p63M43R59J95M17
$$ -494 130 403 730 714 630 -9 -589 -1019 -579 -161 414 434 854 400 84 -586 -1349 -906 53 248 665
5730F65k06J9q00o77K53o5J026L23J30J8l40n20j03n53N32J64Q19J97l69j63k55
$$ 665 459 478 -322 -999 -746 -811 215 538 668 686 346 -174 -277 -830 -298 -134 685 882 513 350 95
5751I5p25k62L60M02N14K00J30l65p74r4j33o2O05O53N19q26k12k70n44k34l0
$$ 95 -630 -892 -532 -130 384 584 714 349 -425 -519 -652 -714 -109 544 1063 237 25 -245 -789 -1023 -1053
5772a053Q58Q98J61l68l7m26r20L47j42M42Q12K94P1j060j12k59q4j16M59P35
$$ -1053 -195 703 864 496 459 33 -887 -540 -682 -240 572 866 937 -123 -235 -494 -578 -694 -235 500
5792E00K06k74k23m42k25l82M06K33Q01R6K68j020l32k68J80J63j88Q42P37k08
$$ 500 706 432 209 -233 -458 -840 -434 -201 600 696 964 -56 -388 -656 -476 -313 -501 341 1078 870
5812H70q16n08j07o3O7K80R35M1J76n35o11o01J23N76K91M34p2N63q90q90j66
$$ 870 54 -454 -561 -624 -557 -277 658 699 875 340 -271 -872 -749 -173 118 552 480 1043 153 -737 -903
5833i03R3J33R10K87R9K23n79p06m63J17N44L04M26J04j71k75o24p26N63N79N05
$$ -903 -810 -677 233 520 619 842 263 -443 -906 -789 -245 59 485 589 418 143 -481 -1207 -644 -65 440
5854D40N34q7l19l33m05p06j7O19P00m5J62j39j0p18o45M0L78P44J54J21k4m63
$$ 440 974 887 568 235 -170 -876 -893 -274 426 381 543 404 394 -324 -969 -929 -551 193 347 468 444 -19
5876a9l02m87K6M63L79R58m23j31l28l56n98k82J100J85L31R4J08n51m45p46J60
$$ -19 -321 -808 -782 -319 60 1018 595 464 136 -220 -818 -1100 0 185 516 610 718 167 -278 -1024 -864
5897h64L62P85M99k40j9p10np38K08N02N86O67n12j81k12p60J5k76O60K42J117
$$ -864 -502 283 782 542 523 -187 -192 -930 -722 -220 366 1033 521 340 128 -632 -617 -893 -233 9 1126
5918A126m05n37m9p50J23J59J24K06N86K00n53j49m68m44K46M23L93N4N39n01
$$ 1126 721 184 135 -615 -492 -333 -209 -3 583 783 230 81 -387 -831 -585 -162 231 285 824 323
5938C23m57L3n21l8J81O71J80N39o28m29l45p1j06M97L15N04k2J1n71o96M8m1
$$ 323 -134 -101 -622 -660 -479 192 372 911 283 -146 -491 -562 -668 -171 144 648 626 637 66 -630 -582 -623
5960f23O91J29M84K9k20o36l49%O8M85k8N08K61j73n51p49p5J12L98P16q5J58
$$ -623 68 197 681 710 490 -146 -495 -495 -427 58 30 538 799 626 75 -674 -749 -637 -239 477 392 550
5982E50J5p36k68k25L40K1R54n3J32o63j23n83p7K84N50M25j43mj57n23l90m31
$$ 550 565 -171 -439 -664 -324 -303 651 598 730 67 -56 -639 -716 -432 118 543 400 396 239 -284 -674 -1105
6004a105M85O30K71R6jj09l30o80k63L60Q18K92m9m6n8k59p23j99L23N21N97K21
$$ -1105 -620 10 281 377 376 267 -63 -743 -1006 -646 172 464 415 369 311 52 -671 -870 -547 -26 571 792
6026G92m80k29k59m36k36J98N09N43K01k7l45n05k86k21L0Q69L74q8J22l16l79
$$ 792 312 83 -176 -612 -848 -650 -141 402 603 576 231 -274 -560 -781 -751 118 492 404 526 210 -169
6047a69m70p6K68L76N20J31k79K17p77l07l9J64L73P65J48m89l94j88m90j44K49
$$ -169 -639 -715 -447 -71 449 580 301 518 -259 -566 -605 -441 -68 697 845 356 -38 -226 -716 -860 -611
6068f11N67O16K40r6o26m97o0p8L93J01O68K56j56m07o61k68j3L84N8O26M79k52
$$ -611 -44 572 812 716 90 -407 -467 -545 -152 -51 617 873 717 310 -351 -619 -632 -248 -190 436 915 663
6090F63o65j88p92M91K63n5N27N75j74l86l85j56k68J81M41J40R78n13m77m40
$$ 663 -2 -190 -982 -491 -228 -283 244 819 645 259 -126 -282 -550 -369 72 212 1190 677 200 -240
6110b40l98J25K96O27j62J80L92n64p11m23J76K80K67L42N02k57l10o15m03L02
$$ -240 -638 -513 -217 410 248 428 820 256 -455 -878 -702 -422 -155 187 689 432 122 -493 -896 -594
6130e94L16M04K85p2j06R2m80p43J30O45L11M80j77j56j41m00n93J92J32Q31L9
$$ -594 -278 126 411 339 233 325 -155 -898 -768 -123 188 668 491 335 194 -206 -799 -607 -475 356 395
6151C95q6P3k71l69n97K78L51M93M70l05n9j56l52r02K69O58K96L76K01n27k03
$$ 395 309 382 111 -258 -855 -577 -226 267 737 432 373 217 -135 -1037 -768 -110 186 562 763 236 33
6172C3p1q87J11M04Q59l3K06k45p8p02k42K76J34N42L95m8N3p85l28n86J09L76
$$ 33 -38 -925 -814 -410 449 416 622 377 299 -403 -645 -369 -235 307 702 654 707 -78 -406 -992 -883 -507
6194e07R03K91n0j28o71k96l97L96N5N32O59k25k11m37m92N48n98K53M85P24m6
$$ -507 396 687 637 509 -162 -458 -855 -459 -404 128 787 562 351 -86 -578 -30 -628 -375 110 834 788
6215G88n14n73J31l43k43O96M3P02J66n61k06n48L0JN25k2M99Q4l52n71j58l47
$$ 788 274 -299 -168 -511 -754 -58 -15 687 853 292 86 -462 -432 -431 94 72 571 655 303 -268 -426 -773
6237g73J86N72K6N90l8k58n20l85J53N7L96n1N40L72l18m65o86P6K86j13K66N33
$$ -773 -587 -15 11 601 563 305 -215 -600 -447 -390 6 -45 495 867 549 84 -602 -526 -240 -353 -87 446
6259D46M9j95k60n60p2M1L70N21j52M43r8k65p41l02M57M20Q8J82K65n78l0k79
$$ 446 495 300 40 -520 -592 -551 -181 340 188 631 533 268 -473 -775 -318 102 190 372 637 59 29 -250
6281b50m58L14M67J64L19j81J0m10n31j76M46K51L63N1J17j37p53l9l81L70P08
$$ -250 -708 -394 73 237 556 375 385 -25 -556 -732 -286 -35 328 379 496 359 -394 -433 -814 -444 264
6302B64L9O5j1m02P9n87j79J52M15N24K66n20l7j32k62k12j23O02L25N56l42k03
$$ 264 303 368 357 -45 34 -553 -732 -580 -165 359 625 105 68 -64 -326 -538 -661 -59 266 822 480 277
6324B77l47m59q0k41R02L29M13m61Q2o45j30l56J78N60M35J86l34j84j31m17j66
$$ 277 -70 -529 -609 -850 52 381 794 333 415 -230 -360 -716 -538 22 457 643 309 125 -6 -423 -589
6345e89J83N99J25J58J29l50l51l92k26J31N54K38M94j81n70j41j85l22O41J08
$$ -589 -406 193 318 476 605 255 -96 -488 -714 -583 -29 209 703 522 -48 -189 -374 -696 -55 53
6365E3K33K99J25m34m96m6l27J65M39J87L44R4n93n19p3k4M77p4L87N18jl70q57
$$ 53 286 585 710 276 -220 -266 -593 -428 11 198 542 636 43 -476 -549 -573 -96 -170 217 735 734 364 -493
6388d93J9J9L37J3M17L08K04o04o12J16J8p1J42M04K65l6n03m19l46K88N52O7
$$ -493 -474 -455 -118 -105 312 620 824 220 -392 -276 -258 -329 -187 217 482 446 -57 -476 -822 -534 18 85
6410H5M23n5m8n02L9n48R7J87N63K24K08m72JOm31l73O54K09L85k79K40n99m70
$$ 85 508 453 405 -97 -58 -606 -509 -322 241 465 673 201 202 208 -223 -596 58 267 652 373 613 14 -456
6433d56j39L12O8O64Rp4j07m66k57k58O0N01K73O6K16m25J59o6l98n23O77N39
$$ -456 -595 -283 -215 449 458 384 277 -189 -446 -704 -644 -143 130 196 412 -13 146 80 -318 -841 -164 375
6455C75J66Ok12l27k76J3k06J11K61M98L07o23l46L6L33r17J038P6K30j48j92
$$ 375 541 547 335 8 -268 -255 -461 -350 -89 409 716 93 -253 -217 116 -801 237 313 543 395 203
6476B03k15p15L60j21M90J38L69K92l16m33j31l32M4J17L79L97m1k62l56k05J0
$$ 203 -12 -727 -367 -488 2 140 509 801 485 52 -79 -411 -367 -250 129 526 485 223 -133 -338 -328
6497c28k08J52N81K33m4j89k88n0j79n4K32J97J91M02n69l98l4J33j70J25L05
$$ -328 -536 -384 197 430 386 197 -91 -141 -320 -374 -142 55 246 648 79 -319 -353 -220 -390 -265 40
6518D0K51k25L38k57p59j9K45K7P32K35k5k94m20l27j49N10r8L48L85m4l0o19
$$ 40 291 66 404 147 -612 -631 -386 -359 373 608 583 289 -131 -458 -607 -97 -195 153 538 494 464 -155
6540a55l84o0K50j71Q35K79j26K33n88m35j73J46L99K50l7J38J18m55n26q6M27
$$ -155 -539 -599 -349 -520 315 594 468 701 113 -322 -495 -349 50 300 263 401 519 64 -462 -548 -121
6561a21J65L11K20n00J67J56p53Q8J55J5N56n3Q4m11K9l03k84k3M38M70K18m57
$$ -121 44 355 575 75 242 398 -355 -267 -112 -97 459 406 490 79 108 -195 -479 -502 -64 406 624 167
6583A67L37n72k85k49J75O87q1L45j34k06m40l1m78L42J42N18K71j91k64l33N3
$$ 167 504 -68 -353 -602 -427 260 179 524 390 184 -256 -287 -765 -423 -281 237 508 317 53 -280 -227
6604b27l57K09K76J13O75l25n38Pk46Q1k17P60R9K01J79o55q0l53M5k43O24K30
$$ -227 -584 -375 -99 14 689 364 -174 -167 -413 -332 -549 211 310 511 690 35 -45 -398 -353 -596 28 258
6626B58L64m07L9o88K5J36l0M06J92J76k40l29l18o4L8j3N05N5K06J60n41k18
$$ 258 622 215 254 -434 -409 -273 -303 103 295 471 231 -98 -416 -480 -442 -455 50 105 311 471 -70 -288
6648b88J73m18J05M22Q2K63J31q4r91J09J25N28k46L68J72N1l27n11j64j19K94
$$ -288 -115 -533 -428 -6 76 339 470 386 -605 -496 -371 157 -89 279 451 502 175 -336 -500 -619 -325
6669c25M43M8J66j74M4m76k44K72Q6N96R9j33j2k47m93k27K87K56J80j35J42J51
$$ -325 118 166 332 158 202 -274 -518 -246 -160 436 535 402 390 143 -350 -577 -290 -34 146 11 153 304
6691C04o6k90k98pK9N02K96K29m92j50o52l6K06K66J54R0K43o5q7m50m19L04K02
$$ 304 238 -52 -350 -357 -328 174 470 699 207 57 -595 -631 -425 -159 -5 85 328 263 176 -274 -693 -389 -187
6714a87L63K30J29j17m36j63l50L44j09M72J00K21l54p7m56J64k12J93M37N24
$$ -187 176 406 535 418 -18 -181 -531 -187 -296 176 276 497 143 66 -390 -226 -438 -245 192 716
6734G16l30jn26r5j08PJ09L66L03N2m10j56l98K36k1J92O01k39P6N9n25l6j72
$$ 716 386 385 -141 -236 -344 -337 -228 138 441 493 83 -73 -471 -235 -256 -64 537 298 374 433 -92 -128 -300
6757c00j90M01J34O87k27l78k99j20K5k25LP66K21K0n46l0j31j53j8r3O32L2J23
$$ -300 -490 -89 45 732 505 127 -172 -292 -267 -492 -489 277 498 518 -28 -58 -189 -342 -360 -453 179 211 334
6780C34n3m24j40m20K09o4P64N0j99Q8mm39q9K84J63M4K12R9j08k51n87L92j32
$$ 334 281 -143 -283 -703 -494 -558 206 256 57 145 141 -298 -387 -103 60 104 316 415 307 56 -531 -139 -271
6803b71K03K43n5M59l98n92J51j0J86J46K41P5R7m64q7l72o6L03K54L10o0J39
$$ -271 -68 175 120 579 181 -411 -260 -270 -84 62 303 378 475 11 -76 -448 -514 -211 43 353 293 432
6825D32r5m23j74j17M8L61P1J77L28k76m97l09K06K32p9l2K40L84j80k66l08k96
$$ 432 337 -86 -260 -377 -329 32 103 280 608 332 -165 -474 -268 -36 -115 -147 93 477 297 31 -277 -573
6847e73L44N04O1L1m00K99l35j72l26M76l0J31J68j79N94n56l81k82J42N01K51
$$ -573 -229 275 336 367 -33 266 -69 -241 -567 -91 -121 10 178 -1 593 37 -344 -626 -484 17 268
6868B68L46l67k71k42L36o74K24K46J86N49l90q7l84k06P4r4M69K44J21K02o60
$$ 268 614 247 -24 -266 70 -604 -380 -134 52 601 211 124 -260 -466 -392 -486 -17 227 348 550 -110
6889a10J69j57k61J69N2J36M71p8n54J06k27m6LL52K78J64M5l94k57p8n0J2L73
$$ -110 59 -98 -359 -190 -138 -2 469 391 -163 -57 -284 -330 -327 25 303 467 512 118 -139 -217 -267 -255 118
6912A18j41M41r7k99k19k91OL67P1M98p1Jj00n42j5k2J55K64K61L4Nn65l35K07
$$ 118 -23 418 321 22 -197 -488 -482 -115 -44 454 383 384 284 -258 -273 -295 -140 124 385 419 424 -141 -476 -269
6936b69j88j1M04L38J57k17k04m13k73N01K54l15K85J26M48p0p95k49K96L43n
$$ -269 -457 -468 -64 274 431 214 10 -403 -676 -175 79 -236 49 175 623 553 -242 -491 -195 148 143
6957A43k31N71j90k11k92j94J14q4N30p5L05j08l44j48k43p2L80M90k98K04J80
$$ 143 -88 483 293 82 -210 -404 -290 -374 156 81 386 278 -66 -214 -457 -529 -149 341 43 247 427
6978D27k36k25l32n3J25M11K10l10M44l40l12j36R2K68L03j54K96j83P3o97j82
$$ 427 191 -34 -366 -419 -294 117 327 17 461 121 -191 -327 -235 33 336 182 478 295 368 -329 -511
6999e11J41M70L55l96O06p21J85l42m24N2L24N63K63m13l2j08nk29m42L97M77
$$ -511 -370 100 455 59 665 -56 129 -213 -637 -585 -261 302 565 152 120 12 7 -222 -664 -267 210
7020B10J77K38n11q4m20J67j41pM61L35l00L55p10K37l66l2K37K81L7R0j62K6
$$ 210 387 625 114 30 -390 -223 -364 -371 90 425 125 480 -230 7 -359 -391 -154 127 164 254 92 118
7042A18m19p5k06K99N25K4K36l03q02M91o6j65K89j91M69J57j21q1n57k8L54j43
$$ 118 -301 -376 -582 -283 242 266 502 199 -603 -112 -178 -343 -54 -245 224 381 260 179 -378 -406 -52 -195
7064a95M69K39m7l65m78R9J08j48J58R9R1P2L7k25J91m18j23L12L61J07n9J42
$$ -195 274 513 466 101 -377 -278 -170 -318 -160 -61 30 102 139 -86 105 -313 -436 -124 237 344 285 427
7086D27j56m78J31j91J00J87J27J48J89l25m87j28K17O35l19L75K9M5p17Jk71
$$ 427 271 -207 -76 -267 -167 20 147 295 484 159 -328 -456 -239 396 77 452 481 526 -191 -190 -461
7107d61J23K94M58l36K59j09l82J29m84L54K11O2K89j57j09R0n86n9K56m6K89
$$ -461 -338 -44 414 78 337 228 -154 -25 -509 -155 56 118 407 250 141 231 -355 -414 -158 -204 85
7128H5M09k26k99l27J36j59j01O10L6K29k62J22jl53k32o4L47L89R8k89m23K7
$$ 85 494 268 -31 -358 -222 -381 -482 128 164 393 131 253 252 -101 -333 -397 -50 339 437 148 -275 -248
7150b48Q9k30k01O49J94J97m06k7k72O9m56K23N52o8K50r9k96J25k18j10J97p2
$$ -248 -159 -389 -590 59 253 450 44 17 -255 -186 -642 -419 133 65 315 216 -80 45 -173 -283 -86 -158
7172a58N86j83O4l06n24L67ql5o4O65M9K6j32m40K4k56L2O1L08O44o38J68p21
$$ -158 428 245 309 3 -521 -154 -162 -197 -261 404 453 479 347 -93 -69 -325 -293 -232 76 720 82 250 -471
7195d71oK35k70Q62q0L4L19o38l76J52J95j21J06J12K92k1k9l50j27O7m33P57
$$ -471 -477 -242 -512 350 270 304 623 -15 -391 -239 -44 -165 -59 53 345 324 295 -55 -182 -115 -548 209
7217B09k40J39M58m64m60N1Q8K28n8O15L6k95k98k13j54K36o6L91K2M4J36k59
$$ 209 -31 108 566 102 -358 -307 -219 9 -49 566 602 307 9 -204 -358 -122 -188 203 225 269 405 146
7239A46l75M1m14O76J53P9l3J8M5o48k47k6M33N52k04M3j48j0l60k32m2M41J60
$$ 146 -229 -188 -602 74 227 306 273 291 336 -312 -559 -585 -152 400 196 239 91 81 -279 -511 -553 -112 48
7262D8J50l3j39O6l26nj10Q6K09J80J2K50n61m8j88k8J14N92lj57J68k56k48k2
$$ 48 198 165 26 92 -234 -239 -349 -263 -54 126 138 388 -173 -221 -409 -437 -323 269 266 109 277 21 -227 -249
7286b49r0L39M45k83n1O9k11J0j87l69L47O12l04L8L59l66l78r9J42Q9K04J11
$$ -249 -339 0 445 162 111 180 -31 -21 -208 -577 -230 382 78 116 475 109 -269 -368 -226 -137 67 178
7308A78j09K09n19j8J11k94K33M35OM1j33o3o03J8N42j12L9L50k7J32o40N5j25
$$ 178 69 278 -241 -259 -148 -442 -209 226 232 273 140 77 -526 -508 34 -78 -39 311 284 416 -224 -169 -294
7331b94K3l9L12L79K06l70p6l44J11m5o7L56J22l1j08m80M5K2J34L47k38R1M30
$$ -294 -271 -310 2 381 587 217 141 -203 -92 -137 -204 152 274 243 135 -345 -300 -278 -144 203 -35 56 486
7354D86l61k25l93Q0L9L28JL05kj9k74k88M5P8r5J0P18o9r3k67l3l38L8L26J82
$$ 486 125 -100 -493 -413 -374 -46 -45 260 258 239 -35 -323 -278 -200 -295 -285 433 364 271 4 -29 -367 -329 -3 179
7379A79L44Q5o34j79j38M5M4M55j06K91R6k47l53j21n48J97O56J49J05l00J12
$$ 179 523 608 -26 -205 -343 -298 -254 201 95 386 482 235 -118 -239 -787 -590 66 215 320 20 132
7400A32k21k83J07L0J61J18J81m83P35m14m89j42L56K34K7M54l28O2l77J12j52
$$ 132 -89 -372 -265 -235 -74 44 225 -258 477 63 -426 -568 -212 22 49 503 175 237 -140 -28 -180
7421a80K8J10K77N8K9l04k9j84k10M78N8J13K48m59Q1l55O1k02q8N66K69N6k72
$$ -180 -152 -42 235 293 322 18 -11 -195 -405 73 131 244 492 33 114 -241 -180 -382 -470 96 365 421 149
7444A49Rk09M5n94N74m7J66K00j20Q9l73k68P1L84l93L88K39j35k31r8p1k22L84
$$ 149 158 -51 -6 -600 -26 -73 93 293 173 262 -111 -379 -308 76 -317 71 310 175 -56 -154 -225 -447 -63
7467f3K04o3J63j97K20m16k91K48L43j23L84J63r27L44q5J18k29K17K27Q7j51
$$ -63 141 78 241 44 264 -152 -443 -195 148 25 409 572 -355 -11 -96 22 -207 10 237 324 173
7488A73OK37o01o9K9J96l6K74K93m68K46k79l61M2KN85p6L09m15J2k56o8P6o8
$$ 173 179 416 -185 -254 -225 -29 -65 209 502 34 280 1 -360 -318 -316 269 193 502 87 99 -157 -225 -149 -217
7512b17L25M8K79k43J77m24m64K36l8O44l54L05k05J35n79K14QJ58J20m3J22o9
$$ -217 108 156 435 192 369 -55 -519 -283 -321 323 -31 274 69 204 -375 -161 -153 5 125 82 204 135
7534A35k38J67l05k90L04L85O9j57L4J22l88j4p6M59pK24l85q4L14m13m6n6J60
$$ 135 -103 64 -241 -531 -227 158 227 70 104 226 -162 -176 -252 207 200 424 39 -45 269 -144 -190 -246 -86
7557h6K51r9K22r3j82j62on1J5M06j67K84l83L76n43J08j7J95k1J68j09n6N4j3
$$ -86 165 66 288 195 13 -149 -155 -206 -191 215 48 332 -51 325 -218 -110 -127 68 47 215 106 50 104 91
7581I1l99M6J14K70M3R8l23l9j61L17m76M79K86k09L53m27r5L0j90l0L56rJ38
$$ 91 -308 -262 -148 122 165 263 -60 -99 -260 57 -419 60 346 137 490 63 -32 -2 -192 -222 134 125 263
7604B63L78k3p79r0J29K12N5L8j01M36j41n76k54O5L21J81K05J52k55m10K3j80
$$ 263 641 618 -161 -251 -122 90 145 183 82 518 377 -199 -453 -388 -67 114 319 471 216 -194 -171 -351
7626c51J07r3J09qM15L06l73o4m81J47J86m78R42l64N24k06l98m6l10L94l0K18
$$ -351 -244 -337 -228 -236 179 485 112 48 -433 -286 -100 -578 364 0 524 318 -80 -126 -436 -42 -72 146
7648A46mO6K70l10o45L09L94j82J33K8Q9j83O4o60J21K02J68J22K26j38k13jm35
$$ 146 142 208 478 168 -477 -168 226 44 177 205 294 111 175 -485 -364 -162 6 128 354 216 3 2 -433
7671d33J09O5K44J4j8M99m12k64j72k58N42r3L83K09n9l43n4k24j96K00K70j82
$$ -433 -324 -259 -15 -1 -19 480 68 -196 -368 -626 -84 -177 206 415 356 13 -41 -265 -461 -261 9 -173
7693a73M84k10J67l38k16L81m72L63L91k82J3j30j72J20j72K1J57J24L16m28J9
$$ -173 311 101 268 -70 -286 95 -377 -14 377 95 108 -22 -194 -74 -246 -225 -68 56 372 -56 -37
7714c7o7J37l67P5L28m6q7N63l84j92N7r9j54M4J74M14l21L93o09n5j68J82J7
$$ -37 -104 33 -334 -259 69 23 -64 499 115 -77 -20 -119 -273 -229 -55 359 38 431 -178 -233 -401 -219 -202
7737b02L80nR6o00M27o12P7J97O0L34J84j01k2m06K02k21K36M0j12N77j24m61
$$ -202 178 173 269 -331 96 -516 -439 -242 -182 152 336 235 213 -193 9 -212 24 64 -48 529 405 -56
7759e6q5j4q1J57j28L97N1O1l45R7l90J13M97l79K46J07k67J26k94j50n9N04j18
$$ -56 -141 -155 -236 -79 -207 190 241 302 -43 54 -336 -223 274 -105 141 248 -19 107 -187 -337 -396 108 -10
7782a0P8N00q1j69l43j62L83l56K2L07J43l23N9l34N1L28N4l4k6j0L38l45j47
$$ -10 68 568 487 318 -25 -187 196 -160 -138 169 312 -11 48 -286 -235 93 147 113 87 77 415 70 -77
7805g7L7l16J14L12K47o4J13j02n71j30J29M71o4J99J04j91m19j12m4L4L38J19
$$ -77 -40 -356 -242 70 317 253 366 264 -307 -437 -308 163 99 298 402 211 -208 -320 -364 -330 8 127
7827A27K2L2l25K62k6l07O5m6M28l12J86r4J2J04n70q2N48J02M45j64n62K60l28
$$ 127 149 181 -144 118 92 -215 -150 -196 232 -80 106 12 24 128 -442 -524 24 126 571 407 -155 105 -223
7850b23j11J43O0J68M0L84l59k91M6K20k67P9K20K52k2n36J33J9k39JP5L02J21
$$ -223 -334 -191 -131 37 77 461 102 -189 -143 77 -190 -111 109 361 339 -197 -64 -45 -284 -283 -208 94 215
7873B15j0K8j39k30Kj42L9N95j22Q2n0l25k68J25j88K95J13J43l12M9L6j97K08
$$ 215 205 233 94 -136 -134 -276 -237 358 236 318 268 -57 -325 -200 -388 -93 20 163 -149 -100 -64 -261 -53
7896e3m49M29P1K37L04l37k83j28J61J62l87M28l3j80J98J32n08l7J73K70j53
$$ -53 -502 -73 -2 235 539 202 -81 -209 -48 114 -273 155 122 -58 140 272 -236 -273 -100 170 17
7917A7K66j58k04N2k83J94J83k45K21O7n1J16R2n87j52P5N73J83r5Q9l60l8j24
$$ 17 283 125 -79 -27 -310 -116 67 -178 43 110 59 175 267 -320 -472 -397 176 359 264 353 -7 -45 -169
7940a69l32L23L9K58K0j2K70k44m55J18P3J71J26K25k80J51k11n07J80K61k13
$$ -169 -501 -178 -139 119 139 127 397 153 -302 -184 -111 60 186 411 131 282 71 -436 -256 5 -208
7961b08L26Pl9m3N4r4k3k65J47M07J69j64l93l57P0J37J81J63m5K9P6j19M4k75
$$ -208 118 125 86 43 97 3 -20 -285 -138 269 438 274 -119 -476 -406 -269 -88 75 30 59 135 16 60 -215
7985b15L3M1K70J84k78L24n12J81p1J95k29O9R8o3R0J14k78P6j04J3o2J81k7R2
$$ -215 -182 -141 129 313 35 359 -153 28 -43 152 -77 -8 90 27 117 231 -47 29 -75 -62 -124 57 30 122
8009A22j33j67j48j81J87O6K20L59k81K1j16n2n1K49j17K64k09J38k47r2K21k26
$$ 122 -11 -178 -326 -507 -320 -254 -34 325 44 65 -51 -103 -154 95 -22 242 33 171 -76 -168 53 -173
8031a73L21l19M43L2l73J55l24k65M68l02J81N66Q9j39n03j12J43l15J4K56K90
$$ -173 148 -171 272 304 -69 86 -238 -503 -35 -337 -156 410 499 360 -143 -255 -112 -427 -413 -157 133
8052A33j9M2k2l34k60j8M19J39l62N89k72K3j86j78O1k0K75Q4j29L22k57j66o6
$$ 133 114 156 134 -200 -460 -478 -59 80 -282 307 35 58 -128 -306 -245 -265 10 94 -35 287 30 -136 -202
8075b02J49J14J42L17l06j3J23l02m02M04k24M51m53M07K02k22k83l62M54L29
$$ -202 -53 61 203 520 214 201 324 22 -380 24 -200 251 -202 205 407 185 -98 -460 -6 323
8095C23k28K57l22j09K53m58J05r2K16K6L40j4mk79j58p4M0K75J28j27J76l74
$$ 323 95 352 30 -79 174 -284 -179 -271 -55 -29 311 297 293 14 -144 -218 -178 97 225 98 274 -100
8117a00K1Q7k37J22J40J64l42P9Q5j01J28k23j54L57J27k99N17l19o0Jm10J97
$$ -100 -79 8 -229 -107 33 197 -145 -66 19 -82 46 -177 -331 26 153 -146 371 52 -8 -7 -417 -220
8139b20J48L26j68J06j8p6J16m99l9J21L63Q2J83j60j54N3l03J88j08L7M60k22
$$ -220 -72 254 86 192 174 98 214 -285 -324 -203 160 242 425 265 111 164 -139 49 -59 -22 438 216
8161B16j83J70l37J05p0K2J52M8Q8j69j89P5O5O8J36j70J17J28q2l87J25J3l34
$$ 216 33 203 -134 -29 -99 -77 75 123 211 42 -147 -72 -7 61 197 27 144 272 190 -197 -72 -59 -393
8184c93K02J94K87r1n4l2n10
$$ -393 -191 3 290 199 145 113 -397
8191c97
$$ Imaginary data points
##PAGE= N=2
##DATA TABLE= (X++(I..I)), XYDATA
0@%%%kJ0qQj6K4l2L4m2N6p2Q8j05J26j51J79k11K46k87L34l86M47n12N84o65P54
$$ 0 0 0 0 -2 8 0 8 -8 16 -16 18 -24 32 -40 48 -57 69 -82 97 -114 132 -155 179 -207 240 -272 312 -353 401
29D01q52R60j081J213j358J518j693J883k094K325k576K853l159L500l877M294
$$ 401 -451 509 -572 641 -717 801 -892 991 -1103 1222 -1354 1499 -1660 1840 -2037 2257
45B257m760N284n881O566p355Q282r389J0737j2423J4598j7532K1730k8281M0040
$$ 2257 -2503 2781 -3100 3466 -3889 4393 -4996 5741 -6682 7916 -9616 12114 -16167 23873
59B3873o7720K51388K30977l15478m9759L6391l0988j28783N0662Q8284J1350
$$ 23873 -43847 207541 438518 123040 73281 109672 78684 -50099 563 88847 100197
70A00197l7575J2533q3214j42394m5347R4639P1038N5465P3508J9843q3656l4986
$$ 100197 62622 75155 -8059 -150453 -195800 -101161 -30123 25342 98850 118693 35037 51
82E1K4510n8984j06668P5505J90229L2925j23867m9788p5r7981r3202P4956J08449
$$ 51 24561 -34423 -141091 -65586 124643 157568 33701 -16087 -16162 -114143 -207345 -132389 -23940
95b3940m632P016J15140L5387j39147j11131N5139R7457M7675N1722N2912j0129
$$ -23940 -28572 -21556 93584 128971 -10176 -121307 -66168 31289 78964 130686 183598 173469
107A73469m1847l3772p5469r3023J6000J07974M1135k9663J4495L233j22918j22991
$$ 173469 131622 97850 22381 -70642 -54642 53332 94467 64804 79299 82532 -40386 -163377
119a63377N1691J08886j0466k4286J04902R3903q2790j40945l3586K3522P332
$$ -163377 -111686 -2800 -13266 -37552 67350 161253 78463 -62482 -96068 -72546 -65214
130f5214M3197P9443J3375n3151k7305j9278p5293o1867M4825R3217N7573M0071
$$ -65214 -22017 57426 70801 17650 -9655 -28933 -104226 -166093 -121268 -28051 29522 69593
142F9593K0378n9106r1987n678N2743J211o820Q5673R2458l2711r3164l8806k7854
$$ 69593 89971 30865 -61122 -66800 -14057 -12846 -19666 66007 158465 125754 32590 -6216 -34070
155c4070n8286J3188J16775P0005m5205l3762L0024k1182r6669m4974O0308Q3281
$$ -34070 -92356 -79168 37607 107612 62407 28645 58669 37487 -59182 -104156 -43848 39433
167C9433N5376K6042l2243q0849m7153q02k7995l6742M9785J00354J8027n7458
$$ 39433 94809 120851 88608 7759 -39394 -40196 -68191 -104933 -55148 45206 63233 5775
179E775l4831k6484o7315k7215Q1517R0994Q718k92M0321o307q5382n7498J9697
$$ 5775 -29056 -55540 -122855 -150070 -68553 22441 31159 30867 71188 64881 -20501 -77999 -58302
192e8302L3194L3136O7412M2936n2198p7678j7496m837l9281j044P8618P3683
$$ -58302 -25108 8028 75440 118376 66178 -11500 -28996 -33833 -73114 -74158 4460 78143
204G8143J2361j2130l1361o9875m8747L3926N3694P417J7437N7866K902r1838
$$ 78143 90504 78374 47013 -22862 -71609 -37683 16011 23428 40865 98731 101633 9795
216I795p9525n931q8j0924M3744P7482J3054n3112m0269k1713l6385j4439M1562
$$ 9795 -69730 -75661 -75749 -86673 -42929 34553 47607 -5505 -45774 -67487 -103872 -118311 -76749
229g6749N4694L2329L0253Q254o0479q4487j8368L4702J8650J4640N2149M1909
$$ -76749 -22055 10274 40527 48781 -11698 -96185 -114553 -79851 -61201 -46561 5588 47497
241D7497k4706n4849l3931k2178q967M2222P6801M3971J078o052k1865n6449m3099
$$ 47497 22791 -32058 -65989 -88167 -97134 -54912 21889 65860 66938 60886 39021 -17428 -60527
254f0527J7957M1450K2522K3916L2187j0709o8957o5593j8054J3147K9436M4772
$$ -60527 -42570 -1120 21402 45318 77505 66796 -2161 -67754 -85808 -72661 -43225 1547
266A547L8633R207r200j8284m4439n1774K407O2998N5277J1500m792q365l8944
$$ 1547 40180 49387 40187 21903 -22536 -74310 -71903 -8905 46372 57872 53080 44715 5771
279E771o1465l7740M272K6708M0451M3059J4410k6995m1491k9361j5364O899M4837
$$ 5771 -55694 -93434 -89162 -62454 -22003 21056 35466 8471 -33020 -62381 -77745 -70846 -26009
292b6009O0893L4913M580q658k6312n2685m3381P601M5654L9642J6687k475k1512
$$ -26009 34884 69797 74377 65719 39407 -13278 -56659 -49058 -3404 36238 52925 50450 28938
305B8938l8382l9921k6499j014L6864O4091M7059j441k9129k5379k2222k5240
$$ 28938 -9444 -49365 -75864 -76878 -40014 24077 71136 69695 40566 15187 -7035 -32275
317c2275n420L4711N2710L0999o384l4393m7454m2480k2056J303K4183M2698M1357
$$ -32275 -37695 -2984 49726 80725 74341 39948 -7506 -49986 -72042 -70739 -46556 -3858 37499
330C7499R517k8676l9176k5273q492Q517L5038N2797L7962R92k8074m0327l9087
$$ 37499 47016 18340 -20836 -46109 -54601 -46084 -11046 41751 79713 80705 52631 12304 -26783
343b6783k3870K794K7906L9804L0338O58l3595m4419k9021o740R134K8405M9608
$$ -26783 -50653 -47859 -19953 19851 50189 50847 17252 -27167 -56188 -62928 -53794 -25389 24219
356B4219M5737Q095l2802m3987k8100p360Q133K1759L2439K9547M192l3070n5082
$$ 24219 69956 78051 45249 1262 -26838 -34198 -26065 -4306 28133 57680 61872 28802 -26280
369b6280m2028p618J9076K7884L2505L2984J3666k0842m3527l4572n098K2037
$$ -26280 -68308 -75926 -56850 -28966 3539 36523 50189 29347 -14180 -48752 -53850 -31813
381c1813L3489L4463K5411K741k7728m8298m2407j3694J6702L1476L0696K2738
$$ -31813 1676 36139 61550 64291 36563 -11735 -54142 -67836 -51134 -19658 11038 33776
393C3776M346k3236m1438l4239m128K5693L8692L5365K4548M500k2819m4492m1055
$$ 33776 38122 14886 -26552 -60791 -64919 -39226 -534 34831 59379 63879 41060 -3432 -44487
406d4487j0830K0716L2785K5840J4410P79k1555m2432m0807r189K8139M4173L5510
$$ -44487 -55317 -34601 -1816 24024 38434 39213 17658 -24774 -65581 -74770 -46631 -2458 33052
419C3052J7377P03j5525l3022l7021j5439K1479M3360L3854P763j3040k4477l5704
$$ 33052 50429 51132 35607 2585 -34436 -49875 -28396 14964 48818 56581 43541 19064 -16640
432a6640l7625j7145J8581M1955L9211J6518p361k2383k9038k4984r064J8732
$$ -16640 -54265 -71410 -52829 -10874 28337 44855 37494 15111 -13927 -38911 -47975 -29243
444b9243M2495L9785J4069j4179k8682l3509l3073j6806J4516L9145L5572J0734
$$ -29243 13252 53037 67106 52927 24245 -9264 -42337 -59143 -44627 -5482 30090 40824
456D0824j2764k5550k9823k4259o515K0151M2636M4734J9475j4414l0931k6882
$$ 40824 28060 2510 -27313 -51572 -58087 -37936 4700 49434 68909 54495 23564 -3318
468c318k0824j4089R106L6595L9991J1239k2128l5034l1927k1099m352J5805L3370
$$ -3318 -24142 -38231 -29125 7470 47461 58700 36572 1538 -30389 -51488 -55840 -40035 -6665
481f665L8857K5496p522l6686l6582j2947M496J3412K7597L6537J6617j8613l7190
$$ -6665 32192 57688 50166 13480 -23102 -36049 -31553 -18141 9456 45993 62610 43997 6807
494F807l4416k4650p179J9151L5984L1086J3713q081l0488l6371j4162J2084J9973
$$ 6807 -27609 -52259 -59438 -40287 -4303 26783 40496 32415 1927 -34444 -48606 -36522 -16549
507a6549K2910L5532K9246j2802m7409l9520j1654K708J4117K7523K6523J0112
$$ -16549 6361 41893 71139 58337 10928 -28592 -40246 -37538 -23421 4102 30625 40737
519D0737p821k4984m0229k9884J1177L8472L1848K0325J7835k144l5599m0212
$$ 40737 32916 7932 -32297 -62181 -51004 -12532 19316 39641 57476 55332 19733 -20479
531b0479j2122O864J0692K4250L5423J0893k5765l6705l1364k3245K200L4259
$$ -20479 -32601 -25737 -15045 9205 44628 55521 29756 -6949 -38313 -61558 -59358 -25099
543b5099L5827J2777P391R484j8271m7971k6691K0517L6448K6831K0815P948j9500
$$ -25099 10728 23505 30896 40380 22109 -25862 -52553 -32036 4412 31243 52058 60006 40506
556D0506l1836k3140k0520j4201K0692M9016K7694r774j4401j3453l2710k9124
$$ 40506 8670 -14470 -34990 -49191 -28499 20517 48211 38437 24036 10583 -22127 -51251
568e1251J7164M4646K4805P895J5730K280l5490m4668j6376P782K1115L5116K5569
$$ -51251 -34087 10559 35364 43259 58989 61269 25779 -18889 -35265 -27483 -6368 28748 54317
581E4317j1992k9844j4544j3738l0445j0837L7897M7814J8084q32q055k9657l8258
$$ 54317 42325 12481 -2063 -15801 -46246 -57083 -19186 28628 46712 45880 37825 8168 -30090
594c0090n164K3261J4261J1711L1197J9579k7430m4096j9519o120o058K3656N3064
$$ -30090 -35254 -11993 2268 13979 45176 64755 37325 -6771 -26290 -32410 -38468 -14812 38252
607C8252K7291j9017k2262m708j5225k4722O56K9938L3017K6294P283l2721n2010
$$ 38252 65543 46526 24264 19556 4331 -20391 -19735 10203 43220 69514 76797 44076 -7934
620g934j8846J3370n06p949L1176M6803r44m0063k3465q752j9430j221M4875M4299
$$ -7934 -26780 -13410 -13916 -21865 9311 56114 55170 15107 -8358 -17110 -36540 -37761 7114 51413
634E1413K92j4750k809j7963m1112k0878J4329J8903J8645K6695M960m0268m2128
$$ 51413 51705 36955 34146 16183 -24929 -45807 -31478 -12575 6070 32765 37725 -2543 -44671
647d4671m737O336k435J8554M3102K4485l675m688j6040m2909k0353M1305M7109
$$ -44671 -49408 -43072 -45507 -26953 16149 40634 36959 32271 16231 -26678 -47031 -5726 41383
660D1383m076j1576K2026Q47n5435m6657Q268J9881M776K2607L6812j289l8283
$$ 41383 37307 25731 47757 48604 -6831 -53488 -45220 -25339 -20563 2044 38856 37567 -716
673g16k4135l975m588J0846L2952K3389N291J3231J7n1162n4968J1631M4185L409
$$ -716 -24851 -28826 -33414 -22568 10384 33773 39064 52295 52312 1150 -53818 -42187 1998 5407
687E407j0513K4844J7910l7439m2934k936R66j1409K7988O1322J7653l3715j7885
$$ 5407 -5106 19738 37648 209 -42725 -45661 -44695 -56104 -28116 33206 50859 17144 -741
700g41N034j6970k2731J7159L5754J5896J0124R371k4593m9116j8534J4194O204
$$ -741 4293 -12677 -35408 -18249 17505 33401 43525 52896 28303 -20813 -39347 -25153 -18949
713a8949R040L7156K2045k7646k4781P762j2505m4444M538P1007L9538k9374k4161
$$ -18949 -9909 27247 49292 21646 -3135 4627 -7878 -52322 -47784 23223 62761 33387 9226
726I226R264j3353m2372j0727K5832J9873J2787K1305N43l5270l0882l499n45
$$ 9226 18490 5137 -37235 -47962 -22130 -2257 10530 31835 32378 -2892 -33774 -37273 -37818
739c7818L226L4132L5334n781j9150L793r363m6477k1252M1294M1779r86k193
$$ -37818 -34592 -460 34874 29093 9943 13736 4373 -42104 -63356 -22062 19717 18731 16538
752A6538J2502j8585m4135r313K4057M852j759L7581M0642j5834m7244j9835J612
$$ 16538 29040 10455 -33680 -42993 -18936 -14084 -15843 21738 62380 46546 -698 -20533 -18921
765a8921l008P698K5240J4418j377J16j2417m2606l2289J4547K5586N965J5147
$$ -18921 -21929 -14231 11009 25427 24050 24166 11749 -30857 -63146 -48599 -23013 -17048 -1901
778a901K9874p408m8071k0890K0104J113j9765K1575N4697J3291l5855k8803j0690
$$ -1901 27973 20565 -27506 -48396 -28292 -27179 -46944 -25369 29328 42619 6764 -22039 -32729
791c2729j4992n332K2660K1961M032R709J1941k1354m2461j1306K2407J6602J5337
$$ -32729 -47721 -53053 -30393 -8432 -4400 5309 17250 -4104 -46565 -57871 -35464 -18862 -3525
804c525L1116J5746k2465k4123j940r512k0771J2652M5280J8479j5600p978m805
$$ -3525 27591 43337 20872 -3251 -5191 -14703 -35474 -22822 22458 40937 25337 17359 12554
817A2554l2399l0670J7444L5431P281J047K2366P461l3458l3661m047P571R806
$$ 12554 -19845 -50515 -33071 2360 9641 10688 33054 40515 7057 -26604 -30651 -23080 -13274
830a3274K6322K2216r824j9837o166j5666l3773n496L7961K8034k970L819J1577
$$ -13274 13048 35264 25440 5603 -563 -16229 -50002 -55498 -17537 10497 7527 11346 22923
843B2923k0717l9790n700K6007J4398Q672K3393J3842j9737k6404j0615j4033
$$ 22923 2206 -37584 -43284 -17277 -2879 5793 29186 43028 23291 -3113 -13728 -27761
855b7761j3219K0756M0210J0439j8007p316k675k3359k1930J1820K7855J7545
$$ -27761 -40980 -20224 19986 30425 12418 5102 2427 -20932 -42862 -31042 -3187 14358
867A4358J6580J4508j3404l4169j5302M417k753J153K6819K5792j0699k6693j1510
$$ 14358 30938 45446 32042 -2127 -17429 -13012 -15765 -14612 12207 37999 27300 607 -10903
880a0903j3343k3802k392L1998K8684N684m69k317j7178k2370k183J0279J0696
$$ -10903 -24246 -48048 -50440 -18442 10242 15926 15457 13140 -4038 -26408 -28591 -18312 -7616
893g616K0776K7982J983l0926k6048m578o406r952J2793L1250J5585p269j2473
$$ -7616 13160 41142 43125 12199 -13849 -18427 -24833 -34785 -21992 9258 24843 17574 5101
906E101j5517k0838p043J6977K0997J3582J6586J2537j4553l2395j6325L778L267
$$ 5101 -10416 -31254 -38297 -21320 -323 13259 29845 42382 27829 -4566 -20891 -17113 -13846
919a3846N952K1158K0081o273k3391j8833j3941j1231O858K3474K0920R305L661
$$ -13846 -7894 13264 33345 27072 3681 -15152 -29093 -40324 -33466 -9992 10928 20233 23894
932B3894o975k4443k1329L176J5382J1288J2770J9270M950k2748k8431j3950j448
$$ 23894 16919 -7524 -28853 -25677 -10295 993 13763 33033 37983 15235 -13196 -27146 -28594
945b8594N693J6319K0071J0295k004p876j8292k2843n124K1244K3733J0954P124
$$ -28594 -22901 -6582 13489 23784 21780 13904 -4388 -27231 -32355 -11111 12622 23576 30700
958C0700N607j0665k6766j9959j443R762J4993J8284J0289o085j6603j7012j5526
$$ 30700 36307 25642 -1124 -21083 -22526 -12764 2229 20513 30802 24717 8114 -8898 -24424
971b4424p494J2208K4403J7515N113K65p684k2437k2787k059J6946J7594J2433
$$ -24424 -31918 -19710 4693 22208 27321 27586 19902 -2535 -25322 -27381 -10435 7159 19592
984A9592O847k748j5157j9702j5972o424R128K4604K2420M052q672r722j2737
$$ 19592 26439 23691 8534 -11168 -27140 -33564 -24436 168 22588 26640 17968 8246 -4491
997d491j6718p793J3535K3761J6384M163n998j5171j9213j4706m327Q421J9668
$$ -4491 -21209 -29002 -15467 8294 24678 28841 22843 7672 -11541 -26247 -30574 -22153 -2485
1010b485K1549O764j0003j5727j2252r773n877R568K3244K1204N305r046j5953
$$ -2485 19064 25828 15825 98 -12154 -21927 -27804 -18236 5008 26212 31517 22471 6518
1023F518j7598j2823k439Q960J6983J7587P786q543j8417j6208r035j162J0216
$$ 6518 -11080 -23903 -26342 -17382 -399 17188 24974 16431 -1986 -18194 -27229 -28391 -18175
1036a8175K1380K2065O670j0676j6225j3626q667l314P492J7116J9329P529j2296
$$ -18175 3205 25270 31940 21264 5039 -8587 -17254 -20568 -13076 4040 23369 30898 18602
1049A8602k3080j8566n561L347O966J3607J8904J3061o074j9863j9828o529P129
$$ 18602 -4478 -23044 -28605 -25258 -18292 -4685 14219 27280 21206 1343 -18485 -25014 -17885
1062a7885J2840J4865J3024O350n833j8191k1164j2149K299J2489J5686J4432
$$ -17885 -5045 9820 22844 29194 23361 5170 -15994 -28143 -25844 -13355 2331 16763
1074A6763N648p278j7549j6531n819N150J2717J6596J6890Q118o813j9873k0272
$$ 16763 22411 15133 -2416 -18947 -24766 -19616 -6899 9697 26587 34705 27892 8019 -12253
1087a2253p995O147J2278J1096R022N760m886j8957k2879j0089Q136J7498J5218
$$ -12253 -20248 -14101 -1823 9273 18295 24055 19169 212 -22667 -32756 -24620 -7122 8096
1100H096R739M573l049j3273j8727j1209L967J7966J7735P429j795p675j4083
$$ 8096 17835 22408 19359 6086 -12641 -23850 -19883 -1917 15818 23247 21452 13777 -306
1113c06j9077j2863L592J5884J7929J0901J265p235j3353j3527p508N000J6519
$$ -306 -19383 -32246 -28654 -12770 5159 16060 17325 10090 -3263 -16790 -24298 -19298 -2779
$$ [...]
8191i8
##END NTUPLES=NMR FID
##END=
