##TITLE=1H_SA_2l.202
 CDCl3, 8 sc, 
 5.6.2020
##JCAMPDX= 6.0         $$ Bruker NMR JCAMP-DX V2.0
##DATA TYPE= NMR FID
##DATA CLASS= NTUPLES
##ORIGIN= UXNMR, Bruker Analytische Messtechnik GmbH
##OWNER= root
$$ XWIN-NMR		Version 3.5
$$ Fri Jun  5 12:02:24 2020 Russian Standard Time (UT+4h)  she@DPX200
##.OBSERVE FREQUENCY= 200.1315
##.OBSERVE NUCLEUS= ^1H
##.DELAY= (6, 6)
##.ACQUISITION MODE= SIMULTANEOUS
##.ACQUISITION SCHEME= undefined
##.AVERAGES= 8
##.DIGITISER RES= 18
##SPECTROMETER/DATA SYSTEM= spect
##.PULSE SEQUENCE= zg30
##.SOLVENT NAME= D2O
##.SHIFT REFERENCE= (INTERNAL, D2O, 0, 15.7039)
##AUDIT TRAIL= $$ (NUMBER, WHEN, WHO, WHERE, WHAT)
$$ ##TITLE= Audit trail, XWIN-NMR		Version 3.5
$$ ##JCAMPDX= 5.01
$$ ##ORIGIN= Bruker BioSpin GmbH
$$ ##OWNER= she
$$ F:/spectra/data/she/nmr/H-F/1/audita.txt
$$ ##AUDIT TRAIL=  $$ (NUMBER, WHEN, WHO, WHERE, WHAT)
(   1,<2020-06-05 12:01:15.39 +0400>,<she>,<DPX200>,
      <created by zg, POWCHK disabled, PULCHK disabled
       configuration hash MD5:
       00 E9 B6 7A A2 85 ED C7 34 08 36 98 17 FE 4E 26
       data hash MD5: 16K
       07 8E 7E 0E F5 46 2C 0E FD BE 38 9F 2C 43 5F 86>)
$$ ##END=
$$ 
$$ hash MD5
$$ CD E2 59 A6 3A 21 19 4B 99 1C 68 EF 6A 8F 69 74
##$RELAX= 
##$RELAX= 
##$RELAX= 
##$RELAX= 
##$RELAX= 
##$RELAX= 
$$ Bruker specific parameters
$$ --------------------------
##$DU= <F:/spectra>
##$EXPNO= 1
##$NAME= <H-F>
##$PROCNO= 1
##$TYPE= <nmr>
##$USER= <she>
##$AMP= (0..31)
100 100 100 100 100 100 100 100 100 100 100 100 100 100 100 100 100 100 
100 100 100 100 100 100 100 100 100 100 100 100 100 100 
##$AQSEQ= 0
##$AQ_mod= 1
##$AUNM= <au_zg>
##$AUTOPOS= <>
##$BF1= 200.13
##$BF2= 200.13
##$BF3= 200.13
##$BF4= 200.13
##$BF5= 200.13
##$BF6= 200.13
##$BF7= 200.13
##$BF8= 200.13
##$BYTORDA= 1
##$CFDGTYP= 0
##$CFRGTYP= 5
##$CHEMSTR= <none>
##$CNST= (0..31)
1 1 145 1 1 1 1 1 1 1 1 1 1 1 1 1 1 1 1 1 1 1 1 1 1 1 1 1 1 1 1 1 
##$CPDPRG= <>
##$CPDPRG1= <>
##$CPDPRG2= <>
##$CPDPRG3= <>
##$CPDPRG4= <mlev>
##$CPDPRG5= <mlev>
##$CPDPRG6= <mlev>
##$CPDPRG7= <mlev>
##$CPDPRG8= <mlev>
##$CPDPRGB= <>
##$CPDPRGT= <>
##$D= (0..31)
0 1.2 0 0 0 0 0 0 0 0.06 0 0.03 0 0 0 0 0.0002 0 0 0 0 0 0 0 0 0 0 0 0 
0 0 0 
##$DATE= 1591344074
##$DBL= (0..7)
120 120 120 120 120 120 120 120 
##$DBP= (0..7)
150 150 150 150 150 150 150 150 
##$DBP07= 0
##$DBPNAM0= <>
##$DBPNAM1= <>
##$DBPNAM2= <>
##$DBPNAM3= <>
##$DBPNAM4= <>
##$DBPNAM5= <>
##$DBPNAM6= <>
##$DBPNAM7= <>
##$DBPOAL= (0..7)
0.5 0.5 0.5 0.5 0.5 0.5 0.5 0.5 
##$DBPOFFS= (0..7)
0 0 0 0 0 0 0 0 
##$DE= 6
##$DECBNUC= <off>
##$DECIM= 24
##$DECNUC= <off>
##$DECSTAT= 4
##$DIGMOD= 1
##$DIGTYP= 9
##$DL= (0..7)
0 120 120 120 120 120 120 120 
##$DP= (0..7)
150 150 150 150 150 150 150 150 
##$DP07= 0
##$DPNAME0= <>
##$DPNAME1= <>
##$DPNAME2= <>
##$DPNAME3= <>
##$DPNAME4= <>
##$DPNAME5= <>
##$DPNAME6= <>
##$DPNAME7= <>
##$DPOAL= (0..7)
0.5 0.5 0.5 0.5 0.5 0.5 0.5 0.5 
##$DPOFFS= (0..7)
0 0 0 0 0 0 0 0 
##$DQDMODE= 0
##$DR= 18
##$DS= 0
##$DSLIST= <SSSSSSSSSSSSSSS>
##$DSPFIRM= 0
$$ [...]
##$SUBNAM2= <"">
##$SUBNAM3= <"">
##$SUBNAM4= <"">
##$SUBNAM5= <"">
##$SUBNAM6= <"">
##$SUBNAM7= <"">
##$SUBNAM8= <"">
##$SUBNAM9= <"">
##$SW= 24.9337058887773
##$SWIBOX= (0..15)
0 0 2 0 0 0 0 0 0 0 0 0 0 0 0 0 
##$SW_h= 4990.01996007984
##$TD= 16384
##$TD0= 1
##$TE= 0
##$TE2= 300
##$TE3= 300
##$TEG= 300
##$TL= (0..7)
0 120 120 120 120 120 120 120 
##$TP= (0..7)
150 150 150 150 150 150 150 150 
##$TP07= 0
##$TPNAME0= <>
##$TPNAME1= <>
##$TPNAME2= <>
##$TPNAME3= <>
##$TPNAME4= <>
##$TPNAME5= <>
##$TPNAME6= <>
##$TPNAME7= <>
##$TPOAL= (0..7)
0.5 0.5 0.5 0.5 0.5 0.5 0.5 0.5 
##$TPOFFS= (0..7)
0 0 0 0 0 0 0 0 
##$TUNHIN= 0
##$TUNHOUT= 0
##$TUNXOUT= 0
##$USERA1= <user>
##$USERA2= <user>
##$USERA3= <user>
##$USERA4= <user>
##$USERA5= <user>
##$V9= 5
##$VALIST= <valist>
##$VCLIST= <CCCCCCCCCCCCCCC>
##$VD= 0
##$VDLIST= <DDDDDDDDDDDDDDD>
##$VPLIST= <PPPPPPPPPPPPPPP>
##$VTLIST= <TTTTTTTTTTTTTTT>
##$WBST= 1024
##$WBSW= 4
##$XGAIN= (0..3)
0 0 0 0 
##$XL= 0
##$YL= 0
##$YMAX_a= 671856
##$YMIN_a= -664069
##$ZGOPTNS= <>
##$ZL1= 120
##$ZL2= 120
##$ZL3= 120
##$ZL4= 120
##$ABSF1= 10
##$ABSF2= 0
##$ABSG= 5
##$ABSL= 3
##$ALPHA= 0
##$AQORDER= 0
##$ASSFAC= 0
##$ASSFACI= 0
##$ASSFACX= 0
##$ASSWID= 0
##$AUNMP= <proc_1d>
##$AZFE= 0.1
##$AZFW= 0.1
##$BCFW= 1
##$BC_mod= 2
##$BYTORDP= 1
##$COROFFS= 0
##$CY= 11.3945322036743
##$DATMOD= 1
##$DC= 2
##$DFILT= <>
##$DTYPP= 0
##$F1P= 16.9975609425685
##$F2P= -3.02152046262296
##$FCOR= 0.5
##$FTSIZE= 0
##$FT_mod= 4
##$GAMMA= 1
##$GB= 0.15
##$INTBC= 1
##$INTSCL= 1
##$ISEN= 128
##$LB= 0.24
##$LEV0= 0
##$LPBIN= 0
##$MAXI= 10000
##$MC2= 0
##$MEAN= 0
##$ME_mod= 0
##$MI= 1.114404
##$NCOEF= 0
##$NC_proc= 0
##$NLEV= 6
##$NOISF1= 3.799351
##$NOISF2= 2.8
##$NSP= 1
##$NTH_PI= 0
##$NZP= 0
##$OFFSET= 15.70392
##$PC= 1
##$PHC0= -9787.693
##$PHC1= 8.200815
##$PH_mod= 1
##$PKNL= yes
##$PPARMOD= 0
##$PSCAL= 0
##$PSIGN= 0
##$REVERSE= no
##$SF= 200.130013532006
##$SI= 16384
##$SIGF1= 3
##$SIGF2= 2
##$SINO= 400
##$SIOLD= 16384
##$SREGLST= <1H.CDCl3>
##$SSB= 0
##$STSI= 0
##$STSR= 0
##$SW_p= 3612.71676300578
##$SYMM= 0
##$S_DEV= 0
##$TDeff= 0
##$TDoff= 0
##$TI= <>
##$TILT= no
##$TM1= 0
##$TM2= 0
##$TOPLEV= 0
##$USERP1= <user>
##$USERP2= <user>
##$USERP3= <user>
##$USERP4= <user>
##$USERP5= <user>
##$WDW= 1
##$XDIM= 8192
##$YMAX_p= 0
##$YMIN_p= 0
$$ End of Bruker specific parameters
$$ ---------------------------------
##NTUPLES= NMR FID
##VAR_NAME=  TIME,          FID/REAL,        FID/IMAG
##SYMBOL=    X,             R,               I
##VAR_TYPE=  INDEPENDENT,   DEPENDENT,       DEPENDENT
##VAR_FORM=  AFFN,          ASDF,            ASDF
##VAR_DIM=   8192,          8192,            8192
##UNITS=     SECONDS,       ARBITRARY UNITS, ARBITRARY UNITS
##FACTOR=    0.0002004,     1,               1
##FIRST=     0,             0,               0
##LAST=      1.6414764,     0,               0
##MIN=       0,             -664069,         0
##MAX=       1.6414764,     671856,          0
$$ Real data points
##PAGE= N=1
##DATA TABLE= (X++(R..R)), XYDATA
$$ [...]
3493a1387K4081L545k4632q344K2444J2264j7799j3873J3402J2018j0143p982
$$ -11387 12694 16239 -8393 -16737 5707 17971 172 -13701 -299 11719 1576 -6406
3505f406R430N100j2228l633J5541N151j7735j1132J9199J5791j6742k0035J2210
$$ -6406 3024 8124 -4104 -7737 7804 12955 -4780 -15912 3287 19078 2336 -17699 -5489
3518e489K1526p809j8927L338J5026k684j2120M568R511o259j0353Q822J4343
$$ -5489 16037 8228 -10699 -7361 7665 4981 -7139 -2571 6940 681 -9672 -850 13493
3531A3493j0536j9179Q410K3199m538k4056l32K2429M623j8309o609J4300N273
$$ 13493 2957 -16222 -7812 15387 10849 -13207 -13539 8890 13513 -4796 -11405 2895 8168
3544H168j1186j742J0956j03j2998J30J8608L0k1301m293K2543R754k1014j3314
$$ 8168 -3018 -4760 6196 6093 -6905 -6775 11833 11863 -9438 -13731 8812 18566 -2448 -15762
3558a5762J6473J5652j2375j3789Q009J1048o812p744P919P185j2007p863J4302
$$ -15762 711 16363 3988 -9801 -1792 9256 2444 -5300 2619 9804 -2203 -10066 4236
3571D236J1765j6543j6151J5244J9284j1019k1212O340J9276j101j7229m20J3286
$$ 4236 16001 -542 -16693 -1449 17835 6816 -14396 -8056 11220 10119 -7110 -7530 5756
3584E756l37j1088K538J1865p092j3624Q065J7686o180k1997L379K3061J830k1850
$$ 5756 5419 -5669 -3131 8734 1642 -11982 -3917 13769 7589 -14408 -11029 12032 13862 -7988
3598g988o209J8056R754j4127q431J0278O929r468m712J2122K448j4670k793J8240
$$ -7988 -14197 3859 13613 -514 -8945 1333 8262 -1206 -5918 6204 8652 -6018 -8811 9429
3612I429N252j9470r964J9168J2820j4925j6035J0599J6288o628j3972L737J1255
$$ 9429 14681 -4789 -14753 4415 17235 2310 -13725 -3126 13162 6534 -7438 -3701 7554
3625G554m675q716P093Q906j1758r992J2188J4809j2017j8168P904K0808l674
$$ 7554 2879 -5837 1256 10162 -1596 -11588 600 15409 3392 -14776 -6872 13936 10262
3638A0262k0977r57J8194M302j5637l486J1959J350r844J334J1666l102j5413
$$ 10262 -10715 -11672 6522 10824 -4813 -8299 3660 5010 -4834 -3500 8166 5064 -10349
3651a0349L590J8245r04k0106l897J9451R438j7407j1836J3942J1843r578j0480
$$ -10349 -6759 11486 10582 -9524 -13421 6030 15468 -1939 -13775 167 12010 2432 -8048
3664h048Q006Q293r161m633J0785M162j3935o498J5544J1348j5997j3617J2523
$$ -8048 -42 8251 -910 -5543 5242 9404 -4531 -11029 4515 15863 -134 -13751 -1228
3677a228J7004q449j8692M651J6683k449j3571K216R750l180r712P477J0212q951
$$ -1228 15776 7327 -11365 -6714 9969 7520 -6051 -3835 5915 2735 -6977 500 10712 1761
3691A761j4318Q887J7198o270j8940N87K0807K906j8599o590J5370P473j2046
$$ 1761 -12557 -3670 13528 7258 -11682 -11095 9712 12618 -5981 -12571 2799 10272 -1774
3704a774l867Q797J695j0325Q93J2068o27j5046j376J7622N620j8660r698J6404
$$ -1774 -5641 3156 4851 -5474 -4581 7487 6860 -8186 -9562 8060 13680 -4980 -14678 1726
3718A726J4250j4285j3297Q616J3173o566r349O057O178p307o143J0258P932j1435
$$ 1726 15976 1691 -11606 -2990 10183 3617 -5732 325 6503 -804 -6947 3311 11243 -192
3732a92j0800J1269J5043r997j9645P831J9051k759j8136J59J4990Jj0571j25
$$ -192 -10992 277 15320 5323 -14322 -6491 12560 9801 -8335 -8176 6814 6815 -3756 -3881
3746c881Q870l101r373N096J2040n438j5792L175J9671q37j8831n041J7999Q661
$$ -3881 4989 1888 -7485 -2389 9651 4213 -11579 -8404 11267 10430 -8401 -13442 4557 13218
3760A3218j5538r169J1844P139p300o122Q792K156j0402n37J2085K308j4114o324
$$ 13218 -2320 -11489 355 7494 194 -5928 2864 5020 -5382 -5919 6166 8474 -5640 -11964
3774a1964J6011J0364j5500j3668J2305J5222p579j4512M485J1630k967q628L736
$$ -11964 4047 14411 -1089 -14757 -2452 12770 5191 -9321 -4836 6794 3827 -4801 -1065
3787a065O670n825q206Q909J0230j0143j3800Q159J8106m929j8728J362J6730
$$ -1065 5605 -220 -8426 483 10713 570 -13230 -5071 13035 8106 -10622 -9260 7470
3800G470J893j4311m061J1378L728q598k282R510j643j0079J931J3638j820j6502
$$ 7470 9363 -4948 -9009 2369 6097 -2501 -4783 4727 3084 -6995 -5064 8574 6754 -9748
3814i748q35J7680N160j6718q749J4457J0191j0510r707O881P751n886n119N660
$$ -9748 -10583 7097 12257 -4461 -13210 1247 11438 928 -8779 -1898 5853 -33 -5152 508
3828E08N903j0601l926J2191P132j4428r794J2594J4804j1059j5828O527J5220
$$ 508 6411 -4190 -8116 4075 11207 -3221 -13015 -421 14383 3324 -12504 -5977 9243
3841I243k151j3344J174R872r31q513K910Q376n700r873P289J3271q192j5738
$$ 9243 7092 -6252 -5078 4794 3863 -4650 -1740 6636 936 -8937 -1648 11623 3431 -12307
3855a2307M468J8382o58j7930k677J4674O290j1750o067Q753M076q361r50Q296
$$ -12307 -7839 10543 9885 -8045 -10722 3952 10242 -1508 -7575 1178 5254 -3107 -4057 4239
3869D239J73j0925n11J4093K482j5305o746J6038R433j4056j0784R185J2765p152
$$ 4239 4412 -6513 -7024 7069 9551 -5754 -12500 3538 12971 -1085 -11869 -2684 10081 2929
3883B929j0869M110R419n231o100O699N887r745p045J0428J1462j1865j3432R355
$$ 2929 -7940 -3830 5589 358 -5742 957 6844 -2901 -9946 482 11944 79 -13353 -3998
3897c998J5520n997j4509O81J4216K296j2348j605R258N0p526K116P877l333j1340
$$ -3998 11522 5525 -8984 -8303 5913 8209 -4139 -5744 3514 3564 -3962 -1846 6031 2698 -8642
3912h642M318J4611l330j6837m43J7725N173j7600p039J3473P558q816p086O853
$$ -8642 -4324 10287 6957 -9880 -10323 7402 12575 -5025 -12064 1409 8967 151 -6935 -82
3926h2M730p435k439R368J351j1779k771J2294O672j3622q712J1182J3278q340
$$ -82 4648 -2787 -5226 4142 5493 -6286 -9057 3237 9909 -3713 -12425 -1243 12035 3695
3940C695j4993N962J3805m597j0712M420O767m202o267N953P063q174q270Q017
$$ 3695 -11298 -5336 8469 3872 -6840 -2420 4347 145 -6122 -169 6894 -1280 -9550 -1533
3954a533J2141o580j5328L139J6903Q24j5849k671J2671L637j0627j931P249J392
$$ -1533 10608 4028 -11300 -8161 8742 9566 -6283 -8954 3717 7354 -3273 -5204 2045 3437
3968C437q163J825R428k669r853p17J4148K432j5668n153J4476Q132j1693j0260
$$ 3437 -4726 -2901 6527 3858 -5995 -6712 7436 9868 -5800 -10953 3523 11655 -38 -10298
3982a0298Q986R509p116o629O073L646n865l593Q598M300j0900o151J0461J0905
$$ -10298 -1312 8197 1081 -5548 525 4171 -1694 -5287 3311 7611 -3289 -9440 1021 11926
3996A1926j0685j3270P903J4606n856j2871K276J0286K68q937J000O448l087n965
$$ 11926 1241 -12029 -4126 10480 4624 -8247 -5971 4315 4583 -4354 -3354 3094 7 -5958
4010e958N245Q050n877j0812M877J3589j488j6882q5J5715L691j3529n052R836
$$ -5958 -713 7337 1460 -9352 -4475 9114 7626 -9256 -9341 6374 10065 -3464 -8516 1320
4024A320N307p864l346P370J230p543J11R443N66j1796l571J4015O135j3468r609
$$ 1320 6627 -1237 -4583 2787 4017 -3526 -3415 6028 6594 -5202 -8773 5242 11377 -2091 -11700
4039a1700J1584J1146q319j0700N440Q216l653o459M050M702n310n328Q021O557
$$ -11700 -116 11030 2711 -7989 -2549 5667 2014 -4445 -395 4307 -1003 -6331 1690 8247
4053H247q669j0154R232J1690p085j3878M093J4062j153j2131j220R594J893p851
$$ 8247 -422 -10576 -1344 10346 3261 -10617 -6524 7538 6385 -5746 -6966 2628 4521 -3330
4067c330PP160j762q195L252J0852l465j3257J903J4970J369j5141l803J2778
$$ -3330 -3323 3837 2075 -6120 -2868 7984 4519 -8738 -6835 8135 9504 -5637 -9440 3338
4081C338O535r826o916P043O015n610l956N772K689q019k335J0815L194j2046
$$ 3338 9873 47 -6869 174 6189 579 -3377 2395 5084 -2935 -5270 5545 8739 -3307
4095c307o332J2090R309j0465j1110P423J1078l799j0380J765Q284k009o521L099
$$ -3307 -9639 2451 11760 1295 -9815 -2392 8686 4887 -5493 -3728 4556 2547 -3974 -875
4109h75O139n614o980P487Q989p511j1715N591J3631k865j3596p11J2649L090
$$ -875 5264 -350 -7330 157 9146 1635 -10080 -4489 9142 6277 -7319 -8030 4619 7709
4123G709j0505l609P706L226o801r53P314p60q820J739J1119p90j2904j811J3600
$$ 7709 -2796 -6405 1301 4527 -2274 -3227 4087 3327 -5493 -3754 7365 6575 -6329 -8140 5460
4138E460M895j1713p764R166Q974o821q184M980O485m473m679O322K903q149l851
$$ 5460 10355 -1358 -9122 44 9018 2197 -5987 -1007 5478 1005 -3674 2648 5551 -2598 -6449
4153f449R689O352j0371r004Q839J1165o308j2105L076J1515q48r886K13P344
$$ -6449 3240 9592 -779 -9783 -944 10221 3913 -8192 -5116 6399 5551 -4335 -4122 3222
4167C222n83o862K946O978n151p896N082J0531m007j2592J662J3255J558j2609
$$ 3222 2639 -4223 -1277 5701 550 -7346 -2264 8267 4260 -8332 -6670 6585 8143 -4466
4181d466m045J0750N228q432m571O747K907o290q05P086J75q906p53J1088K579
$$ -4466 -8511 2239 7467 -965 -5536 1211 4118 -2172 -2977 4109 4284 -4622 -5375 5713 8292
4196H292j1781n723J1117Q548r193r841O636R866m493q411L868N563m134l751
$$ 8292 -3489 -9212 1905 10453 1260 -8581 -1945 7921 3428 -4983 -1115 4448 314 -3437
4210c437M951M306p220n639P960Q480p381j1337N543J2242j987j2557m46J0531
$$ -3437 1514 5820 -1400 -7039 921 9401 2020 -9317 -3774 8468 6481 -6076 -6522 4009
4224D009J719q914p89O482m77n328J851O566k615r221K710J1059m70j2463k417
$$ 4009 5728 -3186 -3975 2507 2030 -3298 -1447 5119 2504 -6717 -4007 7052 6582 -5881 -8298
4239h298J2627M712j0616o520Q846N856n946m506M348L028n458j602P485J616
$$ -8298 4329 9041 -1575 -8095 751 6607 661 -3845 503 3531 -1927 -3529 3956 5572
4253E572q891l731J0510N800r871q654Q073J0557n817j0239L230R060k115o918
$$ 5572 -3319 -7050 3460 9260 -611 -9265 -1192 9365 3548 -6691 -3461 5599 3484 -3434
4267c434J934N152l046m558M432N481n667p932N882J0303m084j2232J865J2240
$$ -3434 -1500 3652 606 -3952 480 5961 294 -7638 -1756 8547 4463 -7769 -5904 6336
4281F336M65j0779k328Q519K334o003j896N063L96n431M32Q012j251r675m92J1652
$$ 6336 6801 -3978 -6306 2213 4547 -1456 -3352 1711 2107 -3324 -2892 5120 3869 -5806 -6298 5354
4297E354K753j1793n162J0197O560p680p248N546O747m256m720L474L817n020
$$ 5354 8107 -3686 -8848 1349 7909 229 -7019 -1473 5274 1018 -3702 -228 3589 -1431
4311a431l126O880L917q257o100Q909Q218p670r760M984J0572k434r430L62P484
$$ -1431 -4557 2323 6240 -2017 -8117 792 9010 1340 -8420 -3436 7136 4702 -4728 -4366 3118
4326C118K53n808N13M908j961n738L505P646m127r334L099J0912p03j1612j622
$$ 3118 3371 -2437 -1924 2984 1023 -4715 -1210 6436 2309 -7025 -3926 6986 6283 -5329 -6951
4341f951J0477L437q408m604O352M088m694k852M922J161o228o24P861J368r676
$$ -6951 3526 6963 -1445 -6049 303 4391 -303 -3155 1767 2928 -3300 -3924 3937 5305 -4371
4356d371l271J0590N453r658p435P283Q012m079q409L021O359k184m783K905M070
$$ -4371 -7642 2948 8401 -1257 -8692 -1409 6603 2524 -5885 -2864 3495 1311 -3472 -567 3503
4371C503m660m421O505N842o836q115O229R400l741j0660J573J0168O57q302j723
$$ 3503 -1157 -5578 927 6769 -67 -8182 -1953 7447 3706 -6954 -5381 4787 5444 -2858 -4581
4386d581O486J128n032j93N802j887o830K894Q288k314r653j80J0654K759j0274
$$ -4581 1905 3033 -1999 -2192 3610 1723 -5107 -2213 6075 3761 -5892 -6072 4582 7341 -2933
4401b933m748Q701N595n975o218M811M202m510k653M883J600o631j661Q352K812
$$ -2933 -7681 1020 6615 640 -5578 -767 3435 -1075 -3728 1155 2755 -3876 -5537 2815 5627
4416E627q784n155Q131P645o444r253M532Q669j588q085J463N304j125m657L175
$$ 5627 -3157 -8312 -181 7464 1020 -8233 -3701 4968 3380 -4705 -3242 2062 937 -3720 -545
4431e45M421m837m959N104O882m567q756K787J0739r64j0054j626R025L217p512
$$ -545 3876 -961 -5920 -816 6066 1499 -7257 -4470 6269 5305 -4749 -6375 2650 5867 -1645
4446a645k778N641J623m770j42N511j265o162J7Q793M14r561k383Q535N722q283
$$ -1645 -4423 1218 2841 -1929 -2071 3440 2175 -3987 -3970 4823 5237 -4324 -6707 1828 7550 -733
4462g33o404O048O722m695n097K798L890l531k690N155J743o250l046O663N477
$$ -733 -7137 -1089 5633 938 -4159 -1361 2529 -1002 -3692 1463 3206 -3044 -6090 573 6050
4477F050o733p632N856Q660l214r290J694P872k68o377L97N134j243m534K891
$$ 6050 -683 -8315 -2459 6201 2987 -6303 -4609 3263 2995 -3382 -2985 2149 906 -3628 -737
4492g37M691l252o255L108Q254j789r256r01J0523J739q553l350O887M012n357
$$ -737 3954 702 -5553 -2445 5809 4020 -5236 -6137 4386 6125 -2428 -5778 1109 5121 -236
4507b36k737L816J796m014n10M995J53o629j456P703L680q715n551P810O742o122
$$ -236 -2973 843 2639 -1375 -1885 3110 3263 -3366 -4822 2881 6561 -2154 -7705 105 6847 725
4523G25o858L574O328k452m873J477L761k492l474M353L274m678n060N112P423
$$ 725 -6133 -2559 3769 1317 -3556 -2079 1682 -810 -4284 69 3343 -1335 -6395 -1283 6140
4538F140m860q356K600R236p66q744n45O782J467m607p19L591O7l782J099N248
$$ 6140 1280 -7076 -4476 4760 3994 -4750 -5295 1487 2954 -1653 -2372 1219 1286 -2496 -1397 3851
4554C851j816o766Q08R020M76r104k488Q580L959o690n154N055M459l885l063
$$ 3851 2035 -4731 -3923 5097 5573 -3531 -6019 2561 6520 -170 -5324 -269 4190 305 -2758
4569b758L156J918l666j497N185J740o982l429P896N417p416p069N368P646l175
$$ -2758 398 2316 -1350 -2847 2338 4078 -2904 -6333 1563 6980 -436 -7505 -2137 5509 2334
4584B334p226J701N452n81n146J601M247k991l835L428N261m380o691L643Q792
$$ 2334 -4892 -3191 2261 1680 -3466 -1865 2382 -609 -4444 -1016 4245 -135 -6826 -3183 5609
4599E609k544q337L2Q424K147p644k324N210K603l911j464L768O24m619L05O478
$$ 5609 3065 -5272 -5240 3184 5331 -2313 -4637 573 3176 -735 -2199 1569 2193 -2426 -2121 4357
4615D357k10p994l23Q471K037q078l676N939N421m313n761K894M819k137m108
$$ 4357 4147 -3847 -4170 4301 6338 -1740 -5416 523 5944 1631 -4130 -1236 3583 1446 -2662
4630b662L127K383m287k337N419L379o183m818N298O616m161q006K257P508m62
$$ -2662 465 2848 -1439 -3776 1643 5022 -1161 -5979 -681 5935 1774 -6232 -3975 3533 3071
4645C071o722m73N451J39l838P01L658k161l661K373O204l099p421K039Q017O06
$$ 3071 -3651 -4124 1327 1466 -2372 -1671 1987 -174 -3835 -1462 4742 1643 -5778 -3739 4278 4884
4661D884q418k097P526L426n201l912M654K131l108k056M265P85n342K83N660
$$ 4884 -3534 -5631 1895 5321 120 -3792 862 2993 -115 -2171 2094 2879 -2463 -2180 3480
4676C480J321o898l177O815M913o167n911M258O738l050n874J951M727k329l459
$$ 3480 4801 -2097 -5274 1541 6454 287 -5624 -1366 5372 2322 -3552 -1601 3126 797 -2662
4691b662K997K338l518l634M517M896m599o211L566P614k198p886J63P001J557
$$ -2662 335 2673 -845 -4479 38 4934 335 -5876 -2310 5304 3106 -4780 -4617 2384 3941
4706C941o557r19M840K80l889J411L433j923m256J667N866k28p582q20P958K975
$$ 3941 -2616 -3535 1305 1585 -2304 -893 2540 617 -3639 -1972 3894 3666 -3916 -4736 3222 6197
4722F197p124m148O140L930l998m261L545K489k849j517L915R11m568k114O161
$$ 6197 -927 -5075 1065 4995 997 -3264 281 2770 -79 -1596 2319 3230 -1338 -3452 2709
4737B709K870o245m054M319O654l840p556L109N962j637m481O52L610j395k874
$$ 2709 5579 -666 -4720 -401 6253 2413 -5143 -2034 3928 2291 -2190 -1538 2072 677 -2197
4752b197J718L763l013m734L154O434l101o893Q43Q193L17p677j246N921K169
$$ -2197 -479 3284 271 -4463 -1309 5125 2024 -4869 -4026 4167 4484 -3193 -4439 1482 3651
4767C651m802j316L411Q70k539n17L709l14n158m74P002J128o919k880O546M180
$$ 3651 -1151 -2467 944 1814 -725 -1242 2467 2153 -3005 -3479 3523 4651 -2268 -5148 1398 5578
4783E578n825m318L784M835k335l854J789K783k529j653L083K291m678l115N162
$$ 5578 -247 -4565 -781 4054 1719 -2135 -346 2437 -92 -1745 1338 3629 -1049 -4164 998
4798I98M414m579o165L555O475j566o563J90N281R38m662K19L161n83l384J231
$$ 998 5412 833 -5332 -1777 4698 3132 -3431 -3241 2040 2978 -1684 -1465 1696 1113 -2271 -1040
4814a040L757j401n841K248O761r43p529l29P250J831o081k836M346L140k952
$$ -1040 2717 1316 -4525 -2277 4484 3541 -3988 -4317 2933 4764 -1317 -4153 193 3333 381
4829C81k598K949J108l040j099M491J122n454j860O087K942n959m130M726N296
$$ 381 -2217 732 1840 -1200 -2299 2192 3314 -2140 -4000 2087 5029 -930 -5060 -334 4962
4844D962l004n670J920M826j042l354J247K224j998k321K592L488l917m573M399
$$ 4962 1958 -3712 -1792 3034 1992 -1362 -115 2109 111 -2210 382 3870 -47 -4620 -221
4859b21N152l319o006J368O077M08n787j675N563J347l186j772L598P6m449J203
$$ -221 4931 1612 -4394 -3026 3051 3459 -2328 -4003 1560 2907 -279 -2051 1547 1623 -2826 -1623
4875a623N023j388n937Q56O362O38o003k818N751L769l920l957K388L171k109
$$ -1623 3400 2012 -3925 -3069 3293 3931 -2072 -4890 861 4630 710 -3247 -859 2312 203
4890B03j937K330J277l498j062M483J945n240k971M916M315m451n051L222N058
$$ 203 -1734 596 1873 -1625 -2687 1796 3741 -1499 -4470 446 4761 310 -4741 -1519 3539
4905C539j163n136M61M133m0l616J358K601j958l305L010L602k876m424K040N784
$$ 3539 2376 -2760 -2299 1834 1794 -1822 -464 2137 179 -3126 -116 3486 610 -3814 -1774 4010
4921D010j142n785r18N724K152m846k182L406K032l136p14L055k73l594j85M978
$$ 4010 2868 -2917 -3835 1889 4041 -805 -2987 419 2451 -685 -1399 1656 1383 -2211 -2396 2582
4937B582j9n365j387N486L575n802m314M561M729l503m025J990K874j104k610
$$ 2582 2563 -2802 -4189 1297 4872 -930 -5244 -683 4046 543 -3482 -1492 1382 278 -2332
4952b332K541J158l115j600M030K750m033m075L788N076k058o056J017N295O88
$$ -2332 209 1367 -1748 -3348 682 3432 -601 -4676 -888 4188 2130 -3926 -2909 2386 3074
4967C074m914l42L797j58k597K60K976j313l888J978M855j362n365j86N763J717
$$ 3074 -1840 -2182 1615 1457 -1140 -880 2096 783 -3105 -1127 3728 2366 -2999 -3185 2578 4295
4983D295o178j989M705K462l170k531K394J812k632q18K619L30l311r19M182J780
$$ 4295 -1883 -3872 833 3295 125 -2406 -12 1800 -832 -1650 969 1299 -2012 -2931 1251 3031
4999C031m685l059N124L752l831m792K688M602j696l611P82K933q25k403J458
$$ 3031 -1654 -4713 411 4163 332 -4460 -1772 2830 1134 -2477 -1695 1238 413 -1990 -532
5014e32J925j692l104L294L603k739n286K593N393q66o009j64N762L89l367j163
$$ -532 1393 -299 -3403 -109 3494 755 -4531 -1938 3455 2589 -3420 -3584 2178 2567 -800 -1963
5030a963K169J008k540M93L111q21m382J542M473P4n732j502N568K734m611k796
$$ -1963 206 1214 -1326 -833 2278 1457 -2925 -1383 3090 3164 -2568 -4070 1498 4232 -379 -3175
5046c175K910L209k334k738J138K439j922j561L280N25l374j758M015K718l883
$$ -3175 -265 2944 610 -2128 -990 1449 -473 -2034 1246 1771 -1603 -3361 654 3372 -511
5061e11m245L529M584k304m463L60M913o33l344K36K218j30k282J111L166j546
$$ -511 -4756 -1227 3357 1053 -3410 -3050 1863 1230 -2114 -1878 340 210 -2072 -961 2205 659
5077F59m139K108M488j321n261M8N607J520n198k035M357J590k565j710K645O30
$$ 659 -3480 -1372 3116 1795 -3466 -3418 2189 3709 -1489 -3524 833 2423 -142 -1852 793 1423
5093A423k673O7L191l97m242k25M746J888m951k864M099M146l639l488J834K951
$$ 1423 -1250 -1183 2008 1611 -2631 -2856 1890 3778 -1173 -4037 62 4208 569 -2919 -1085 1866
5109A866r05k885J271J985j758j748K104K368l391k901L152M161k967m045J286
$$ 1866 961 -1924 -653 1332 -426 -2174 -70 2298 -1093 -3994 -842 3319 352 -3693 -2407
5124b407N034q15m423m03M492O23k875j199L014k17k546P98L497j992l771J189
$$ -2407 2627 1812 -2611 -3014 1478 2101 -774 -1973 1041 824 -1722 -924 2573 581 -3190 -2001
5140b001N006K10n538n96M242K535m331k266K462K287k247j344K122P79k506q88
$$ -2001 3005 3215 -2323 -2919 1323 3858 -473 -2739 -277 2010 -237 -1581 541 1320 -1186 -2074
5156b074L837M95m362q75L392L655m151l741K532M353j651m036P40K935k53k502
$$ -2074 1763 2258 -2104 -2979 413 4068 -83 -3824 -1292 3061 1410 -2626 -1886 1049 796 -1706
5172a706J297J477j642j926K570K445k350l784J892M561j185m709m10N132P27
$$ -1706 -409 1068 -574 -2500 70 2515 165 -3619 -1727 2834 1649 -3060 -3470 1662 2389
5187B389m126r50L211J344k938l48K704o20k782Q74L847p73l991j63M127J370
$$ 2389 -1737 -2687 524 1868 -1070 -1418 1286 666 -2116 -1242 2605 1832 -2159 -2322 1805 3175
5203C175l963l265M637L082k578l286J918K288j904j011J165J182k646r73K944
$$ 3175 -788 -4053 584 3666 1088 -2198 -280 2008 104 -907 258 1440 -1206 -2179 765
5218G65J947l325l259L754L255j959m380J734L813r43l682J46K871o4k108P85
$$ 765 2712 -613 -3872 -118 3137 1178 -3202 -1468 2345 1402 -2280 -2134 737 673 -1435 -650
5234f50K254j892k276J893K659j369l422M49M924l81m245r26M279J902l482k570
$$ -650 1604 -288 -2564 -671 1988 619 -2803 -2354 2570 2189 -2056 -2982 1297 3199 -283 -2853
5250b853L116J569k532k06K314P6k939K4L107J282m690r72L709L260m325k820
$$ -2853 263 1832 -700 -906 1408 1484 -1455 -1431 1676 2958 -1732 -2704 1005 4265 -60 -2880
5266b880K479L084j555k563N06K208p57j753J396J515j961k029K575K718k921
$$ -2880 -401 2683 1128 -1435 -929 1279 522 -1231 165 1680 -281 -2310 265 2983 62
5281F2l603K074M257m83n100M75L742P32l578k51K138K16j978R82J799p56k399
$$ 62 -3541 -1467 2790 2307 -2793 -2318 1424 2156 -1422 -1673 465 681 -1297 -315 1484 728 -1671
5298a671J95L229N82m693o09M480J612m338j951L258J988k235j094J166J703j873
$$ -1671 -1476 1753 2335 -2358 -2967 1513 3125 -1213 -3164 94 2082 -153 -1247 -81 1622 -251
5314b51j126K452M53k750r58L457J929l573l012L215L555k179l441Q88L272k66
$$ -251 -1377 1075 1528 -1222 -2180 1277 3206 -367 -3379 -164 3391 1212 -2229 -1341 1931 1665
5330A665l392O02K005m61j623J465J320j441l104J968M226k145m373J462M966
$$ 1665 -1727 -1125 880 419 -1204 261 1581 140 -2964 -996 3230 1085 -3288 -1826 3140
5345C140p83l905q24L105J377k192j787K482L21k116J006J747r6l518O8L929Q32
$$ 3140 2357 -1548 -2372 733 2110 -82 -1869 613 934 -1182 -176 1571 1475 -2043 -1975 1954 2786
5362B786m490o90K151L024k826k403J906K605k006j395J077R57p73j173J832J696
$$ 2786 -1704 -2394 -243 2781 -45 -2448 -542 2063 57 -1338 -261 696 -77 -1250 582 2278
5378B278l165j708L345K059j912l090J019L608q58l040J63K437N73k490P71J102
$$ 2278 -887 -2595 750 2809 897 -2193 -1174 2434 1576 -1464 -1301 1136 1709 -781 -10 1092
5394A092o97j816J138K221q68l227P55M046n68m566l68M497Q91k758k327K772
$$ 1092 395 -1421 -283 1938 1070 -2157 -1402 2644 2076 -2490 -2858 1639 2530 -228 -2555 217
5410B17J277j450j316J254P56j470l48K643j17l234m46L599J289k551l086K133
$$ 217 1494 44 -1272 -18 738 -732 -1080 1563 1446 -1788 -2234 1365 2654 103 -2983 -850
5426h50L744j588l391R26L234j495j771R98J470j269j838K500J657k518k799K562
$$ -850 2894 1306 -2085 -1159 2075 580 -1191 -193 1277 8 -1830 670 2327 -191 -2990 -428
5442d28K957j003l857N95L554L71l635q92L261N25j384k12J670m69j846K42K408
$$ -428 2529 1526 -2331 -1736 1818 2189 -1446 -2338 923 1448 64 -148 1522 1053 -793 -551 1857
5459A857n71l180l3L603Q14l515k097L161K092j799j747J559J055j335j534J940
$$ 1857 1286 -1894 -1927 1676 2490 -1025 -3122 39 2131 332 -1415 144 1199 -136 -1670 270
5475B70J129k555m26K608J370k889k380K337L652l054l249K491K801j174k662
$$ 270 1399 -1156 -1582 1026 2396 -493 -2873 -536 3116 62 -3187 -696 2105 931 -1731
5490a731K01L383q84k142R42J080q29j343J187J379o25k824R07L730j74l566q02
$$ -1731 -1530 1853 969 -1173 -231 849 20 -1323 -136 1243 618 -2206 -1299 2431 2257 -1309 -2111
5507b111K872J323k433j266J299K070k072q13K162P20l401k7L035P43l502q45
$$ -2111 761 2084 -349 -1615 -316 1754 -318 -1131 1031 1751 -1650 -1677 1358 2101 -1401 -2246
5523b246K497K810l243k436K160K395j288k389J462J168j481m52J483O55j827
$$ -2246 251 3061 -182 -2618 -458 1937 649 -1740 -278 890 -591 -1043 440 1095 -732
5538g32j592K867J767k408k677J905L521j407k828l43L004K48k458j16J928K22
$$ -732 -2324 543 2310 -98 -2775 -870 2651 1244 -1584 -1927 1077 1325 -1133 -1249 679 901
5554I01j177n39K538j580j802J110K605k17m261J114K954N80l368j527L805K85
$$ 901 -276 -815 1723 143 -1659 -549 2056 1839 -2422 -1308 1646 2226 -1142 -2669 1136 1421
5570A421r51k244K042R02j114o62J486j33j695p64K571J793l159k505L339K385
$$ 1421 470 -1774 268 1170 56 -606 880 747 -948 -1712 859 2652 -507 -3012 327 2712
5586B712k767j801L32K472k7k161K48K220j411q88N80J385j819j276J469K683
$$ 2712 -55 -1856 -1524 948 921 -1240 -992 1228 -183 -1071 -491 894 -925 -2201 -732 1951
5602A951j030l184K43L996m03l113m14K288J005j960n05J858o15r58L96J966n31
$$ 1951 921 -2263 -2020 1976 1573 -1540 -1954 334 1339 -621 -1126 732 117 -841 -445 1521 990
5619I90l674Q71L142J105l632j052L283K243k776l098K738J253q73j951J505N24
$$ 990 -2684 -1813 1329 2434 -1198 -2250 1033 3276 500 -2598 140 1393 520 -1431 74 598
5635E98o05j402J838R74k475j589K796K043l242j958K034L684j054l256K29J962
$$ 598 -7 -1409 429 1403 -1072 -2661 135 2178 -1064 -3022 -988 2696 1642 -1614 -1385 577
5651E77l72r93L80J259m00j381R02K032j547k212J463J832n61k824rL251J353
$$ 577 205 -788 -408 851 451 -930 -28 2004 457 -1755 -292 1540 979 -1845 -1854 1397 2750
5668B750k811j942J948J366j519q75J888J35j753k81K406M91k385j449K987Q67
$$ 2750 -61 -2003 -55 1311 -208 -1083 805 940 -813 -1094 1312 1803 -582 -2031 956 1823
5684A823k043j856J866K413k293r39K24K070p29j793Q90J453j192j370J189J832
$$ 1823 -220 -2076 -210 2203 -90 -1029 -805 1265 536 -1257 -367 1086 -106 -1476 -287 1545
5700A545j675j952J897J800j66k874q0L043j83k417o99L003j24j481j028J474
$$ 1545 -130 -2082 -185 1615 1449 -1425 -1505 1538 1355 -1062 -1761 1242 1118 -363 -1391 83
5716H3M35k208J283K225j731j737K72L393k50k690j154K176J773k028j874J298
$$ 83 518 -1690 -407 1818 87 -1650 -1378 2015 1765 -925 -2079 97 1870 -158 -2032 -734
5732g34K459j074j350J015N48j749k27O09K182j935j749K536K204k352k778J276
$$ -734 1725 651 -699 316 864 -885 -1112 -503 1679 -256 -2005 531 2735 383 -2395 -1119
5748a119L337r36k512l89K568r87o65J01R44l53j629J580J661j581k734J837L094
$$ -1119 2218 1282 -1230 -1619 949 -38 -703 -602 342 -11 -1640 -60 1601 20 -2714 -877 2217
5765B217r76k832p05K650J330l061N93J273N23r65p46R42N04j047Q5J336P82l029
$$ 2217 1241 -1591 -2296 354 1684 -1377 -784 489 1012 47 -699 243 747 -300 -215 1121 1903 -1126
5783a126m10K826J248k995k303K789K046j669j560M79J152r27O9R43O01j551n34
$$ -1126 -1536 1290 2538 -457 -2760 29 2075 406 -1154 -675 477 -450 -381 562 1163 -388 -922
5800i22J473J560k142k361K166K807j761k874M88L062q34j271k64J607j06j559
$$ -922 551 2111 -31 -2392 -226 2581 820 -2054 -1566 1496 662 -609 -873 734 628 -931
5816i31K32J733j286j720J760K734j020m245J657K838N15l362p66K140J069j570
$$ -931 -699 1034 -252 -1972 -212 2522 1502 -2743 -1086 1752 2267 -1095 -1861 279 1348 -222
5832b22n52R82O55j511j12P93J069k299J70J999N74k714j421L119K081j955k819
$$ -222 -774 208 863 -648 -760 33 1102 -1197 -1027 972 1546 -1168 -2589 530 2611 656 -2163
5849b163J584J527j1k078J17J866l60j462M50J696j765r73J513J681r06k594Q15
$$ -2163 -579 948 937 -1141 -1024 842 482 -980 -530 1166 -599 -1572 -59 1622 716 -1878 -1063
5866a063L148n5l250l78J786R57k212M16J465Q5j738O73J401j12k375Q8K244p2
$$ -1063 2085 2030 -1220 -1598 188 1145 -1067 -651 814 899 -839 -166 1235 1123 -1252 -1164 1080 1008
5884A008k110n00K221J615j832k026J114L021j957j767O18J222j276r20K226P76
$$ 1008 -1102 -1602 619 2234 402 -1624 -510 2511 554 -1213 -595 627 -649 -1569 657 1433
5900A433k240r09K160J556j578k116Q20K204k19k274J68J494N45j524M60J011
$$ 1433 -807 -1716 444 2000 422 -1694 -874 1330 1111 -1163 -995 499 1044 -480 -20 991
5916I91j060r97J219J126q31j686J009K478j006k609r90K896J276j473j600J097
$$ 991 -69 -1066 153 1279 448 -1238 -229 2249 1243 -1366 -2356 540 1816 343 -1257 -160
5932a60J394j456r91J246L51j205J53J645n14r14j600K615J536j699k186J564
$$ -160 1234 -222 -1213 33 384 -821 -668 977 463 -451 -2051 564 2100 401 -1785 -221
5948b21K443j494k035R33J600l79j293K12O54o06r69J694J192j270k641K351K079
$$ -221 2222 728 -1307 -374 1226 847 -446 -234 420 -186 -1155 539 1731 461 -2180 171 2250
5965B250j862j568m28K813j25j533j098J609J091k291R65M25L13j462R21J123
$$ 2250 388 -1180 -1608 1205 1080 -453 -1551 58 1149 -1142 -177 248 561 -901 20 1143
5981A143o64q92j169L041O99k703j587K859R62j285j733J101J652j488n73J268
$$ 1143 479 -413 -1582 1459 2158 -545 -2132 727 1689 404 -1329 -228 1424 -64 -637 631
5997F31M48k158p90K178J574k813o40J622J824j903k155J661K185q18k250L28
$$ 631 1079 -1079 -1869 309 1883 -930 -1570 52 1876 -27 -2182 -521 1664 846 -1404 -1076
6013a076J751j37j372L8J038k90j324J221J520j108j962M59K755j74k813L88J627
$$ -1076 675 538 -834 -796 242 -48 -1372 -151 1369 261 -1701 -1242 1513 1339 -1474 -1086 541
6030E41J356k430j316K146K49j036K18Q17rj404J47J498O85k251o40K502P76j929
$$ 541 1897 -533 -1849 297 546 -490 -272 545 536 -868 -721 777 1462 -789 -1429 1073 1849 -80
6048h0j502Q40K513p50k661J365K16J60j137M05J256p94j600K050J452j405j998
$$ -80 -1582 -742 1771 1021 -1640 -275 -59 101 -1036 -631 625 -169 -1769 281 1733 328 -1670
6065a670J098K006r56k040Q1J800O87j617r5P24O20j559L69J497j180j200J025
$$ -1670 -572 1434 478 -1562 -1481 319 1006 -611 -706 18 638 -921 -552 945 -235 -1435 -410
6082d10J822r23k373Q26J993J73j064j674J628J177j075j338O71J265r35J11M45
$$ -410 1412 489 -1884 -1058 935 1108 44 -1630 -2 1175 100 -1238 -567 698 -237 -126 319
6099C19R23j862j56J469J119k512j082K295J105r67j769Q95J946j463j575L02
$$ 319 1242 -620 -776 693 1812 -700 -1782 513 1618 651 -1118 -223 1723 260 -1315 -1013
6115a013J730r2k007Q42O62m34q67L83J679q82j024k48K454k57k124l26J985O01
$$ -1013 717 625 -1382 -540 122 -312 -1179 -796 883 1 -1023 -1271 1183 926 -1198 -1524 461 1062
6133A062k104K45J195n17n68O17M24J02j433m81K463J37j890m73J662J186j703
$$ 1062 -1042 -797 398 -119 -687 -70 354 456 -977 -1458 1005 1142 -748 -1221 441 1627 -76
6150g6j563J335J880r64j580P99P77j056p86Q84J435j748o11J619J217j207j970
$$ -76 -1639 -304 1576 612 -968 -169 608 -448 -1234 -350 1085 -663 -1274 345 1562 355 -1615
6167a615J354J976o41k207k22K860n56j396n13J646o77o85M18K87J11r81N41J735
$$ -1615 -261 1715 1074 -1133 -1355 1505 949 -447 -960 686 9 -676 -258 29 140 -841 -300 1435
6185A435m59j773o88K023n65l76q57J213J863j374j387M92R83j521J83J455o12
$$ 1435 976 -797 -1485 538 -27 -403 -1260 -47 1816 442 -945 -453 530 -991 -808 647 35
6202C5j029m02J625R14j95j636j8K047j260j349Q90J230m3j319O53O47r07l74
$$ 35 -994 -1396 229 1143 948 -688 -706 1341 81 -1268 -378 852 809 -510 143 790 -117 -491
6220d91N93K67l50j478J921M44lk229N84J681lj849P5K125p90n74o51J008j57
$$ -491 102 369 19 -1459 462 906 903 -1326 -742 939 936 -913 -838 1287 497 -77 -728 280 123
6239A23n54J43J462j072o35j692L007O76k132j387J821J622j695j659J981R57
$$ 123 -431 -288 1174 102 -533 -2225 782 1458 -674 -2061 -240 1382 -313 -1972 9 966
6255I66q60p44J400L59q68n40N44N40j596o87J404J658m23k534N46J828n03l35
$$ 966 106 -638 762 1121 253 -287 257 797 -799 -1486 -82 1576 1153 -1381 -835 993 490 155
6273A55l91j99L62j60K16P17j305n66M84K551j185k342K6K358Q17k016j139K107
$$ 155 -236 -435 -73 -233 -17 700 -605 -1171 -687 1864 679 -1663 -1637 721 1538 -478 -1617 490
6291D90J657k962l35M97J117q4l20J26M2q02q32K898o56q02j904K530K28j607
$$ 490 2147 -815 -1150 -653 464 380 60 186 228 -574 -1406 1492 836 34 -1870 660 888 -719
6309g19l31L56J022K82j625J357J13j07r50Q11J26m33j440J602R59q23j324J89
$$ -719 -1050 -694 328 610 -1015 342 455 348 -602 209 335 -98 -1538 64 1023 200 -1124 -935
6327i35K019L30j526j247K282K08k002J15J268L19j590j23J243J45j508L00J917
$$ -935 1084 1414 -112 -1359 923 1131 -871 -756 512 831 -759 -882 361 506 -1002 -702 1215
6344A215J91k837K05J374J482k527r58J961R46o57j192M35P68r42l91K169j583
$$ 1215 1406 -1431 -1226 148 1630 -897 -1855 106 1052 395 -797 -362 406 -536 -927 1242 -341
6361c41k31j483J863J612j734m51J170J262k224o59J223O25n14j46o42K85N76
$$ -341 -572 -2055 -192 1420 -314 -765 405 1667 -557 -1216 7 632 118 -28 -670 -385 191
6378A91q68J025N77j160j489J709J658q94k422O75J512O01j088l54p4J668p93
$$ 191 -677 348 925 -235 -1724 -15 1643 749 -1673 -998 514 1115 27 -327 -401 1267 474
6395D74j295J842n07j476P55M53L20j453j04K256j40j873p55J692J405r78k035
$$ 474 -821 1021 514 -962 -207 246 566 -887 -991 1265 1125 -748 -1503 189 1594 616 -1419
6412a419O86K083j049j009K7J742j694n8J184N92n53j448J343k32j02j390M18
$$ -1419 -733 1350 301 -708 -681 1061 -633 -691 493 1085 532 -916 427 195 93 -1297 -879
6429h79J545k84j548j26K935j001n59o91M14k76P36n77K099j632j819J370M11
$$ -879 666 382 -1166 -1292 1643 642 83 -608 -194 -470 266 -311 1788 156 -1663 -293 118
6446A18J136j107j526K039N58j702j263K610O90j915j287J203J879j605N38L9
$$ 118 1254 147 -1379 660 1218 -484 -1747 863 1553 -362 -1649 -446 1433 -172 366 405
6462D05m53l64Q5J132J167k701q10J630R95p14j779J403J692j192r60N13O60q18
$$ 405 -48 -412 -327 805 1972 -729 -1539 91 1086 372 -1407 -4 1688 496 -464 49 709 -109
6480a09j04m3O17j765q3J183J610O0k194K11J767n23k072L17J648M94j581L99
$$ -109 -213 -256 361 -1404 -1487 -304 1306 1366 -828 -617 1150 627 -1445 -1128 520 1014 -567 -168
6498a68R74l12p51nP5J110j901Q90J998k2j714j891K773j5o62j980J589o1K9r7
$$ -168 806 494 -257 -262 -187 923 -978 -88 1910 1888 174 -1717 1056 1041 379 -1601 -12 -73 -44 -141
6518a41K40m5q32P68J37k43L48j754J464J394r22j247m1J301m90j265J197J122
$$ -141 99 54 -778 -10 127 -116 232 -1522 -58 1336 414 -833 -874 427 -63 -1328 -131 991
6536I91n4j602J26N79J65j407K60J777k90r33o29K050P04k053j279K181J174j959
$$ 991 937 -665 -539 40 205 -1202 -942 835 545 -388 -1017 1033 1737 -316 -1595 586 1760 -199
6554a99o54N33J299n78J22k74R98j568j445K279J245k947j56K464m8j256o05O58
$$ -199 -853 -320 979 401 523 249 1247 -321 -1766 513 1758 -1189 -1345 1119 1071 -185 -790 -132
6572a32J297q55j277Q14R33K42l05j433J247r54p6N96P00j270L89L43R96j406
$$ -132 1165 310 -967 -153 780 1022 717 -716 531 -423 -499 97 797 -473 -84 259 1255 -151
6590a51j686J379J306r29o99l84J291J45p09l09R76o2j174J361R76j192j004O2
$$ -151 -1837 -458 848 -81 -780 -1164 127 272 -437 -746 230 168 -1006 355 1331 139 -865 -803
6608h03J524M47o85j660K438j06k210L91J243N3l30j516O62J342j095K25p7J699
$$ -803 721 1168 483 -1177 1261 1155 -1055 -664 579 632 302 -1214 -552 790 -305 -80 -157 1542
6626A542k252j307J882J459j691q65M06J779p12n57r04K111M27j945l64K434k95
$$ 1542 -710 -2017 -135 1324 -367 -1232 -826 953 241 -316 -1220 891 1318 -627 -991 1443 1148
6643A148j839M77P91j107n38N73J012L91j555j014K723R6j828N68l20j18k63q90
$$ 1148 -691 -214 577 -530 -1068 -495 517 908 -647 -1661 1062 1158 -670 -102 -422 -540 -803 -1693
6661a693K175l83l24r28J859N67j286j721J009K122j061k424J267K567k010p33
$$ -1693 482 99 -225 -1153 706 1273 -13 -1734 -725 1397 336 -2088 -821 1746 -264 -997
6677i97J435n23J056p06K16J061j544j152Q40J214m37k113Q32J199k73j465R21
$$ -997 438 -85 971 265 481 1542 -2 -1154 -314 900 463 -1650 -818 381 108 -1357 -436
6694d36M19J080q28j223P57O20o77o3J338p57j458M45J883m95j620r90K373m12
$$ -436 -17 1063 235 -988 -231 389 -288 -351 987 230 -1228 -783 1100 605 -1015 -2005 368 -44
6712d4l86j147R08K679k458N6j47J212j139Q29R9J03n05m3N38J075j677q20R85
$$ -44 -430 -1577 -669 2010 -448 -392 -539 673 -466 363 462 565 60 17 555 1630 -47 -867 118
6731A18p32N51o3kR84N5r56q11J563O0j183O91Q70j116j089K47J228k40o53j022
$$ 118 -614 -63 -126 -128 856 911 -45 -856 707 767 -416 275 1145 29 -1060 -813 415 175 -478 -1500
6751a500J566L31o62j240J380P70q31r05J915n7j042p15J377n07r92K15J160R58
$$ -1500 66 397 -265 -1505 -125 645 -186 -1091 824 767 -275 -990 387 -120 -1112 -897 263 1221
6769A221k052j76P89n6K80j083O59M27Q09j674O41J796j291q25J159J085k221
$$ 1221 -831 -1007 -218 -274 6 -1077 -418 9 818 -856 -215 1581 290 -535 624 1709 -512
6786e12l16N04J888j487j572J599N48j058j28j31K962k221K59q31j18O62k86l67
$$ -512 -828 -324 1564 77 -1495 104 652 -406 -534 -665 2297 76 335 -496 -614 48 -238 -605
6804f05P58j62j923J423J284k45j615k58R13K085p61j947N90O99k99r64J344m54
$$ -605 153 -9 -1932 -509 775 530 -1085 -1343 -430 1655 894 -1053 -463 236 -63 -1027 317 -137
6822a37p25K64J545n33n72j077J733k98L11p93N14P50j514j069P48J626J55j576
$$ -137 -862 -598 947 414 -158 -1235 498 200 511 -282 232 982 -532 -1601 -853 773 928 -648
6840f48m09Q06M14k539J968J23o2N80N14K94j502p14P17Q07J93j27r37Q91L71
$$ -648 -1057 -251 163 -2376 -408 -285 -347 233 747 1041 -461 -1175 -458 349 542 415 -522 369 740
6859G40m97m75M30M45j929J016J550j225n05j60J524L86j372q89J150K67l23k040
$$ 740 243 -232 198 643 -1286 -270 1280 55 -450 -610 914 1300 -72 -961 189 456 133 -1907
6877a907J754P15K05r83P79M7k46r49L74J687k094k73J760J32j632l30Q98J791
$$ -1907 -153 562 767 -216 563 610 364 -585 -211 1476 -618 -891 869 1001 -631 -961 -63 1728
6895A728j211k56o07k67O64n36J019K87m11j278J305R57j377j868J311R70N78
$$ 1728 517 261 -346 -613 51 -485 534 821 410 -868 437 1394 17 -1851 -540 430 1008
6912A008j659o9J913j229M22n36nN07r19R4j97QM10r87K577M33k445m28R89P73
$$ 1008 -651 -720 1193 -36 386 -150 -155 352 -567 -473 -670 -662 -252 -1239 1338 1771 -674 -1102 -113 660
6932F60o83n57k2O73o95P95o70l95J375j347Q61P21j231n44J641lK58k010J183
$$ 660 -23 -580 -602 71 -624 171 -499 -894 481 -866 -5 716 -515 -1059 582 579 837 -1173 10
6951A0p0J110l95r38O45j66M4j510J196k0M19o78R67j045L67q51N0J068n04o79
$$ 10 -60 1050 655 -283 362 196 240 -1270 -74 -94 325 -353 614 -431 -64 -915 -865 203 -301 -980
6971i80J65J318j045K14j15J369j481N0P63K29j052n4L67O51n48j281J130J133
$$ -980 -815 503 -542 -328 -443 926 -555 -505 258 487 -565 -619 -252 399 -149 -1430 -300 833
6989H33m4k606K277J15l55n5p40J389N31j488m55J205n38p46J095j319K44L22
$$ 833 789 -1817 460 575 220 165 -575 814 1345 -143 -598 607 69 -677 418 -901 -657 -335
7007c35p07J610L44r65j91J231j164m19l79P16O64n41m42J449j39j016p34J246
$$ -335 -1042 568 912 -53 -244 987 -177 -596 -975 -259 405 -136 -578 871 732 -284 -1018 228
7025B28mj799J458J154k17j704N63J269r13p3k69q35J979n35p92L40J212j524
$$ 228 224 -1575 -117 1037 820 -884 -321 948 35 -38 -307 -1142 837 302 -490 -150 1062 -462
7043d62q30M25K146r74j590O34J619N60l086J313J428k61j039mL9L17o97O08J399
$$ -462 -1292 -867 1279 305 -1285 -651 968 1528 -1558 -245 1183 922 -117 -121 -82 235 -462 146 1545
7062A545k440M14n28K179n02p32q55K208j167l38j286K867k54j298k40M36O13
$$ 1545 -895 -481 -1009 1170 668 -64 -919 1289 122 -216 -1502 1365 1111 -187 -427 9 622
7079F22n24j145J346K11j282J42J069n3o56l64Q05J179j866m70J095J505j408
$$ 622 98 -1047 299 510 -772 -630 439 386 -270 -634 171 1350 -516 -986 109 1614 206
7096B06M37p57J368j268P62j679J485r99L78O88L1m83j051R46N47o66j36k71M70
$$ 206 643 -114 1254 -14 748 -931 554 -445 -67 621 652 169 -882 64 611 -55 -191 -462 8
7115Hj128Q13p16J018l39q14O58k12M83o5k82J434m27j302j40J769P12k045L51
$$ 8 -1120 -307 -1023 -5 -344 -1158 -500 -712 -229 -294 -576 858 431 -871 -1011 758 1470 -575 -224
7134b24j33O94l85l42J231k8M72k076P58Q60j160K14O96n67n34m24p4J522o3p82
$$ -224 -357 337 -48 -390 841 813 1285 -791 -33 827 -333 -119 577 10 -524 -948 -1022 500 437 -345
7154c45j21J440r03q91K91J518n36j088M29j57P83j093Q7J806j084j329M08n2
$$ -345 -466 974 71 -820 -529 989 453 -635 -206 -363 420 -673 -586 1220 136 -1193 -785 -837
7172h37J65R38l98K35n0r8J48J54P32k265Q00J357J44k427J256Q29M47k353Q27
$$ -837 -672 266 -132 103 53 -45 103 257 989 -1276 -476 881 1025 -1402 -146 683 1130 -1223 -396
7191c96O13L39k74q28o94J535J01L92L94j265N68j332P26J006L05k472J201M97
$$ -396 217 556 282 -546 -1240 295 396 788 1182 -83 485 -847 -121 885 1190 -1282 -81 416
7209D16p61J32n1J714q47k051J733l15m79K28o61J382p16r07k33J779j642K20
$$ 416 -345 -213 -264 1450 603 -1448 285 -30 -509 -281 -942 440 -276 -1183 -1416 363 -1279 -1059
7227a059J199P20q28n7k04%R50o45M6N75j310R04j165J250j158K54k19J549M08
$$ -1059 140 860 32 -25 -229 -229 721 76 122 697 -613 291 -874 376 -782 -528 -747 802 1210
7246A210k220R15O73J110j986o17R74O96l26l86m83J376j190K28J162j62j110
$$ 1210 -1010 -95 578 1688 -298 -915 59 755 429 43 -440 936 -254 -26 1136 974 -136
7263a36n04J024L60l55j232J010k37M08j529J218O90j8j238k24Q62m0p1r50Q52
$$ -136 -640 384 744 389 -843 167 -70 338 -1191 27 717 699 -539 -763 99 59 -12 -962 -110
7282a10J556k575P98L67o6q08l2P77Q38j227l13J370O48p18j672K210j87J12j904
$$ -110 1446 -1129 -331 36 -30 -838 -870 -93 745 -482 -795 575 1223 505 -1167 1043 856 968 -936
7301i36K91J952j020j136J130Q13r53j280J05K163j077p59P14R68q13p25J24k76
$$ -936 -645 1307 287 -849 281 1094 141 -1139 -1034 1129 52 -707 7 975 162 -563 -439 -715
7319g15J794j336j01P63P0M43k074K266j260n07J340M79K22j805N91m77K60Q9
$$ -715 1079 -257 -358 405 475 918 -1156 1110 -150 -657 683 1162 1384 -421 170 -307 -47 42
7337D2n8k28QN10m85n49J141n27J459j011J268j493k75L26o2L30n97l05J216n19
$$ 42 -16 -244 -236 274 -211 -760 381 -146 1313 302 1570 77 -198 128 66 396 -201 -506 710 191
7357A91P47j253P42n02R60r49M2Q1o05N95Q39j378L07J28J097j700p0P65J155
$$ 191 938 -315 427 -75 885 -64 -22 59 -546 49 888 -490 -183 -55 1042 -658 -728 37 1192
7376A192n08j183M82K85M20j155O66P14r95N75j468R93m99P52q79J620o37j341
$$ 1192 684 -499 -17 268 688 -467 199 913 -82 493 -975 18 -481 271 -608 1012 375 -966
7394i66O54J262p98J47j514J81J086j014J337p84M08K50j105N42J750j982o2J146
$$ -966 -312 950 152 299 -1215 -1034 52 -962 375 -409 -1 249 -856 -314 1436 -546 -608 538
7412E38P14o21j849P00M70L80p78o62K247j381M72j39P88q13j189K158n4q1j586
$$ 538 1252 631 -1218 -518 -48 332 -446 -1108 1139 -242 230 91 879 66 -1123 1035 981 900 -686
7431f86N79M15k65k75M75l50m70K88O9J54k63n1N46r9M63q24N1K88J014o31j515
$$ -686 -107 308 43 -232 243 -107 -577 -289 -220 -66 -329 -380 166 67 530 -294 -243 45 1059 428 -1087
7452a087Q63J213r95r22M87K66K32r58J280Q60j400p91J218Q84j860p15J704J630
$$ -1087 -224 989 -6 -928 -441 -175 57 -901 379 1239 -161 -952 266 1150 -710 -1425 279 1909
7470A909j920l89l44J040k7j577L63J454j85K51j311J219p41j577K137O90r33
$$ 1909 -11 -400 -744 296 269 -1308 -945 509 324 575 -736 483 -258 -1835 302 992 59
7487E9j270R47J368o34j367J437l53J121j365q97J191J040j408L40r58L35J258
$$ 59 -1211 -264 1104 470 -897 540 187 1308 -57 -954 237 1277 -131 209 -749 -414 844
7504H44j578M46O35n10n64j62J802j500P00j45o51R76r90J696l00j023J278j047
$$ 844 -734 -288 347 -163 -727 -889 913 -587 113 -32 -683 293 -697 999 699 -324 954 -93
7522i3J10J59o22L92N65o16m50PO30M36p76n07K263j075j78p98J043p50J37N35
$$ -93 17 176 -446 -54 511 -105 -555 -548 82 518 -258 -765 1498 423 245 -553 490 -260 -123 412
7542D12m5R06j625M51l69J182j778O95K97M62j785J749j150J139L55q94j29J123
$$ 412 367 1273 -352 99 -270 912 -866 -171 126 588 -1197 552 -598 541 896 2 -127 996
7560I96l44q76O59l4q91L27q66N92J370l55l41K72Q16j808J328n45p75n94O13
$$ 996 652 -224 435 401 -490 -163 -1029 -437 933 578 237 509 1325 -483 845 300 -475 -1069 -456
7579d56J149O08j96r18J16J50r68o70K545O2k757J454O44j28j171J071k66P92
$$ -456 693 1301 1105 187 303 453 -515 -1185 1360 1422 -1335 119 763 635 -536 535 269 1061
7597A061j903N14q12J486K88k098M75J033j157N9K437j617j50n82Q95M79o58L37
$$ 1061 -842 -328 -1140 346 634 -1464 -989 44 -1113 -1054 1383 -234 -384 -966 -71 408 -250 87
7615H7m85K19R70j358M24L45m34J90P05j85m44N04j352J649p40r7J234k25p52
$$ 87 -398 -179 791 -567 -143 202 -232 -42 663 478 34 538 -814 835 95 -2 1232 1007 255
7634B55q34K090o55L78j099j160K065q54M9K34m95o33K65R85j64p02M27n84J045
$$ 255 -579 1511 856 1234 135 -1025 1040 186 235 469 -26 -659 -394 591 427 -275 152 -432 613
7653F13r58j3Q47R18j297j04j21m41Q28N23j378L81J070j439m9Q77N49j121Q06
$$ 613 -345 -358 489 1407 110 6 -115 -556 272 795 -583 -202 868 -571 -620 257 806 -315 491
7672D91m08P26P01k740J071N64o08j467K401p8L66o34K26N55q27j373M19J067
$$ 491 83 809 1510 -1230 -159 405 -203 -1670 731 653 1019 385 611 1166 339 -1034 -615 452
7690D52n03r27o79R62J037r41O33M52q98k27P37n08O90o70o05J398p35J65J151
$$ 452 -51 -978 -1657 -695 342 -599 34 486 -412 -639 98 -410 280 -390 -995 403 -332 -167 984
7709I84l60P8j007o85J349K55p86k39O39Q6M26j077N45N51l43n40k71L04o72J212
$$ 984 624 702 -305 -990 359 614 -172 -411 228 314 740 -337 208 759 416 -124 -395 -91 -763 449
7729D49m82J182j555M96n69J278q4j917J396Q85o45j854R44J851j140l99O38j82
$$ 449 -33 1149 -406 90 -479 799 715 -1202 194 1079 434 -1420 -476 1375 235 -164 474 292
7747B92J11J64j673J545N62k353R08N36k46p6m04K58M51m66L54P69m14j604J825
$$ 292 403 567 -1106 439 1001 -1352 -444 92 -154 -230 -634 -376 75 -391 -37 732 318 -1286 539
7766E39q56P03K66o17L92J564k265k22M85P78j604k72Q51K14k71J345k228O55
$$ 539 -317 386 652 35 427 1991 -274 -496 -11 767 -837 -1109 -258 -44 -315 1030 -1198 -543
7784e43R07j981J601O84j158o25K026k048J838q46M79j80N31j505J80R20P3P1
$$ -543 364 -1617 -16 668 -490 -1115 911 -1137 701 -145 334 154 685 -820 -640 280 353 424
7802D24j179K133j542p0o95J975j765J80N08K28O01j417N38m5Q53m03q45m09R70
$$ 424 -755 1378 -164 -234 -929 1046 -719 -539 -31 197 798 -619 -81 -126 727 324 -521 -930 40
7821D0K25j543J299O10j146P53j147M40K69K70p83K128j366j67L05N47P22j236
$$ 40 265 -1278 21 631 -515 238 -909 -469 -200 70 -713 1415 49 -118 187 734 1456 220
7839B20m12j410J750J35m13K48r08j65J747L95j631j019N88J562P10q81j620L67
$$ 220 -192 -1602 148 283 -130 118 -790 -955 792 1187 -444 -1463 -875 687 1397 516 -1104 -737
7857g37J875p5j862Q41O97j616J172M87r11M58j127R40J54m19l62J38J845j150
$$ -737 1138 1063 -799 42 739 -877 295 782 -129 329 -798 142 296 -123 -485 -347 1498 348
7875C48q49P6J42j735J528k07J588k016J46L78J392j052J18j07M91P7q48L93R59
$$ 348 -501 -425 -283 -2018 -490 -697 891 -1125 -979 -601 791 -261 -143 -250 241 318 -530 -137 822
7894H22K13p19j141O38q1l01O24l09k07N49J067q53Mn95j30K104r84m10m24J57
$$ 822 1035 316 -825 -187 -268 -569 55 -254 -461 88 1155 302 306 -289 -419 1685 701 291 -133 24
7914B4j96J71r27J480j075M35L78P0j261J047k09J112l18j306J210k57Q12j238
$$ 24 -172 -1 -928 552 -523 -88 290 360 -901 146 -63 1049 731 -575 635 378 1190 -48
7932d8l40L78M87j269J381n86J006k04o38k86L51j318L09J279l81k86J97l26Q32
$$ -48 -388 -10 477 -792 589 3 1009 805 167 -119 232 -1086 -777 502 121 -165 32 -294 538
7951E38j72j489Q16N14j411J435j064O37m92J130k41r5L46n56k22O29L20j730
$$ 538 366 -1123 -307 207 -1204 231 -833 -196 -688 442 201 106 452 -104 -326 303 623 -1107
7969a107k68J798O94j713j19J570j225O70j463Q6J100L65q21N2J942j001l79M00
$$ -1107 -1375 423 1117 -596 -715 855 -370 300 -1163 -1077 23 388 -433 -381 1561 560 181 581
7987E81j1k35j634K006o59R2j363J245o48J253n74j34O58o11l60j08J46J267j054
$$ 581 570 335 -1299 707 48 140 -1223 22 -626 627 53 -81 577 -34 -394 -502 -356 911 -143
8006a43O58oK42j342K48M58j71p2J86K45J192j316j46K52l24q3n17J284j24n54
$$ -143 515 509 751 -591 -343 115 -56 -128 58 303 1495 179 33 285 -39 -122 -639 645 521 -33
8026c3l81J46J086o64j165N59L78R02j234N0N69p8l06k64Q74o80K37l50J435k09
$$ -33 -414 -268 818 154 -1011 -452 -74 828 -406 -356 213 135 -171 -435 439 -241 -4 -354 1081 872
8046H72q46N14o27J111p84j90j73P15k100P03r2P57q25L09P34M04n18m67J040
$$ 872 26 540 -87 1024 240 50 -123 592 -1508 -805 -897 -140 -965 -656 78 482 -36 -503 537
8065E37R1j249P08k8M18j259L39J622j487L52k4L15L97r56o60J702n98k08k68
$$ 537 628 -621 87 59 477 -782 -443 1179 -308 44 20 335 732 -224 -884 818 220 12 -256
8084b56J090q23K24j052P57LO36k276J176N81l88p93J54J978j357J62L94M85k454
$$ -256 834 11 235 -817 -60 -57 579 -1697 -521 60 -328 -1121 -967 1011 -346 -184 210 695 -1759
8103a759J065q5J434j653N84k33J342j60n34k09Q01m26j411J564O38j38p88k167
$$ -1759 -694 -779 655 -998 -414 -647 695 535 1 -208 593 167 -1244 320 958 820 32 -2135
8121b135K402Q75p88j430O09K04N5K97k13m5j993J655J109J57j528q94J400J67
$$ -2135 267 1142 354 -1076 -467 -263 -208 89 -124 -169 -2162 -507 602 759 -769 -1663 -263 -96
8139i6l63R75k84J240j468j92K14N10%n60M51o61O98j219J875j418J176r05j471
$$ -96 -459 516 232 1472 4 -188 26 536 536 -24 427 -234 464 -755 1120 -298 878 -27 -1498
8158a498J026P91N51j352J628p41p06P68L87j246k16J457p15O70j73p26N74M09
$$ -1498 -472 319 870 -482 1146 405 -301 467 854 -392 -608 849 134 804 631 -95 479 888
8176H88j333J87L96K08J47r84M40J359r10q23lN04k70k3J81
$$ 888 -445 -258 138 346 493 -491 -51 1308 398 -425 -428 76 -194 -217 -36
8191c6
$$ Imaginary data points
##PAGE= N=2
##DATA TABLE= (X++(I..I)), XYDATA
0@%%%qJ6j6J6k5M1m9O5q8J11j35J60j95K36k82L30l90M65n37O17p21Q34r49J081
$$ 0 0 0 0 -8 8 -8 8 -17 24 -25 40 -48 63 -72 88 -107 129 -153 177 -213 252 -285 332 -389 445 -504 577
27E77j236J403j580J781k009K253k517K812l139L495l878M301m776N294n854O479
$$ 577 -659 744 -836 945 -1064 1189 -1328 1484 -1655 1840 -2038 2263 -2513 2781 -3073 3406
43C406p183P958q817R793j0906J2174j3639J5368j7436J9951k3097K7172l2679
$$ 3406 -3777 4181 -4636 5157 -5749 6425 -7214 8154 -9282 10669 -12428 14744 -17935
56a7935M0570n2901P5045j26891M56273K92483r81210L8044P31854J51243p00960
$$ -17935 22635 -30266 44779 -82112 374161 666644 -314566 -276522 455332 606575 -94385
67i4385j40284N05408J20125n05616l6151M74209j6847o12630J4711O89654N8891
$$ -94385 -234669 270739 390864 -114752 -150903 323306 306459 -306171 -291460 398194 457085
78D57085q02288j91622P85073L31201p23846m28500N74506M67871m43235m16813
$$ 457085 -345203 -536825 248248 579449 -144397 -572897 1609 469480 26245 -390568
88c90568L51044L50702l30623k66402M00084K66643m78082l01504N68846M35185
$$ -390568 -39524 311178 -19445 -285847 114237 380880 -97202 -398706 170140 605325
98F05325n65557n41203N15212O58079l68724o69388K38333O40953j12189n40857
$$ 605325 39768 -501435 13777 671856 303132 -366256 -127923 513030 400841 -140016
108a40016P6323M63158r8115m17157J71232M41536k41728n32791K53044O30198
$$ -140016 -63693 399465 301350 -115807 55425 496961 255233 -277558 -24514 605684
118F05684k08734p31019P9128P39749M3538p05287j82358N82687K18963m91861
$$ 605684 396950 -334069 -254941 484808 528346 -176941 -359299 223388 442351 -49510
128d9510k24965L98797J43761m12133r1564M56610M5173n60098r3153O30702J82119
$$ -49510 -274475 124322 268083 -144050 -235614 220996 266169 -293929 -387082 243620 425739
139D25739o57221l09291O01392M25311m93910m79561L71491M79285k63621m07508
$$ 425739 -231482 -540773 60619 485930 -7980 -487541 -116050 363235 99614 -307894
149c07894K39546L49706k58260k90990L45596L21275l98800l80852M37213M97461
$$ -307894 -68348 281358 23098 -267892 77704 398979 179 -380673 56540 554001
159E54001l73837n79004K77662O34261j32847o07177K2347N46229L7340m59521
$$ 554001 180164 -398840 -121178 513083 380236 -226941 -204594 341635 378975 -80546
169h0546k6057L94663l7593l91245R9827M28597j42951n19729R9518N85557k2067
$$ -80546 -106603 288060 250467 -140778 -40951 387646 244695 -275034 -175516 410041 387974
180C87974o34810j17933N92964K20267n34278k98274M20308K87291l56162k48267
$$ 387974 -246836 -364769 228195 448462 -85816 -384090 36218 323509 -32653 -280920
190b80920L18067J68801l54527j30148M13850J38240m83595k10297N12558L24243
$$ -280920 37147 205948 -148579 -278727 135123 273363 -210232 -420529 92029 416272
200D16272m78250m30970L99879N06005k80131n04927J93874M63414j31671l76352
$$ 416272 -61978 -492948 -93069 412936 132805 -372122 -178248 285166 153495 -222857
210b22857J50211L26576j91245l03655K62704L55436k81460m33029K60240N29886
$$ -222857 -72646 253930 62685 -240970 21734 377170 95710 -337319 -77079 452807
220D52807j72001n81646N7388N87041M7474n32949j14590M48656J12315l78442
$$ 452807 280806 -300840 -243452 343589 391063 -141886 -256476 192180 304495 -73947
230g3947p1232L35576R9l62810K7580M16472k3738m98388n9133N32495J58282
$$ -73947 -145179 190397 190496 -172314 -144734 271738 248000 -250388 -309521 222974 381256
241C81256n38449k76112M71092L35481l88659l54245K96330L05539k48051k43735
$$ 381256 -157193 -433305 37787 373268 -15391 -369636 -73306 232233 -15818 -259553
251b59553K44632J90512k86511j82806L41276K34870l72101l23228L67608M26746
$$ -259553 -14921 175591 -110920 -293726 47550 282420 -89681 -412909 -45301 381445
261C81445l01835m88043K15368N07795j15832m56601O0826L88801m0911l13631
$$ 381445 79610 -408433 -193065 314730 198898 -257703 -196877 191924 151013 -162618
271a62618P8463K88841j24466l06410J62454L81450j54403m64959R8879N29438
$$ -162618 -84155 204686 80220 -226190 -63736 317714 163311 -301648 -202769 326669
281C26669n593n45537r2890N02088J58595m25927j81866L39757J49823k91467
$$ 326669 321076 -224461 -317351 184737 343332 -82595 -264461 75296 225119 -66348
291f6348j04737K84499O0552l37854o2464L99237J06719m58681j97224M64309
$$ -66348 -171085 113414 173966 -163888 -226352 172885 279604 -179077 -376301 88008
301H8008K87008m23110l60921L37551L80961k46558l52464J75427K93770j52977
$$ 88008 375016 -48094 -409015 -71464 309497 62939 -289525 -114098 179672 26695
311B6695k36715J78175K16840k26129k43699K73486L17555k82317l95349K44727
$$ 26695 -210020 -31845 184995 -41134 -284833 -11347 306208 23891 -371458 -126731
321a26731M65633j64244m81597P6360M51453K884l84687l1369L16377K1259k72841
$$ -126731 338902 174658 -306939 -230579 220874 223758 -160929 -192298 124079 145338 -127503
332a27503K0787K83100o2151l32297P4763M03691l9584m67721l1533M86280J21181
$$ -127503 -106716 176384 114233 -218064 -143301 260390 220806 -246915 -278448 207832 329013
343C29013m56218j96443L82361K32033k99497k25754K36078J85339k21245j42100
$$ 329013 -127205 -323648 58713 290746 -8751 -234505 1573 186912 -34333 -176433
353a76433K50335J19946l09410j42796L63251K01228l83612k83545L54379L52382
$$ -176433 73902 193848 -115562 -258358 104893 306121 -77491 -361036 -6657 345725
363C45725k82191l85237J88655L75277j14505l28713P8079K74450r2313k41404
$$ 345725 63534 -321703 -133048 242229 127724 -200989 -122910 151540 59227 -182177
373a82177J38814K48156j90097k96159K13712L66370j91514m30472J23295M59838
$$ -182177 -43363 204793 14696 -281463 -67751 298619 107105 -323367 -200072 259766
383B59766l1108m43516n2338L90079J01218l23271j01278K73357O6756k60657
$$ 259766 228658 -214858 -267196 122883 224101 -99170 -200448 72909 139665 -120992
393a20992j8828K91326o189l46483n164M02871O1521m23177j41030M03322K22827
$$ -120992 -139820 151506 145317 -201166 -206330 196541 258062 -165115 -306145 97177 320004
404C20004l41061k68686K64444K76793j96625k41869J69928J94453j81686j57307
$$ 320004 -21057 -289743 -25299 251494 54869 -187000 -17072 177381 -4305 -161612
414a61612K29252J56738k77803j94479L02427K64231k86419l33742K25637L77723
$$ -161612 67640 224378 -53425 -247904 54523 318754 32335 -301407 -75770 301953
424C01953j42948l85078O4999L50449k4053k99214K1285K52604o0466k41518J05459
$$ 301953 159005 -226073 -161074 189375 165322 -133892 -112607 139997 79531 -161987 -56528
435e6528K63340j36633l21195J24777L76485o9988m17252j6211M18299R8804l78466
$$ -56528 206812 70179 -251016 -126239 250246 180258 -236994 -253205 165094 263898 -114568
446a14568j53849L17537J66398k58633j33486K31002Q8018k37295m6765K81926
$$ -114568 -268417 49120 215518 -43115 -176601 54401 142419 -94876 -141641 140285
456A40285M7672l25239q5799L61360J63982l52000k36825L10570K98962k38357
$$ 140285 187957 -137282 -223081 138279 302261 -49739 -286564 24006 322968 84611
466H4611l09465J75511K86248j30436k33675J29329J89847j58448j70838J99711
$$ 84611 -224854 -49343 236905 106469 -127206 2123 191970 33522 -137316 62395
476F2395J94890k29648k53399K21309L20360j77907l77980J03329L87403l2722
$$ 62395 257285 27637 -225762 -4453 315907 138000 -239980 -136651 250752 218030
486B18030l67212k2631L09174L1301k59436j4300K22566l0541k31755N7260K65617
$$ 218030 -149182 -171813 137361 168662 -90774 -105074 117492 86951 -144804 -87544 178073
497A78073n9585l23454J8024L67526M8576l79685j23618L53528J81602k96450
$$ 178073 118488 -204966 -186942 180584 229160 -150525 -274143 79385 260987 -35463
507c5463j95512K36154J79801j87414j33197J83960R8481k03086p9540K53204
$$ -35463 -230975 5179 184980 -2434 -135631 48329 146810 -56276 -135816 117388
517A17388J13729k85297j69129L01981K48110k68096l02960K15994L29356j43616
$$ 117388 231117 -54180 -223309 78672 326782 58686 -244274 -28280 301076 157460
527A57460l08724R2834K64581p0915k13585Q3704J84954j19491j98102J49613
$$ 157460 -151264 -58430 206151 135236 -78349 5355 190309 70818 -127284 22329
537B2329K40272j60444l09709J28423L57873p5407l86299o76L60344N3300l15728
$$ 22329 262601 102157 -207552 -79129 278744 203337 -182962 -183638 176706 230006 -85722
548h5722q5424K48697P1878k10103m4460J97431P115k27306K578K76330J9162
$$ -85722 -171146 77551 149429 -60674 -105134 92297 99412 -127894 -125316 151014 170176
559A70176l24356o9287L46498J39154l26181j92748K80157K23679k07577k10910
$$ 170176 -154180 -223467 123031 262185 -63996 -256744 23413 247092 39515 -171395
569a71395J59531J86030j29595j38947J48140J26259j79335j31096K25755J82447
$$ -171395 -11864 174166 44571 -94376 53764 180023 688 -130408 95347 277794
579B77794k40006k39637K30338K98315j77112l22581J09822L15685m8307k77146
$$ 277794 37788 -201849 28489 326804 149692 -172889 -63067 252618 204311 -72835
589g2835J1829K26047j5012j95804L9737J87246q0731k24449R5219K71429r2561
$$ -72835 -61006 165041 150029 -45775 -6038 181208 100477 -123972 -28753 242676 150115
600A50115l28289M0156L47986J8905l46689q6752K95861J20830k43198j30460
$$ 150115 -178174 -138018 209968 228873 -117816 -204568 91293 212123 -31075 -161535
610a61535J90618J02793j73949p0107J91138M5725k33959m9717K82037R0663l03887
$$ -161535 29083 131876 -42073 -112180 78958 124683 -109276 -158993 123044 213707 -90180
621i0180j45432K98605K08213k45259k41573J87547K54203j21101k22064R3763
$$ -90180 -235612 62993 271206 25947 -215626 -28079 226124 105023 -117041 -23278
631b3278J91100q8665j55002J25267J56290j59989j77909J88251K28483j78777
$$ -23278 167822 79157 -75845 49422 205712 45723 -132186 56065 284548 105771
641A05771k77041J36593L08973p3004l10673N630K78717L2117k38630m5432J93953
$$ 105771 -171270 -34677 274296 201292 -109381 -103751 174966 207083 -31547 -76979 116974
652A16974J6227j84584J4189J92608m9034k37955M2078K75323j4757l09874n0289
$$ 116974 133201 -51383 -37194 155414 106380 -131575 -89497 185826 171069 -138805 -189094
663a89094L03892J08421k75465j60036K21650J72355j73775j55731J46200J21085
$$ -189094 114798 223219 -52246 -212282 9368 181723 7948 -147783 -1583 119502
673A19502j49252q6557J81826Q0796k16275r9281K46763J54453k37841k07110
$$ 119502 -29750 -116307 65519 146315 -69960 -169241 77522 231975 -5866 -212976
683b12976K10099K58850j45220k68831R3541K56257m6875k14087M6054J78679
$$ -212976 -2877 255973 110753 -158078 -64537 191720 144845 -69242 -23188 155491
693A55491o3711j56395J02335J70068j29176k07189J29742K54059r7368k96127
$$ 155491 91780 -64615 37720 207788 78612 -128577 1165 255224 157856 -138271
703a38271L8834L02405K0735k88114p2801K42384Q1774k04128p2181J69483L1522
$$ -138271 -99437 202968 223703 -64411 -137212 105172 186946 -17182 -89363 80120 111642
714A11642j74615p088J94238o354k36591k4973K63998P1461k73503j36407K49494
$$ 111642 -62973 -70061 124177 117823 -118768 -143741 120257 191718 -81785 -218192 31302
725C1302J81721k04861k01282J53659J91296j16597j53407J07905J20918j21542
$$ 31302 213023 8162 -193120 -39461 151835 35238 -118169 -10264 110654 -10888
735a0888r7653J56342J14634j78487j49171J88622K08936j59842k51305J19015
$$ -10888 -108541 47801 162435 -16052 -165223 23399 232335 72493 -178812 -59797
745e9797K75296n9484k61153K1601K26465o51j83071J3749J55101m2507j53407
$$ -59797 215499 156015 -105138 -83537 142928 142277 -40794 -27045 128056 85549 -67858
756f7858O7292J80792p7884k29371N3946K67235j0976k91866n0701K75773R3578
$$ -67858 -566 180226 102342 -127029 -73083 194152 183176 -108690 -159391 116382 209960
767B09960k43820j21540J89943J08781j56283q5520J37328N0261j56417l9722
$$ 209960 -33860 -155400 34543 143324 -12959 -98479 38849 89110 -67307 -107029
777a07029J86527N1183k22747r2575K35772J47278k25086j93125J86542K18510
$$ -107029 79498 130681 -92066 -184641 51131 198409 -26677 -219802 -33260 185250
787A85250j33856k09708R2379J81213o6005j40762P4296J21160r5685j18848J27902
$$ 185250 51394 -158314 -65935 115278 49273 -91489 -17193 103967 8282 -110566 17336
798A7336J53638j37577j98425J31065K45602r0914k66340M2121K62549M861k27439
$$ 17336 170974 33397 -165028 -33963 211639 120725 -145615 -103494 159055 163916 -63523
809f3523l2674J85564L4046j51962j5473J40561j3384j60413K5661J95432k0023
$$ -63523 -96197 89367 123413 -28549 -44022 96539 83155 -77258 -51597 143835 123812
820A23812k39566j6718K59022O1617k57648j12099K20063J37628j75991j42100
$$ 123812 -115754 -132472 126550 188167 -69481 -181580 38483 176111 120 -141980
830a41980J27772J19646j07189r4035J11370P2010j41683p3680J75368J01449
$$ -141980 -14208 105438 -1751 -95786 15584 87594 -54089 -127769 47599 149048
840A49048j97975j45724J96470J90945j63023k17856J15547K22240o3682j96894
$$ 149048 -48927 -194651 1819 192764 29741 -188115 -72568 149672 85990 -110904
850a10904L3093J66847k7305j34956M9118J31166p7233j47579J01179J87697r7847
$$ -110904 -77811 89036 61731 -73225 -24107 107059 29826 -117753 -16574 171123 73276
861G3276k27568P0803K53563k1743k53369k8672K27303O4359j88062p6123J48467
$$ 73276 -154292 -83489 170074 148331 -105038 -133710 93593 157952 -30110 -106233 42234
872D2234O1609j32370l6788J37732J1323j68976j0811K02193L0368k28935p3066
$$ 42234 103843 -28527 -65315 72417 83740 -85236 -96047 106146 136514 -92421 -165487
883a65487K24306J18161j99685j55576J53568J64669j09058j54814Q0372J26882
$$ -165487 58819 176980 -22705 -178281 -24713 139956 30898 -123916 -43544 83338
893H3338p9090j01205J00266R1891j32371j05085J56925J40342j57828j81434
$$ 83338 4248 -96957 3309 95200 -37171 -142256 14669 155011 -2817 -184251
903a84251J33650K15072q6036k24041L6931K11885R89j80564j0822J50224j576
$$ -184251 -50601 164471 78435 -145606 -108675 103210 104199 -76365 -87187 63037 61461
914F1461j31921L1465J39025n6449j64530O3085K00243m2173k28048j27K34510
$$ 61461 -70460 -38995 100030 43581 -120949 -57864 142379 100206 -127842 -127969 106541
925A06541N1778k17894r2761J82450J09137j45376j00573J19112P2902j17139
$$ 106541 158319 -59575 -152336 30114 139251 -6125 -106698 12414 85316 -31823
935c1823m5599J34565L2475j65068m6898J89660Q0048j94682j27329J76709J64093
$$ -31823 -77422 57143 89618 -75450 -122348 67312 147360 -47322 -174651 2058 166151
946A66151j36878j85141R4071J78634o2500j51979N1400J22038o3595j01773Q8038
$$ 166151 29273 -155868 -61797 116837 54337 -97642 -46242 75796 12201 -89572 -1534
957a534J05780j11494j30614J16997J69775r8223k03475O0474K20023j3034k13285
$$ -1534 104246 -7248 -137862 -20865 148910 50687 -152788 -92314 127709 114675 -98610
968i8610k3688J86938M0226j51880l3419J26985R625j20349J5836J35886k6086
$$ -98610 -122298 64640 104866 -47014 -80433 46552 56177 -64172 -48336 87550 61464
979F1464j65977J3682J95778K2253k10665o8958K03386J09137j74148j30231J36756
$$ 61464 -104513 -90831 104947 127200 -83465 -152423 50963 160100 -14048 -144279 -7523
990g523J25908j04998j01908R1308P3743r9867n5723J23095O0754j47990q8853
$$ -7523 118385 13387 -88521 2787 76530 -23337 -79060 44035 104789 -43201 -132054
1001a32054J59421J31936j50307j72332J19975J95272q0181j92497M2828J68466
$$ -132054 27367 159303 8996 -163336 -43361 151911 71730 -120767 -77939 90527
1011I0527k4334j35124K5501J09009m4140j05156O6160J22179p7723j57446O7946
$$ 90527 66193 -68931 -43430 65579 21439 -83717 -17557 104622 26899 -130547 -62601
1022f2601J92805l9169k14435k163K11328M0259j87525o3381J52301O3242j19695
$$ -62601 130204 91035 -123400 -125563 85765 126024 -61501 -124882 27419 90661 -29034
1033b9034m5267J04607K2908j11836q509J37688J5013j67352l9843J87249Q0713
$$ -29034 -74301 30306 53214 -58622 -67131 70557 85570 -81782 -121625 65624 146337
1044A46337j84732j16607J61083J41545j22567j41853Q6811J25078o2817r7678
$$ 146337 -38395 -155002 6081 147626 25059 -116794 -29983 95095 32278 -65400
1054f5400O3224P8881q0322p5877J05196R5842j22374j30542J21059J66915r7582
$$ -65400 -2176 76705 -3617 -79494 25702 121544 -830 -131372 -10313 156602 59020
1065E9020j92238O0217J92253k1011j74347n270J40897J0506j13822M67J01026
$$ 59020 -133218 -73001 119252 98241 -76106 -81376 59521 70027 -43795 -43328 57698
1076E7698k2695j14663L9943J41625m0940j76414K0650J98106J5396k01951n4798
$$ 57698 35003 -79660 -39717 101908 60968 -115446 -94796 103310 118706 -83245 -138043
1087a38043J82141Q1568j45769q9952J11021Q1157q9575n8620R1233M2261j10536
$$ -138043 44098 125666 -20103 -110055 966 82123 -7452 -66072 25161 67422 -43114
1098d3114l7297J41709N5047j61154q4268J65065J21406j43777j44860J08324
$$ -43114 -80411 61298 116345 -44809 -129077 35988 157394 13617 -131243 -22919
1108b2919J55642o8070j42681M1200J20033l2116r6985M5594Q7957o9077r7779
$$ -22919 132723 64653 -78028 -36828 83205 51089 -45896 -302 87655 18578 -79201
1119g9201Q9337J22557r5414j54701P6936J78314m5479j85253L138J70969K5767
$$ -79201 10136 132693 37279 -117422 -40486 137828 92349 -92904 -89766 81203 106970
1130A06970j45280m2496J16000L3164j01871j4122J02466p879j24676J6455J50853
$$ 106970 -38310 -80806 35194 68358 -33513 -47635 54831 46952 -77724 -61269 89584
1141H9584n169j74496k6069J80256O4324j65724r6134J36108J13462r9652j08161
$$ 89584 84415 -90081 -116150 64106 128430 -37294 -133428 2680 116142 16490 -91671
1152i1671P6822R0018o9398o5882Q5273N5173j07347n8683J31895Q4318j35606
$$ -91671 -14849 75169 5771 -60111 25162 80335 -27012 -85695 46200 130518 -5088
1163e088j16360J24084J47540r0070j61284N3139J58199k1603j37824R234J13182
$$ -5088 -121448 2636 150176 60106 -101178 -48039 110160 88557 -49267 -40033 73149
1174G3149j7374r6390L8223R5211o1285j12692O8003J38949n8977j65753K6415
$$ 73149 55775 -40615 -2392 92819 31534 -81158 -13155 125794 66817 -98936 -72521
1185g2521J76053J0211j72982m6385J48595O3097j23121o1092R8217M1335r2827
$$ -72521 103532 113743 -59239 -105624 42971 106068 -17053 -78145 20072 61407 -31420
1196c1420k0080J02087O712j24563j1935J45785L7300j54946p2863J49181J07730
$$ -31420 -51500 50587 57299 -67264 -79199 66586 103886 -51060 -123923 25258 132988
1207A32988j22685j26347R3342J27601o3152j08260N3390Q6269n6409o5379P7208
$$ 132988 10303 -116044 -22702 104899 41747 -66513 -13123 73146 16737 -48642 28566
1218B8566O5696r4803q0992J06982J13231r7621j43332P3064J64625l8218j65497
$$ 28566 94262 -541 -81533 25449 138680 41059 -102273 -29209 135416 97198 -68299
1229f8299O918J48051J0248j22562r989R7975p559r0431K6100R7690m0072j23388
$$ -68299 -61381 86670 96918 -25644 -35633 62342 54783 -35648 -9548 88142 48070 -75318
1241g5318L1979J47695j0136j68615k7120J66739N9000j51314q1369J20574Q1659
$$ -75318 -43339 104356 94220 -74395 -101515 65224 124224 -27090 -108459 12115 93774
1252I3774r4341o7834P8353M4932q0471k9103R7021L0059j17801m8203J33248
$$ 93774 -567 -68401 9952 54884 -25587 -54690 42331 72390 -45411 -93614 39634
1263C9634Q1642j30676j12984J14543J36550q2522j37333N4661J24400l3041r7969
$$ 39634 121276 -9400 -122384 -7841 128709 46187 -91146 -36485 87915 54874 -43095
1274d3095L2183P8809m1860p0468O1504Q3297p2781j09039P2347J39197n3991
$$ -43095 -10912 67897 26037 -44431 17073 100370 27589 -81450 -9103 130094 76103
1285G6103j60680K3841J64108N898j50039k9326J22258L3379r6977k6477Q0579
$$ 76103 -84577 -60736 103372 109270 -40769 -70095 52163 85542 -11435 -37912 42667
1296D2667O708q5921N316J02861r137j30829q951J49546L5029j55730o7962J40357
$$ 42667 49375 -36546 -31230 71631 62494 -68335 -77286 72260 107289 -48441 -116403 23954
1308B3954Q9935j14060r7287Q2776Q7399o0850o8727N7252N1950o8925m5343R1481
$$ 23954 113889 -171 -97458 -14682 72717 11867 -56860 392 52342 -16583 -61926 29555
1320B9555N8332j08764q1712J15664J13588j00764j34369P5531J43791m1485j31668
$$ 29555 87887 -20877 -102589 13075 126663 25899 -108470 -32939 110852 69367 -62301
1331f2301J7774J12072o242q8499J3481P7825k9070q2404M6324J02332n1953j28945
$$ -62301 -44527 67545 61303 -27196 -13715 64110 35040 -47364 -1040 101292 49339 -79606
1343g9606M0655J49719j6623j57467j5996J44683M1221j22139n5377R3456M9813
$$ -79606 -38951 110768 94145 -63322 -79318 65365 106586 -15553 -70930 22526 72339
1354G2339p7254l6704P2899J9019q8943j2582J09394J8704j31144m1305J37199
$$ 72339 -4915 -41619 31280 50299 -38644 -51226 58168 76872 -54272 -95577 41622
1365D1622O9194j27590r4671J01462J07588p0812j03957M6433Q9979l7000p0776
$$ 41622 110816 -16774 -111445 -9983 97605 26793 -77164 -30731 59248 22248 -48528
1376d8528M5349O1103o3497o2486Q4386Q0831r1115j04831Q4205J29537n8947
$$ -48528 -3179 57924 -5573 -68059 16327 97158 6043 -98788 -14583 114954 56007
1387E6007j39725K7403J37107K217j19178j6564R7766J4315q1995J607P9410k0960
$$ 56007 -83718 -56315 80792 83009 -36169 -52733 45033 59348 -22647 -21040 58370 37410
1399C7410r1995L0869J12976k6774j34814M938J43130K4314j39035n4979J17701
$$ 37410 -54585 -23716 89260 62486 -72328 -67390 75740 100054 -38981 -93960 23741
1410B3741P1405r3750p4007P1825N9441o5656m1783P1357K8294r0149k9573J07949
$$ 23741 95146 1396 -72611 -786 58655 -7001 -48784 22573 50867 -39282 -68855 39094
1422C9094M4796j17152p1998J10824R8572q9289j15349O0830J18357l5466j04774
$$ 39094 83890 -33262 -105260 5564 104136 14847 -100502 -39672 78685 43219 -61555
1433f1555K3145Q5688k4168o9435L9441O5975n6434p4823O7883R6342o1978j19086
$$ -61555 -38410 47278 23110 -46325 -6884 59091 2657 -72166 -4283 92059 30081 -89005
1445h9005M2555J35593j3267j35790j5261J23744L2756j02636l4051Q3439K0899
$$ -89005 -46450 89143 75876 -59914 -75175 48569 81325 -21311 -55362 28077 48976
1456D8976p3784k909P7357r965r4867R677J12956O895j27895l5116J26913O4209
$$ 48976 -24808 -27717 49640 39675 -55192 -45515 67441 74336 -53559 -88675 38238 102447
1468A02447j13795q5211R0838Q8189o7848p8797N3733N9157n3804m2623O4628
$$ 102447 -11348 -96559 -5721 82468 14620 -64177 -10444 48713 -5091 -47714 16914
1479A6914L8329q2419m8705R3341P2812r2811r9783P7948J20303n2870j25974
$$ 16914 55243 -27176 -75881 17460 90272 -2539 -102322 -24374 95929 43059 -82915
1490h2915K8048J16053j0375r6036P604P6062j6197o5324L1322P0243m2986q7421
$$ -82915 -54867 61186 50811 -45225 -37621 38441 22244 -43080 -11758 58485 15499 -71922
1502g1922M3163J10310k8196j28967L455J35278K2924j25416m2144J04593M7855
$$ -71922 -28759 81551 53355 -75612 -72157 63121 86045 -39371 -81515 23078 70933
1513G0933q1860m0412O6284K5184o4806j1561P5746Q087r4127j9931J09871M2856
$$ 70933 -10927 -51339 14945 40129 -24677 -36238 39508 47595 -46532 -66463 43408 86264
1525H6264j15610o9063J05948Q9926q5940r7042O0785Q9293m0706p3651L4322
$$ 86264 -29346 -98409 7539 97465 11525 -85517 -24732 64561 23855 -49796 -15474
1536a5474N4703m0359m6986N5422N3022o9793p2471P4746R7155o6891j18046M6131
$$ -15474 39229 -1130 -48116 7306 60328 -9465 -81936 -7190 89965 23074 -94972 -48841
1548d8841J25851k0579j19626m79J00563J0645p9954p387O5745n181o5237J8169
$$ -48841 77010 56431 -63195 -63674 36889 47534 -32420 -39807 25938 20757 -44480 -26311
1560b6311P8770k3221j00555J6223J20306L038j28162k8062J22403M9856j02575
$$ -26311 52459 29238 -71317 -55094 65212 68250 -59912 -87974 34429 84285 -18290
1571a8290o0138P8125N9043n8775m6144N2234L3020n9376k5510P6808L0629r3485
$$ -18290 -78428 -303 58740 -35 -46179 6055 39075 -20301 -45811 30997 61626 -31859
1583c1859m6821J02493O9757r6131q9934P7204J01219n2275r7918K9025Q4663
$$ -31859 -78680 23813 93570 -2561 -92495 -15291 85928 33653 -64265 -35240 49423
1594D9423j7684o8659J9734N7337l2590n8225M7016P1317n6872r2323N2552J10531
$$ 49423 31739 -36920 -17186 40151 7561 -50664 -3648 67669 10797 -81526 -28974 81557
1606H1557l5954j21058R536J17547J3445j02501k8724Q2145K9293o6072j9785
$$ 81557 45603 -75455 -65919 51628 65073 -37428 -66152 15993 45286 -20786 -40571
1617d0571O1272N557o9443M345Q8002l263j05384j0662J16166L3930j11343n6513
$$ -40571 20701 26258 -43185 -38840 49162 45899 -59485 -70147 46019 79949 -31394 -87907
1629h7907R5736P3138p1752p4666N1712O6365m0290n1263M5072M0378n8260l7855
$$ -87907 7829 80967 9215 -65451 -13739 52626 12336 -38927 6145 46523 -11737 -49592
1641d9592P5840M8893q5112o8531Q3245Q8972o6296j03428M1455J05443j8463
$$ -49592 26248 75141 -9971 -78502 4743 93715 27419 -76009 -34554 70889 52426
1652E2426r6293K432Q0164l133o6240J1886O0589k8750o8063L8408Q2601l8612
$$ 52426 -43867 -41435 38729 35596 -30644 -18758 41831 13081 -54982 -16574 66027 27415
1664B7415j01430K3003J12351q04j13008k5398J01871M2808q5582m6257O6462
$$ 27415 -74015 -51012 61339 60535 -52473 -77871 24000 66808 -18774 -65031 1431
1675A431L9428n7612k3698N9637J2177p1388p855Q8143J8598r7459l7943R8421
$$ 1431 40859 -16753 -40451 19186 31363 -40025 -47880 40263 58861 -38598 -76541 21880
1687B1880O3689q5366p9767O6526Q7362m4158q0005L2922O5936k9695n0672M0173
$$ 21880 85569 203 -79564 -13038 74324 30166 -49839 -16917 49019 19324 -31348 8825
1699H825M4233n3497m9004O4592O4954o4807q6606N3332J02630l2124j09615P233
$$ 8825 53058 -439 -49443 15149 80103 15296 -71310 -17978 84652 52528 -57087 -49854
1711d9854J03352P160q8841j3833P0342N602o1103O875O0479k0467p2102K0613
$$ -49854 53498 60658 -28183 -42016 28326 33928 -27175 -20300 40179 19712 -52390 -31777
1723c1777Q8699j1557j03970r594J08164L3122j02204n1389Q5786N8894o5638
$$ -31777 56922 45365 -58605 -68199 39965 73087 -29117 -80506 5280 64174 -1464
1734a464n3213N3221L9991m8433k4961N6421K1231o8331k5977Q2377M4962q3737
$$ -1464 -54677 -1456 38535 -9898 -34859 21562 42793 -25538 -51515 30862 75824 -7913
1746g913o6075P7698Q5605n8384r2970L9895R0431k2789p5234J7252N9282k0929
$$ -7913 -73988 3710 89315 30931 -62039 -22144 68287 45498 -29736 -12484 46798 25869
1758B5869m8720L1825M9871m3231o3015M5458Q2288l9224j01258K1135J07728
$$ 25869 -22851 8974 58845 15614 -47401 -1943 80345 41121 -60137 -39002 68726
1769F8726j054j05918j8096Q9457K5432p2265k4529N5775J2833n3579j754N9243
$$ 68726 67672 -38246 -56342 33115 58547 -13718 -38247 17528 30361 -23218 -24972 34271
1781C4271m537p6166j666R1712J7435j00301l8874R7836N7583q2264o6739O2938
$$ 34271 29734 -46432 -48098 43614 61049 -39252 -78126 19710 77293 -4971 -71710 -8772
1793h772O5677m4384n3165L7285M1144l8074l1385N1501L5435o2320m7461P1333
$$ -8772 56905 12521 -40644 -3359 37785 -289 -31674 19827 55262 -7058 -54519 16814
1805A6814O8511o7520q4193N4028R6237l3996r2781J5277Q1130l281o5901K678
$$ 16814 85325 17805 -66388 -12360 83877 49881 -42900 -27623 53507 50226 -15675 -12997
1817a2997N3614j1987n1537K2153N9578l0421p7241K6658R2727j5695j04485m675
$$ -12997 40617 28630 -22907 -754 58824 28403 -48838 -22180 70547 54852 -49633 -54308
1829e4308J00703K2673q9690l6955P0011L7650n4819l1695M6490J9209n0721j2165
$$ -54308 46395 69068 -20622 -57577 12434 50084 -4735 -36430 10060 29269 -21452 -33617
1841c3617O3843J1921p8975k2659Q9743M0845q8360n7708P6296P2024n5425p3106
$$ -33617 30226 42147 -36828 -59487 30256 71101 -17259 -74967 1329 73353 17928 -55178
1853e5178L7435O7506k3699n3050K4788M4311l2187m0444M7344M9250n6093o3751
$$ -55178 -17743 49763 26064 -26986 -2198 42113 9926 -30518 16826 66076 9983 -53768
1865e3768N7901Q1608m6088r2442K7089R4222o099q5629r615P1619J2033n8514
$$ -53768 4133 85741 39653 -52789 -25700 68522 62423 -23206 -32821 38798 50831 -7683
1877g683p156N1486o116n6803J4744O8197j8594q4527P843R3580Q323r6433k9657
$$ -7683 -14839 36647 30531 -26272 -11528 56669 38075 -46452 -38609 54971 63294 -33139 -62796
1890f2796Q5116M4337o9865n1156N2095M6094m2805l5646M2891K4718n1553k0921
$$ -62796 22320 66657 -3208 -54364 -2269 43825 1020 -34626 8265 32983 -18570 -39491
1902c9491O5627K7089p4942m0545P6641N9697o6277p2865M9515Q0608k9237p5000
$$ -39491 26136 53225 -21717 -62262 14379 74076 7799 -65066 -15551 65057 35820 -39180
1914c9180J6295O5690j1992n1691J9010M5910l0329m6975M1549N8319m3270p4027
$$ -39180 -22885 42805 30813 -20878 -1868 44042 13713 -33262 8287 66606 23336 -50691
1926e0691L5622Q6207j7948r2436k566Q7952J6625p5346k5880O0765K1235n2110
$$ -50691 -15069 71138 53190 -39246 -41812 46140 62765 -12581 -38461 22304 43539 -8571
1938h571j0917M9161j749n7878N190O9378j012q2339j4964Q5676L4409q1954n1340
$$ -8571 -19488 29673 27924 -29954 -24764 44614 43602 -38737 -53701 31975 66384 -15570 -66910
1951f6910O7432N9935n1051n8543L8152M7954l3953l5290L8601K8647m9042k9225
$$ -66910 522 60457 9406 -49137 -10985 36969 3016 -32274 6327 34974 -14068 -43293
1963d3293N9632M1459o2109n8459N8039P5335m2036q3579K5115Q3334j0071p1168
$$ -43293 16339 57798 -4311 -62770 -4731 70604 28568 -55011 -29896 53438 43367 -27801
1975b7801L078N8845n784m7367J5010M5842k4837n2910K8260O7781k3811q1720
$$ -27801 -24723 34122 28338 -19029 -4019 41823 16986 -35924 -7664 60117 36306 -45414
1987d5414R109Q9601Q877q8451k6207P7247L4003o2921l3474M8330K4453m4032
$$ -45414 -36305 53296 62173 -26278 -52485 24762 58765 -4156 -37630 10700 35153 -8879
1999h879j3693M6253O425n7474r599O8690K0903p6221l9546P4313N6169o3967
$$ -8879 -22572 23681 30106 -27368 -36967 31723 52626 -23595 -63141 11172 67341 3374
2011C374o6098M8039O5833l2447n7791K4606M4640k4169l4466L1999L3274m1075
$$ 3374 -62724 -14685 51148 18701 -39090 -14484 30156 5987 -28479 3520 36794 -4281
2023d281m2531M9583N7344m6956p3448L6827Q4500k0286q5209M892P6536N914
$$ -4281 -46812 2771 60115 13159 -60289 -23462 61038 40752 -44457 -39565 36971 42885
2035D2885o1382q038M8527J861m3797P321M8239j3658o0269J1949P4037k917q3862
$$ 42885 -18497 -26535 21992 23853 -19944 -12623 35616 21958 -38311 -26362 47675 44758 -39104
2048c9104j3310Q4885K9106p6380m0737O0934M2098m5954l6693L6452K7086l7027
$$ -39104 -52414 32471 61577 -14803 -55540 5394 47492 1538 -35155 1297 28383 -8644
2060h644j9691M5097J7815n6315k7299O6266L9825o6302n6600N8721O7241m3868
$$ -8644 -28335 16762 34577 -21738 -49037 17229 57054 -9248 -65848 -7127 60114 16246
2072A6246o9644K6842O3548j4574n2489J1021M2339j6400l8503K6532M2775l4367
$$ 16246 -53398 -26556 36992 22418 -30071 -19050 23289 6889 -31614 -5082 37693 3326
2084C326n5356L6536P0134k9326q0807J4641Q3521K064p6640j5434O3992K0674
$$ 3326 -52030 -15494 54640 25314 -55493 -40852 42669 44733 -31907 -47341 16651 37325
2096C7325n0218j7636M2440R115m3106l58N2523k738o4889l060P6472J5600p8929
$$ 37325 -12893 -30529 11911 21026 -22080 -22438 30085 27347 -37542 -40602 35870 51470 -27459
2109b7459l1201P2488M4021n7403n0716M2221M8261l1410l9615K7781L1162l4560
$$ -27459 -58660 13828 57849 446 -50270 -8049 40212 8802 -30813 -3032 28130 -6430
2121f430k6274M4960K9998n4744m1251N7962N4622n2095o6931L7356P2493k1080
$$ -6430 -32704 12256 42254 -12490 -53741 4221 58843 6748 -60183 -22827 49666 28586
2133B8586o9401O431N9574q59m9542L733M2291j3030m3259K1950N0963k6179o3477
$$ 28586 -40815 -34384 25190 24331 -25211 -21478 20813 7783 -35476 -13526 37437 11258 -52219
2146e2219K1691P3913q911p8418p883P4827K2686o4111l0250N0946L0653m1580
$$ -52219 -30528 43385 34474 -43944 -51827 23000 45686 -18425 -48675 2271 32924 -8656
2158h656k1711L9214J2597m4240o137N5277Q570o4173j8079O8974L4089o4916
$$ -8656 -30367 8847 21444 -22796 -28933 26344 34914 -29259 -47338 21636 55725 -9191
2170i191m8008N3575N7159l7928n7965K6049N0554k0522m0531K3293L2037l2244
$$ -9191 -57199 -3624 53535 15607 -42358 -16309 34245 13723 -26808 -3515 28522 -3722
2182c722l1815M1042L8379m6394n1741M2097O4003l0882p3064J4223P2442j050
$$ -3722 -35537 5505 43884 -2510 -54251 -12154 51849 20967 -52097 -37874 34568 33518
2194C3518o5776q418N4500O730m5314K33M0941j0018m5109J5922N4480j3849o5273
$$ 33518 -32258 -40676 13824 20554 -24760 -24527 16414 6396 -38713 -22791 31689 17840 -47433
2207d7433K976P2939J2893p2122k7062O4889L7450n1698l7712M1270L2423l4692
$$ -47433 -44457 28482 41375 -30747 -57809 7080 44530 -7168 -44880 -3610 28813 -5879
2219e879k1216L6568J5176m2815j3754N2903K2552n7691l5153N7231N0660m8649
$$ -5879 -27095 9473 24649 -18166 -31920 20983 43535 -14156 -49309 7922 58582 9933
2231I933o0346L5072O2972k2075n7221J3554M6371j3295l6650J8042L2065k7261
$$ 9933 -50413 -15341 47631 25556 -31665 -18111 28260 14965 -21685 -3643 28422 1161
2243A161l6931L1656M7232l2042o2052K3070P0582j0175p4462n079O7628J3978
$$ 1161 -35770 -4114 43118 11076 -50976 -27906 42676 32501 -41961 -47040 20588 34566
2255C4566n7123j6691M4866J1504l8168l605L8752k896m6224M022N7648M360o5910
$$ 34566 -22557 -39248 5618 17122 -21046 -24651 14101 11205 -35019 -30997 26651 31011 -34899
2268c4899j6533O9156L2165o2847m1137N2218M5741l7511m0087K9438L2475k5885
$$ -34899 -51432 17724 49889 -12958 -54095 -1877 43864 6353 -33734 -4296 28179 2294
2280B294k3428L2250K1372l9604k5402M7481L8055m9215n1167M3447O1756l1962
$$ 2294 -21134 11116 32488 -7116 -32518 14963 53018 3803 -47364 -3917 57839 25877
2292B5877o5608J7638O0291p528n1374K503L9938o408l5330J1986L5713k0099
$$ 25877 -39731 -22093 38198 30670 -20704 -18201 21737 15329 -20001 -8015 27698 7599
2304G599m6167K1012N6753j7001o8296M847P1063P724o7214k0037N6118K5122
$$ 7599 -38568 -17556 39197 22196 -46100 -41253 29810 37534 -29680 -49717 6401 31523
2316C1523m4349k3012L4997J6813l2409r651L9246P102m7959r606N8419K0659
$$ 31523 -12826 -35838 -841 15972 -16437 -26088 13158 20260 -27699 -37305 21114 41773
2328D1773o0890l2282N8889M4968m6545m8960L4261M8520k1270m0027J7301L2806
$$ 41773 -19117 -51399 7490 52458 5913 -43047 -8786 39734 18464 -21563 -4262 28544
2340B8544j8855k7565K8031K8996l5618l7374M0533M9076l8134n9810K7014O4290
$$ 28544 9689 -17876 10155 39151 3533 -33841 6692 55768 17634 -42176 -15162 49128
2352D9128j4215o2665n5N3826N539m4876o438L6307j024l6597P421M1096j2967
$$ 49128 34913 -27752 -27807 26019 31558 -13318 -19756 16551 15527 -21070 -13649 27447 14480
2365A4480n2715J0320O0871k203o6367j1163O3414K3856n4529l1575M2906L2850
$$ 14480 -38235 -27915 32956 30753 -35614 -46777 16637 40493 -14036 -45611 -2705 30145
2377C0145l1941k7186K9050K0463l1224j3934M0778J5330m8030k0748N4557L3277
$$ 30145 -1796 -28982 68 20531 -10693 -24627 16151 31481 -16549 -37297 17260 50537
2389E0537n0474m3447M2776N2657k8583n2629J7237M8364r325l9357J0683L2380
$$ 50537 63 -43384 -608 52049 23466 -29163 -11926 36438 27113 -12244 -1561 30819
2401C0819j7023l0835K5332L5385l1574m4951K9537N4552k2170o2253P432O1788
$$ 30819 13796 -17039 8293 43678 12104 -32847 -3310 51242 29072 -33181 -25749 36039
2413C6039M646n7262j4994M6695J5116l9283j1369L3701K068l7140L462M3734
$$ 36039 40685 -16577 -31571 15124 30240 -9043 -20412 13289 15357 -21783 -18321 25413
2425B5413m774n2877k635N8640J4351n8513k7183N1887L7394m1034l9537L1529
$$ 25413 20639 -32238 -34873 23767 38118 -20395 -47578 4309 41703 669 -38868 -7339
2437g339L6454k4097k7256K5381K1283k9796j7458L9048K2578m3154l1292M4158
$$ -7339 29115 5018 -22238 3143 24426 -5370 -22828 16220 38798 -4356 -35648 8510
2449H510M4121l6021n2614K5730N6494j2997n2758N582M4300l478l6511Q034L1046
$$ 8510 52631 16610 -36004 -10274 46220 33223 -19535 -13953 30347 26869 -9642 -1608 29438
2462B9438j5479l2898K0132L9263k1441n0333J4043N7834l946o1460j0519N7069
$$ 29438 13959 -18939 1193 40456 19015 -31318 -17275 40559 36613 -24847 -35366 21703
2474B1703J8779m9914k2852L8705J8625l2114j2472L0590M822l5491k682M3200
$$ 21703 40482 -9432 -32284 6421 25046 -7068 -19540 11050 15872 -19619 -22301 20899
2486B0899P336n0435j7141N3489L0447m9152l9942M1031M4615k8473m2059K1633
$$ 20899 28235 -22200 -39341 14148 44595 -4557 -44499 -3468 41147 12674 -29385 -7752
2498g752L5064j7233k5619K1138K2085k6401k2896L3573L1715l4625m2943L1417
$$ -7752 27312 10079 -15540 5598 27683 1282 -21614 11959 43674 9049 -33894 -2477
2510b477N3311k1560n7610J0250N5347p76m8141l562L7882J779l1469L065K9731
$$ -2477 50834 29274 -28336 -18086 37261 36485 -11656 -15218 22664 24443 -7026 -3961 25770
2523B5770r555l6388J1127M4576r066n3892j567N7849J2134n6494k2872M7539
$$ 25770 16215 -20173 -9046 35530 26464 -27428 -28995 28854 40988 -15506 -38378 9161
2535I161K7055l7847k6707K8999K0320k4818j4177K7227J1109l4722j2498M2284
$$ 9161 36216 -1631 -28338 661 20981 -3837 -18014 9213 20322 -14400 -26898 15386
2547A5386K1107m6253l1260M4867M1818l6422m6885K6221M6206j4759l9644J0111
$$ 15386 36493 -9760 -41020 3847 45665 9243 -37642 -11421 34785 20026 -19618 -9507
2559i507L2426r918k5834J4928K6507k1577l1452K5867M1514k4708n0866J7124
$$ -9507 22919 13001 -12833 2095 28602 7025 -24427 1440 42954 18246 -32620 -15496
2571a5496N6390o672n5514m156M8140J0761l9336j2058L0663P109k8209j766L0919
$$ -15496 40894 34222 -21292 -25448 22692 33453 -5883 -17941 12722 19831 -8378 -10144 20775
2584B0775k715l9938J454M7818M259n3633j5075N2798K4357m5855l1756L4951
$$ 20775 18060 -21878 -20424 27394 31653 -21980 -37055 15743 40100 -5755 -37511 -2560
2596b560L2995k5427k8742J9636K3030k0339j8315K6712J8058l4124k2376L9156
$$ -2560 30435 5008 -23734 -4098 18932 -1407 -19722 6990 25048 -9076 -31452 7704
2608G704L1771l8808m0408L2393M7387k1241m7903J0299M4045k500l6380J325
$$ 7704 39475 667 -39741 -7348 40039 18798 -29105 -18806 25239 22739 -13641 -12316
2620a2316K9968m898k7565J1973L1010j7485l7978J7812M6421j2621n2304K271
$$ -12316 17652 12754 -14811 -2838 28172 10687 -27291 -9479 36942 24321 -27983 -25712
2632b5712N2815Q686m8028j7343L9004K0460l0994j8173K6175J1621k7490o054
$$ -25712 27103 35789 -12239 -29582 9422 29882 -1112 -19285 6890 18511 -8979 -15033
2644a5033L3099L286m0536p659M5888J6320m6946k6766M1523L4845l1284l9234
$$ -15033 18066 21352 -19184 -26843 19045 35365 -11581 -38347 3176 38021 6737 -32497
2656c2497K1368L6913j5214l0296J3908K3921j8003k0960K4813K2772l0277k9126
$$ -32497 -11129 25784 10570 -19726 -5818 18103 100 -20860 3953 26725 -3552 -32678
2668c2678L0828L8824k6138m6082J6210M9112n349m6199l155M0128N873l2867
$$ -32678 -1850 36974 10836 -35246 -19036 30076 24727 -21472 -24627 15501 21374 -11493
2680a1493k658K7593k984k8578R324L3485j0899m1396P384M6760K441m9211j3615
$$ -11493 -14151 13442 10458 -18120 -8796 24689 13790 -27606 -20222 26538 28979 -20232 -33847
2693c3847M6604K2247l9327k6199L0113K4951k4327j8908K2543J2361k6028q766
$$ -33847 12757 35004 -4323 -30522 -409 24542 215 -18693 3850 16211 -9817 -18583
2705a8583L2039J0710l7840j8136L9231K8665l6302l7432K8378M1925j9159m1450
$$ -18583 13456 24166 -13674 -31810 7421 36086 -216 -37648 -9270 32655 13496 -27954
2717b7954J1274L5271q090k7832R890K2291j5163k2672K0757K7068k2829l5866
$$ -27954 -16680 18591 10501 -17331 -7441 14850 -313 -22985 -2228 24840 2011 -33855
2729c3855J9904M4044j2142m9014J980M8114O604m2199j0798L4287J0029k7480
$$ -33855 -13951 30093 17951 -31063 -29083 19031 25635 -16564 -27362 6925 16954 -10526
2741a0526m845K5029p87k7398L805L4226j094m1385n424M5737J5722m4311k4941
$$ -10526 -15371 9658 8871 -18527 -14722 19504 18410 -22975 -28399 17338 33060 -11251 -36192
2754c6192L8762K9971k9463k9534K2007K4477j7899j8105J9202J3127k2991j3803
$$ -36192 2570 32541 3078 -26456 -4449 20028 2129 -15976 3226 16353 -6638 -20441
2766b0441K8404J9663l2474k8857L1355L7591k5917m3460J6862M2816q733l7886
$$ -20441 7963 27626 -4848 -33705 -2350 35241 9324 -34136 -17274 25542 16809 -21077
2778b1077K822L0307k961k4147N940K1767j1415k5735J4299L3261j4218m1351
$$ -21077 -18255 12052 9091 -15056 -9116 12651 1236 -24499 -10200 23061 8843 -32508
2790c2508Q010M7622K91m7434q935M1972J5566l3901j6310K6099J3549k1388q009
$$ -32508 -24498 23124 23415 -24019 -32954 9018 24584 -9317 -25627 472 14021 -7367 -15376
2803a5376K2721M584k7701m200L5589R266m0256j6715M0720K6108l5866l1460
$$ -15376 7345 11929 -15772 -19972 15617 24883 -15373 -32088 8632 34740 -1126 -32586
2815c2586K7194L3368j8714k9430J2455K3668j1679j8492J4928J7136k1204k0829
$$ -32586 -5392 27976 9262 -20168 -7713 15955 4276 -14216 712 17848 -3356 -24185
2827b4185K5627K7667k7023l6379K2362M1497j4586m3282M646L8895J817l2518
$$ -24185 1442 29109 2086 -34293 -11931 29566 14980 -28302 -23656 15239 17056 -15462
2839a5462m792K5406K307k2667K295K4268p250l0205Q193L7597m900m3137k360
$$ -15462 -20254 5152 7459 -15208 -12913 11355 4105 -26100 -17907 19690 14790 -28347 -30707
2852c0707M4492J1486l9566j8379L2693K2312k3974k0124J8806J6063j7947j0426
$$ -30707 13785 25271 -14295 -32674 19 22331 -1643 -21767 -2961 13102 -4845 -15271
2864a5271K3006R064k8837j0617L4750J7787l6225k5026L2429L2159k3966l5469
$$ -15271 7735 16799 -12038 -22655 12095 29882 -6343 -31369 1060 33219 9253 -26216
2876b6216J4872L3688p920k8861N284K2967p856k0258J3197K0462j8787k6438
$$ -26216 -11344 22344 14424 -14437 -9153 13814 5958 -14300 -1103 19359 572 -25866
2888b5866K0747L2767j8472l9652J0251M1461j072l9747p675L3790J0858k7193
$$ -25866 -5119 27648 9176 -30476 -20225 21236 20164 -19583 -27258 6532 17390 -9803
2900i803j0306K2801N076k2212K55K6198l312l1934K142L7349M798l8957j3193
$$ -9803 -20109 2692 7768 -14444 -14189 12009 8697 -23237 -21095 16254 21052 -17905 -31098
2913c1098L6854K1937k9833k5627K2974K6073j6579k1020J5010J6308j6979j1717
$$ -31098 5756 27693 -2140 -27767 -4793 21280 4701 -16319 -1309 14999 -1980 -13697
2925a3697K1899J3154k6842j7175K9618K4605k6814l2612K0502L6724j1939l7232
$$ -13697 8202 21356 -5486 -22661 6957 31562 4748 -27864 -7362 29362 17423 -19809
2937a9809M238L2573j196k6514J502K1212o594k0568J1208K2627j4430k9595J2332
$$ -19809 -15571 17002 15806 -10708 -9206 12006 5412 -15156 -3948 18679 4249 -25346 -13014
2950a3014L5317o712l9378k857L8634J0884l5257j5481K8311J5496k2793j1041
$$ -13014 22303 15591 -23787 -26644 11990 22874 -12383 -27864 447 15943 -6850 -17891
2962a7891J9864N922k0534j953K5754K353l0664o954L4691J5619l3192k3203K8914
$$ -17891 1973 7895 -12639 -14592 11162 13515 -17149 -24103 10588 26207 -6985 -30188 -1274
2975a274K9698k1546k9229J5278K6442j1106k0244J2025J5421j4635j3705J9774
$$ -1274 28424 6878 -22351 -7073 19369 8263 -11981 44 15465 830 -12875 6899
2987F899J7029k3125k3653K1378L1910j7117l7456R396L8026k275l4548l044K7781
$$ 6899 23928 803 -22850 -1472 30438 13321 -24135 -14739 23287 21012 -13536 -16580 11201
3000A1201K420k1602p51J8232l978k0833P302K4881p489l1426K452L6130N169
$$ 11201 13621 -7981 -8732 9500 5522 -15311 -8009 16872 9383 -22043 -19591 16539 21708
3013B1708l8327j2447L4688J8064k8449j8598K1110J6665j6274j1452J5925P927
$$ 21708 -16619 -29066 5622 23686 -4763 -23361 -2251 14414 -1860 -13312 2613 10540
3025A0540j8978o421K5264J0416k9459j6114L0454K4811k6554l0257K1253L1853
$$ 10540 -8438 -14859 10405 20821 -8638 -24752 5702 30513 3959 -26298 -5045 26808
3037B6808j2547k9436P693K3751n166j8002P442J5189j1092j7954J5423K2903
$$ 26808 14261 -15175 -7482 16269 11103 -6899 543 15732 4640 -13314 2109 25012
3049B5012j6670l0316J3512L5440p574l7923K43L4049N614k8944q871K2200O430
$$ 25012 8342 -21974 -8462 26978 19404 -18519 -18276 15773 21387 -7557 -16428 5772 12202
3062A2202j7825l745J7906j056k1844J375K8342M18l3498o376L5049J4069l2927
$$ 12202 -5623 -9368 8538 7482 -14362 -12987 15355 15773 -17725 -24101 10948 25017 -7910
3075g910j9388K7062K1931j8381k1540J3780J6819j0727j2357J3749J1416j9101
$$ -7910 -27298 -236 21695 3314 -18226 -4446 12373 1646 -10711 3038 14454 -4647
3087d647j1894K3723J7419k5232k3492K3679K9402j7682l1440R876L0473k829
$$ -4647 -16541 7182 24601 -631 -24123 -444 28958 11276 -20164 -10288 20185 17356
3099A7356k5931k15K0497q65j6950M316J7747r580k1722J1781K6912j0746l2970
$$ 17356 -8575 -8790 11707 10842 -6108 -1792 15955 6375 -15347 -3566 23346 12600 -20370
3112b0370N148L4955K013l3687r149K7893J3302k2212j4082J7515R977j6087n928
$$ -20370 -15222 19733 21746 -11941 -21090 6803 20105 -2107 -16189 1326 11303 -4784 -10712
3125a0712J8841K098k3283l297K8878P618l1306j3678K9583K0502k3786k4660
$$ -10712 8129 10227 -13056 -16353 12525 20143 -11163 -24841 4742 25244 1458 -23202
3137b3202J7103K5058j0100k1887Q019J7542q727j3778J3272J3449j7791j6364
$$ -23202 -6099 18959 8859 -13028 -5009 12533 3806 -9972 3300 16749 -1042 -17406
3149a7406K1197K2334j9904k7621J4719L1401p123l1606L15K8243L902k3450m240
$$ -17406 3791 26125 6221 -21400 -6681 24720 17597 -14009 -13694 14549 18451 -4999 -9239
3162i239J8961N92j7672M022J9298p207k4300O709K8704l689l1073m507L1273
$$ -9239 9722 10314 -7358 -3336 15962 8755 -15545 -8836 19868 16179 -14894 -19401 11872
3175A1872J1854k8486j6288K1802J7466j6844j5289J4534R826j4665o543J8744
$$ 11872 23726 -4760 -21048 754 18220 1376 -13913 621 10447 -4218 -10761 7983
3187G983N421k2717q545K6055J3953k4692k1343K1951K5740j4800k7560Q819K5598
$$ 7983 13404 -9313 -17858 8197 22150 -2542 -23885 -1934 23806 9006 -18554 -9735 15863
3200A5863n221k0312N373J5089p389j3432J2254J4867j4955j9584J4857K5776
$$ 15863 10642 -9670 -4297 10792 3403 -10029 2225 17092 2137 -17447 -2590 23186
3212B3186j1124l0446M461L1867K204k9576p267K4785Q086j9480o126J6468J323
$$ 23186 12062 -18384 -13923 17944 20148 -9428 -16695 8090 16176 -3304 -9430 7038 8361
3225H361j6204J630J9777l278k4215j286K8932O203k9030j3961K6531J9435k1991
$$ 8361 -7843 -6213 13564 10286 -13929 -15215 13717 19920 -9110 -23071 3460 22895 904
3238I04k1261J6426J8031j1455j3872J0723R718j2847p816J6892R892j9946j5133
$$ 904 -20357 -3931 14100 2645 -11227 -504 9214 -3633 -11449 5443 15335 -4611 -19744
3251a9744K0940K2122j8983k6996J3945K9103p166k7513L027K2184j04j7393J322
$$ -19744 1196 23318 4335 -22661 -8716 20387 13221 -14292 -11265 10919 10815 -6578 -5256
3264e256J4438n413j3862Q300J8505r836k4137P590K8544k089l1187l921K9720
$$ -5256 9182 3769 -10093 -1793 16712 6876 -17261 -9671 18873 16784 -14403 -18324 11396
3277A1396Q643k4501j1435J8854J0699j4620p467J2739M117j5447j891J9801L604
$$ 11396 20039 -4462 -15897 2957 13656 -964 -8431 4308 8425 -7022 -8913 10888 14492
3290A4492k4873q129K6763J4137k4977j9985K0649K2018j4788k0648R242J6915
$$ 14492 -10381 -18510 8253 22390 -2587 -22572 -1923 20095 5307 -15341 -6099 10816
3302A0816o672j2840P336J1387j1196j1376J4497J4977j6380k1153J6026K6192
$$ 10816 4144 -8696 -1360 10027 -1169 -12545 1952 16929 549 -20604 -4578 21614
3314B1614j1920k8750N906K7517L42k3313l702J8129K908j4282n4J3306k221j6744
$$ 21614 9694 -19056 -13150 14367 14709 -8604 -12306 5823 8731 -5551 -5605 7701 5480 -11264
3328a1264M523K1403l997k5897L52K8482M733k7695j0645K4154J3657j8143j4133
$$ -11264 -6741 14662 10665 -15232 -14880 13602 18335 -9360 -20005 4149 17806 -337 -14470
3341a4470J2829J2582j1134q206J1712O377j5936o353K0239R149k3116j4038K2644
$$ -14470 -1641 10941 -193 -8399 3313 9690 -6246 -12599 7640 16789 -6327 -20365 2279
3354B279J9343j9038k2738J2675K2880o346k0827K698J6911k929j3457O067J2281
$$ 2279 21622 2584 -20154 -7479 15401 9055 -11772 -9074 7837 4908 -8549 -2482 9799
3367I799r376j3978J1660J9057j2657k4140R196K6680k473k7606k467K3810O144
$$ 9799 423 -13555 -1895 17162 4505 -19635 -10439 16241 13768 -13838 -16305 7505 13649
3380A3649j9116p538J5130O065j3669j745J5047j351j8158J262K3184R31k5392
$$ 13649 -5467 -13005 2125 8190 -5479 -7224 7823 6472 -11686 -10424 12760 13691 -11701
3393a1701o447K5596J2086k1734j6747J6412J8784j2088j5756Q194J2958r783
$$ -11701 -18148 7448 19534 -2200 -18947 -2535 16249 4161 -11595 -3401 9557 -226
3405b26q779J2554P517j6300r163J8473J4073j8808j9036J5729K3073r818k4881
$$ -226 -9005 3549 11066 -5234 -14397 4076 18149 -659 -19695 -3966 19107 9289 -15592
3418a5592L854K3120q07j8893j510J6044j809j3153N964J3091q691j6649R621
$$ -15592 -11738 11382 10575 -8318 -9828 6216 4407 -8746 -2782 10309 1618 -15031 -5410
3431e410K0711o665k4752J991K5045M471k3044j0046K0195J1269j5968j0008J3712
$$ -5410 15301 8636 -16116 -14125 10920 15391 -7653 -17699 2496 13765 -2203 -12211 1501
3444A501N749j2324k121J4559M62j7962k862K1494P763k2358j2754J9754J8503
$$ 1501 7250 -5074 -7195 7364 7826 -10136 -12998 8496 16259 -6099 -18853 901 19404
3457A9404j6305k0298J1221J8867o077j6719O442J1990q187r163J0830R799j3684
$$ 19404 3099 -17199 -5978 12889 6812 -9907 -3465 8525 338 -8825 2005 11804 -1880
3470a880j3469J4339J7881j2299k2349P144K5405k858k4539j342K1415J970j5728
$$ -1880 -15349 -1010 16871 4572 -17777 -10633 14772 11914 -12625 -13967 7448 9418 -6310
3483f310k131J2017m62j2015M424J3868n149j8386L589K2313Q93k4801o210K4482
$$ -6310 -8441 3576 3114 -8901 -4477 9391 4242 -14144 -10555 11758 12651 -12150 -18360 6122
3497F122J0489j9812j3222J4807J3475j1334r962R575O416r873n053J4189M552
$$ 6122 16611 -3201 -16423 -1616 11859 525 -9437 138 6554 -3319 -8372 5817 10369
3510A0369j6723q604J9539J3523j8393j8530J4832K1175r822j9833M824J7245
$$ 10369 -6354 -14958 4581 18104 -289 -18819 -3987 17188 7366 -12467 -7643 9602
3522I602k752j3466L104J0498o103r562Q034J2717j0848j6819R667K1376o153
$$ 9602 6850 -6616 -3512 6986 883 -8679 -645 12072 1224 -15595 -5928 15448 9295
3535I295k4146J407K3332L593k1577n139J5274O630j1842m456J1020M76j1956
$$ 9295 -14851 -13444 9888 13481 -8096 -13235 2039 8669 -3173 -7629 3391 3867 -8089
3548h089J194J5660k67j9415k912K2365P626k2373j1561J9318J4427j3863j5326
$$ -8089 -6895 8765 8498 -10917 -13829 8536 16162 -6211 -17772 1546 15973 2110 -13216
3561a3216R537J3385o503j0061O879P781j0106p006J3470R606j6114j4524J7124
$$ -13216 -3679 9706 3203 -6858 21 7802 -2304 -9310 4160 13766 -2348 -16872 252
3574B52J8339j3481k0654Q561K0645l913j8826J002J4888Q0j1520K700R419m753
$$ 252 18591 5110 -15544 -6983 13662 9749 -9077 -8075 6813 6893 -4627 -1927 7492 2739
3588B739j2185O195J6021p812j9206M289K2430m5k3272m126K0181P354j5473r796
$$ 2739 -9446 -3251 12770 4958 -14248 -9959 12471 12426 -10846 -14972 5209 12563 -2910 -12706
$$ [...]
8191B01
##END NTUPLES=NMR FID
##END=
