##TITLE=1H_SA_18.tr.sub
 CDCl3, 108 sc, 
 27.04.2021
##JCAMPDX= 6.0         $$ Bruker NMR JCAMP-DX V2.0
##DATA TYPE= NMR FID
##DATA CLASS= NTUPLES
##ORIGIN= UXNMR, Bruker Analytische Messtechnik GmbH
##OWNER= root
$$ XWIN-NMR		Version 3.5
$$ Tue Apr 27 16:00:11 2021 Russian Standard Time (UT+4h)  she@DPX200
##.OBSERVE FREQUENCY= 200.131506
##.OBSERVE NUCLEUS= ^1H
##.DELAY= (6, 6)
##.ACQUISITION MODE= SIMULTANEOUS
##.ACQUISITION SCHEME= undefined
##.AVERAGES= 108
##.DIGITISER RES= 18
##SPECTROMETER/DATA SYSTEM= spect
##.PULSE SEQUENCE= zg30
##.SOLVENT NAME= CDCl3
##.SHIFT REFERENCE= (INTERNAL, CDCl3, 0, 15.7039)
##AUDIT TRAIL= $$ (NUMBER, WHEN, WHO, WHERE, WHAT)
$$ ##TITLE= Audit trail, XWIN-NMR		Version 3.5
$$ ##JCAMPDX= 5.01
$$ ##ORIGIN= Bruker BioSpin GmbH
$$ ##OWNER= she
$$ F:/spectra/data/she/nmr/H-F/1/audita.txt
$$ ##AUDIT TRAIL=  $$ (NUMBER, WHEN, WHO, WHERE, WHAT)
(   1,<2021-04-27 15:56:36.54 +0400>,<she>,<DPX200>,
      <continue with go, POWCHK disabled, PULCHK disabled
       configuration hash MD5:
       00 E9 B6 7A A2 85 ED C7 34 08 36 98 17 FE 4E 26
       data hash MD5: 16K
       8C 58 20 64 81 FD 9F BF 95 A5 26 F5 E8 75 06 BE>)
$$ ##END=
$$ 
$$ hash MD5
$$ E6 60 69 2E 37 59 16 C7 5E 12 65 81 B8 F6 97 62
##$RELAX= 
##$RELAX= 
##$RELAX= 
##$RELAX= 
##$RELAX= 
##$RELAX= 
$$ Bruker specific parameters
$$ --------------------------
##$DU= <F:/spectra>
##$EXPNO= 1
##$NAME= <H-F>
##$PROCNO= 1
##$TYPE= <nmr>
##$USER= <she>
##$AMP= (0..31)
100 100 100 100 100 100 100 100 100 100 100 100 100 100 100 100 100 100 
100 100 100 100 100 100 100 100 100 100 100 100 100 100 
##$AQSEQ= 0
##$AQ_mod= 1
##$AUNM= <au_zg>
##$AUTOPOS= <>
##$BF1= 200.13
##$BF2= 200.13
##$BF3= 200.13
##$BF4= 200.13
##$BF5= 200.13
##$BF6= 200.13
##$BF7= 200.13
##$BF8= 200.13
##$BYTORDA= 1
##$CFDGTYP= 0
##$CFRGTYP= 5
##$CHEMSTR= <none>
##$CNST= (0..31)
1 1 145 1 1 1 1 1 1 1 1 1 1 1 1 1 1 1 1 1 1 1 1 1 1 1 1 1 1 1 1 1 
##$CPDPRG= <>
##$CPDPRG1= <>
##$CPDPRG2= <>
##$CPDPRG3= <>
##$CPDPRG4= <mlev>
##$CPDPRG5= <mlev>
##$CPDPRG6= <mlev>
##$CPDPRG7= <mlev>
##$CPDPRG8= <mlev>
##$CPDPRGB= <>
##$CPDPRGT= <>
##$D= (0..31)
0 1.2 0 0 0 0 0 0 0 0.06 0 0.03 0 0 0 0 0.0002 0 0 0 0 0 0 0 0 0 0 0 0 
0 0 0 
##$DATE= 1619524193
##$DBL= (0..7)
120 120 120 120 120 120 120 120 
##$DBP= (0..7)
150 150 150 150 150 150 150 150 
##$DBP07= 0
##$DBPNAM0= <>
##$DBPNAM1= <>
##$DBPNAM2= <>
##$DBPNAM3= <>
##$DBPNAM4= <>
##$DBPNAM5= <>
##$DBPNAM6= <>
##$DBPNAM7= <>
##$DBPOAL= (0..7)
0.5 0.5 0.5 0.5 0.5 0.5 0.5 0.5 
##$DBPOFFS= (0..7)
0 0 0 0 0 0 0 0 
##$DE= 6
##$DECBNUC= <off>
##$DECIM= 32
##$DECNUC= <off>
##$DECSTAT= 4
##$DIGMOD= 1
##$DIGTYP= 9
##$DL= (0..7)
0 120 120 120 120 120 120 120 
##$DP= (0..7)
150 150 150 150 150 150 150 150 
##$DP07= 0
##$DPNAME0= <>
##$DPNAME1= <>
##$DPNAME2= <>
##$DPNAME3= <>
##$DPNAME4= <>
##$DPNAME5= <>
##$DPNAME6= <>
##$DPNAME7= <>
##$DPOAL= (0..7)
0.5 0.5 0.5 0.5 0.5 0.5 0.5 0.5 
##$DPOFFS= (0..7)
0 0 0 0 0 0 0 0 
##$DQDMODE= 0
##$DR= 18
##$DS= 0
$$ [...]
##$SUBNAM2= <"">
##$SUBNAM3= <"">
##$SUBNAM4= <"">
##$SUBNAM5= <"">
##$SUBNAM6= <"">
##$SUBNAM7= <"">
##$SUBNAM8= <"">
##$SUBNAM9= <"">
##$SW= 16.9725357007746
##$SWIBOX= (0..15)
0 0 2 0 0 0 0 0 0 0 0 0 0 0 0 0 
##$SW_h= 3396.73913043478
##$TD= 16384
##$TD0= 1
##$TE= 0
##$TE2= 300
##$TE3= 300
##$TEG= 300
##$TL= (0..7)
0 120 120 120 120 120 120 120 
##$TP= (0..7)
150 150 150 150 150 150 150 150 
##$TP07= 0
##$TPNAME0= <>
##$TPNAME1= <>
##$TPNAME2= <>
##$TPNAME3= <>
##$TPNAME4= <>
##$TPNAME5= <>
##$TPNAME6= <>
##$TPNAME7= <>
##$TPOAL= (0..7)
0.5 0.5 0.5 0.5 0.5 0.5 0.5 0.5 
##$TPOFFS= (0..7)
0 0 0 0 0 0 0 0 
##$TUNHIN= 0
##$TUNHOUT= 0
##$TUNXOUT= 0
##$USERA1= <user>
##$USERA2= <user>
##$USERA3= <user>
##$USERA4= <user>
##$USERA5= <user>
##$V9= 5
##$VALIST= <valist>
##$VCLIST= <CCCCCCCCCCCCCCC>
##$VD= 0
##$VDLIST= <DDDDDDDDDDDDDDD>
##$VPLIST= <PPPPPPPPPPPPPPP>
##$VTLIST= <TTTTTTTTTTTTTTT>
##$WBST= 1024
##$WBSW= 4
##$XGAIN= (0..3)
0 0 0 0 
##$XL= 0
##$YL= 0
##$YMAX_a= 496790
##$YMIN_a= -165665
##$ZGOPTNS= <>
##$ZL1= 120
##$ZL2= 120
##$ZL3= 120
##$ZL4= 120
##$ABSF1= 10
##$ABSF2= 0
##$ABSG= 5
##$ABSL= 3
##$ALPHA= 0
##$AQORDER= 0
##$ASSFAC= 0
##$ASSFACI= 0
##$ASSFACX= 0
##$ASSWID= 0
##$AUNMP= <proc_1d>
##$AZFE= 0.1
##$AZFW= 0.1
##$BCFW= 1
##$BC_mod= 2
##$BYTORDP= 1
##$COROFFS= 0
##$CY= 11.3945322036743
##$DATMOD= 1
##$DC= 2
##$DFILT= <>
##$DTYPP= 0
##$F1P= 15.9154993809931
##$F2P= -4.1035820241983
##$FCOR= 0.5
##$FTSIZE= 0
##$FT_mod= 4
##$GAMMA= 1
##$GB= 0.15
##$INTBC= 1
##$INTSCL= 1
##$ISEN= 128
##$LB= 0.24
##$LEV0= 0
##$LPBIN= 0
##$MAXI= 10000
##$MC2= 0
##$MEAN= 0
##$ME_mod= 0
##$MI= 1.114404
##$NCOEF= 0
##$NC_proc= 0
##$NLEV= 6
##$NOISF1= 3.799351
##$NOISF2= 2.8
##$NSP= 1
##$NTH_PI= 0
##$NZP= 0
##$OFFSET= 15.70392
##$PC= 1
##$PHC0= -11127.57
##$PHC1= 22.20102
##$PH_mod= 1
##$PKNL= yes
##$PPARMOD= 0
##$PSCAL= 0
##$PSIGN= 0
##$REVERSE= no
##$SF= 200.130013532006
##$SI= 16384
##$SIGF1= 3
##$SIGF2= 2
##$SINO= 400
##$SIOLD= 16384
##$SREGLST= <1H.CDCl3>
##$SSB= 0
##$STSI= 0
##$STSR= 0
##$SW_p= 3612.71676300578
##$SYMM= 0
##$S_DEV= 0
##$TDeff= 0
##$TDoff= 0
##$TI= <>
##$TILT= no
##$TM1= 0
##$TM2= 0
##$TOPLEV= 0
##$USERP1= <user>
##$USERP2= <user>
##$USERP3= <user>
##$USERP4= <user>
##$USERP5= <user>
##$WDW= 1
##$XDIM= 8192
##$YMAX_p= 0
##$YMIN_p= 0
$$ End of Bruker specific parameters
$$ ---------------------------------
##NTUPLES= NMR FID
##VAR_NAME=  TIME,          FID/REAL,        FID/IMAG
##SYMBOL=    X,             R,               I
##VAR_TYPE=  INDEPENDENT,   DEPENDENT,       DEPENDENT
##VAR_FORM=  AFFN,          ASDF,            ASDF
##VAR_DIM=   8192,          8192,            8192
##UNITS=     SECONDS,       ARBITRARY UNITS, ARBITRARY UNITS
##FACTOR=    0.0002944,     1,               1
##FIRST=     0,             0,               0
##LAST=      2.4114304,     0,               0
##MIN=       0,             -165665,         0
##MAX=       2.4114304,     496790,          0
$$ Real data points
##PAGE= N=1
##DATA TABLE= (X++(R..R)), XYDATA
0@%%%%%%%%%%%%%%%%%N9j67K16k16K16k16K29l37M32m32N40o48O97q05R24j033
33e41J186j352J490j664J870k097K348k617K904l223L576l957M370m820N302n845
49c070O441p089P813q609R497j0485J1606j2880J4339j6042J8046k0443K3372
62A2496k7054L1831l8283M7517o1838Q7211j44911N08023Q1798o62455O31064
73D65399l67969n4547K34621k75983J15810j3840j98683L07698k70442k3994K81378
84A99448l35199J42873J24014k58645J70255N301j41601J54458q823j26645J59287
95H4723j50083L6063R4928j75482J72044o7704j45917K29200j15032q7162K44991
106A20569k22288M0804J70870k67114K18134o9074j12739K22527k05717O7086
$$ y = [0, 0, 0, 0, 0, 0, 0, 0, 0, 0, 0, 0, 0, 0, 0, 0, 0, 0, 59, -108, 108, -108, 108, -108, 121, -216, 216, -216, 324, -324, 373, -432, 492, -541, 645, -707, 783, -881, 989, -1108, 1240, -1377, 1527, -1696, 1880, -2077, 2293, -2527, 2775, -3070, 3371, -3718, 4095, -4514, 4983, -5502, 6104, -6776, 7563, -8479, 9567, -10876, 12496, -14558, 17273, -21010, 26507, -35331, 51880, -93031, 414992, 496790, -165665, 465399, 97430, 42883, 277504, 1521, 117331, 103491, -95192, 212506, -57936, -81930, 199448, -135751, 7122, 131136, -127509, 42746, 48047, -93554, 60904, 52081, -74564, 84723, -65360, -29297, 65631, -109851, 62193, -5511, -151428, 77772, -37260, -124422, 120569, -101719, -60915, 109955, -157159, 60975, -8099, -120838, 101689, -104028, -36942]
116c6942R8714k00362J56843j8329j46039K33339j53494m0238J69046j93615J10112
127b0965L0142j09750R6512l3350l2631R7162p8776q803J21655j44660Q2132L7244
139C5912j26097J29364l8511n1381J04473p1638n861J09096j35531P5721M9038
150G4585j30888J48145q2188k4137J11056j26275N9731M5061j20896J08956j4084
161D9066j04067J42460j06973J0569Q3840j38117R3159j2619o6655Q6247m5736
172h826l2149P6231o8365K3133M9569j11321R8905k3324p1250J04039n3184k7917
184d4459O5083n7419M482N5896q0702P1547k9866n3869J10230r2087K5120M5971
196A9927q7595O3210J7861p7008Q3214k5099n4086J01998p9620K8328K6393o2185
$$ y = [-36942, 61772, -138590, 18253, -76, -146115, 87224, -66270, -106508, 62538, -131077, -20965, 9177, -100573, -4061, -37411, -70042, 27120, -51656, -60459, 61196, -83464, -1332, 35912, -90185, 39179, 668, -50713, 53760, -17878, -23739, 85357, -50174, 25547, 74585, -56303, 91842, 9654, -14483, 96573, -29702, 30029, 75090, -45806, 63150, 49066, -55001, 87459, -19514, -8945, 74895, -63222, 29937, 17318, -49337, 36910, -8826, -40975, 35256, -33109, -9976, 39593, -71728, 27177, 3853, -67397, 36642, -16542, -44459, 20624, -36795, -32313, 23583, -57119, 14428, -15438, -69307, 40923, -51164, -26044, 19927, -67668, -4458, 13403, -63605, 19609, -5490, -59576, 42422, -37198, -8870, 17523, -44662]
208d4662P1775m5021r361P0064o2662o669P4910q1629L9125M1721q3882O9572
220C3281l0554r238M8896m5819J5898K5142m4801L9602O085o1212R2521n9528
232A0273j7035Q0209q6225L4016K9425n5743L0060Q148l6201M7978m4790P49N5665
245E6529q9426O9142r354o2155P5992l7568k2323N2452m2375m724M9882p3204
257c7132M4974J016m3031O4945o4730J5900L1983n4746L6789J7863o8092N2583
269a678P060o2629P5425m7292K570L5458n3032M0145p364k3001L9324j9545k3099
282c7658O2805n3713Q535M4026p4034O8241q413l8793M5776k4359q632L8953k8720
295e986N850K6700n6064O1505k6541k6059P0055o0775J3458K7917m0573K0116
$$ y = [-44662, 27113, -17908, -27269, 42795, -19867, -26536, 48374, -33255, 5870, 47591, -36291, 33281, 2727, -6511, 42385, -3434, 12464, 37606, -7195, 32407, 38492, -22720, 69801, 10273, -6762, 73447, -12778, 21238, 50663, -5080, 24980, 33128, -3073, 44905, 115, 864, 56529, -32897, 36245, 26891, -35264, 40728, 3160, -19163, 33289, -9086, -13810, 36072, -37132, 7842, 8858, -34173, 30772, -33958, -18058, 13925, -40821, -4032, 13831, -54261, -1678, 5382, -57247, 18178, -29114, -26544, 8914, -44118, -3973, -11337, -34338, 4986, -14559, -37658, 25147, -28566, -20031, 23995, -50039, 18202, 9789, -29004, 16772, -7587, -16219, 22734, -5986, -136, 26564, -29500, 32005, 5464, -20595, 49460, -11315, 2143, 30060, -10513, 9603]
307I603J8010m3703L8558r686k5289N2969n7973K5036J5326l7957M1561k2334
319D121j8954L7640k2867j8704N1915n0827J5390K3606n1979M4533k1381l697
331a1204K5524l2588M219K3946l6864J9339J6071m9543N4591l0059j0821M1839
343A4450m5588K1944J3980l0410J7853P654k7079L4792k6601j772M0648n3823
355c3952L9422k635l3093M0089j0576j3142K5296j9995l568L4069m0979L1616
367A2552J204k6727L9744k8496Q437J7907k3854J0728J4323l1944L0280L961l9833
380a1718M4098k8685O938J9898l2151J8654l038j6774K4981r139k1119L8499l4698
393d254R577K1898m0606L9054j6177j4646K7686j7108m319J6551k3473P113J4339
$$ y = [9603, 27613, -16090, 22468, 12782, -12507, 40462, -17511, 7525, 22851, -15106, 26455, 4121, -14833, 22807, -60, -18764, 33151, -17676, -2286, 21320, -30659, 13874, -7507, -11204, 14320, -18268, -14049, 9897, -26967, -7628, 8443, -41100, 13491, -16568, -27389, 14450, -31138, -9194, 4786, -25624, -7771, -117, -27196, 7596, -19005, -20777, 19871, -33952, 5470, 2835, -30258, 9831, -745, -13887, 11409, -8586, -12154, 21915, -19064, 12552, 13756, -12971, 26773, -1723, 6714, 24621, 767, 11495, 25818, -6126, 24154, 28115, -11718, 32380, 3695, 10633, 30531, -1620, 17034, 13996, -2778, 22203, 13064, -8055, 30444, -4254, 5323, 27221, -13385, 25669, 9492, -5154, 22532, 5424, 1105, 17656, -5817, 1296, 15635]
406A5635l1712L3301k4300q809K9921l3028J3310O819k0778J0409N317k3977K7014
419h78j4239r109L2510l7408K0064M326j8547K2175j0781q615K0990j4479n654
432a9645L0146l7079K4712P356k7851L3987j9347J873J7678k1482O966J8022k6613
445a1277K0253p28k3081M2016l2059Q949J5902l4297K3953N425k2841J7067R01
458A0183k1836L0221k2282P187J7123l4152L2440j2870j2992K7225j6236j0158
470f147K3846k3002M957K1563m0209K8017n506j2927K5479k4378O760N779j7346
483a3114J4846Q420l2958L2300j0623k1319L9466k9346Q709P724j9738J4323k611
496c921r622J5571j2344j0058L0954l2275J6895J1052l1615L3484r183j2272J9255
$$ y = [15635, -16077, 17224, -7076, -15885, 14036, -18992, -5682, 1137, -19641, -9232, -3915, -27892, -878, -15117, -24226, 8284, -29124, -9060, -4734, -23281, -1106, -11887, -20502, 488, -13991, -19645, 10501, -26578, -1866, 5490, -22361, 11626, -7721, -5848, 11830, -9652, -2686, 15336, -11277, 8976, 8248, -14833, 27183, -4876, 4073, 19975, -14322, 9631, 15056, -7785, 9282, 10183, -11653, 18568, -3714, 3473, 20596, -13556, 18884, 6014, -6978, 20247, 4011, -6147, 17699, -5303, -346, 21217, -18992, 9025, 3519, -9408, 16071, -8307, -1547, 4232, -13114, 1732, 10152, -22806, 9494, -1129, -22448, 17018, -12328, -3619, 4105, -15633, -1310, -3921, -13543, 2028, -10316, -20374, 10580, -21695, -4800, 6252, -25363, 8121, -1062, -13334, 5921]
509E921q201p597K1777j7986R341Q092k5655L6475k5124p49K8922k9055P228J2528
523A5917k0489R511R950k2546K5501j5389j313K2253l1837K5234k240j4143J9480
536A9889r801j0502K2988j3357o293K2726k8502J8224L7j3729J7822j6914K677
549E265R658j4705o85J6306k7276J3718O525k3164K7130k0194L81J0804j7665
562a3902J3754K518k2559J5144l25j8327L1147k5304L703J5053k6138K3936p600
575h900r428J3682r072l681J5583j7346P584J2265k7208K8657p245q812J5748
588A827j2142L195M840p23R06K863j3717K0106p082j1325K6247k1568O882R008
602I317j1680M321O310j3748J3939k426j0251K1707k3557J5793J549j9501K8394
$$ y = [5921, -2280, -9877, 11900, -6086, 3255, 11347, -14308, 22167, -2957, -3706, 25216, -3839, 3389, 15917, -4572, 4939, 14889, -7657, 17844, 2455, 1142, 23395, -8442, 16792, 14552, 409, 19889, 10088, -414, 22574, 9217, 2924, 25650, -2852, 15372, 15409, 1680, 19502, 2588, 5265, 14923, 218, -467, 15839, -11437, 2281, 8806, -14358, 12772, -7422, -7041, 3763, -13902, -148, 2370, -20189, -5045, -5370, -23697, 7450, -17854, -14151, 902, -25236, -1300, -8900, -18328, -4646, -13718, -17399, -1816, -19162, -11578, 687, -26521, 2136, -5109, -13921, 1827, -10315, -7120, -2280, -3003, -2097, 766, -12951, 7155, 73, -11252, 14995, -6573, 309, 9317, -2363, 1958, 8268, -5480, 8459, 6033, -4218, 17489, -6068, 9725, 11274, -8227, 20167]
615B0167j3972p226J8103j2170m927J8423j7370N708L105j1289J9853k1506R107
628F006Q876j8211R552K657j4367Q924M682j8308J8175j0560j500J0242j5019
641h851Q822l741j853O186n705o852J6824j6300j950K2453k6972J6440J945j4399
655a3953J5194p013J093O161r971M597P987j8556K2804q225j2230K5010j9904
668g006O747Q124j1141O058L762q412Q625r87p443J4550j6901J1334M609j4587
682b668J5469n726q969J2339Nj2169J5836j1635J126Q315j7384J8372r746l123
696D2J1389j1203j89J0019j4222N226Q453j9715K1766j1907o576J5040j6694R132
710E61q46n874L737n73q949J3510r444m915J7295k0463J1179l46p854Q978m289
$$ y = [20167, 6195, -1031, 17072, 4902, -25, 18398, 1028, 6736, 9841, -1448, 18405, -3101, 6006, 14882, -3329, 6223, 8880, -5487, 3437, 8119, -10189, 7986, -2574, -4074, 6168, -8851, -29, -3770, -5623, 563, -5142, -11994, 4830, -11470, -13420, 9033, -17939, -1499, 446, -13953, 1241, -5772, -4679, 1482, -8489, -3892, 4095, -14461, 8343, 118, -12112, 12898, -7006, -259, 7865, -3276, 2782, 6544, -1868, 6757, 5770, -1673, 12877, -4024, 7310, 11919, -2668, 12801, 7075, -1894, 10445, 10450, -1719, 14117, 2482, 3608, 11923, -5461, 12911, 3165, 42, 11431, 228, 39, 10058, -4164, 1062, 9515, -10200, 11566, -341, -6917, 8123, -8571, 561, -285, -6159, -2422, -2995, -11944, 1566, -7878, -12793, 4502, -15961, -4782, -5128, -12982, -4004, -8293]
725h293l165Q271n517n393J6363j6199O499O159j2628J5349j0108J699Q377r772
739h358J298J0967j3465O763O996j5713J9793j3637L726R073j3848R342K120m742
753C15L978L07p414J4700j0942J389J2495j9721J3726j16p682O884j331k990L675
768G273k177j927J0121j4955J1704l131q340J3773j0857J441N110p165k07R508
782A0171j2831N632K675j1225J2413r615M274L09q263R707m659m823Q071k318
796d82r583J3060j0615L048O008r958Q064o906L181K017k689M90N014n414K072
811b693M284j2515J5389p891l478R339n791K562J469m20k998M848l257Q211p291
826b32j507J1661j4547R749O08n572N241m09k525M163k178l862Q401j1070Q248
$$ y = [-8293, -11458, -3187, -8704, -14097, 2266, -13933, -7434, -1275, -13903, 1446, -8662, -6963, 1414, -8358, -7060, 3907, -9558, -2795, 4201, -11512, 8281, -5356, -1630, 7443, -6405, 2937, 5057, 315, 4293, 4600, -2814, 11886, 944, 2333, 14828, -4893, 8833, 8717, 1035, 7919, 6588, 3598, 7273, 5096, 3169, 13290, -1665, 10039, 6908, -1432, 12341, 1484, 2925, 8035, 870, 663, 10171, -2660, 2972, 5647, -5578, 6835, -2780, 1494, 1803, -6460, 3247, -1412, -6235, 1836, -482, -10065, 2995, -7620, -4572, 1436, -8522, -458, -7364, -4183, -2166, -4855, -4365, 649, -4765, -2693, 1591, -10924, 4465, -3426, -6904, 2435, -3356, -794, 675, 255, -2743, 2105, -1152, 7059, -232, -1739, 9922, -4625, 5124, 5732, 160, 5401, 4992, 2467, 6630, 4452, 590, 8991, -2079, 6169]
841F169j377o061J0250j1583N213M051n786Q96M706j0020M805M199p744O561q241
856c962M876j031m661P925m164l800L795Q7o272R265q846J179N067j0035R055
871a522l211k725K585O21k382L827l785J375K709r455J3104n191l738P555o067
886f300J814J416j840K560L060r057R594l223k424Q169r154P964l079o23N312
901D189l900p72M999j052k923Q849q705M269L94l730P423o012L224J955l785r63
917C460N823o108M518J926r737J0776q346J570M395n819J197J898k530k74K650
932E399o661Q813r025R52O716j1111P628k821k641K976n3k451K120l459j137O588
948A833q209P337n377j592O246n241L217R70k826j588O102p176N036J272o592
$$ y = [6169, 4792, -1269, 8981, -2602, 2611, 6662, 876, 1772, 6478, -3542, 1263, 5462, -2282, 4279, -3962, 914, -117, -4778, 3147, -1017, -4817, -1022, -935, -7207, 2058, -6788, -5609, -542, -10577, -1522, -4733, -7458, -4873, -4252, -6634, -2807, -6592, -5217, -2508, -11963, 1141, -4050, -7788, -233, -6300, -4486, -3070, -4910, -2350, 710, -8347, 1247, -1976, -4400, 3769, -5385, 2579, -500, -1123, 4189, 289, -483, 4516, 3464, 541, 9390, 685, 4954, 5348, 1618, 9041, 3029, 6253, 8208, 4423, 3460, 9283, 3175, 7693, 9619, -118, 10658, 2312, 3882, 8277, 2458, 3655, 5553, 3023, 2749, 5399, -1262, 7551, -1474, -522, 6194, -4917, 2711, -110, -2751, 225, 172, -2279, -159, -3618, -4755, 1833, -6376, 961, -4416, -6008, 238, -5003, -1786, -816, -3642, -5230, 872, -6304, -1268, 4, -6588]
963f588O549n820N062j594j883K787J180l221M972R28q372R758p269L693L053
978C235n503N816l598J623P12J139k352M669l496J4L952p871R811p023J13L184
994D425j881P97r38N48j494L530o514O477m615j357N243p134L986j835L0M50k51
1011e33l774M972k331l657Q351r801N184j752j541N362o408K358K86n59j880N517
1027b06o155L577k262l451Q082p979N429m92j348K535J096j1j714J560j882O377
1043C156o962L691K111o267O692k233o01J933J860m716L922j677J001M139q403
1058b354Q408m821J892L322m105K490J318k678P43M740q418P139l147r21L903
1073G511n604N832m437j87L011k962n19K947l264l001O381p489N446j753k351
$$ y = [-6588, -39, -5859, -797, -2391, -4274, -1487, -307, -3528, 1444, 2372, -6000, 3758, -3511, 182, 3235, -2268, 3548, -50, 1573, 2285, 3424, 1072, 5741, 2245, 2259, 6211, -1660, 8151, 1128, 1241, 4425, 2544, 3341, 2403, 2951, 1457, 4987, -1527, 4950, 335, -1022, 4221, -2913, 1073, -762, -732, -282, -533, -4307, 665, -1666, -5323, 3028, -6773, -1589, -3341, -4882, 480, -5928, -3570, -3284, -3843, -5723, -206, -6361, -2784, -5046, -8497, -415, -8394, -2965, -3457, -4805, -2270, -1174, -1185, -2899, -1339, -3221, 3156, -3806, -115, 1996, -4271, 2421, 188, -413, 1520, 3380, -1336, 2586, 909, 1910, 6049, -2354, 6054, 1233, 3125, 6447, 2342, 4832, 6150, 3472, 4215, 8955, 537, 7676, 4529, 3608, 7511, 1907, 7739, 3302, 3115, 6126, 3164, 2645, 5592, 2328, -673, 5708, -1781, 3665, 1912, -439]
1088d39L319m521J818l20j228q9K427o136N157r83n926R158q078J865J154l10
1104c132o52J567k430K468N26m250P213q206L477M510q006O060j378q23J466k62
1120a852j951N091m294P63L998o024O232k903q25M124m111K896J795l643L82M560
1136D238o375N097p94k681N754o265L039R13j407K245R57n346K976L38m059P547
1152F177p252L664N65n237M721j349j738J761l12l101L957n619K933J532o532
1167e830O485l447R66M10k408J837O70j389r8J989o468P079j894k018M500m417
1183d033J205j9N7M21K155l409L849l238j048O241o219N026j670o01L230j320
1199F27j168J828n13j892N783n917M920j013l325O944n202K718J196r73k051L436
$$ y = [-439, 2880, -1641, 177, -143, -1371, -1460, 967, -5169, -12, -995, -6921, 2237, -5841, -3976, -2822, -3132, -3784, -2217, -4647, -2179, -1653, -5903, 1310, -6896, -3419, 1091, -6915, -855, -2233, -3056, -1590, -1852, -3803, 1288, -3006, -2243, 1755, -4269, 1963, -940, -1765, 2359, -1752, 1144, 2939, -704, -322, 4238, -2137, 2960, 2166, -515, 5239, -1026, 2013, 2926, 1519, 3764, 4721, -625, 2351, 2689, -1370, 6177, -1075, 2589, 3154, -2083, 2638, 1289, -449, 1312, 1000, -2101, 1856, -3763, -830, 702, -5830, 655, -2792, -1826, -1416, -3824, -1987, -1317, -2706, -2804, -815, -7283, -204, -2098, -4116, 384, -4033, -2828, -2847, -2790, -2369, -214, -3623, 226, -3012, -4060, 2181, -4038, 988, -682, -1283, 1947, 627, -541, 1287, 774, -1118, 4665, -1252, 3668, 2655, -670, 6274, 1072, 3790, 4986, 4013, 1962, 5398]
1215E398k218j25J750l614O074n091L390j07l963L363q19j656N81J853n191N069
1231D694k872n52K918n230M123k898L53l43m13m60K606l954l67N014p510N411
1247E20k229q80K143l176J860p21n65K52P92k952K838Q5k602M737n154L449m64
1264b067j791K120O2r98j662M025k873K677l869M046j97l679O586m427J315LR35
1281B06j520K787j481K60K712m010N067l956J058Q81k668L060j126n42P77K052
1297C557l809M868k226j474L234m572L333k139J636J210k491j850K241O47l297
1312a132M450o077M031j154j684K766k900N85l02m21j509L642l126J598L15l525
1328d443N929m300K560K6l079J646R01q24M18k64j991M080m774K769K364n260
$$ y = [5398, 3180, 3055, 4805, 1191, 7265, 2174, 5564, 5457, 1494, 4857, 4038, 2382, 2963, 4816, -375, 4694, 1822, 1270, 4188, -1042, 3081, 183, 536, 193, -220, -680, 1926, -2028, -2395, 2619, -4891, 520, -1709, -2589, -446, -3622, -1762, -2483, -3048, -2796, -2004, -4956, -2118, -2033, -4635, 102, -5052, -1603, -2067, -3858, -1738, -1676, -2674, -4336, -311, -3184, -507, -4376, -330, -527, -4206, 2380, -2047, -732, -729, 206, -1314, 1473, -8, 252, 2964, -1046, 4021, 65, 1123, 2004, -664, 2396, 1270, 728, 1505, 3557, -252, 4616, 2390, 916, 4150, -422, 2911, 772, 2408, 3618, 1127, -723, 1518, 2165, -1132, 3318, -2759, 1272, 118, -1566, 1200, -1700, -1115, -1417, -1838, -3347, 295, -2831, -1233, -918, -4443, 1486, -2814, -254, -228, -3307, -1661, -760, -1584, -1166, -1430, -3421, 659, -4115, -1346, 1018, -4242]
1344d242N097j415L50j011Q50r29J726o39P3L563m937L035k19q3K069k084J270
1361B474N11Q5j365L204m180K511m07j282M000m532L144j510m7L08Q51k093J60
1378A832J706l017L461k555J653j425j940L177k365L61j41l7k432L318k747Q35
1394c16O33k667L532l859oJ400j410J658j810k43q01K639k952L602l307j064L601
1411a370k866J498r85J358j291J070j314K612p57j191L568m164L650j593N28L07
1427i40r30P66J381m10j857L355k526K249R4o97K162m012L719r81m51P00J197
1444B819q15j346J658j676L689l677J062J369j454Q23j107J051j679J281r70J182
1460B210p16j291J278j743L047k858J770j127j096J93Q2L32j133J464j393K85
$$ y = [-4242, 855, -560, -210, -1221, -371, -1300, 426, -213, -140, 3423, -1514, 1521, 1302, 1219, 3288, 1204, 2474, 2985, 3070, 1705, 4909, 729, 3240, 2833, 1551, 5551, 1019, 4163, 2653, 2606, 2914, 3765, 1672, 1832, 3538, 521, 3982, 1427, 3080, 1655, -285, 2892, 527, 888, 747, 710, -1722, 1596, -1151, -316, 317, -2350, 1182, -2677, -2683, -1283, -2693, -1035, -2845, -3088, -3889, -1250, -4202, -600, -3907, -4971, -1370, -4236, -2738, -3723, -2365, -3656, -2586, -3900, -1288, -2045, -3236, 332, -3832, -182, -1775, -1247, -940, -1870, -1104, 277, -133, -1990, 1365, -1161, 1088, 1182, 485, 2647, -1365, 2354, 1373, 922, 1622, 2819, 2004, 658, 2316, 640, 4329, 652, 1714, 3083, 1629, 2452, 1345, 2396, 717, 1998, 1028, 2210, 1494, 203, 1481, -262, 2785, -73, 1697, 570, -526, -333, -251, 81, -1052, 412, -981, -696]
1476f96j560J021J112k619K411k752N74P43K58p85Q55J193j560J127j708K623
1492B37k094M09K105k713K886k910J876j571J896j498K280k74j030K656l551L791
1508B495j979J462q04l19O14N15R84j892K373m097K804J38j036J523j090O34p1
1525B254K0q71N29j970J466J625k581K470l530J258q6p81J314r18M52j404J300
1542E47j300Q13j467J72J547l793L750j624O46k099J113p63l08J96J80J217k983
1559d156L297k075o49J178r52J654r66O55o25J212j903J451q96p19L657k271J437
1576f71j053J078J48N4K54K99P62k273K786j753M28J238j469K130j050N18o48
1593G78J185r10J612r36j488K810j927K338l111J956m2o24N7J24K90j661J768
$$ y = [-696, -2256, -1235, -123, -2742, -331, -3083, -2509, -1766, -1508, -2293, -1438, -245, -1805, -678, -2386, 237, -1857, -1448, 657, -2056, 830, -2080, -204, -1775, 121, -1377, 903, 629, -401, 2255, -1296, 2495, 516, 1978, 1174, 855, 1469, 1984, 2968, 1076, 3449, -648, 2156, 2294, 1258, 2781, 1691, 2325, 2254, 2274, 1403, 1932, -38, 1428, 3053, 472, 2942, -588, 670, 584, -197, 1117, 199, 651, -753, 547, -753, 60, -1407, -1235, 312, -3481, 269, -1355, -709, -2808, -1695, -2458, -2766, -2570, -2390, -1173, -4156, -859, -2934, -3583, -2405, -3357, -1703, -2669, -2014, -2639, -1427, -3330, -1879, -2775, -3494, 163, -2108, -671, -1724, -646, -498, -444, -190, 109, 871, -1402, 1384, -369, 59, 1297, -172, 1958, 908, 1426, 778, 1963, 1053, 2665, 1729, 241, 3051, 1124, 3462, 351, 2307, 2265, 1641, 1698, 1822, 2112, 451, 2219]
1610B219l341L195j327L31P79j189J424k102m07M49J161j118P74j218M5J656m030
1627b699K582o44p03O75j197J537r81M96r03J309p28N02K93j979J774j491J719
1644d38k87O33j323L33R38j37R99k403K471k064J653N39j203J078q83o94K611
1661A823k69l52R79r64o10K441k092J894r16q93J609j425J144l07P40k000R24
1678A726j557K615j725j204K670k854J836k075K088q61L9m34K16q67l50J868k963
1695a832J259n84l60R16j628J573p65M37j668K137j807L43J007k127K804m070
1711d365K980m74j599O97J274j371M14J487k222K528j749R87P15j581K434q69
1727g14O74p01P84j544J662k67j395L438l318L286j052j268J424k92j91J65N65
$$ y = [2219, -1122, 2073, 746, 1077, 1856, 667, 2091, -11, -418, 31, 1192, 74, 848, -370, -325, 1331, -2699, -117, -761, -1464, -789, -1986, -449, -1430, -934, -1837, -528, -1256, -754, -461, -2440, -666, -2157, -438, -725, -92, -1415, -1082, -144, -281, 718, -1685, 786, -1278, 375, 914, -289, 789, -94, -788, 1823, 1554, 1202, 2181, 1217, 607, 3048, 956, 2850, 1934, 1041, 2650, 1225, 2369, 2062, 2802, 802, 1726, 169, 2784, 1059, -145, 2525, -329, 1507, -568, 1520, 659, 698, 264, 480, -387, -737, 1131, -1832, -573, -1157, -1517, -601, -2229, -656, -1421, -984, -2652, -515, -2322, -1979, -972, -3099, -295, -4365, -1385, -1859, -3458, -2761, -1487, -2858, -2444, -957, -3179, -651, -2400, -1413, -698, -2279, 155, -714, -40, -741, 43, -1501, 161, -106, -1501, 1937, -1381, 1905, 853, -415, 1009, 717, 526, 691, 1256]
1744A256p48J355k245K302j08j478K246j628O37N15q28M75q0K96j01Q82k545L199
1762C402k891J007n4j563J619p42o74L25O17k639K337j085J009n23o20J527k445
1779a393J778n06Q2l31k90M02k144L312k656J377q06r73K614k226R46m82K85m62
1797a473J193j206J639j170j12K080k511J639o1QJ45q8N38R70o0j587K270k299
1815h5N17J319j748J297j922J367K08J057j528J198m48p52K119k030J147j040
1831F76o24N91J38M56n35J82m87J312j938K17K36M3J219k534J331o22j142K00
1849a281Q63q35k70M56p39J462j809J162p95K3K46k17O92j257J515j103J261j154
1867a780j045J482j594L017j810N60j17K03L79k94J38k24J382j437K033j380R89
$$ y = [1256, 508, 1863, -382, 1920, 1812, 334, 2580, 952, 1589, 2104, 1276, 1751, 1671, 1967, 1866, 2748, 203, 3402, 511, 1518, 1464, -99, 1520, 778, 104, 429, 1046, -1593, 744, -341, 668, 145, -475, 1052, -1393, 385, -121, -39, -370, -660, -258, -2402, 910, -1746, -369, -1175, -2148, 466, -1760, -814, -1296, -1011, -1473, -280, -1486, 153, -1017, -1129, 951, -1560, 79, 18, 26, 171, 83, 621, 1591, 1531, -56, 2214, -85, 432, 1751, 3, 1300, -622, 745, 953, 2010, 482, 1680, 1232, 480, 2599, 569, 1716, 676, 52, 643, 781, 1237, 702, 884, 397, 1709, -229, -12, 224, 267, 1486, -1048, 283, -339, -1481, -1281, -418, -1253, -1523, -1067, -1806, -344, -2153, -991, -1786, -1763, -1517, -1734, -1042, -2299, -784, -1887, -626, -1780, -2825, -1343, -2937, 80, -1730, -1170, -1287, -1084, -705, -999, -861, -1085, 297, -1140, 893, -487, 502]
1884E02nq75K319o25p08J32J041j965J559k47M04J615k103K093k558J963m05n59
1902A578Q7l3K74l72J913k479L32R54j212J908j888J011j115J223j104P62j036
1919H03K97J31j819J741j244P54m51L0j24p15P37j244Q49R1P7l19l48m92j237
1938b483J632p64N69j64N34r66M60P61j289J386j548J353o56k68O30n95P73m78
1956a113N73l18J430o86j105J733q52Q33j620J997m02q42J124q55J189m6n00J62
1974G02O96j492J890j121j181J474r01Q30n52O03n86J008n35l06J367k668J709
1991I37p42P51j265K73J89L09r1m68r4p07R88k20m79O39j058J898j443m80J32
2010i31J49j91l52N52K24l45j411K175m16k65N16j940J744r38M64k79K70l87L98
$$ y = [502, 497, -378, 1941, 1316, 608, 740, 1781, -184, 1375, 1128, 1532, 3147, 1044, 3137, 579, 2542, 2137, 1578, 1665, 1632, 1906, 1534, 3447, 968, 1300, 2254, 1042, 2950, 1062, 2073, 958, 2181, 1077, 1839, 803, 1100, 1231, -588, 1153, -91, 663, 212, 242, 118, -597, 140, -1104, -255, -164, -87, -406, -754, -1246, -2483, -851, -1615, -1046, -1210, -676, -1642, -1182, -421, -1710, -324, -1872, -519, -1175, -1443, -813, -1408, -635, -1113, -540, -858, 572, -114, -1219, 514, -338, 495, -1125, 872, 470, -372, 752, -103, 1086, 1040, 540, 702, 1398, -94, 1796, 675, -506, 968, 67, 897, 345, 948, 362, 1370, 835, 529, 1896, -772, 937, 195, 946, -319, -46, 143, 452, 361, -107, -201, -908, 80, -140, -619, 20, -1038, 860, -583, -1063, -931, -782, -973, -1325, -773, -549, -894, -2305, -130, -546, -811, -295, -2235, -491, -1429, -965, -1244, -974, -1361, -963]
2029i63J140q74K66k05J749q20r85J096n58R35r20J329j321J572j105J201R47
2046B484k130Q75M6L13l62o25M46K53O49m57Q27k130J634n68Q25j570L02J057
2064A869q83j84P06o72j87J83n27P37r98j138J767j579J280m51n16R8o51P46j030
2083a430N88j307K500j217pJ6j57m48l5R91j260J051l12l5K68q56M21q26J303
2102g52o56K97O68r92J144q22J160j218J586j230J362q24l46J359j931K280j410
2119c25Q66n42J221n35r53J883j103P07j729J798m11m48R36m06K60n3p75m30J026
2138I87Q5k173K300j474P29j49L11r85J97Q65j456N16O4J112j789J459r87j114
2156a502K145j623J215k329J992p01m82K09l99R44j189J400q49J218k000J277
$$ y = [-963, 177, -697, -431, -636, 1113, 293, -692, 404, -154, 781, -139, 1190, -131, 1441, 336, 1537, 2484, 354, 1229, 1275, 1588, 1226, 601, 1047, 1300, 1949, 1492, 2319, 189, 1823, 1255, 2080, 510, 812, 1869, 986, 802, 1508, 836, 649, 832, 305, 1042, 44, -1094, 673, -906, 374, -77, -593, -495, -1146, -400, -1430, -842, -2149, 351, -866, -873, -857, -1014, -1462, -1497, -506, -1766, -715, -1027, -1062, -794, -1650, -1229, -2055, -752, -1408, -1111, -443, -1435, -291, -1113, 47, -1171, 415, -815, 547, -277, -623, 736, -1195, 1085, -325, 541, -1, 1220, 685, -268, 1615, 512, 1219, -510, 1288, 877, 429, 1365, 959, 1219, 1166, 391, -39, 987, 1072, -1101, 1199, -275, 454, 305, 616, -369, -172, 693, -763, -247, -183, 929, -860, 599, -388, -1502, 643, -980, 235, -2094, -102, -803, -1285, -1076, -1475, -531, -1720, -320, -1169, 49, -1951, -674]
2172f74Q27o82k36j46O30j840K153r54J007o2j265J272j175J412j0K68j92NP32
2191A070o82M69q40J761r96L01O93j522P27M74L03j231N10j182J542l59k77J012
2209A773j806J264o90N07k7l3j36rm77k50J645j752Q81n91n40R1m66J564j152
2228b04K97j180J517l90j78K93k050K206k008J398p77J9K50l98J042r72R23j373
2246a585M42j049P68J9M11P09j225M69N92J48n40L45J62m17n5j093K394k61p36
2265e02N74j077J053o58P62r68J684j502M76j33J15J100j585R50k92L60J021j77
2283A201p9j6L50r51R17j117R62j51m88k52p4L8l82M17J33o0j242N92Q74j865
2303a193J718j428J797j145l78J072j241K21q92J357l01J54Q9o12j7o42N46N6
$$ y = [-674, 153, -529, -765, -911, -281, -2121, 32, -922, 85, 23, -1242, 30, -1145, 267, 257, 525, 333, 338, 1070, 388, 857, 17, 1778, 782, 1083, 1776, 254, 981, 1455, 1758, 527, 1037, -145, 1397, 1038, 761, 1773, -33, 1231, 541, 1048, 1021, 988, 852, 843, 366, 116, 1761, 9, 890, 299, -241, -150, -616, 948, -204, 93, -1087, 430, 40, -138, 155, -1895, 311, -1697, -299, -1076, -1057, -807, -1205, -163, -1135, -212, -1585, -1143, -2192, -1424, -1405, -994, -285, -1510, -1041, -449, -301, -841, -496, -334, -751, -806, -1899, 495, 234, -502, 72, -1005, 48, -610, 152, -816, 868, -634, -158, -291, -176, 924, -661, 289, -3, 357, 1378, 1201, 1122, 1106, 1456, 505, 1422, 305, 1267, 1116, 628, 376, 302, 340, -42, 375, 508, 448, -794, -202, 672, -1193, 525, -903, 894, -251, -629, 443, -798, -577, -1469, -112, -413, -259, -170, -782, -799, -1441, -895, -839]
2321h39k90O30J61k51O33j154O1J098j294J774q14m12N96n49Q69n79Q5o6N23o06
2341d24M98M08Q06j67o90M25q76J503j56o30N51p84J091r42j41l9O96K55n34k62
2361E88M1m07J21O78n73L59m77m33J691k309J139j040J103K63o08L06j06j201
2379h65K28J465j552N65k93J5J76j228P86J044j124J01P97j087n29M90l05J515
2397A99k306J001l17P59j79n2j62m41J397o06n49M06J185q28l70R18j772R70P59
2416A2K99J56R4r15M28P33p45O40m31p9r1r4Q42m34K47k64J55K76O53j019K18
2437F81P50r24J374k003J240j417J343j188J215j440K84J345p64PO71j329M64
2454C09L11J3j596P10j65R19r28%J356k326J127r06J32L45m09L72k39L06o99J693
$$ y = [-839, -1129, -499, -338, -589, 44, -1110, -1049, 49, -1245, 529, -285, -697, -101, -650, 219, -360, -275, -341, 182, -424, 74, 482, 1288, 1121, 431, 856, -20, 1483, 1327, 697, 1248, 464, 1555, 613, 472, 433, 1129, 1384, 850, 588, 629, 222, 343, 1021, 448, 807, 330, -103, 1588, -721, 418, -622, 481, 744, 136, 442, 336, -865, -637, 828, -724, -159, -452, -437, -261, -1489, -703, 341, -783, -682, 115, -972, -1501, -1011, -1316, 199, -2107, -1106, -1423, -664, -843, -895, -1057, -1498, -101, -707, -1256, -850, 335, -493, -863, 55, -1717, -747, 12, 311, 467, 561, -354, 74, 807, 62, 702, 271, 192, 101, 7, 849, 415, 662, 398, 553, 829, 1482, 463, 681, 1431, 507, 1881, -122, 1118, -299, 1044, -144, 1071, -369, -85, 1260, 496, 503, 1174, -155, 309, 620, 633, -963, -253, -418, 501, -427, -427, 929, -1397, -270, -1176, -1044, -699, -1108, -736, -975, -669, -1368, 325]
2474C25j026Q58k55k35l64m64J017m98l7O90l60M32J36L17m38M02p55L7O90n70
2494i8L88M90m8m42R58j428R90j67o72Q38n71M50J4P82j235J021r0l93J31r46
2514b8N53l92k26N77j83Q41j827Q40o52J140l02M15q27M45kq9k92k08j65j307
2534a689J574o66L88k20J14n83K34M93m26m14N63K93N86j475R91m02J66n44K72
2553g45K37n10K86p9K19j070P25L86q0R1q67K161j568J060q11Q12p42P63P40j457
2573d49J361j030K45K07M01j95k64M99j158J122n26N20m6k94L60l92N16j121O65
2592D21M44M59o49r35R90m17L38k50J19k3k71m00L47N17q19O29j397L15M76ol57
2613d69j6N62j497J623j414J300o36l77J490j492N02k1j81m53K070j092n50M42
$$ y = [325, -701, 157, -98, -333, -697, -1161, -144, -642, -679, 11, -349, 83, 219, 536, 98, 500, -255, -218, 472, -98, 290, 780, 732, 290, 1248, -180, 810, 643, -29, 809, 238, 688, 702, 1484, 249, 1270, 1180, 787, 918, -28, 525, 133, -93, 484, 301, 1142, -685, 155, -497, 643, 341, 756, -71, 374, 372, 283, -9, -217, -382, -1689, -115, -781, -393, -613, -499, -1082, -848, -355, -781, -1195, -632, -339, 247, -1228, -237, -639, -473, -1017, -745, -508, -1018, -732, -811, -592, -1662, -937, -551, -631, -540, -1407, 754, -814, 246, -565, 247, -495, 268, 1008, -449, 912, -118, 127, 334, 735, 540, 276, 775, -383, 739, 213, 733, 687, 393, 753, 361, 877, -244, 421, 865, 1324, 675, -260, 730, 313, 651, 401, 520, 497, 226, -174, 173, 690, -129, 500, -897, -582, -106, -112, -469, -485, 77, -1420, 203, -1211, 89, -547, -924, 566, -926, -424, -445, -626, -1079, 991, -101, -651, -209]
2631b09m84P74k035J780p36N21K6k94P46o13L28O60l34k051J411Q46n64R10k53
2650D29k06q8P50m94l59N92n61M83n42J432m87p26j65P18r45L07P67j331J247
2669H21r03l54L30L25O46j596J048o7n9L8j53K06J15n48N34J35j423K88K1J281
2689F85o64r93N86j66L47j89J23k74M29m95l39P58j98M99j367P98o97J557n92
2708a92o85J245j538O48N37l78j85m13P44j56O93q91O12p50J344l42m23J003m60
2727D13M71j132K99P02r42J128r56K15J204l92l07j66L52o83K88j63K98j016P53
2746C66j52k25J26J406j038O89p52l62L15n46M5r5o08P23O19J6M39l68j015J31
2766b86M48n23p7K2J17L15m32L34j381J495j077J003R6l36j77J81O2L1k22J0L25
$$ y = [-209, -693, 81, -1954, -174, -910, -389, -363, -657, 89, -524, -196, 464, 130, -1921, -510, 336, -228, 682, 429, 223, 135, 885, 391, 32, 624, 63, 546, 4, 1436, 949, 223, 58, 776, -169, 138, 905, -426, 821, -82, -436, -106, 219, 865, -731, 317, 250, 191, 229, 76, 282, 397, -151, 383, 518, -905, -617, -596, 685, 21, -972, -386, -552, -205, -394, -271, -545, -116, -611, -950, -192, -390, 109, -1258, -460, -1157, 400, -192, -877, 368, -1170, -522, 15, -363, -548, -961, -217, -373, 320, -571, 41, -709, 635, 293, -130, 873, 413, 884, -248, 51, 753, -189, 939, -17, 198, 1402, 1010, 703, 537, 889, 206, 494, 331, 629, -387, 366, 214, -11, 115, 1521, 483, 1172, 420, 58, 373, -173, -128, -223, -831, -108, 511, 527, 966, 598, -417, -286, 162, -361, -438, -416, -299, 16, -416, -82, -1463, 32, -1045, -42, 54, -282, -459, -278, -216, -185, -407, -397, -72]
2787g2q3K97j029L50J146j512J049j76k48R34j412J243p52n75Q75Q59j212J361
2805A043j501R72n25L60k04kN13o17k67N86R87j844P62l49J80k15L11N25j72m94
2825D9K31n58M13J1J62j130J128j003J243n77m17j71K10M0J206j096L97j08l75
2844c45M41K12k78n51O47q70j3l78O50r9O82m78j78O84M9J95o24p73O31n22Q74
2865d4k55Q81j459J199n18N01n44M84o01P9O77n32R35q21N67l77J029j100L28
2884D29p71R64K68p60J356p09n87M6K6j73J81k5n80P81J051q49j20k51J024p88
2904E13r34J3J025j92m02j327J377Q1L4M30q84k81Q78j598J333k2J90k56L96m83
2924a09P22m87m06j4O46R4j152K24K27M27j054L06M89m53K68m06J506j100j57
$$ y = [-72, -155, 142, -887, -537, 609, -903, 146, -30, -278, 656, -756, 487, -265, -840, 35, 894, -318, 1043, -458, 514, -11, 349, 145, 143, 656, 39, -228, 358, 1345, -499, 263, -86, 94, -121, 190, 715, 543, 49, 280, -278, 135, 146, 308, -822, 306, -697, 546, -31, -448, -619, -409, -369, 837, -259, 138, 30, -345, 96, 308, 30, -521, 126, -744, -757, -1135, -485, -584, 98, -380, -558, 126, 175, 370, -254, -1027, -396, -918, -44, -299, 582, -877, 322, -196, 305, -239, 245, -356, -277, 400, -132, 803, -18, 549, 172, 1201, 101, 429, -342, 622, 890, 130, 1486, 777, 190, 236, 262, 89, 270, 245, -335, 446, 1497, 648, 528, 277, 1301, 513, -421, -408, 617, 425, 23, -1304, 73, 154, 188, 618, -266, -547, 331, -1267, 66, 44, 234, -22, 374, -109, 613, 126, -280, -294, 352, 446, -706, -482, -255, 172, -882, -576, -87, -540, -272, -678, 828, -272, -429]
2943d29N26j8n63l18J327n46q0k23N86K95P6r79l41J199j293M71J283l08j46n98
2963g9J018p20Q94n46l7j76k93K023k413J170k72R86j018k28j02L40n55M8J94
2982B34m45P97q19L65K87j495J492o82l67P26k7n97j31Q39j233N61m04R61j392
3001a330J058m98N23o44o17J789j260J106j184J428l95o69j4o0R26r58M90k95
3019f04N91P39k74N2j133N94j16K33N83j559J248J12M17J54L7k50K68j195R28
3038H25J07j360N27K74m62N59q07O86k56J68P46n00J69M7L5o66O9o25J276J6r82
3059a54J49j64m04N1n3K02O88k03k00k35M42k19j089J413j148P60r29J91R79p95
3079g18J88p1p8J5P34j65N35j431Q44l46j321J366J5K14n54P52m68P57o55J27
$$ y = [-429, 97, 79, -484, -802, 525, -21, -101, -324, 262, 557, 633, -346, -687, 512, -781, -310, 973, 665, 519, -79, 939, 219, 1113, 567, 530, 354, 61, 2084, -329, 841, 569, 1555, 537, 309, 207, 547, -8, 40, 234, -211, 586, -233, 132, 419, -1076, 416, -266, -633, 93, 66, -531, -662, 177, -1056, -495, -899, 62, -1330, -272, -770, -247, -891, -1508, 281, -979, 127, -1057, 371, -24, -693, -707, -767, 159, -799, -309, -604, -13, 726, 452, 504, -629, -35, -151, 82, 665, -894, 354, 466, 883, 1037, 1074, 824, 1092, -103, 825, 932, -428, 99, 373, -89, 470, -337, 349, 93, 261, 1007, 507, 676, 723, 758, 92, 161, -464, 812, 828, -154, -5, -169, -573, -522, -575, -373, 315, 112, -88, -323, 119, -100, -1189, 224, -924, -164, -1093, -902, 77, -718, -530, -601, -679, -664, 70, -95, 440, -991, -147, -493, -1814, -448, -433, -219, -773, -21, -489, 268, -387, -260]
3099b60N08l32m78L0K35O86p06O20m48J212m93j016O62p1j4O52j48n73j78O99
3119E87P8n43o70R94k4k32k80O68j321R44m85K33Q2j031M47l30Q44k64p43M53
3139e93O52O0l55P70k42l18r08Q54m61k76N46j205R56p0J86Q30j215J077q86J30
3159d68n39N76J27p2Q32k11M20q75K87J84K12m91L5l91P12j26o42O2K45q4Q45
3180F38l21q00K59R27q03N61j3k05lj45n58J641j105m14Q64l0m80L71L69l77m75
3201i9J088j210O60o21O18j42O41m25q82J118j631J384J50n60R12l22q3n13l21
3220b38M74q61k43J130rm73k56M80o73K40k31L15K59K79q20Q94k08M16j111R74
3240C38j030L88R30k348J818n51p2Q43l75o35N07L8p04J498q61J002r07O14n42
$$ y = [-260, 248, -84, -562, -532, -297, 389, -317, 303, -145, 1067, 574, -442, 220, 149, 135, 787, 639, 66, -112, 587, 665, 122, -548, 446, 422, 190, -90, 578, -743, 201, -284, -51, 31, -1000, -553, -883, -39, -303, -1046, -593, 59, 119, -236, 534, 292, -26, -934, -80, -541, -817, -271, -1476, -520, -590, -404, 426, -789, 288, -598, -468, -1007, -431, -304, -376, 456, 245, 665, -210, 77, 261, 473, -18, 17, -374, 338, 212, -430, -368, -123, -207, 638, 317, -483, -224, 703, -100, 461, 448, 243, 240, 95, -463, 1178, 73, -341, 523, 493, 13, 384, 753, 376, -99, 989, -221, 439, -182, 436, 294, 935, 510, -372, 746, -885, 499, 649, 89, 1001, 679, 596, 83, -238, 236, -625, -868, 262, 253, -220, -476, 4, -669, -429, -660, -345, -86, 193, -627, 267, 59, 475, -636, 338, -692, -304, 626, -1722, 96, -455, -527, 316, -59, -694, -187, -149, -853, 645, -216, 786, -121, 493, -49]
3259d9K91j335J007m9O21M2m77M28o59J392q40n30o5J072o69Q35q49N65Rj113
3279c73P15l40m91J739m39k43j89k38M75j733K193p13r42J80J85Q19q42p08J142
3298A97p42n44Q04j76j33L29P2N23kp09N88n56O0R55j106Q58N58k146J354l54
3318a70M78l31n71R16o08L7N86l64M07m35K22n78L66N9Q13j35k87o83j45O73m31
3339a81nQ31J75l38n5o83L58K98L45L86p45r46L46N42R3l69o09J18l89J948j363
3360b43j08R0Q37j765P21M17m23K62j1N04j573R42M42R1q38K25L09O0p88L86k95
3381g58P26O20j123p39L90J8J329j013J052j47j219RK054j405K56p15M13P44m49
3400D3r09j19M23Q09p04K97Q6J84j64J196o42O3Q59m03j572L14j8L51j25Q99r80
$$ y = [-49, 242, -1093, -86, -135, 486, 528, 51, 479, -180, 1212, 372, -158, -223, 849, 180, 1015, 166, 731, 740, -373, 342, 2, -489, 1250, 811, 568, 379, 141, 616, -1117, 1076, 363, -579, -399, -214, 605, -237, -945, 197, -545, -1089, -285, -461, -594, -265, -193, 330, 328, -381, 207, -349, -289, 666, -440, 418, 976, -1170, 184, -170, 308, -23, -594, 322, -286, -249, 337, -27, 380, -55, 167, -411, -45, 14, 827, 692, 405, -278, -423, 250, -181, -186, 645, 820, 482, 427, -256, 102, 400, 745, 1131, 386, -560, -214, 328, 421, 52, -557, -439, -828, 1120, -243, -351, -261, 576, -1189, -468, -51, -474, -212, -223, 281, -1292, -350, 92, 183, -655, -430, -121, -61, -849, -463, -758, -32, 588, -535, -1274, -884, -866, 463, -550, 502, 355, -864, -855, 1199, -206, 50, -665, -252, 492, 43, -866, -985, -562, 247, -457, -160, -74, 110, -54, 1142, 500, 563, 1422, 1019, -553, -239, -257, 94, -31, 868, -112]
3421a12j52O09K85m17l49o69O11J012o86J04K24O8M6Q7p35N44m72j15L2j3M93
3442C95r95N20L68L16j66K86l46j76j62j7j70M73o71L24j90q2j35m4M51k86N63
3463B56J33J74m31l84q41R33o88J500l74p42M59p09L98N35p22P29j56n18L30M17
3483B99l57m10N04J77l20L4o5M21q65J551l33o74L62K08O55p09n4M19q11J66J24
3504C22n78M66j85m42M22L52j46q06N96j05m0K55P29K51j670N96n9m68J439j237
3524c08K85K38J45q67Q94n55M35l58o79L47L11o48J32R53m74L95J25p24k54L67
3544b40p44J125k17j04O51j191J390j384N03R41j202J24R0N60m44J56j37k65l25
3563g13Q66l86N41O84j000j1o3RN71k58j162J042k8j47Q1J10n07J024p29N56J24
$$ y = [-112, -264, 345, 630, 213, -136, -805, -194, 818, 132, 236, 460, 528, 574, 661, -74, 470, -2, -117, -85, -98, 395, -600, -80, 288, 604, 438, 724, 378, 202, 40, 23, -147, 326, -345, -21, -211, -293, -428, -472, -21, -307, 256, 389, 563, 132, -252, -1093, -160, -848, 652, 278, -464, -5, -714, -316, 219, -503, 226, 70, -448, -118, 299, -58, -468, 36, 213, -107, -73, -138, 283, -582, 969, 636, -38, 324, 532, 1187, 478, 424, 843, 32, 198, 322, -256, 210, 25, -417, 5, 357, 211, -595, 1, -104, -144, 111, 840, 1091, -579, 17, -42, -510, 929, -308, -23, 215, 360, -507, 387, -168, 267, -91, -770, -423, -112, -760, -628, 325, -149, 246, 371, -353, -607, -240, -984, 141, -76, -180, 471, -720, 670, -714, -211, 730, -472, -348, -258, 302, -142, 14, -123, -388, -713, 153, -233, 308, 992, -8, -19, -82, -73, 498, 240, -922, 120, 92, -55, 26, 136, -371, 653, -76, 480, 604]
3584F04l40Q92q68l44J360k009Q19K4K01L4L40q67k6L55m43M56l98o11O54m29
3604e96j78Q73j46N99l86r51Q94K41j02l34K96m3L58Q9k14j003J230j214M00j8
3624b05O5J72j09O90o13q70L94L34N74l81j89k92O34M68n16K31Jk67L31j430R22
3645e6n8M64j103M5l9Q94J37m34J269j440M31J74o22K63k96r17J022R44M3j28
3665E93q53J93K77M63j153Q46k29J08k46j43J42J91M38j381J351r40k58P71k31
3684f1k7L3n45l3J71j7k30j17O60l86J238p63n69j07R53r16p4J116l23j072O55
3705d14P50k57n91P07m73J25N65r41J109l20M11r60Q82k85R8j147R88q32k45K54
3725e76R32M7N82q42j41p0M86l04q42J104M40j189O02j87j033J627k3r09P16p68
$$ y = [604, 264, 1156, 288, -56, 1304, -705, 114, 138, 339, 373, 713, -154, -180, 175, -268, 188, -210, -821, -167, -596, -774, 99, -47, 552, 166, -785, 109, 350, 248, -86, 210, 167, 525, 614, 400, -603, 627, -587, -187, -205, -140, 32, -77, 613, 0, -870, -476, -142, 432, 51, -138, -430, 204, 672, 156, 387, 388, 121, 452, -978, -56, -114, 350, -753, -708, -747, 147, 284, -150, 1119, -321, 110, 284, -338, -75, -371, -1288, -266, 678, 721, 593, -260, -67, 210, 673, -480, 366, 137, 245, -1, -144, -2, 189, 627, -754, 597, -343, -601, 170, -61, -88, -55, -600, -633, -462, -479, -709, -826, -166, -552, 686, -77, -646, -753, 200, -716, -790, 326, 3, -1069, -414, 336, 79, -512, 195, -278, -153, 412, -529, 580, 260, 671, -289, 593, 308, 406, -741, 247, -585, -830, -576, 356, 403, 985, 143, 2, -68, 418, 114, -728, 376, 816, -373, 229, 42, -991, 636, 613, -296, 420, -348]
3745c48L04k0Q5M6P13p71n96K44N44q73Q64L23j143N11R2o86O33P9j2l4n96J95
3767d46N9J003j520J444j330l77Q99K0j162J529P3j99k70n87P52m84M55Q23j342
3786f60P82l47r67N91l68J736j131N08N83l17o87L21P05n19m2p23L55K8m89n13
3806a154J015K53L52q05l3J504j510O64m26J49n61J72m5N01l56J40J214r24m62
3825c12QJ353j131K72m05k69l93P60N7M9m60K20k80K14M77j76on80L10n56J504
3846F56j31J86N28j728N39k64j014O91K87o96J367j77m25p29K68P24l87l11Q82
3865B66m1Qr38P05m14m67J379o42P72j29k35o31Q29k9Q94j621J28L13M65l4n1
3886E27o89L92n28P6Q27K86j184R67j093O13o77O97L19n78L06K80J17j701R06
$$ y = [-348, -44, -64, 21, 67, 780, 9, -587, -343, 201, -672, 192, 515, -628, -117, -25, -711, -78, 1, -11, -45, -641, -446, -387, 616, -904, 540, -790, -1167, -268, -248, -1410, 119, 192, -7, -277, -864, -112, -596, -141, 682, -660, 122, -225, -1192, -601, -969, 767, -364, 144, 727, 410, -277, 44, 749, 230, 188, -535, -180, -152, -641, -1154, -139, 114, 466, -339, -372, 1132, -378, 286, -140, 9, -552, -380, -425, 76, -280, -140, 1074, 150, -312, -304, 1049, -82, 190, -215, -484, -877, -117, -60, -11, -471, -251, -531, -317, 160, -16, -22, -602, -292, -848, 656, 525, 711, 1239, -489, 50, -214, -1228, -537, -250, -946, 421, 244, -181, -910, -642, 82, -305, -616, 266, 225, 233, -705, 0, -414, -881, 498, -144, 628, 499, 264, -367, 462, 433, 1327, -294, -166, 147, 612, 578, 527, -162, 230, -298, -222, 605, 891, -293, 674, -419, 194, -483, 214, 533, -45, 261, 541, 658, -1043, -137]
3905a37O01k39p45J73L06J38k85Q07r95M52m93N59l13K21j85j82o5N85l86M68
3925B85k17K14m44L97m10K87n20M08j24P87l90j078O25M28Q7p04M6O38j411R93
3945a03n2j81J88M74j79o43l97O86J91K45n08R00p06R9K4nK77L95j104J283n32
3966C52j43p87Q23P7k39l76O79n94K8O45j05m64M37p67K27K64q64J505j666J154
3986A86Q38j043K40m71K85j081m8J372M99r12M86r87Q99j399J156j099Q83M94
4004B98Q3l77O7L36K6L47q48k01k7J217j433J26J65M83k98j97l24P3k46R49M9
4025B68L5r58R66n87N32j43J79m48L05o38l63J199l07J17p81J224n41p61P99j29
4045c2j03J64k9L42l40l81l29O92r69P18m90M55L56n55j90P79J91q83q6M28M14
$$ y = [-137, 464, 225, -520, -347, -41, 97, -188, 619, -376, 76, -417, 142, -171, 50, -135, -317, -382, 203, -183, 285, 68, 282, -162, 235, -175, 112, -408, 0, -124, 663, 273, -805, -180, 248, 335, -369, -323, 315, -1096, -103, -155, -336, -148, 326, 147, -496, -893, -207, -16, 229, -279, 621, -85, 14, 38, 33, 310, 705, -399, 884, 352, 209, -578, 245, 322, 83, -293, 386, -208, -180, 465, 360, -104, 333, -434, -207, 57, -807, 698, -968, 186, 1024, -19, 221, -250, 35, -1046, -1094, 278, 777, -135, 351, -636, 263, -1136, 20, -1079, -196, 298, 381, 4, 71, 407, 433, 780, -68, -269, -296, 921, -512, -386, -221, 262, -36, -233, -557, -484, -730, 219, 268, 303, -655, 311, -276, 256, 113, 292, -156, 149, -489, -852, 347, 40, 157, -624, 600, 59, -702, 97, -32, -135, 29, 0, 342, 2, -379, -708, -16, -985, -267, -757, -302, 54, -501, -691, 88, 279, -604, -690, -262, 152]
4066A52l15M49k27J92j025N61R0K97q74N74R7m78P94j166Q81j02k87K91p2N9N44
4087D35o47m08j60J278q97P91j181J83R21L65K1p23R1j75j159J190j8P73r86P61
4107D55j557Q87k39J241p14l11Q01N11j397j76l71J17J501n71k0J17n22l97J03
4126e42M74N5O28p86k63L56N62o41q71O26Q17j090P90P12j431J142k71j56o62
4145e51L39k57R22n37L96J93r03N78M6o16J32O46l6o26L20Rj8l22J161j280P86
4166C82j060Q60J12q76P65K84n42K09K08O12p47r52Q30l77J08N99p96J111k07
4185E23l54k86K63m48k66J561j123Q0N23m71P49o77L64j53n54J66k40K48M09o09
4205b95K91P04j006J85J77K21o71J611j247j94L04l49Q39q72P13q84J156j223
$$ y = [152, -163, 286, 59, 251, -774, -213, -123, 174, -700, -126, -29, -507, 287, -879, 2, -100, -387, -96, -168, -109, 435, -212, -620, -780, 498, -399, 392, -789, -606, 315, 680, 701, -22, 69, -106, -1265, -75, -93, 680, -306, 455, -1102, -215, -454, 787, 73, -238, 563, 1074, -323, -499, -870, -753, 748, 177, 157, 274, -248, -645, -542, -68, -13, 615, -171, -434, -78, 484, -157, -1028, -402, 415, -675, 115, 827, -604, 538, 267, 111, -551, -212, -469, 453, -84, 312, 505, -398, 180, 226, -390, -258, 388, 352, -274, 46, 55, 37, -285, 876, -404, 382, -678, 182, 294, -582, 183, 467, -75, 134, 342, 954, 207, -745, 85, -292, -184, 415, -381, 730, 523, 169, -117, 146, -302, -568, 993, -130, -50, 473, 2, 751, 74, 438, 285, -269, -103, -343, -95, 314, -295, -4, 700, -306, -121, 56, 277, -394, 1217, -30, -224, 80, -269, 570, -302, 411, -473, 683, -540]
4223e40P84l89N78m52K19M47p87n40J271L07n78Q4n84O02J41q67M93K66q14O42
4243B83L49q78P71L9j287L09J132k22K42K05q67n17L89P82j179N87m25O45J76
4262E34r31J315m80m78L61l49n40J215o0j11l86j06M2Q2J82q85L49P59m62j58
4282a07l11K34k42R35n75M39k22k63N80n09M03l0o50L99p93M51K38L59p4q16k11
4303g65J330J82j025Q9j05L80J234r32r88K53K22J027r24M97j14m9J60q03L24
4322gn17N85O61p88r6j09O69j035O87n68M64n18L51L74o42k69J253m38P4N61j147
4343d55M38m57N34R7o51N76N23Pl6j289J870m88q58O35n04j45P67j417J35R28
4363B10R23j012m66L69n89K45M33L57n01o29J115k70j04P78q06k93L39j36l7j59
$$ y = [-540, 244, -145, 433, -19, 200, 647, -140, -680, 591, 898, 320, 404, -180, 422, 563, -304, 189, 455, -359, 283, 632, -246, 525, 564, -723, -414, 718, 496, 738, 943, 76, -441, -52, 730, -449, 138, -287, 358, 534, -397, 918, 438, -40, 321, -28, -568, 647, 587, 476, 90, -16, 26, 108, 290, -595, -246, 513, 51, -107, -418, -184, -426, 509, -66, 373, 151, -112, 468, -41, 362, 332, -318, 81, -712, -261, -23, 336, 262, -554, -765, 565, 747, -278, -189, -294, 86, 1320, 388, -600, -347, -125, 902, -22, 475, 361, 312, 472, -331, -7, -524, 61, 722, -66, -162, -271, 398, -637, 50, -518, -54, -572, -221, 153, -489, -758, 495, 57, 131, 692, -455, -17, -474, 60, 157, -494, 82, 605, 612, 576, -713, 1157, 669, -189, 446, -58, -203, 564, -853, -718, 210, 1133, 121, -345, 24, -565, -320, 113, 470, -31, -660, 455, 185, 81, 859, 53, -240, 99, -37, -74, -233]
4383b33N69p95l87N45J1p5N43j19J61o51Q67q95l17O02k89J138m41K43o16l76
4403e15L86M47p6p47L08p70P84M66n26k49Q59O29q76K11J24j48O39j011l78R39
4423D96r00O59m41l63K17P12j066J416j150N73l01j091J919k99N38p44m04K23
4441fR79n57m17k75k05P36Mk5m44n6R06p70n48P38M50l33o4l2j26M68r69M64O3
4464a9j391N63J092n65Q24r63L38J101j807J407r61R89o25l88Q21l94J78p95Q18
4483B23n74P48k06l32J10k67P04o42O80j032J565q15j110O78O73j28M32n19p32
4502e44P05k52l85N84K47l77L74j53J75O2n87M23L59l2M9l03K62j762J621j171
4522g05N63O12Q1J2Q8r99n87O41K23l05N66P0q36R91q8n18k90Q04M49p21m27K56
$$ y = [-233, 336, -459, -846, -301, -290, -365, 178, 59, 220, -431, 436, -459, -776, -174, -463, 675, 234, 477, -139, -515, -129, 318, 242, -505, -197, -967, -183, 283, -243, -492, 367, 996, 120, 331, 455, 307, 946, -65, -443, 496, -404, 255, -186, -549, -332, 380, -686, 730, -420, 153, -148, -1239, 680, 381, 919, 175, -229, -6, 973, 416, -1, -276, -481, 255, 259, 234, -210, -266, 640, -130, -678, 60, 510, 177, 113, 81, -45, 423, -546, -82, -19, -1410, -847, 245, -320, 504, -459, -121, 980, -827, 580, -381, 608, -17, -405, 416, 22, 200, -595, 223, -351, 397, 191, -141, -31, -298, 406, -236, 444, -588, 977, 162, -948, -270, 403, 275, 707, 188, -544, 161, -91, -476, 108, 355, -22, 352, 199, 374, 436, -151, 272, 631, 599, 648, 345, 607, -1155, 466, -705, -142, 470, 551, 563, 651, -348, -935, -294, -71, -376, 190, 260, -576, 415, 327, -191, -481, 323, 772, 51, -376, -120]
4544a20j08N76O53l65j72j515P76j43n67J043j48l4O44O5o19n23L79L00N03j228
4564f03J047P0m47K2N57j185O70K61m76k35K19O79M88j688R20l34M61K42p56J147
4584A059q64k48n88P27K10n81k6m4N0J083p69K52L37p73L38J52p10J635j592l75
4604g27J083M09p83k78J97o77O12O07q38K8P53L24j16k467J784Q0p75J288m37
4623F7j77L02q02J070r96O01p86K23m4N69o9J23j51l45K5L57M00n05L81p97j41
4644f95M66M70j079N45O71n13P2R41j683N27l91K46q7R42l0k12M02K82n02L4K86
4665F92r11N75N8o71n11J132o79J409j572J582o87r49M3m64K70P16j30Q3l35J19
4685b30l29M71L40k95N42j864J091o5R55n08j245O81p0L49J80R7K34p48J70R3
$$ y = [-120, -228, 348, 1001, 636, 464, -1051, -275, -418, -985, 58, -90, -124, 520, 585, -34, -557, -178, 122, 625, -603, 444, 514, 67, 89, 646, -539, 131, 392, -84, -319, -100, 579, 1067, -621, 299, -35, 426, 668, -88, 1059, 195, -53, -641, 86, 296, -285, -311, -355, -305, 778, 9, 261, 598, -175, 163, 315, -395, 1240, -352, -727, 356, 765, -18, -296, -99, -776, -164, 443, -395, -367, 386, 710, 594, -1873, -89, -9, -784, 504, 67, -110, 192, -610, 460, -536, 65, -721, -498, -542, 27, -42, 81, -70, -415, -390, -33, 367, -138, 243, -554, -695, -229, 241, -838, -293, 378, -135, -63, 878, -805, -278, -669, -423, -510, 432, 402, 190, 592, 874, 372, 406, 692, -219, 356, 414, -257, -768, 364, -315, 1094, -478, 1104, 417, -532, -489, -953, -683, 33, -97, -14, -349, -230, -559, -88, 252, -43, 499, -1365, -274, -339, 616, 108, -1137, -456, -526, -177, 3, 100, 334, -414, -244, -151]
4705a51M19k24l75m78K002j665K49P6Q67l26L07q40J112k26j224J121j093J186
4723G37j264R17j093Q30Q64p80M28o92N65q42J09j92Q58k50n4k98L98k41J409
4742A409j702J052k85m10r53J027m32N33n21N14K00o68N11l4M80q71J55P48j303
4761e50k82J000j78N32p82k80P12L60n40l10m48J110p12N71J05p51Q29J43o78
4780a49N38L33n8l60o55Q70j225J529j230l31p33P95J188m31M81n84L08J83n60
4799i1o2J29P4J13k85n37N98k4j24k63O37K9p46P92l83J21K10m48j92R65l57l8
4821A18O31m72N55r36j175J694l22k35OMk15L04K61J04p04n25L17J159j16j595
4841a142J476l77l0n98J083o95m43M53o91M34L68K0J13k84K84O4k16q00O19N43
$$ y = [-151, 268, 44, -331, -809, 1193, -472, -223, -147, 720, 394, 701, -139, 973, 747, -477, 644, -449, 737, -527, 390, -703, 127, 991, 211, 639, -53, 512, -330, -221, -413, 445, 195, 141, -157, 241, 0, 1409, -293, 759, 474, 64, -889, 138, -294, 239, -282, 232, 432, -236, 275, 241, 721, -150, 5, 753, -550, -832, 168, -10, 522, -260, -540, 172, 532, -8, -318, -766, 344, -368, 203, 308, -443, 386, 529, -149, 389, 722, 664, 304, -351, 519, -706, 823, -407, -738, -1471, -676, 512, 81, 562, -22, 286, 469, -91, -153, -24, 50, 163, -122, -659, -61, -85, -209, -472, 165, 194, -552, 240, -143, -22, 188, -260, -452, 513, 156, 118, 749, 277, 832, -104, -1279, 415, 93, -142, -136, -132, -347, -43, 218, 322, -382, -907, -590, 569, 453, -1142, 334, -43, -73, -671, 412, -283, -726, -273, -964, -530, -162, -142, -29, -313, -29, 35, -181, -981, -362, 181]
4861A81N26p34M71Q2q28m0P04n11O85j175M33M77J21M34m40l71j84nj89P83j26
4882B94N86o35l91J65K87j326M67R75J271j618R51j330R98o28O1n36r3J759r13
4901C44l70j13P3J71j091P08K31J370j069o4nk36l17M3K32J43N79n55m58j88J95
4922c77P19q77J04P88J41o81J46m43qJ250j101O77k51N84j595P23J055j128K87
4941A3m58q76J088j44M29j245J323n53J91J111j084P92j435P38L50k61Q11M8r65
4960a27M92n83L87j143R63Q0m16L73M0n91O19p06N19qJ85l00p14R90j86j011Q49
4981b88R01q16N04n06j81J42j33Q31n45L51n77j44L64n7o35K58J692j092o32R08
5001C45p16J9L77M57m86J4K41j06m22Q15j129N82Q80m22p45O74l73m14P3K32P19
$$ y = [181, 707, -27, 444, 526, -302, -342, 362, -149, 536, -639, -206, 271, 392, 826, 386, 15, -169, -174, -363, 420, 294, 880, 245, -146, 19, 306, -1020, -553, 422, 1693, 75, 1026, -304, 694, 66, 127, -409, -502, 1257, 344, -26, -139, -66, 105, -986, -278, -47, 1323, 254, 190, 185, -51, -368, -325, -93, 50, 629, 74, -384, -572, -377, 342, -535, -431, 357, 498, -183, -37, -480, -488, 762, -339, 338, 87, 671, -924, -201, 854, -274, 13, -445, -1321, -233, -377, 52, -1193, 130, -423, -232, 879, -205, 587, -848, -110, 240, -21, 790, 838, -127, 365, -218, 169, -974, -11, 69, -347, 26, 66, -525, 94, -612, -93, -101, 84, -216, -930, 60, -126, -1137, -288, 613, -203, 301, -205, -386, -244, -377, 454, -91, 260, -317, -461, -97, -154, -789, -531, 1161, 69, -563, 345, -371, -352, 25, 482, -4, 10, 251, 145, -277, 538, -591, -9, 871, 449, -296, 378, 5, -409, -336, -104, 615]
5022F15r14P32o41j73L80J09K6P18j200K74l35J29J081j356N04M33r62P02P9j049
5042h48O47R37p77n08J85J046m26m36k59J056m52p8Q14l80n46m85R19n83N77q90
5062d87J51M15oJ224j161p09O51M9R1J119r03j11N1n03M21n8L8k99L25P5p50P94
5084D17N60j244q5m65L38K16M90k8p78J75m89J544n00m11k48J276j517K06J61
5103c82J91K82q23j18J807j168O20n56P79j01o85k9O89j93o12j00K33J96M43l54
5123A19L52J61k94J27n24J98K0Q1J20k44N88M0r47M61o98Q41n54L06M6k59o44
5144g04O34K91j38J040p18K55o81j04j17j01O8M82J90l94n41J056r99L73R66n8
5164H00j239J42M49n53J99M06o4j07l61o0K04M97p01J28R84K2m93l1p84J165n59
$$ y = [615, -299, 433, -208, -381, -1, 108, 134, 852, -348, -74, -409, -280, 801, -555, -51, 382, -580, 122, 201, -848, -201, 736, -41, -549, -364, 682, 256, -180, -439, 617, 165, 87, 901, 521, -25, -510, 409, -174, 403, -487, -336, 79, 73, 1297, 136, -573, 78, 127, 218, 1337, 434, 323, 374, -129, 292, 234, 272, -27, 298, 373, -377, 417, 977, -267, -352, -817, -479, -263, 227, 199, -579, -404, -893, 651, 151, -260, -508, 768, -749, -543, -382, -191, 91, -732, -850, 957, -211, 409, -147, 632, 531, -154, -183, 506, 313, -299, -399, -166, 30, 473, 119, 471, 632, 338, 465, -59, 139, 159, 240, 360, 116, 704, 744, -203, 258, -440, 401, -153, 153, 199, -60, -704, -70, 221, 83, 1123, 405, 660, -21, -125, -242, -343, -275, 207, 397, 3, -538, 518, -481, -108, 858, 800, -439, -297, 152, -401, -202, 204, 140, 33, -328, -388, -184, 313, -388, -260, 724, 746, 253, 222, -562, 603, 44]
5185D4l2k79O14j137J241j661J860n15o03J14M22L75n24N85p12J63l43P62o20
5204b46N78j56K57j429J338j063J194J87K93j527J322J01m96J27m33o83K89O98
5222C51q54J055q54O40N98j457R6R9O26n18Q68k84L69J42j051M64r75O99J29L22
5242D65r03K19j43K50J88o94J483r01K77l10k70J171j488N62K42J8k13L5k21L55
5262A22j112M73N32o67M89j62J534j006n13M00R07j232J002n58n67O29N23j067
5280b73k5N91n37O60J23j137J051p45O69m81M02o07R00m96k94j0k31L26J59K11
5300B56k50O4p78J327p87O64k58j40j488J995j24K0j373J699q98R9M54L28l57
5319D53K8m18J41L07p25J366j415L85o51P26J64r23K39P29L1j282R21j14l30R6
$$ y = [44, 12, -267, 347, -790, 451, -1210, 650, 135, -468, -354, 68, 443, -81, 504, -208, -45, -388, 374, -246, 332, 176, 433, -996, 342, -721, 473, 660, 953, -574, 748, 849, 353, 480, 47, -636, -347, 351, -503, 552, -302, 338, 936, -521, -425, -326, 300, -218, 650, 366, 735, 877, -174, 290, -685, 14, 143, 465, -438, -219, -362, -112, 76, -618, 865, -36, 241, -69, -339, 832, -656, -94, 148, 166, -47, -12, -233, 122, -990, -517, 15, -652, -163, -325, 1209, 203, -310, 90, 997, -235, 767, 209, -358, 271, 794, -273, -298, 293, -244, 416, 539, -598, 453, -292, 377, -104, 298, -309, 591, 95, -199, -209, -440, -114, 45, 256, 6, 70, -708, 619, -168, 496, 238, 98, -1390, 605, 481, 501, -872, 827, -71, 28, 482, 810, 453, 481, 63, 204, 511, -214, 1152, -263, 122, -529, 197, 361, -562, -323, 406, 437, -845, 76, -38, -368, -272]
5339b72l49K64L34n20Nk34J257j587R97j14Q6j21N71K87r41j66J05O58p55Q65
5359C70P5J46o39L69M78j60q24P89K67o89Q58p76jOn42O0K91k68Q67n86O87r43
5381a65R28j215J051K85o16j049J93N36K48j021Q0J06N33K74j58J3L02j60o02
5400d37M17Q30o41o86N9PO38j81J32j27O64m35Q8k50o10M52M37k82J23o06K45
5421a63L88K44q72J196r16K38M48o27l76n34J753j303J798j250j57k59R7R35n56
5440H4j07M44r39J604j445Q38m25k11j28R77m15K66l51l02O18l59K61k96j14o88
5460f88P96P37j264o1O06l29P24j175Q00L56j149r5M8N90k80M69K69L28m37j32
5480A13m16O93p4q20P58r13R71M01p46K27N81n55l23N61q22o14M04O16L53p50
$$ y = [-272, -621, -357, -23, -543, -538, -772, 485, -1102, -105, -219, -133, -254, 317, 604, -337, -503, -398, 260, -495, 370, 445, 591, -48, 321, 799, 639, -185, 604, 871, 182, 1040, 264, 263, 269, -273, -213, 78, -190, 677, 91, 778, -165, 763, -452, 599, 884, 268, -781, -588, -52, 196, -825, -745, -639, -106, 168, 10, 23, 325, 165, -437, -20, 810, 169, -517, -458, -451, 187, 6, 138, 11, 675, 240, 328, 78, -532, -80, 357, 75, 198, -408, -163, 225, 469, -403, 793, -123, 115, 563, -64, -440, -974, 779, -524, 1274, 24, -133, -392, -295, 640, 84, -23, 421, -518, 1086, -359, 479, 54, -157, -285, 692, 277, 543, 192, -110, 508, 149, 410, 114, 0, -688, 108, 845, -419, -480, 126, -203, 521, -654, 146, 502, -647, -742, -694, -104, -384, 85, 354, 682, 245, 113, -303, 390, 316, -504, 254, -659, 312, 713, -33, 194, 775, 220, -103, 458, -364, -978, -574, 42, 395, -355]
5500c55M48k08J72k39n21M85R63j781M60J052k46n73K79j003P87N53j26N56L06
5519A009j459O64J8j37k9M81o80Q6k62P64r51O32J033j212Q52j185k7J43J189
5538I29j905J98K31R83o32j85M79n03P41L3j217J666j299M18n95M17J70L16k33
5557A2J42m21p33q3Q59N51m81N34R6j109N09K92k90N84q46K81n55P45K59j333
5577i87J319J69q30j3P75q32J131q04O02M27j022k28Q06j93q04Q15k04J32l47
5596h8P91n99N84j159l27O07l80J77K64M35r01O2O43r39P08P03p26M83M37j452
5616f77R4j4M24k91J66J49K81j26L95n92p6J16k63p8m55J166r0N07o81j05M87
5637C37p27q99J200P28j48N88j127n07N78P8l50m6l67J103j434J267L75p96j5
$$ y = [-355, 93, -115, 57, -182, -703, -218, 745, -1036, -576, 476, 230, -343, -64, -1067, -280, 273, 147, 703, 1009, -450, 214, 232, 95, 66, 547, -133, -47, -309, 455, -496, 136, 1169, -43, 809, -376, -403, -260, 929, -976, -778, -547, 436, -196, -381, 98, -405, 336, 369, -848, 818, -481, -63, -658, -241, -71, 245, 12, 154, -267, -1000, -1083, -224, 327, -154, 380, 476, -633, -124, 168, -122, 462, -384, -103, -658, 87, 346, -987, 332, 501, -329, -342, 433, -399, 732, -72, 530, 957, -65, -293, 513, 320, -484, 331, 127, 259, -88, 703, 104, 688, -471, -798, -191, -571, -394, -130, 305, -596, -534, 109, -830, -122, 581, -145, 338, 775, -677, -583, -597, -173, -464, -298, -149, 132, 6, 401, -191, -267, -151, -414, -492, -947, 219, 129, 636, -45, -150, 337, -390, -1289, -89, 639, 491, 1079, -48, -555, 23, 101, -249, -295, -662, 441, -993, 274, 649, -147, -162]
5656a62Q77n11M74M95j692L97o83J222k16k73M1L41j89N40J3k75J11k19l62L11
5676B40j13l32j23N30J59j73k51k7J02m9L32j017J342l04n05L03n58K57J028p78
5696F3j28J00m02n50M17j22K85M70p31O65k24J196j026m88j61J017L40p33P5j24
5716f1L22L07o81j07l81P35m36j52L8J87N42K58j251M42j5N20l17k5j61n52J824
5737A036R9q41K65l64n13L20N08r20K11l27K41P42m13L76M10m96p2k57m3q61P82
5758a17R2R47j768J301n06O64l69p17K87L74K43p82R83l32n91r6K45q1L13j22
5778c2n20R43m09M00j086J087j90m37j74Q65p60L39mqm02N2J39N36L21r21Q20
5799E59j372R50p20Q7N1N58j78O20k82O9M08j284P71n97M65j078J309o78K85L98
$$ y = [-162, 715, 204, 678, 1173, -519, -122, -805, 417, 201, -72, -31, 310, 121, 661, 674, 399, 510, 291, -71, 240, 127, -205, -328, 202, 361, 188, -63, -90, 12, -37, 295, -722, 620, 316, -189, 114, -444, -187, 841, 63, -65, 35, -367, -917, -500, -622, -337, 133, -598, 67, -157, 1039, 13, -475, -636, 381, 721, -12, 63, -61, 261, 568, -113, -220, -601, 134, -302, -454, -416, -229, 313, 571, -680, -238, -253, 267, -50, -75, -236, -788, 1036, 1135, 294, 559, 195, -318, 2, 510, -410, -199, -526, -285, 457, 44, 420, 830, 334, 262, 5, -38, -899, -117, -25, 922, -846, 455, -51, 613, 244, -473, -186, 188, 431, -351, 632, 300, -291, -387, -142, -223, 90, -32, -552, 391, -18, 382, -704, 383, 193, -244, -418, 447, -313, 26, 22, 14, -388, -336, -197, 339, 660, -261, 559, -813, 137, -583, -496, -445, 113, -65, 555, 273, 342, 750, -534, 237, -360, 105, -973, 336, -342, -57, 341]
5819C41p18L08O85r59j039J127j2L6o3O39n69K16o14L24l4P17Nq21J96Q26k6q53
5841b88M38j182R55O18l10k64M79o99J90J50J37l93O95j431O0N49J03k43P67n14
5861a83K87j00l07m15Q63K53m50L25J56k23O4l1q25O74K70o51K62N0m08K36m82
5882f35M26l05O28K99j231L96J440q04j45n2J0O84q89K88m22l12J307r73O95q63
5902d58K1J288o53P31q33k70L20M03M91j224j647J699N57k03L67o20K08j72L15
5921C20p31m85O77n44O31M94n75Q5Q2k6j13R62l80j074J492r51k1P98p15L84r53
5942f43K17k66J137J4o11j38l69O41N55R0p99N01n5n68k10M0J005p77n53J526
5962G37j058j02N08J0m72R7q57J667N43n86k42j364K81J02N92j41J89k23R99n58
$$ y = [341, -377, -69, 616, -343, -1382, -255, -267, -231, -294, 345, -224, -8, -622, -298, -332, 385, 390, -431, -235, 591, 565, -288, 150, -1032, -77, 541, 231, -33, 446, -253, -63, 87, 224, -169, 526, -905, -845, -296, -193, -436, 331, -183, 104, 4, -303, -718, 145, 398, -52, 273, 429, 206, 270, 239, -586, 88, 358, -293, -31, 19, -389, -153, -635, -209, -514, 114, 413, -818, -422, 1018, 214, 69, 17, 27, 711, -178, 110, -312, -624, 683, -290, 405, -458, -437, 851, 198, 929, 96, -174, 146, 549, 1040, -184, -1831, -132, 425, 222, 589, -31, 177, 5, 320, -411, -896, -219, -763, -132, 362, -213, -128, -46, -72, -185, 777, 397, -677, 815, -136, -157, 641, -74, 310, -643, -426, -692, 445, 459, -152, -290, -659, -18, 537, 627, -172, 329, 274, -294, -504, -464, 541, -236, -789, 737, -321, -423, 85, 95, -377, -280, -1137, 530, 1073, 487, 245, -1119, -838, -736, -144, -285, -96, -319, 680, 122]
5982A22l80J84P47l59j76l54M20J54n70K99L32p98L86J198j013O44r62R83m17
6001D40j076r8O47k88O88j7R4k11K37o64O74q57R0R28n78M89j149J01R44l59r9
6022f4N18J36r39O71r23J075K4rj204J244r51M33M9L67m94n7Q12l62L30m10l43
6043i7J070j185l24L24K7J316j05j804M10K35n03M15J42o2Q18p02k64L37P89j102
6063b65M99J40Qj01j23l06k82J079j019q89L61M21L28m65R7m90J664q57K15R9
6083A14p50J1P75o48J83K64j78J050m42k88K0m14J008l90j020R34K76p07K16n00
6103d86M81K76r32J200m10J62P68M4j008K23K26j197J489k25n92m45R75j227O66
6122a2m35O35N66m70r28O64m77J76j0K16k72Q85p67O38l55j76l99M84J53l60L7
$$ y = [122, -258, -74, 673, 314, 138, -216, 204, 358, -212, 87, 419, -379, 7, 1205, 192, 836, -126, 857, 440, -636, -734, -87, -375, 313, 296, 390, 179, 416, -248, 426, -431, -341, 587, 9, 498, -651, -550, 394, 35, -64, 454, 590, -349, 322, -601, 474, 498, 489, -715, 529, -422, 11, 60, 427, -67, -124, 688, 326, 656, 246, -97, 973, -212, -536, -212, -185, 1131, 1026, -778, -368, -133, -636, -221, -79, -141, 677, -25, -289, 48, 837, -265, 234, 374, 382, 281, 158, -148, -430, 649, -370, -1259, -898, -477, -149, -614, -517, -1007, 657, -200, 15, 114, -636, -625, 150, -498, -315, -51, -229, 821, 379, 91, 111, -303, 705, 315, -705, 229, 505, -202, 14, -486, -5, 271, -661, 539, 129, 291, 1059, 1103, 95, 318, 544, -653, 836, 611, 19, -426, 549, -678, -12, -447, 188, 754, 284, -644, 20, -457, -281, -291, -75, -347, 538, -229, 409, 54, -122, -521, -37, 116, -244, -207]
6143b07J36L22j133N19q6L70R19J64j989J114O63j124J296j160m76P75L60m17
6161D6j51K61j14n33J67N32oj96J018j509Q52K3o57J0O95m1n86K05Q8j2n07R73
6183E58r74L01k36L08L74q87L37O31l8p78M8N57j068M28R62r57n28K64Q88p15
6203e25L81l69J305r27P2n96O20J18J085o89r10k27O52k29P39l04L68n84N63l71
6223A72m25P43q88k83J008q56M54m23oL59O0J64l02J056r28q35P42P94p16J01
6243iL6k29J32j81J070p30k26J56l15L58l94o91J026r28J251p70P73J72o62K3
6263a38l86O04j64l86k19J85J30N97lK8M97m21j57n71o21Q88O22r85j082N03R28
6284a51K58l49N38q47K89m37O6N47M54l96Q21l97P30n21k57q77O79l12L33j84
$$ y = [-207, -71, 251, -882, -363, -449, -79, 840, 1004, -985, 129, 792, -332, 964, -196, -672, 103, 463, 46, -105, 156, 42, -491, -324, 208, 202, 6, 1024, -485, 367, 390, -267, -257, 438, 397, -189, 16, 104, 92, -415, 558, -416, -115, -351, -43, 331, -556, -219, 412, 374, -404, -356, 201, -867, -439, 523, -434, -962, -698, 190, -525, -144, -513, 792, -135, -63, -659, -39, 79, 1164, 475, -435, -662, -10, -239, 500, 196, 564, -20, 543, 172, -253, 490, -398, -681, 327, -529, -75, -498, -504, -145, -85, 79, -223, 833, -95, -930, -188, 606, -110, -9, 27, -202, -70, -251, 819, 89, -137, 19, -296, 62, -332, -1023, 3, -925, 326, -444, 329, 501, -161, -138, -524, 80, -84, -470, -689, -504, -374, 223, 220, 248, 745, 324, 167, -404, -1025, -137, 485, -500, -1582, -1079, -151, 107, -242, 296, -551, -262, -699, -633, -86, 368, -28, 793, 396, 1126, 605, 348, -529, 150, -162, 171, -13]
6304a3j19J29Q2o3p57P62l38Q81n02O11o3J6j284J151k60l60M50m05K39L51N97
6325A105j458N09N12j4p86K9k9L52L38K31j264L20m96P28n20n9J245q35p5J71
6345Do5N24j171J002m07n78J504n64m91L99m82KJ38k28N16o9k06j98Q1K30k21
6366b80P62n93K78j67K60k47ON3l09j41J180l88n4o75k20O24L30p41O28p18m52
6387h64R35K4p01M00q17q3J321p07J338j400J50J068m57lm46N1l84P85j059M95
6407c54M42L4Q85p54n03p95R14L08r47R09j89k72k43N02K42lJ05K9n66ln66RQ42
6430B6m06J96O67j8l54K20n87m3O64n31l22L13J233q32Q66n26q37J6P05m10l1
6451IP6L65j79o46L08Q83j231L15l1J25j93Q29l84K22q57Q11o98L9K82J56p0N90
$$ y = [-13, -132, -3, 79, 16, -741, 21, -317, 564, 62, 673, 610, 626, -658, 493, 233, -127, 323, -82, 157, 508, 1105, -353, 156, 668, 654, -132, -103, -132, 220, 558, 789, -475, -155, -651, 77, -443, -502, 743, -92, -167, 4, -61, 463, -708, 294, -113, -691, 813, 249, -242, 157, -325, -323, -185, -413, 103, 34, -172, -370, -289, -59, -280, 482, -111, 167, 0, 260, 13, 19, 72, -237, -378, 802, 414, 360, -315, -535, 89, 419, -322, 306, -412, -864, 71, 95, -606, -206, -1023, -1106, 215, -492, 846, -554, -404, 664, 207, 204, -242, -191, -575, 210, -849, -354, 88, 122, 1007, 253, -250, -1045, -131, 177, -770, 139, -50, -322, -565, -63, 179, 176, 281, 310, -256, -259, -825, -816, 26, -380, -184, 483, 465, 111, 331, -256, -299, 365, -166, -488, -175, 1058, 226, 1092, 566, -271, -255, 450, 40, 9, 85, 450, 271, -375, -67, 816, -415, -100, -131, -6, -199, 630, 246, 468, -389, 422, -276, -237, 45, 201, 131, 721]
6473G21p83n08N46L27L02m14R7L71p60J6M45J41j052J067p35M46L9q12Q08q71
6493f09Q73m51j07K47K28l98o01P99K30p99K94L05k07o4P42n15J35N19p4r24J89
6514a88k09J10o52L69O64N42q69J82P3k66K72k60J58L14j9n51j61L22r9k65L23
6535b10J31l48O76k13J35r98M16N62k69J031j074P4k39J259j292J14m6O33n3o36
6555c47O92m39j36R27J5J32p28l40K27J91j616J286L62K09Q3r79J631r17J79n13
6575h1j3J297j233j349J959o52p72N15O7J65l16P75l91m33P05q65J121n00L47
6594C46r47J019Nj536Q65k12m27M91jJ69N73k72J1O61j254R33m22j99j16N11k59
6615f1K66l48j108J389L82m13L57r38R0n0N12m18j70J161l65j159N78J91n38l73
$$ y = [721, -62, -570, -24, 303, 605, 191, 288, 659, -101, -85, 360, 501, -551, 516, -219, 227, 266, -546, 262, -609, 264, -187, -294, -47, 181, -217, -818, -19, 211, -588, -294, 11, -196, -260, 482, -33, 102, 621, 547, -377, -188, -397, -287, -939, -570, 94, 636, -233, -51, 22, -244, 28, -232, -74, 240, 221, -330, -491, -169, -268, -533, -210, -79, -427, 249, 36, 171, -827, -411, 151, -118, 913, -161, -87, -326, 933, -359, -245, -291, 342, 289, -347, 345, -94, -230, 697, 712, 844, 116, -224, 3, 194, -1422, -136, 226, 435, 518, -461, 1170, 253, 432, -81, -94, 1203, -30, -1379, 580, -72, -844, -329, -262, -97, -413, 362, -29, -462, 243, -622, 499, -1, 346, -601, 418, 423, -1113, -248, -460, -887, -396, -397, -228, 345, 73, 84, 745, -509, 424, 2, -197, -313, 198, -61, 205, -143, -1251, 138, 520, 107, 464, -474, -384, -434, 78, -340, -510, 651, 286, -873, -295, -104, -642, -1015]
6635a015O47Q19o82j012J761l14J10j749N57K33Q44L87q27L34l24J65J28L09j134
6654g63J602j201P8P21%L18j088R44n45j79J61L52l23J43q61L85Q13n82j143K122
6674I54j546L41L44L27j433J948j181k8Q0p5k88K38L92P1P66q56K19K68q82N50
6694B09n86Q86l42K43qo1O50o67k71l48N41k20l13r66J208r8J97N00r18Q93j272
6715g43J03J328n42k11L6K99M61k42j82q77P75J3L70m86p19K84J6K86J48K2j35
6736DL34q5O90p06K7m65P17K7o37L59j378J551L99o06j040P38L91n44m46J033
6756C63p59K47L76l42R3N52l47k87j10J046m18j063O40m05L14k9R0k04n29J088
6776C16m49L94l94n76O76k47J452j738L55j04J42K46L12l58n71L61M73j78j59
$$ y = [-1015, -368, 451, -231, -1243, 518, 204, 314, -1435, -878, -645, 199, 586, -241, 93, -231, -66, 62, 371, -763, 839, -362, -284, 437, 437, 755, -333, 611, 66, -113, 48, 400, 77, 220, -641, -256, 557, -25, -1168, 954, -592, -251, 93, 420, -1013, 935, -246, -274, -194, -269, -557, -319, 73, 144, 910, 54, 273, 541, -341, 209, -377, 509, 167, 410, 402, 341, 991, 324, 53, -295, 246, 26, -287, -1253, -45, -143, 54, 554, -364, 529, -743, -640, 688, 146, -65, -29, 270, 731, 489, 307, -570, 205, 218, 588, 102, -617, -333, -317, -31, 117, 139, 4, 338, 253, 943, 237, 264, -201, 516, 543, -94, 265, -1113, 438, 837, 231, -809, -71, 320, -224, -670, 363, -396, -149, 227, -115, -22, 530, 183, -104, -214, 832, 414, -649, -9, -414, -100, -129, -39, -243, -772, 316, -133, 261, -133, -709, -33, -280, 1172, -566, -211, -315, -173, 73, 385, 27, -544, -183, 290, 112, -47]
6795d7K07J46j74o18P33J40k24L15m94Q33j075m04k24J040l12J72m98k44K73Q75
6815D20M70j172K04J65r24J197m90q4L06K73j31L93j011Q96o56l70n07J248M76
6834G03r58q1K36j27J00L21J16K96K92p78n7P2o27P73j263R01k34k10n31J304
6854B48n4r0j160P16O00Q61j242k85L33p0O74r2j17m39N31o2o54j20N36N08q14
6875a92n4J56M00O64p59l86J49k45L43K81k8P20m11l50j60K0j162J363K19r39
6895c71M27p15M96L29K0j292J588m47M59q00K69M82r09K13N9P35o49O08l66j54
6915a8l11P00j056Q38K75J02j408Q12j52K94l9J012j726P24j27j87R38r25O92
6934D38p59Q00l07l59J66Q31p17o63O57r2M49m14q14L16k16M03r8O88k47o32J619
$$ y = [-47, 160, 306, 132, -486, 247, 387, 163, 478, -16, 817, -258, -662, -886, 154, -158, 14, -484, -728, -455, 420, 890, -282, -78, 87, -837, 360, -130, -214, 92, 365, 234, 627, -384, 512, -144, -514, -1021, 227, 703, -255, -336, -100, -227, -127, 194, 310, 606, 898, 120, 63, 135, -492, 281, -982, -81, -315, -525, -1056, 248, 194, 104, -1056, -340, 260, 1121, -121, -406, -73, -143, 531, 439, 322, -117, 414, 352, -302, -422, 114, 622, -192, -246, -90, 310, 974, 215, -171, -22, -267, 76, 357, 329, 1049, 638, 288, 128, 148, -1014, 349, 568, -371, 56, -659, -163, 166, 186, -1106, 482, 35, 494, -306, -37, 445, -464, -251, -192, 543, -106, 502, 136, -18, -329, 371, -685, 153, 428, 530, -878, -66, -218, 76, 37, 1049, -677, 47, -80, -267, 671, -254, 438, -321, 479, 172, -187, -21, 810, 93, -570, 87, -5, 444, 30, -784, -468, -684, -281, -379, 309, 62, -570, 1049]
6955A049j314P31m96N94k51L19j254K8J133j31p37O79m12k58O51j506J886p16
6973eM7p78J142p40M07nN22n55m83J349l90k01j14N01k90K95j18j400N73L81l57
6994b19K55o83J289J88o80k84K09p92K02Q21n19N67n91O46k49N46l13J19l56L27
7014D83k43n34Q16n81k66L37P0J17q11j03J231p44O34n58l04N49O3k61j37Q95
7034F53j324Q24n5o62J378p03n91P19MM61l71j86M65j333J372r07J43l74R41n52
7054i8k59J59N96R3nq88k33R60q75N47l47k47l34J342n01p86J222l79P08j219
7074e44J294q50M48m30j01L96l20j20j77P85l09Q08p97K54o81J489n49o96L36
7093B36m39N80L11p61j80m0L1J456o76l78Jk03J32L93p06N47o99L59L55m12m57
$$ y = [1049, -265, 466, -30, 564, 313, 632, -622, -594, 539, 408, -329, 350, -62, -320, 331, -1175, 711, -5, 42, -736, 406, -334, 73, 68, 590, 35, -448, 901, 511, 310, 196, 697, 407, 702, 584, -816, -243, 138, -219, 36, -647, 642, 830, 150, -134, 75, -717, -515, 306, -213, 354, -237, 409, 160, 706, 393, 512, 156, 483, 240, -294, 522, -59, -325, 12, 82, 199, -612, -715, 516, -228, 406, -152, -456, 93, 156, -105, -242, 653, -671, 153, 98, -564, 814, 111, -480, 239, 243, 704, 333, 147, 612, -721, 651, -256, -113, -487, 454, -98, -357, -198, 398, 491, 486, -402, -635, 325, -550, -3, -350, -597, -931, 411, -90, -876, 346, -33, 675, -544, 750, -100, 348, -82, -183, 213, -107, -227, -404, 381, 72, 880, 83, 337, -344, 1145, 596, -100, 236, -203, 377, 688, -73, -253, -293, -262, 1194, 518, 140, 141, -62, 70, 463, -243, 304, -395, -36, 319, -93, -550]
7114e50O47m24L36J70L66m15O71p12L5K97j187R90Q9p39L27j39N21p05Q26K89
7134F93k51K25q62K09R65m84k43n1K81l31k37M20m58n83L49j23J67L18K71J03
7154C78O3l67k9Q99j965R51O14r85J037r50L20N19j04J03r66O36k61j91k45Q27
7174B84m2n66J223j204Q33k68r16Q61P34r99p2j26K98n11R84m28l95J149o21L06
7194E24p60M47K14K65l53L20q14k99R73j41n84O06m83N8r0l95O60p53P32Q02l15
7215F14m21m33K06L20j166J686r90p4R9Q5q0km47P53p33j45J029o97O02m71k11
7236d76J245j392N77N0J56q4K31k47l10qO9N92k87K97M81p97M11l07m16m88m80
7257a183N62J186j049L09L48l55J34n3K59K16o36J23N40K80j256K27M00j326J285
$$ y = [-550, 97, -327, 9, 179, 545, 130, 801, 89, 124, 421, -766, 224, 313, -426, -99, -238, 283, -422, 404, 693, 442, 667, -195, 14, 979, 495, 252, 201, 482, 151, -86, 334, -124, -707, -358, -481, -314, 4, 275, 378, 441, 74, 45, 944, -1021, -70, 544, -441, 596, -354, -34, 485, 381, 484, -482, 154, -107, -298, -543, 284, 242, -324, 899, -305, 528, 260, -656, 205, 939, -60, -132, -258, 40, -471, 513, 85, -310, 839, 218, 524, -236, 211, 425, 690, 337, 657, -157, -456, 517, 376, -208, 398, -85, -27, -117, -512, 148, -605, 127, 929, 614, 193, -240, -34, 286, -880, 806, -184, -258, -159, -74, -154, -156, -603, 150, -583, -728, 301, -396, 206, -265, -476, 769, -623, -46, 4, 160, 76, 307, 60, -250, -258, -189, 403, 116, 413, 894, 97, 508, 201, -215, -703, -1183, -621, 565, -484, -175, 173, -182, -48, -101, 158, 374, -262, -139, 401, 681, -575, -348, 52, -1274, 11]
7276A1n58m37M11r1P5N27j352K079l36m1j67o83q6J005m67o21N38K84k85K87o57
7297e64O81p26R17k49q67M55Q53q22R70p29L25P53j037l05m3P39q60l66J287k22
7317A90N42k84q66M61n03J58J71P9L45K75o87O0J4R99j374N82k66K22p0M66j098
7338e84M95k01J261j061L16K41m69J48j40m41rk20J165K65j08k70j15q18Q22j119
7358h42Q09N43n58j70j104N82J047r00o37J120L12p58q2R42p5J74r53J413m61
7377D02m62L27m25j60J26j36M97m6R2m49M2k63l08j042J649L37Q28j367N22r02
7397g38L00l29L55n43R94N09k25r02J235j037Q56o56n18l8P03K97l70M02q03l71
7417h79N24o8O7J041r82J58Q58l37m63m88k46J236n5n37q98J067j66k00N6q08
$$ y = [11, -547, -984, -573, -664, -589, -62, -1414, 665, 329, 288, 121, -562, -648, 357, -110, -731, -193, 91, -194, 93, -564, 117, -609, 308, 59, -808, -353, 500, -322, 648, -81, 244, 997, -40, -345, -388, 351, -509, -875, 412, 190, 732, 448, -418, 43, -460, -302, -131, -52, 293, 568, -119, -59, -45, 954, -420, 162, -104, 118, 48, 514, -584, -89, -290, 971, -90, 226, 467, -2, 146, 6, -435, -444, -664, 501, 766, 658, 388, 273, -545, 277, -842, -33, 510, -48, -218, -1322, -740, 307, -593, -1230, -110, 202, -556, -638, 304, 229, 403, -550, 863, 402, -60, 267, -158, -318, -192, -328, 169, 123, 215, -234, -192, -455, -763, -1805, -156, 181, 1009, -358, 164, -738, -438, -767, -412, -955, 39, 548, 323, -579, 656, -381, 475, -181, -699, -737, -34, 263, -107, 295, -508, -879, -355, -423, -356, 685, -297, -139, 719, 382, -81, -569, -815, 421, 366, -171, -1069, -2, -168, -368, -312, -1120]
7437a120J137r22R67Q27r47l20q4Q01j89k65oM05j89k01L07o07P24K51j26j065
7457f22J61K17Q29q48L66m56Q20m96L11m41J275j243l20J013j099R58n20j035
7475a130R22L04m60N59J6J96j229L33R30o01j40M29o6j51P33l98J45p07M94n56
7495c77R55o02k32N17o5l50Q8J15o04J400j147O73q70M06L23l32K77m14L00J58
7515B19L30r26L43M37j69N64q45L70J63q85Q04r12M20q29J021j39o62K78R71q13
7535b60l11J032o45N96r37k86R31l4K25j405O28M15J16k03k74R40j254J112R1
7554D77q05Q7k30L54K70j587J182J014q04N68q95J28l89J301n7j67K4q19o28J21
7574h55J533r57n2M75o32M76p92J138n72R5K66l47K98p21J142J27n19k87k16L29
$$ y = [-1120, 17, -905, 62, 889, -58, -378, -462, 339, 150, -115, -121, 284, 95, -106, 201, -406, 318, 569, 443, -622, -461, -244, 585, -263, 103, -353, 467, -29, 282, -159, 1116, -127, -447, 566, -533, 425, -95, -1130, -208, 96, -364, 195, 211, 407, -822, -489, 441, -160, -300, 129, 63, -88, 645, 247, 392, -315, 179, -377, 578, -24, -256, 261, 196, -154, -66, 49, -555, 845, -302, 371, -499, -93, 230, -102, 175, -239, 61, 219, 549, -377, -34, 403, 234, 798, -47, 323, 486, -399, 405, -507, -87, -916, 105, -34, -696, -418, 553, -260, -571, 461, -184, 412, -525, -811, 120, 86, 311, -1094, -466, -51, 65, -138, -412, 528, -726, 386, 477, -328, -241, -471, -117, 153, -1434, -252, 762, -42, 526, -369, -241, -630, 671, 614, 447, 471, -348, -976, -855, 678, -279, -331, 144, -488, -12, -804, 334, -238, -143, 123, -224, 74, -647, 495, 622, 103, -184, -400, -71]
7594g1L62o60K36J527l77j290q56J571l60K49q64o5M57N36j240R51O37q14J56
7613H5M60q39o5l0N70j152O68J18R55j054O6j0Q07j639J261n07n02J138j050k35
7633i55Q96l50K65J193o18j154j80J015ll92P34j78j359J424p00K71Q91o63L63
7652E00k88p7m95M10l69J233j503O18N53q6n59K98q86N27j13nK56P00o11L18q36
7673d15L28J694j506N31r83o23J145j19j073J119k85j36j64J34J049q94R34j211
7691d75L74m3m58J165r22K08M17o25l68L75J13J63N76j526K30j45j71O78l59O83
7711a10M63r43j13J105j332J513r37P06j1n32J56o31J158N8J05j077l8L94O52
7730E86r34O2J92p2J694o79n89j299Q39M44o23J45K9k97j07j0P82p08M15r56J894
$$ y = [-71, 291, -369, -133, 1394, 1017, -273, -1129, 442, 82, 331, -533, -598, -141, 395, -845, 106, 743, -71, 85, 545, -294, -359, -389, 181, -971, -303, -185, 770, -284, -218, -228, 579, -1060, 201, -306, -808, 330, -720, -955, -59, -409, -144, 1049, 431, -723, -903, 112, 109, -283, 451, 273, -1086, 338, -362, -91, 800, 137, 500, 212, 135, -360, 50, -319, 914, -589, 29, 582, 496, -63, 235, -651, -124, -237, -242, 14, 714, 103, 421, -415, -87, 1607, 101, 632, -351, -974, 171, 52, -1021, 98, -187, -323, -487, -353, 696, -198, 736, -475, -101, -144, -602, 563, -359, -151, 266, -359, -727, -352, -239, -76, 500, -1026, -796, -941, -1112, -434, -793, -110, 353, -590, -703, 402, -930, 583, -354, 352, 341, -191, -35, -666, 492, 550, 655, -422, -460, -66, 586, -348, -286, -94, -166, 1528, 849, 260, -1039, -200, 244, -379, -234, -205, -502, -609, -619, 163, -545, -130, -1086, 808]
7751H08o03J78R42j393n6J92j08l14l74Q95p59J210n99n32Q28K8J8n65J27N19
7771D42j45m84K54N84m16O30l11r80N47Pk59N52r88N82o81P47k6O52j406J136
7791D37j112M78R86q51L14r73P07N09r41M46M24M1n21N27k42p67O49J46o57P16
7811C16J70j341J938j855J861j316J46K03L03n03L79P91j373J199j64o77p2k61
7829b56J112q46p05L16K98O30n27M72l70m29J30K09l35J84m20J586r93JK51p26
7849d18L41J309r18o15M18R62j725M56k5n30J610m30r5p2l05K90O9J37n65Q21
7869G15j309N35P94j619M18K24O50n18L67r95J385p41N08o75j80K56k29N87q02
7888f29R85j099j51J261M85p46j403R00P10j01mn17l50N05l37P58q64L68J542
$$ y = [808, 205, 383, 1325, -68, -124, 68, -40, -354, -728, 167, -592, 618, 19, -513, 315, 343, 361, -204, -77, 442, 297, -187, 67, 651, 235, 865, 554, -426, 121, 128, -131, 421, -567, 15, -666, 81, 55, 707, -699, 437, -675, -197, 789, -62, 252, -721, -14, 495, -446, 0, 424, 465, -56, 471, 229, -538, 111, 257, -400, 316, 486, -855, 1083, -772, 1089, -227, -81, 122, 425, -78, 301, 1092, -281, 918, 754, 77, 5, -256, 856, 10, -695, -379, -81, 549, 22, 494, 124, -305, -175, 34, -301, -117, -537, 1049, 56, 57, 308, -418, -77, 1232, 314, -301, 117, 1079, -646, -190, -215, -745, 865, 435, 340, 268, -37, 253, 322, 459, -106, 715, -594, -59, 735, -884, -466, -242, 408, -110, 257, -738, 647, -94, 414, -261, -441, -185, -414, 173, -629, 356, -743, -894, 367, 852, 106, -1297, -397, 313, 212, 208, -309, -659, -154, -491, 267, -597, -229, 1313]
7907A313j698N93N84r86L91n29m1Q09q33L08O09J9j360Q56M73n07j89k25J45O90
7927D22m45J26o64J257o1o18K85n95J96r8j150O47L78L14k61M20m60K91p54J103
7947C33N01k77O10j292P6K35Qk41M87n14k36j09L97J73o67O67k68l70J91L49K31
7968B84j59q35J026o2k51L60K45j84L40j153N42o23J067k63j76k62K02k46O85
7987E37n35K71l67k00K18O39j580R49N91j065M24j30R32p48n42K91J271j293R62
8006F25r36L16o47J696j128j31L38l97O8N04m51k25O62m79M23j24k83J32K61r3
8026A31Q97r48l81N55o80K54P78j292J454q97K07n63J014r72J083p57r10R95K78
8045B46m33K69M77j240K78L82o3K57n28M22J04m03m92J075m98k44m60Q65M85o34
$$ y = [1313, -385, 208, 792, -194, 197, -332, -373, 436, -397, -89, 520, 539, -821, 35, 508, 1, -188, -413, -268, 422, -23, 103, -561, 696, 635, 17, 302, -293, -97, -195, -1345, -698, -320, -6, -267, 153, -307, -16, -770, 333, 834, 557, 1167, -125, -49, 186, 194, -47, 440, -74, -310, -419, -22, 151, -516, 151, -117, -487, -296, 53, 284, 125, -710, 316, 254, 3, 363, 608, 424, 764, -389, 153, -470, 597, 334, 158, -104, 98, -148, 537, 2, 273, -94, -294, -76, 563, -1017, -68, 523, -542, -118, -248, 684, -64, -606, -315, 956, -337, 625, -311, 5, -642, 1054, -74, -205, 133, -264, -196, 308, -143, -368, 294, -185, 238, 114, -169, -37, 224, 131, 1028, 80, -301, 254, -426, -172, 606, -686, 768, -129, 78, -485, 529, -443, 640, -117, -1027, -32, 246, -187, 82, 559, -681, -403, -21, -84, 173, -355, 67, 171, -232, -724, 351, -147, -391, -851, 14, 499, -135]
8065a35N2L3o1P8k57K91K21Q02m97m5k62O8Q61j933J332j085K29R31q79N27l94
8086a23k97O6L85n73J279m19o0O9n16R9M49m10Q26j534K35K30o77J151l83Q50
8106F47k87j46p56O68k8O18j202l21P25L90j89r60R54k5L86j335O16O46j038P89
8126A52K20K77k55k44m84K47K85j75j61rk67Q80j43n96k07MJ12Q30m18K02j189
8147i39l0R55l62j64j2J129m01q19O21L69q2O34m25k09M4J49m32r68Q75L81j153
8168h39R93m49m65Q19l02j8J074p77j426J009L50K86q8r03O63j8oM54N82r05j006
8189i72Q87j0
$$ y = [-135, -83, -50, -111, -33, -290, 1, 222, 1024, 527, 482, 220, 288, 1149, -784, 548, -537, -308, 623, -256, 271, -123, -420, -354, 31, -542, 737, 318, 258, 327, -189, -90, 359, -51, 775, -759, -524, -294, -971, 180, -203, 647, 360, 214, -542, 126, 98, 716, -486, -807, -82, 308, 119, -841, 113, 88, 474, -861, -245, 401, -637, 152, 372, 649, 394, 150, -334, -87, 198, 23, -138, -147, -414, 466, 323, -273, -480, -476, -364, 466, 48, 250, -939, -969, -14, -376, -540, -552, 577, 176, -643, -22, 347, 265, 899, 474, 265, 309, 458, 26, -942, -67, 314, -839, 154, -295, -760, 59, -243, -261, 813, 36, -1390, -381, -31, 255, 167, -736, -73, -91, -97, 357, 939, 34, -972, -85, -95]
8191i5
$$ Imaginary data points
##PAGE= N=2
##DATA TABLE= (X++(I..I)), XYDATA
0@%%%%%%%%%%%%%%%%%P5j83K16k16K16k16L04m12M32m55N63o48P56q75R83j173
33f33J309j443J641j858K088k357K653k947L279l658M060m497M964n481O054o670
49c496P354q095Q907r822J0833j1942J3186j4599J6202j8042K0176k2690K5701
62A3673k9385L4032m0097M8408o0613Q0774j22937M32231l60378K84381J53013
73D33102m94459M55891k63816l2068J20316k39501J61879j3728k62594L75027
83B40049k44056q0731K69275k64778N0588J41948j94943R1614P3128j67276J17677
94C2495J021j07452J86282j60827O3936P8574k09735J69274J2775k03550K22436
105H5229p0148j52412K66728k22435M0058J50842k40702K21428q3430r9129K02579
$$ y = [0, 0, 0, 0, 0, 0, 0, 0, 0, 0, 0, 0, 0, 0, 0, 0, 0, 0, 75, -108, 108, -108, 108, -108, 196, -216, 216, -239, 324, -324, 432, -443, 540, -633, 676, -767, 874, -984, 1104, -1253, 1400, -1547, 1732, -1926, 2134, -2363, 2601, -2880, 3174, -3496, 3858, -4237, 4670, -5152, 5681, -6261, 6925, -7674, 8528, -9514, 10662, -12028, 13673, -15712, 18320, -21777, 26631, -33982, 46792, -76145, 356086, -4292, 280089, 433102, -61357, 394534, 130718, 98650, 218966, -20535, 141344, 127616, -134978, 240049, -4007, -84738, 184537, -80241, -29653, 112295, -82648, 8966, 82094, -85182, 32495, 33516, -73936, 112346, -48481, 15455, 94029, -115706, 53568, 66343, -137207, 85229, 15081, -137331, 129397, -93038, -52980, 97862, -142840, 78588, -4842, -103971, 98608]
116I8608j75706M7487J24908k05002J58863O764j80253K32098j21973k9311J39907
127I6390j54444O6215L4111p8287P1945k0356p4855J37001p7979l2895J25241
138I2087j49678P3246M9071j11126Q8720k0877p5503J12972o9998l3296J31467
149H7085j51509P2323L5099j18464J41038q0590l1719J06471j11568M0479P5607
160F4252j45567J01234l4r4431J46646j13270J2244P2684j09814P1520O166o8829
172e7199O8596k2557m4498R1912q8230L2544O0443j17992R1126K596o9591P1888
184A9038k0928m2944P7148n1137Q462N0652r8477R7340k7919m9422R7442p8522
196a9267J3758N8189q3763M1626M3704r2470Q6701k1175m8802Q5555o8756M1439
$$ y = [98608, -77098, -29611, 95297, -109705, 49158, 55922, -124331, 107767, -14206, -43517, 96390, -58054, 8161, 42272, -36015, 35930, 15574, -59281, 77720, -259, -33154, 92087, -57591, 15655, 64726, -46400, 42320, 21443, -54060, 58912, -11086, -44382, 87085, -64424, 7899, 42998, -75466, 65572, -15018, -46737, 59734, -51834, -11355, 64252, -81315, 19919, 19885, -74546, 72100, -41170, -28926, 43758, -66056, 5464, 11630, -57199, 11397, -11160, -55658, 36254, -51976, -19432, 41011, -76981, 14145, 16741, -52850, 19038, -1890, -44834, 32314, -18823, -10361, 40291, -58186, 39154, 11235, -38187, 59255, -19267, -5509, 52680, -31083, 10543, 54247, -38223, 48478, 27303, -21499, 64056, -4700, 36739]
208C6739M864n5355P1780k7866m3978Q0172m6388l1608Q6671q5900K9272K9613
220D8016o0566N4455l3752j4694M1292l6524l068L6802o7729N2403J2534q4142
232e4973R5380n7177k2633P3470o0086M685L1499m4211K2463P107m3082P3749
244B6191o5771L896N9600q9505O4467M626n7812M9711j0270l4902O2262m2035
256b9542j0780N6522o8145N4402j4217l3152O4395n1872Q473M5419n6092J5141
268a9448M9430p7291N1880J2139n1001O4887n0366J3343K8695l7535L1712L193
280A9638m1729M6970q116m1059P4342o2813J6643M2903p0385M5655j02l0394L3796
293B5349r551k3627M1888m0608J4928K5678o5998P1258k6523l0522N2439m0617
$$ y = [36739, 41603, -13752, 58028, 30162, -13816, 66356, 19968, -11640, 75031, -10869, 18403, 48016, -12550, 41905, 8153, -6541, 34751, -1773, -4841, 31961, -35768, 16635, 29169, -54973, 40407, -16770, -39403, 34067, -26019, -21334, 10165, -34046, -11583, -4476, -47558, 26191, -39580, -35684, 23916, -65589, -1122, 3504, -54308, -4597, -14867, -49769, 12493, -29542, -40322, 16200, -51945, 2457, -11760, -44912, 19483, -32389, -23916, 21503, -34589, -19448, 29982, -47309, 4571, 16710, -34291, 30596, -19770, -6427, 22268, -15267, 16445, 19638, -22091, 24879, 16763, -24296, 50046, -12767, 3876, 46779, -23606, 22049, 21947, -8447, 25349, 15798, -7829, 34059, -6549, 8379, 34057, -31941, 39317, 12794, -17728, 34711, -5906]
305e906q9L3499l5006N890K7599n3982M7512k0947k2218N4916n2807K1907N012
318E380l3806L5011j18l9350M3488j6086k8077N7464n2459J7995J5253l1613L7062
331A0144j9947r840K9905k1177p609L9904m4187K3193J2886m9128N6686k7999
343g169m702L4404l3759M861K3151k4481J6292O895l3818N0798l5425J822L7234
356C6103m9594L1754P178k5759K3025k694k1458L3220k4606n785L6375m5882K9423
369B1300q362j9309L1642k0855k478J8794k4640J351K9318m6152K7806K686k9993
382a8892L6373k9836O335J5422k4296J3061O050k9245K9098o325k7510M1274m0605
395b9096J5506J7500l4881K8593p610j6464K0531p268j0054K5288l0635J4574
$$ y = [-5906, -5995, 27504, -7502, -1612, 25987, -27995, 19517, -1430, -23648, 31268, -21539, 368, 5380, -28426, 6585, 6467, -32883, 10605, -5481, -33558, 23906, -28553, -10558, 4695, -26918, 10144, -9803, -19643, 10262, -10915, -18524, 21380, -22807, 386, 13272, -35856, 20830, -7169, -11871, 22533, -11226, -6365, 16786, -7695, 8597, 15492, -18326, 32472, -2953, -1131, 36103, -13491, 18263, 25441, -318, 22707, 20013, -1445, 31775, 7169, 1384, 37759, -8123, 21300, 12938, -6371, 25271, 4416, 1938, 20732, -3908, -2557, 26761, -19391, 8415, 11101, -18892, 17481, -12355, -6020, 9402, -14894, -1833, 4217, -25028, 4070, -2255, -29765, 11509, -29096, -13590, 3910, -30971, -2378, -9988, -26452, -5921, -13189, -23243, 2045, -28590, -14016]
407a4016Q724l1765M0594k1397p382K1561j8270O604J6014k2239R410J0893k6540
420b7809L8239k0111o008K8252k7396K0762M566j5129J6645j104j9448L1954j7271
433F142p992L2624m3096K5665L034j8180K5465j7957o834K2598j6782j308K2252
446B5631l5847K9175m435k1422L6340l1037P031K1251k6263Q093J4763k6772J4996
459A1504Q96k0510L2773l3026J0795J2069l2233K8214m235j9574K1326q374j7183
472a7558L1980l1006M347K1408l3401K6558j2417o919J8398j7242L940J4472k7901
485b5341J5302J7367m0016L5737p277j6541K9120k0226Q939P275j1526J1681L803
498H297k0559K8247j4469j1134L1749l3590J9350J1484k9762J9461K714j3726
$$ y = [-14016, -5292, -37057, 3537, -17860, -25242, -3681, -21951, -15347, 667, -21572, -12162, -1269, -27809, 10430, -9681, -15689, 12563, -14833, 5929, 10495, -4634, 12011, 10907, -8541, 23413, 6142, -1850, 30774, -12322, 13343, 16377, -1803, 23662, 5705, -1129, 21469, 4687, 3379, 25631, -10216, 18959, 14524, -6898, 29442, -1595, 5436, 26687, 424, 8517, 23280, -3492, 11504, 12400, -8110, 24663, -8363, 2432, 14501, -17732, 10482, 6247, -13327, 7999, -375, -17558, 14422, -16584, -12237, 9171, -24230, 2328, -10089, -17008, 1390, -15852, -11912, 2560, -25341, -10039, 7328, -32688, 3049, -4228, -20769, 8351, -11875, -2936, 4339, -7187, 4494, 8297, -12262, 15985, 1516, -9618, 22131, -11459, 7891, 19375, -10387, 9074, 11788, -1938]
510a938J7120n354j3190K2976k7574K1372L021k8089L7216k2893o634K4625j6900
523C758m147J7393k2636Q832Q265k5900K9644k5986K808K1202k6191J6761j354
536B449j8446J6379N115k2291K6325j7590o328K2502k4167J7596m861q991J3891
549A583r755m535J6987j4688p903K4767l1214J7853M193j9925K2757j6011M345
562a1546J2939j7413M739J4905k3869K0371L15k1577L2252k4571R036J1699j7999
575a0719J7618j669r903J2879m476q047K4830k5036R320J3776k6003K2003o421
588H152l464O633k017l258N701r235N959Q599k5897K5833q359j0930J9093j3581
602C229r88Q519p106J237Q165k0289J7446r207o100K0878k7750J8179J125k0562
$$ y = [-1938, 15182, 9828, -3362, 19614, -7960, 13412, 16433, -11656, 25560, 2667, -3967, 20658, 3758, -389, 17004, -5632, 3200, 11465, -14435, 15209, -10777, -7969, 13233, -12958, 3803, 2449, -15997, 382, 5497, -16794, 9531, -8059, -14387, 8115, -16052, 1544, -3317, -12308, 1583, -8172, -12707, 4280, -10408, -18311, 6456, -24758, -6905, -2712, -22637, 120, -15891, -11546, 1393, -16020, -11281, 3624, -20245, 126, 441, -21136, 11116, -13455, -4419, 7280, -10719, 6899, 5230, -4673, 8206, 3730, -4317, 20513, -4523, 4797, 18573, -7430, 14573, 8152, 4688, 11321, 9304, 6046, 11747, 2512, 8471, 17070, -8827, 17006, 8647, -2283, 16810, 3229, 2241, 10760, 3654, 4891, 13056, -7233, 10213, 1006, -5094, 15784, -11966, 6213, 7338, -13224]
616a3224K0121k895j5081J6457o663j0005J7893j7630J3118q004q339K4083k0397
629a0566L848R174j3500K361J3383j6327Q631M537j6035J9010j2754L428P426
642B616r311O423p65o175J2012j712j6976K7259j7814k087K2081k3632J0133L538
656E590o240Q208m496k753J1031j4794P299J2392k5723K4623q529j1505J8709
669A3812j2317K045O922r544J271Q169j3667J2895p698n393J5691j8678R474L137
683F119j4219R468O269j6298Q846M256j4878J6288j6331O573N620j3649J5190
696C254q880p252J2702n480p408J6067j7500P099P945k0736K2657j0524l291R307
710b040r960N581L661q358O925K781j5396K1303j0659k835J4272j4056R322J37
$$ y = [-13224, 6897, 4002, -11079, 5378, -1285, -11290, 6603, -11027, 2091, -5913, -14252, 9831, -10566, -6718, 2456, -11044, -8683, 4700, -11627, -2996, 1541, -14494, 4516, -8238, -4810, 2616, -6695, -272, -1037, -7212, 4800, 3088, -13888, 13371, -4443, -6530, 15551, -8081, 2052, 5590, -650, 7558, 3062, 309, 11340, -3454, 3845, 16237, -9486, 15137, 6608, -4897, 13812, 1495, 3540, 10462, 918, 2189, 10358, -3309, 9586, 1888, -3505, 12186, -6492, 2982, 6119, -8100, 1368, 7637, -8661, 185, 4441, -10437, 5851, -10480, -3907, 1713, -11936, 3254, -5626, -12878, -176, -5656, -13064, 3003, -14497, -7398, 547, -20189, 2468, -8056, -11347, -2040, -12000, -6419, -2758, -11116, -4191, -1410, -16806, 4497, -6162, -8997, 5275, -8781, 541, 678]
724F78m552N809J628r789J4600m494p898J6451j5342R755N2o628J2092p688k902
739A772J0262o944k930J5225j8173J0057Q74j1735J8084j4159K253O340o815O04
753D715M790p678P093k6j2119J7915j4830K628R452j5670P354J837n315M74J513
768B133o805R486q056j53R150j6463J2729m586n523Q314m729l526P535n961l511
783i966J3962j5504Q871l8o412J0005r930P740K3p117N302M884j0910Q459J123
798D92r864J3924r160M712K97n253P479m071O89L611q40m086Q754r381N995O592
814I890j4446J2634n389j513K992J41k545J641m93J094J042r169J5032j1500j9
829f08R343j1086N076Q80m880Q43M883o295O350n884k581P804j1361J0102n343
$$ y = [678, -3874, 1935, 3563, -6226, 8374, 3880, -4018, 12433, -2909, 6846, 6898, 270, 12362, 4674, 1772, 12034, 5090, 2160, 17385, -788, 9269, 10143, -1592, 16492, 2333, 4586, 10926, 4111, 4715, 9505, 1827, 8920, 8894, -3225, 14690, -140, 2488, 11940, -3730, 3624, 5461, 146, 620, 2133, -4672, 4814, -3242, -3395, 5755, -10708, 2021, -2565, -8088, 226, -4503, -8029, -494, -6455, -9966, 3996, -11508, -2637, -2675, -9087, 918, -9012, -1272, -1249, -8366, -3064, 1820, -9090, -631, 492, -9372, 4552, -4608, 104, 401, -4852, 2627, -1444, -755, 2856, 2016, -2070, 6684, -2697, 3298, 9890, -4556, 8078, 2689, 1176, 4168, 4309, 1764, 3405, 2912, 4006, 5048, -4121, 10911, -589, -608, 8735, -2351, 2725, 3605, -1275, -432, 4451, -1844, 4506, -1378, -3959, 3845, -7516, 2586, -2757]
844b757l400P946q379l75O046n485l081J0816j0833M693J314l522O809r813O022
859c999j81k911K802K855o754M683K809q027J1994j0317L685L659n645M003J192
874a52k99q99R04k303Q358q653N258M832j1855J1232k213k445L160j734k17M505
890G479l802J259M615j0192J0082o181J038N093q040M862r55k275L940K324q609
905F38P042k120m276P499q162N715m061j545M355l713k542L609k140k796Q189
920E692j0532O069j152o966R502o970j021J942j058p45M204m622L869j012o711
935i511J2475j0797K618M696p308M952o25k033J740K095m169O962n790J987M258
950A550p937P903n194J32M135j003k502N213l367k47P522q997O105j546j450L319
$$ y = [-2757, -6157, 1789, -6590, -6965, -919, -6404, -9485, 1331, -9502, -4809, -3495, -7017, -208, -10021, -3999, -4180, -7091, -4289, -1434, -8188, -3505, -696, -8723, 3271, -7046, -3361, 298, -5347, -1344, -152, -451, -1350, -446, -2749, 5609, -3044, 2214, 7046, -4809, 6423, 4210, 1765, 4925, 3191, 2974, 7479, 3677, 4936, 9551, -641, 9441, 3260, 4298, 9391, 1351, 6213, 5258, 2983, 6923, 9247, 638, 7680, 5560, 1284, 8783, 621, 6336, 2275, 730, 5085, 1372, -1170, 2439, 299, -2497, 5692, -4840, 1229, 77, -6889, 2613, -4357, -5378, -3436, -4494, -5239, -1035, -5657, -1788, -2800, -9511, 2964, -7833, -5215, -519, -7827, -2875, -3500, -5533, -3793, -1698, -5867, 1095, -4695, -2708, 1550, -6387, 1516, -3678, -3546, 589, -414, -2916, 2297, -1070, -1317, 6205, -2792, 3313, 1767, 317, 3636]
966C636n759L691J435k682Q32N034r002P206Q40o948R150r733O616j096k136K210
982C294k046l48J185L08k171N380r759O900n5p379Q908o449P05j603K351k054
998b833K914l629m51M387p625R662p156O04J462k832K083j60j043N76K617p158
1014h582R142m087p98M881o755P159l262J273K030k409Q8L285r45k049O647q289
1030b671O638l051j080O424o711L539q93Q50j367L256k875L934k179j826O741
1045H729p868N453o09k666J926P95j637j322L550m675O143n936K045J565n962
1060d69O292o420K760J547k767k411M207m826P25M569p562N785m588K690o5m279
1076d812N226l457j603K252R61n193N929l695j425M932o371N095l254J268Q23
$$ y = [3636, -2123, 1568, 3003, 321, 1153, 6187, -2815, 4391, 5231, -1717, 7433, -2300, 4316, 3220, 1084, 3294, 1248, 900, 2085, 2393, 222, 5602, -4157, 2743, 2688, -4691, 4217, -2232, -1527, -3130, -779, -2833, 81, -3548, -3999, 388, -7237, 2425, -4731, -4127, -2665, -5497, -3414, -3574, -4617, -4041, -1424, -8582, 560, -3527, -4325, 556, -6199, 960, -2302, -1029, 1001, -1408, -1320, 1965, 1020, -1029, 5618, -2671, 3967, 916, -164, 6260, -451, 3088, 2195, 3045, 1678, 4934, 2059, 5993, 3814, 1988, 8729, 861, 6314, 5705, 3039, 4965, 5760, 4123, 2801, 6351, 1676, 7819, 1883, 3928, 5493, -469, 5823, -597, 2163, 3710, 943, -1468, 2739, -2087, -1362, 3207, -4355, 1430, -3158, -468, -533, -4812, 414, -3043, -4646, -2394, -1433, -6626, -697, -4392, -5817, -885, -7256, -2161, -5415, -4147, -3324]
1091c324l36J38J124j100j273N658p440P472j509m146M029k751J705Q59Q56j789
1107a827K627l793N656j430m738R405q193K990L040m320K349M80k581K474J994
1122D133l820N697o533L007K795n935O828m961J14K525k242j900N545l311k665
1137g23N120o724N309k636l75J677l910K271J161k352r17M272p025M601m88l039
1153c778O650q136L336m07j250K118q40k587L942j553j932O220p602L851J109
1168h59l413N071k824J262j45m03j268M067l484J580K327m952O725l622J213Q10
1184B085j160Q34P71m65QJ960m865O568l704L23K928m962M449r83j098N45J681
1201D915m019M397k230k223N277o665N817k903k308M780k615j747J029N99k404
$$ y = [-3324, -3660, -3522, -2398, -3498, -4771, 887, -6553, 919, -590, -4736, -707, -3458, -1753, -894, -38, -1827, 800, -2993, 2663, 1233, -3505, 5900, -2293, 697, 3737, -583, 1766, 2246, -335, 2139, 4133, 313, 6010, -523, 2484, 5279, -656, 6172, 1211, 1325, 3850, 1608, -292, 5253, 1942, -723, 4397, -2327, 2982, 346, -29, 1648, -2262, 9, 1170, -1182, -2099, 2173, -4852, -251, -739, -3778, 2872, -5264, -1928, -2335, -3585, -1467, -2307, -4894, -952, -2505, -4437, 1783, -5819, -1968, -859, -4272, 799, -2025, -763, -908, -1311, -2579, 1488, -1996, -416, 1911, -3041, 3684, 62, 1275, 2085, 925, 1759, 2530, 2065, 2073, 4033, -832, 5736, 2032, 2355, 5283, 321, 4770, 3787, 2689, 3234, 4915, 896, 5293, 3063, 840, 6117, -548, 5269, 2366, 58, 4838, 2223, 476, 1505, 2104, -300]
1216c00L272m376L160k371l254O285n291J700J52j632p09K089k784J160J162n034
1232f771O066m693J896J373k855K331k479P43J915o03k979N066m260J206L329
1247g15n653N528j853j76J206j152J724n56L70n35K234k657L833k882j64M823
1263C375n366L451L04r39j088K668k338K308p09j174M061n222M408p69j229J128
1279B869q66K65n46K018l022M215m737K785P79m331N018m491J843k85k424J727
1295H17R59l528J329J331m025M930l610N45J029k849K969k305P57P57N51l464
1311c807M123j891j235L257m099L859k771L05J841p51q63N40n57j024L396m090
1327c767M422j031j593M248k884Q95K32K42J108J143j921K054O97l811N080n079
$$ y = [-300, 2972, -1404, 1756, -615, -3869, 2416, -2875, -1175, -1023, -2655, -3364, -1275, -4059, -2899, -1737, -6771, -705, -5398, -3502, -2129, -4984, -2653, -5132, -4389, -2474, -3077, -6056, -990, -5250, -4044, -715, -6368, -840, -2693, -2869, -1663, -2815, -1091, -1647, -1277, -1812, 422, -2235, 1598, -1284, -1448, 3375, -1991, 1460, 1764, 825, -263, 2405, 67, 2375, 1666, 492, 4553, -669, 3739, 2970, 1741, 2869, 2003, 2268, 1722, 3740, 718, 4933, 196, 2981, 3760, -571, 4447, -44, 1799, 1514, -910, 817, 1776, -1752, -423, 908, -3117, 1813, -1797, -1252, -223, -3072, -103, -2408, -1651, -894, -343, -3807, 316, -1575, -2810, 447, -3652, 207, -2564, -2259, -418, -1169, -2032, -1492, -2049, -3073, 323, -3767, 655, -376, -1969, 2279, -605, 290, 522, 764, 1872, 3015, 1094, 3148, 3845, 34, 5114, 35]
1343C5K634P24j903J375n03O53N6j56j870L531l822J487K494l727K402j516K55
1360B149O99j218j135J489j519J49J941l620K345k969J481J238k951J378J4j624
1376b153m62L087m600K096J70k097L079k873K442j602j517J902K06j351J047N71
1392b055k502K916l435K980N63l082K429p28M25L5J813j435J237k666K100J076
1408c29l442M993j426n27N64K38N95N0j10j81K366l112L593k949J087J090j793
1425G07L783k770R93j03l06o40J385p71j327K747l858L731j148l21L18j420J361
1442B361q42N95k147J039o12K49j63p57K647l237K427j912P35o26J99n76n69R8
1460a091j994M384m457K156l22r87J255j116J355j925J962q59P61J15l69J015
$$ y = [35, 2669, 3393, 1490, 2865, 2362, 3015, 3071, 2915, 1045, 4576, 754, 2241, 4735, 1008, 3410, 1894, 2149, 2848, 1630, 495, 1984, 465, 614, 2555, -1065, 1280, -1689, -208, 1030, -1921, -543, -529, -2153, -2615, 472, -4128, -2032, -1862, -3959, -880, -3753, -1311, -2913, -4430, -2528, -2322, -3673, -2626, -2055, -4557, -1641, -5076, -2096, -1533, -4615, -2186, -2914, -2489, -2454, -641, -2076, -839, -3505, -1405, -329, -3771, 1222, -204, -731, -167, 71, 666, 716, 606, 425, 2791, -321, 3272, 323, 1410, 2500, 707, 4490, 1720, 2713, 2610, 2304, 1664, 3049, 2278, 951, 3698, -160, 3571, 2423, 2102, 2420, 1000, 2361, 1519, 2114, -33, 1006, 394, 643, 480, -277, 2370, -867, 1560, -352, 383, -243, -44, -620, -1189, -1091, -3085, 1299, -3158, -1002, -1324, -2311, -1056, -2172, -817, -2742, -780, -1639, -878, -763, -1132, -117]
1476a17k451K434k060K479o97j227K295j596P10J59J307k176J975l02R91L89j875
1493B38K684l050J715M60J41j082P18J033k549K899k933L243k871J031P39k572
1509a56K642k156J775p74O86k343J058j92j557K441k088J043j148L4o3j154P66
1526a186k08K06l77J281k833J744P11k333K026k153J227n23P81j492K177j911
1542b863R4J171k381M168l597J687n12n63Q18J68N52j323J916k114K975q34j62
1559h00J715l655M201p40K7r19N87Q92m98l00L72K291l836L782j580j71J460j337
1577A491J127j007J080p42J416j691Q59O80j811K258l647L177j404j408J844n92
1593A630R7m91K096n135M597l252J292m82j114J520n52q44n72J581j812L024l153
$$ y = [-117, -2568, -134, -2194, 285, -412, -1639, 656, -940, -230, -71, 1236, -940, 1035, 733, 1724, 2113, 238, 2922, -128, 1587, 2047, 2188, 1106, 1824, 2857, 308, 3207, 274, 3517, 646, 1677, 2416, -156, 2486, 330, 2105, 1331, 2017, -326, 732, 540, -1017, 1424, -664, 379, -769, -735, -798, -1952, -1186, -1394, -1188, -1565, -284, -3117, -1373, -662, -2995, -969, -3122, -1895, -2418, -1637, -3129, -952, -2863, -2769, -1598, -3979, 189, -3408, -1721, -2233, -2796, -1978, -1810, -1258, -2581, -665, -2779, 196, -638, -800, 915, -2740, 1461, 721, 748, -171, 416, 1308, 810, 510, 882, 3173, -663, 3119, 1539, 1368, 2828, 1491, 2618, 1611, 2691, 1949, 3365, 1674, 2533, 3213, 1402, 3660, 13, 3190, 1786, 378, 2222, 1630, 1727, 1236, 3332, -1803, 2794, -458, 834, 352, -762, 758, 206, -638, -1210, 371, -1441, 1583, -1570]
1610a570Q6J898l530K700j084J60P97j680J122q91M10K4J228k396K670j712R15
1627h53J141k593K105j520J493p51L38N76q79P5N18J858k532J998p06p64J296
1644H00j032J920j234J039j181P27k68N37R17k674L318k414J693q85K0M34k71
1661A446l23k90J214k567K161r48J74O94k015J688j950P28j337J697j654Q85J20
1678b77j045J433k714K450j834K73k22n64J289J84p54k99M78j825J995k20m91
1695b143J252l013K473p46M9Q62k63J386r33M44j303K340j391K195j852l54K989
1712A992k195j81J044O26j068J208j496J266P98k408L587j605K16J8r89Q64L23
1729B000J9n3J066k403K340j706J94O70j238J705r70O44l21j056l79J862j072
$$ y = [-1570, -1484, 414, -3116, -416, -1500, -1340, -543, -2223, -1101, -1992, -1582, -1558, -330, -2726, -56, -1768, -853, 288, -2305, -200, -1720, -227, -978, -640, -64, -943, -868, -350, 1508, -1024, 974, 268, -496, 800, -232, 1688, 454, 1493, 312, 1039, 771, 1308, 2225, -449, 2869, 455, 2148, 1263, 1283, 1717, 1446, 1123, 833, 2047, -520, 1641, 693, 867, 1561, -454, 1234, -716, 12, -1325, 372, -1282, -397, -277, -1322, 111, -2603, -153, -1987, -1714, -1936, -2500, -1211, -1027, -1781, -2080, -1602, -3427, -1432, -1652, -2143, -891, -3904, -1431, -2177, -2128, -1266, -1529, -143, -1076, -632, -1935, 405, -986, 1209, -643, -997, 1992, -203, -384, 660, 1286, 218, 1426, -70, 1196, 1994, -414, 3173, 1568, 1784, 1802, 813, 1677, 2000, 2019, 1966, 3032, 629, 2969, 1263, 1457, 2127, 889, 2594, 1624, 2268, 1947, 891, 512, 2374, 1302]
1746A302j148K139k706J809k423J061J624p69o03j79o40o04J714k298J845q39
1762g15r75R70j973K432k269J038n19J406j269O35J433l027J967j762J831K63
1778e34j442J780j337P53N8J100j190K73j87O27J870l385L459k386k99J975m94
1795F41L84o78J077j940K415k117K124p38j769K224k070J924j678J261J65l42
1811H83q36P26R77j853J943j708J319k17j37m32j033J037k3k4j316J067j185O51
1829a61l69R5K87k631K548j325R96n82P57q77r29J778k276K467k352J260n85m92
1847b391J904j589J880k035J759j375J348o09L30K70j111J791p67P5O13k23l66
1864d96J45O46M0R75j921K042j089k31K367r27J94j314O93Q87K55n96L08l72l66
$$ y = [1302, 154, 2293, -413, 1396, -1027, 34, 1658, 889, 286, 107, -533, -1137, 577, -1721, 124, -715, -1690, -720, -2693, -261, -2530, -1492, -2011, -605, -1874, -1239, 194, -2833, -866, -2628, -797, -534, -1976, -196, -1533, -780, -722, 378, -812, -539, -726, -99, 1771, -1614, 1845, -541, -840, 1135, 641, 1025, 347, 1424, -516, 1899, -218, 1906, 1168, -601, 1623, -447, 1477, -201, 1060, 1225, 883, 47, 773, 1750, -103, 1840, 132, 1451, 1234, 1097, 665, -368, 669, 646, 622, -694, 373, -812, -161, -530, -435, -148, -2779, -231, -1556, -560, -1142, -385, -1262, -2191, -413, -2689, -222, -2574, -1314, -1899, -2391, -487, -2076, -196, -2231, -472, -1847, -499, -1108, -778, -508, -1619, 172, -595, -520, 93, -130, -496, -351, 295, 335, 1310, -611, 1431, 342, 111, 2478, 1551, 1745, 431, 1124, 2011, 2266, 1670, 1978, 1606, 1240]
1883A240P40j431J775o67k72j78N66k83m01J58m09J553j992J155p06p73J488j530
1901C3O34q55M44j395J552q64L22L67j113P42j489O63M11m34n26L66K57o93O68
1920i10o30Q76j048n0N12m53K90L57K72j167M17r5L25P22j648L373k619J933j734
1939a277J59Q61m35J924j925J434r74O28o90P00O24j246J621j916R49M58J60l59
$$ y = [1240, 1980, 549, 2324, 1657, 1385, 1207, 1773, 1490, 1089, 1247, 838, 2391, 399, 1554, 848, 75, 1563, 33, 667, -188, 256, -1139, 413, -451, -129, 238, -875, -133, -1622, -959, -548, -982, -1508, -1142, -885, -1578, -910, -1540, -664, -1712, -1762, -1250, -1703, -1413, -1056, -784, -1951, -1534, -1629, -1304, -582, -2230, 1143, -1476, 457, -1277, -1118, -257, -692, 1232, -693, 741, -233, 395, -295, 405, 1029, -217, 1404, -512, 437, 895, 1055, 696]
$$ [...]
8191g0
##END NTUPLES=NMR FID
##END=
