##TITLE=1H_SA_18.pure.sub
 CDCl3, 108 sc, 
 27.04.2021
##JCAMPDX= 6.0         $$ Bruker NMR JCAMP-DX V2.0
##DATA TYPE= NMR FID
##DATA CLASS= NTUPLES
##ORIGIN= UXNMR, Bruker Analytische Messtechnik GmbH
##OWNER= root
$$ XWIN-NMR		Version 3.5
$$ Tue Apr 27 15:41:27 2021 Russian Standard Time (UT+4h)  she@DPX200
##.OBSERVE FREQUENCY= 200.131506
##.OBSERVE NUCLEUS= ^1H
##.DELAY= (6, 6)
##.ACQUISITION MODE= SIMULTANEOUS
##.ACQUISITION SCHEME= undefined
##.AVERAGES= 108
##.DIGITISER RES= 18
##SPECTROMETER/DATA SYSTEM= spect
##.PULSE SEQUENCE= zg30
##.SOLVENT NAME= CDCl3
##.SHIFT REFERENCE= (INTERNAL, CDCl3, 0, 15.7039)
##AUDIT TRAIL= $$ (NUMBER, WHEN, WHO, WHERE, WHAT)
$$ ##TITLE= Audit trail, XWIN-NMR		Version 3.5
$$ ##JCAMPDX= 5.01
$$ ##ORIGIN= Bruker BioSpin GmbH
$$ ##OWNER= she
$$ F:/spectra/data/she/nmr/H-F/1/audita.txt
$$ ##AUDIT TRAIL=  $$ (NUMBER, WHEN, WHO, WHERE, WHAT)
(   1,<2021-04-27 15:37:48.29 +0400>,<she>,<DPX200>,
      <continue with go, POWCHK disabled, PULCHK disabled
       configuration hash MD5:
       00 E9 B6 7A A2 85 ED C7 34 08 36 98 17 FE 4E 26
       data hash MD5: 16K
       F7 C9 4F FB 08 2A 25 58 20 C6 34 41 6B 66 F6 A4>)
$$ ##END=
$$ 
$$ hash MD5
$$ DB A5 96 25 13 7B B2 64 A4 DA A7 56 0A 77 F6 FD
##$RELAX= 
##$RELAX= 
##$RELAX= 
##$RELAX= 
##$RELAX= 
##$RELAX= 
$$ Bruker specific parameters
$$ --------------------------
##$DU= <F:/spectra>
##$EXPNO= 1
##$NAME= <H-F>
##$PROCNO= 1
##$TYPE= <nmr>
##$USER= <she>
##$AMP= (0..31)
100 100 100 100 100 100 100 100 100 100 100 100 100 100 100 100 100 100 
100 100 100 100 100 100 100 100 100 100 100 100 100 100 
##$AQSEQ= 0
##$AQ_mod= 1
##$AUNM= <au_zg>
##$AUTOPOS= <>
##$BF1= 200.13
##$BF2= 200.13
##$BF3= 200.13
##$BF4= 200.13
##$BF5= 200.13
##$BF6= 200.13
##$BF7= 200.13
##$BF8= 200.13
##$BYTORDA= 1
##$CFDGTYP= 0
##$CFRGTYP= 5
##$CHEMSTR= <none>
##$CNST= (0..31)
1 1 145 1 1 1 1 1 1 1 1 1 1 1 1 1 1 1 1 1 1 1 1 1 1 1 1 1 1 1 1 1 
##$CPDPRG= <>
##$CPDPRG1= <>
##$CPDPRG2= <>
##$CPDPRG3= <>
##$CPDPRG4= <mlev>
##$CPDPRG5= <mlev>
##$CPDPRG6= <mlev>
##$CPDPRG7= <mlev>
##$CPDPRG8= <mlev>
##$CPDPRGB= <>
##$CPDPRGT= <>
##$D= (0..31)
0 1.2 0 0 0 0 0 0 0 0.06 0 0.03 0 0 0 0 0.0002 0 0 0 0 0 0 0 0 0 0 0 0 
0 0 0 
##$DATE= 1619523036
##$DBL= (0..7)
120 120 120 120 120 120 120 120 
##$DBP= (0..7)
150 150 150 150 150 150 150 150 
##$DBP07= 0
##$DBPNAM0= <>
##$DBPNAM1= <>
##$DBPNAM2= <>
##$DBPNAM3= <>
##$DBPNAM4= <>
##$DBPNAM5= <>
##$DBPNAM6= <>
##$DBPNAM7= <>
##$DBPOAL= (0..7)
0.5 0.5 0.5 0.5 0.5 0.5 0.5 0.5 
##$DBPOFFS= (0..7)
0 0 0 0 0 0 0 0 
##$DE= 6
##$DECBNUC= <off>
##$DECIM= 32
##$DECNUC= <off>
##$DECSTAT= 4
##$DIGMOD= 1
##$DIGTYP= 9
##$DL= (0..7)
0 120 120 120 120 120 120 120 
##$DP= (0..7)
150 150 150 150 150 150 150 150 
##$DP07= 0
##$DPNAME0= <>
##$DPNAME1= <>
##$DPNAME2= <>
##$DPNAME3= <>
##$DPNAME4= <>
##$DPNAME5= <>
##$DPNAME6= <>
##$DPNAME7= <>
##$DPOAL= (0..7)
0.5 0.5 0.5 0.5 0.5 0.5 0.5 0.5 
##$DPOFFS= (0..7)
0 0 0 0 0 0 0 0 
##$DQDMODE= 0
##$DR= 18
##$DS= 0
$$ [...]
##$SUBNAM2= <"">
##$SUBNAM3= <"">
##$SUBNAM4= <"">
##$SUBNAM5= <"">
##$SUBNAM6= <"">
##$SUBNAM7= <"">
##$SUBNAM8= <"">
##$SUBNAM9= <"">
##$SW= 16.9725357007746
##$SWIBOX= (0..15)
0 0 2 0 0 0 0 0 0 0 0 0 0 0 0 0 
##$SW_h= 3396.73913043478
##$TD= 16384
##$TD0= 1
##$TE= 0
##$TE2= 300
##$TE3= 300
##$TEG= 300
##$TL= (0..7)
0 120 120 120 120 120 120 120 
##$TP= (0..7)
150 150 150 150 150 150 150 150 
##$TP07= 0
##$TPNAME0= <>
##$TPNAME1= <>
##$TPNAME2= <>
##$TPNAME3= <>
##$TPNAME4= <>
##$TPNAME5= <>
##$TPNAME6= <>
##$TPNAME7= <>
##$TPOAL= (0..7)
0.5 0.5 0.5 0.5 0.5 0.5 0.5 0.5 
##$TPOFFS= (0..7)
0 0 0 0 0 0 0 0 
##$TUNHIN= 0
##$TUNHOUT= 0
##$TUNXOUT= 0
##$USERA1= <user>
##$USERA2= <user>
##$USERA3= <user>
##$USERA4= <user>
##$USERA5= <user>
##$V9= 5
##$VALIST= <valist>
##$VCLIST= <CCCCCCCCCCCCCCC>
##$VD= 0
##$VDLIST= <DDDDDDDDDDDDDDD>
##$VPLIST= <PPPPPPPPPPPPPPP>
##$VTLIST= <TTTTTTTTTTTTTTT>
##$WBST= 1024
##$WBSW= 4
##$XGAIN= (0..3)
0 0 0 0 
##$XL= 0
##$YL= 0
##$YMAX_a= 266398
##$YMIN_a= -130569
##$ZGOPTNS= <>
##$ZL1= 120
##$ZL2= 120
##$ZL3= 120
##$ZL4= 120
##$ABSF1= 10
##$ABSF2= 0
##$ABSG= 5
##$ABSL= 3
##$ALPHA= 0
##$AQORDER= 0
##$ASSFAC= 0
##$ASSFACI= 0
##$ASSFACX= 0
##$ASSWID= 0
##$AUNMP= <proc_1d>
##$AZFE= 0.1
##$AZFW= 0.1
##$BCFW= 1
##$BC_mod= 2
##$BYTORDP= 1
##$COROFFS= 0
##$CY= 11.3945322036743
##$DATMOD= 1
##$DC= 2
##$DFILT= <>
##$DTYPP= 0
##$F1P= 15.9154993809931
##$F2P= -4.1035820241983
##$FCOR= 0.5
##$FTSIZE= 0
##$FT_mod= 4
##$GAMMA= 1
##$GB= 0.15
##$INTBC= 1
##$INTSCL= 1
##$ISEN= 128
##$LB= 0.24
##$LEV0= 0
##$LPBIN= 0
##$MAXI= 10000
##$MC2= 0
##$MEAN= 0
##$ME_mod= 0
##$MI= 1.114404
##$NCOEF= 0
##$NC_proc= 0
##$NLEV= 6
##$NOISF1= 3.799351
##$NOISF2= 2.8
##$NSP= 1
##$NTH_PI= 0
##$NZP= 0
##$OFFSET= 15.70392
##$PC= 1
##$PHC0= -11123
##$PHC1= 13.00101
##$PH_mod= 1
##$PKNL= yes
##$PPARMOD= 0
##$PSCAL= 0
##$PSIGN= 0
##$REVERSE= no
##$SF= 200.130013532006
##$SI= 16384
##$SIGF1= 3
##$SIGF2= 2
##$SINO= 400
##$SIOLD= 16384
##$SREGLST= <1H.CDCl3>
##$SSB= 0
##$STSI= 0
##$STSR= 0
##$SW_p= 3612.71676300578
##$SYMM= 0
##$S_DEV= 0
##$TDeff= 0
##$TDoff= 0
##$TI= <>
##$TILT= no
##$TM1= 0
##$TM2= 0
##$TOPLEV= 0
##$USERP1= <user>
##$USERP2= <user>
##$USERP3= <user>
##$USERP4= <user>
##$USERP5= <user>
##$WDW= 1
##$XDIM= 8192
##$YMAX_p= 0
##$YMIN_p= 0
$$ End of Bruker specific parameters
$$ ---------------------------------
##NTUPLES= NMR FID
##VAR_NAME=  TIME,          FID/REAL,        FID/IMAG
##SYMBOL=    X,             R,               I
##VAR_TYPE=  INDEPENDENT,   DEPENDENT,       DEPENDENT
##VAR_FORM=  AFFN,          ASDF,            ASDF
##VAR_DIM=   8192,          8192,            8192
##UNITS=     SECONDS,       ARBITRARY UNITS, ARBITRARY UNITS
##FACTOR=    0.0002944,     1,               1
##FIRST=     0,             0,               0
##LAST=      2.4114304,     0,               0
##MIN=       0,             -130569,         0
##MAX=       2.4114304,     266398,          0
$$ Real data points
##PAGE= N=1
##DATA TABLE= (X++(R..R)), XYDATA
$$ [...]
2599e52L26Q98N6j919J016N26L25j445j74P10K22N90j166P37n10l95Q64j41M4
2618A2L58n13L26k14p12J212m07L61j18n87O22n32l2L54J008l60j789J358n35
2637a88J253j456M68N06K35o06K00m09N38j82j150J211l05J08J8n84M56Q0j70
2656B3J71M6q21R45k92o60j39K68L15Kk30J146q85M8O90p64Q04k24m81M98J79
2677F39m13Q2l57M03J31J35j88o12L33m8n03j98J55M99N59n05j70J219j854Q6
2697f07Q46M44m38k89P2N52k54r38O07m23M63o90P82k75l17M28q2O00r73M60M92
2718D60l1l71l53P58k28Q13n37q57L20P0M8pj14O52n56o82K40k38O74J58j57K45
2740C07r63K98N35k33N18j101R11r4k04j90N54n05j43P0M76N80r53O94p00P39
$$ plain form
2599 -552 -226 672 728 -1191 -175 351 676 -769 -943 -233 -11 579 -587 150 -360 -755 109 -32 12
2618 12 370 -143 183 -31 -743 469 62 423 305 -282 340 -192 -224 130 1138 778 -1011 347 -188
2637 -188 1065 -391 77 583 818 212 412 3 541 359 -791 420 115 223 241 -343 113 193 23
2656 23 194 240 -581 364 72 -588 -727 -459 -144 -142 -372 774 -111 -63 627 -137 667 443 -38 460 639
2677 639 226 308 -49 354 485 620 432 -180 153 105 -398 -596 -441 58 617 112 -58 1161 -693 -607
2697 -607 239 683 245 -44 28 580 326 -612 -5 -428 35 -655 127 -148 -465 -37 -119 481 -492 -32 460
2718 460 429 58 -295 463 235 1048 511 -346 -26 44 92 85 -29 623 67 -615 -375 -613 61 219 62 307
2740 307 -656 -358 177 -56 462 -639 272 178 -26 -216 338 -167 -310 -240 236 816 -137 557 -143 596
2760E96j680R40Q65m65j22P17o58j070J038l72o23J336l9o53l6j343J092p9P8
2779d78J31L25P29o84K28L83j168O00m83K14Q57j28l07r15J600o11l03n6M04J92
2799E30n66n3P26l16o06R32k76p70J80K65k95J29n80P24L38q39K91k15M26N93
2819F18k9k88R1k33L3m27r05l10q0J308M43K84j124R49o24M55p06L82K33l42J26
2840a46R06j065N76k22o6m85O99o1j52P9l35L23J49j96L44J08p47P48j10m11L88
2861C24m43L54N3k35K36o53L61j74N37j39m12k89j3J015n28n03K27J402o68K16
2881F68m57N23j99q18L98K56o26L72l10M18n41J41L71l23L66j183R26K66N66q45
2901c1L24m02J332q42n85L41k67P0N41Rn70m30J14L86j87k87J28K15M09N88o38
$$ plain form
2760 596 -1084 -144 721 256 134 851 193 -877 161 -211 -834 502 463 -190 -226 -1569 -477 -556 -478
2779 -478 -347 -22 707 23 251 634 -534 66 -417 -203 654 526 219 -696 904 293 -10 -66 338 530
2799 530 -36 -89 637 321 -285 647 371 -399 -219 46 -249 -120 -700 24 362 -477 -186 -401 25 618
2819 618 589 301 392 159 192 -235 -1140 -1450 -1530 -222 221 505 -619 330 -294 161 -545 -163 70 -272 -146
2840 -146 760 -305 271 49 -17 -502 197 136 -16 63 -272 51 200 4 348 456 -291 457 347 -64 324
2861 324 -119 235 288 53 289 -364 -3 -177 360 221 -191 -480 -493 522 -6 -509 -282 1120 452 668
2881 668 211 734 535 -283 115 371 -255 117 -193 225 -316 -175 196 -127 239 -944 -18 248 814 -31
2901 -31 293 -109 1223 381 -204 137 -130 -60 481 490 -80 -510 -396 -10 -197 -484 -356 -141 268 856 218
2922B18n78l33L57O39l96L45J64k68n00M68n47N31k92K65Q75p78k63L33O8L62
2942F70k49n10M92Q3n86m70j21J162N59j803J77M52k08j84J012Q8j44k97n11J29
2962b59j99R00m21o53R75j22k50l34M88J27l07J73K14M56m94J79m32R84j374P66
2982D17O0o58j89L93N18L96r26K13n71M50K01l2m17o91N30M81N15j257M16K55
3002A04J80k52Q47m35l08p06N13J008r42L5O06k72l33j44J35P04p16n55L32m87
3022f86J440m93m74P38j181Q5O93k65N20q29L56m28K10j20L83k60O77j01l82m6
3042a63J001j037k04J063M69j155J22p19J16p4L04L20%L07l53K2k54K82K21K63
3062E31j68q95P29N84j260J055r72O65j097M68K13J54j28l01M94M2q2J89J147
$$ plain form
2922 218 -360 -693 -336 303 -93 252 416 148 -352 116 -431 100 -192 73 948 170 -93 240 308 670
2942 670 421 -89 403 486 -100 -570 -691 471 1030 -773 -596 -144 -352 -536 476 564 420 123 -388 -259
2962 -259 -458 442 21 -632 343 221 -29 -363 125 252 -55 118 332 788 294 473 41 1025 -349 417
2982 417 477 -181 -370 23 541 937 11 224 -347 103 304 272 -145 -836 -306 175 690 -567 -151 104
3002 104 284 32 879 444 136 -570 -57 951 9 44 650 378 45 -99 36 740 24 -531 -199 -686
3022 -686 754 261 -213 525 -656 -571 122 -143 377 -452 -96 -524 -314 -434 -51 -311 366 265 -117 -163
3042 -163 838 -199 -403 660 1129 -26 96 -623 -507 -581 -277 43 43 350 -3 19 -235 47 268 531
3062 531 363 -532 197 781 -479 576 -396 269 -828 -360 -147 7 -121 -422 72 114 32 221 1368
3081A368j688K4k73P95q99Q47R3K73m8r94P48m06r1O64r89J8P62l25o3j64P44
3102C96j186L67J241j034J20J042j062p5K65R11q80j280J377o64K47P28o20J051
3120I44m62j74J26l75L1l72o0O51J43m35n18q32O99J013n76J34Oj32J97O0N22
3141E90r90K51k26PP69R5j045L28M83o23l58Q17P24j394K07k09Q24n58Q95j212
3161f25J16K82J38N73j44L8P19m50k81n64p49J046r14M84j40J085j333P88P41
3180H10m60J93j107Q68q57O98P36q61L76m04J156j140m26Q60o54Q45l01j46m60
3199b74J23n90L08M63M00j47o75N95O26r95m10N81K37m5o04OM39J81m51K98q5
3220a9K46N2J34l15L3l42J030j163J71k8L98Q67j650R91o04K46m10P92o88N00
$$ plain form
3081 1368 -320 -296 -569 226 -673 174 267 540 492 -502 246 -160 -251 413 -576 -558 204 -121 -184 -348 396
3102 396 -790 -423 818 -216 -96 946 -116 -191 74 985 105 -1175 202 -462 -215 513 -107 944
3120 944 482 308 434 59 90 -282 -342 309 452 17 -501 -1333 -634 379 -197 -63 -57 -189 8 68 590
3141 590 -400 -149 -375 -368 401 496 -549 -221 262 -361 -719 98 822 -572 -365 -574 250 -308 587 -625
3161 -625 -509 -227 -89 484 340 378 1097 647 366 -198 -947 99 -815 -331 -471 614 -719 69 810
3180 810 350 543 -564 304 -553 145 881 20 396 -8 1148 8 -418 442 -212 633 332 186 -274
3199 -274 -151 -741 -433 30 430 283 -392 203 829 -166 -576 5 242 197 -407 -401 38 219 -232 66 -19
3220 -19 227 279 413 98 131 -211 819 -344 -173 -201 197 1064 -586 405 -199 47 -363 429 -259 241
3240B41k09K79q32P24r65J140j038L67n1o39Q11M4q51Q84J88lO2j63Q4P93q13
3261E3p2J63l70N57m85J40K23P95o84O47j752N64N3M35l82k49o7J031j388Q60
3281G2Q93j317R24N0j470L92M41lp07J336L05j864J160K70m98k34k64m7M5P11
3301A95j29M1j27l84l05J311r87K04l91K54N03n7L36r79N08k39R41j214K95m50
3321f74R58n31J073o15r8K21K30r86K24J44r4K32n07R40o79L41p69P13J08o09
3341c78N85L42o05m39Q21q14N52l41j97K75L54J97q71J139k41n7L13j131O90M07
3361F01j597q4J581j171O16K05p10K67n2J211k37J9k97l15k17L7K59o80J179m30
3381A85j31o2M08J86J03l10J9m03j6M36J58r82L43o3M59L40o20o52K79N84L54
$$ plain form
3240 241 32 311 -521 203 -762 378 -660 -293 -344 -983 -172 -128 -979 -95 93 90 152 -11 73 866 53
3261 53 -19 144 -226 331 -154 -14 209 1004 320 967 -785 -221 -168 267 -115 -364 -431 600 -788 72
3281 72 965 -352 572 622 -848 -456 -15 -18 -725 611 916 -948 212 482 -16 -250 -514 -561 -516 195
3301 195 66 107 -20 -404 -709 602 -385 -181 -572 -318 185 128 464 -515 -7 -246 695 -519 -224 -674
3321 -674 284 -247 826 211 113 334 564 -422 -198 -54 -148 84 -423 517 -162 179 -590 123 231 -378
3341 -378 207 549 -56 -495 326 -488 64 -277 -474 -199 155 352 -519 620 379 322 635 -496 194 601
3361 601 -996 -1080 501 -670 -54 151 -559 -292 -344 867 630 649 352 37 -180 -143 116 -564 615 185
3381 185 54 -8 400 586 689 379 398 -5 -21 415 573 -409 -66 -129 330 670 50 -602 -323 261 615
3402F15j98j48L45l97L43r17O83l73K83o19J3M22j32M49j47k78o32Q49M21r48
3422c66M75J88L58o55O62m47M82k05n24R3j48j69R25o7q00O99l41p22J82k85R24
3443B59m52k44P1l14J110j156J201L11r52L69Q43j034j16J296j295j54k55l2L44
3462b00P55p87Q21j129L55R15K62j349N26j47p35L66rp73M43R12M18j525M86J9
3482c76M59M99j633J048J8K07j419R89N88q14J010o64q2L39k25P35R3k39o53J09
3502a1l68J031J07j290J12J01J362o79j318J022m68L98l48J90M40o03N42j049
3520h29J137q9P2n72J37J47K42L08o59m96m4J301l67k60l20L45m47L51P12j456
3540g87J041P2j01n24J03r46J472l20k7N02p70l73N3J011p17P25r08J253l96j188
$$ plain form
3402 615 417 269 614 217 560 -357 326 -47 236 -383 -370 52 -80 369 222 -56 -688 161 582 -366
3422 -366 109 297 655 0 662 215 697 492 -32 61 -87 -256 669 602 -198 501 160 -562 -380 -665 259
3443 259 -193 -437 -366 -680 430 -726 475 786 -166 203 1046 12 -104 1192 -103 -257 -512 -544 -200
3462 -200 555 -232 589 -540 -185 730 992 -357 169 22 -713 -347 -356 -1129 -686 226 644 -881 -395 -376
3482 -376 83 582 -1051 -3 15 222 -1197 -208 380 -434 576 -88 -170 169 -56 679 772 533 -120 -11
3502 -11 -379 652 759 -531 -419 -318 1044 365 -953 69 -399 -1 -349 -159 281 -322 220 -829
3520 -829 308 219 291 -281 -144 3 245 553 -106 -602 -646 655 288 28 -292 53 -394 -43 669 -787
3540 -787 254 326 225 -299 -196 -1142 330 10 -17 485 -285 -658 -605 406 -311 414 -494 759 363 -825
3560h25K30O86k2O70j474J221q1j07k57k26m79K54O67j042J187k23L5l76M65n58
3580b55K21k79J39k05N25rJ070k197R79r8J26M24k36j93R4j67N25n64j5N6o37
3601f96J015M74j579P26o95P64O22r77l2L30L85j73j30k33k4m0j66J267n54Q8
3621C72k99k48P20j188J496j261J213o60O23j147K74Q38j088j58O16n83J565o37
3639D48k15k42p09J079N14l93m70q6P4n7k01JJ24Q34q09L92J13J0j40o08Q80p35
3661a96M49o2m41J117j020K81p79N90p96J001j99J98q28O53o10N86K61L32j75
3680C62j91o00k95J172o79J44k87J56L14O71j318Q68j180R07k48n60O68R23j003
3699a76J130q87j520J158L67L54m97N8Q11o75K4k96N38l81k69J161p03J79j282
$$ plain form
3560 -825 -595 91 69 739 -735 486 405 298 41 -185 -664 -410 257 -785 402 179 214 -162 303 -255
3580 -255 -34 -313 -174 -379 146 137 1207 -990 -11 -109 17 441 205 12 106 -61 464 -100 -115 -59 -696
3601 -696 319 793 -786 -60 -755 9 631 -346 -378 -48 337 164 34 -199 -223 -263 -429 838 284 372
3621 372 73 -175 545 -643 853 -408 805 145 768 -379 -105 733 -355 -513 103 -480 1085 448
3639 448 233 -9 -718 361 875 482 12 -74 0 -57 -258 -257 -133 701 -108 284 397 407 267 -341 539 -196
3661 -196 253 191 -250 867 -153 128 -651 -61 -857 144 -55 143 -685 -32 -642 -56 205 537 362
3680 362 171 -429 -724 448 -231 -87 -374 -218 96 767 -551 317 -863 44 -204 -764 -96 827 -176
3699 -176 954 67 -1453 -295 72 426 -71 -13 798 123 147 -149 389 8 -261 900 197 376 -906
3718i06J079M87k15j63m58J62j147L29J692p46R44m93n35Q44r65j56n42Q21J3
3737D5Q3J22J39q0O5m07O9N89q65N88L36j223n7J098r38N46K15J98p25M3m53P12
3759A00K42l58o34J345n77O13n00n1J80p55J2N43j084P24N03m74M65j048J24J389
3779G59j540Q02P86o60m84R09j353M83Q42r86K11J88Q10j198k83N33j28O53L5
3798C79n56M9Q17q08L1m8O93q81K18k46J059n94j551J797k94J59n4r94R70L6l53
3819a71Q1M39J22l06N36p80J96j59J03r06Q57L03j039R16Mm87O97j33r88Q8Q04
3840A77L1K72j352J055M24O38j142k27j07q64J285o74N53Q06q96M10J28p96N35
3859B56p75K35q8l38J32J038j269J82N52j47m51Q29l41j30J137j267M81M13K05
$$ plain form
3718 -906 173 660 445 282 -176 -14 -1161 -832 860 114 1058 565 30 874 -91 -247 -789 32 45
3737 45 128 250 389 309 374 -33 36 625 -240 348 684 -539 -596 502 -436 110 325 523 -202 -159 -612 100
3759 100 342 -16 -650 695 118 731 231 180 360 -395 -383 160 -924 -200 303 -171 294 -754 -630 759
3779 759 -781 21 807 147 -337 572 -781 -298 544 -442 -231 -43 767 -431 -714 -181 -309 344 379
3798 379 -177 -128 689 -119 -88 -136 557 -324 -106 -352 707 113 -1438 359 65 224 170 -824 146 182 -171
3819 -171 -90 349 471 165 701 -79 117 -42 61 -845 12 315 -724 192 196 -291 406 273 -715 -627 177
3840 177 208 480 -872 183 607 1245 103 -124 -231 -1095 190 -484 69 875 -21 389 517 -279 256
3859 256 -519 -284 -372 -710 -578 460 -809 -627 -75 -222 -673 156 -185 -315 822 -445 36 449 654
3878F54j412L6J557j030n77Q17q1M01n31M9M42l98j27K04J2M78j96p9M72j241
3898e50K67J92N2m3m45J040j10j110J669j404M9O9m78J340o48j48Q98o93J58L23
3918D28l72r91J156J58r59L49j85N72j21l19j56O05q02N80Q77l22q65Q5P70q83
3938c95O1J81J67r7N5J38j62k13p1j7M33j014J69J243K45j136L85k12K88p31N24
3959a59M21n3k69M9k47l04N47l36K19J059l74M78j320k02m7P95k61l78O99L97
3979G14q15n3L38o88M58J8J87J18L25o85J114m48q24M76o42p38R09N60J91l92
3999A23M26p77n93N38M73m90k20k67R00r8n8n40L15J138j028k74N71k56l09K30
4019a96l92O5J399o71k77J58K27p04J21Q2K58n27R01l74p87J057r5q85O60j49
$$ plain form
3878 654 -758 -722 835 -195 -772 45 -36 365 -166 -117 325 -73 -200 4 16 494 298 219 691 -550
3898 -550 -283 -91 -39 -82 -527 513 403 -707 962 -442 -393 -324 -802 538 -110 -258 640 -53 105 428
3918 428 56 -935 221 379 -580 -231 -416 156 35 -284 -440 165 -637 -57 820 498 -367 -282 488 -395
3938 -395 -334 -153 14 -83 -28 110 -52 -265 -336 -353 80 -934 -765 478 723 -413 -28 -240 48 -683 -159
3959 -159 262 209 -60 -11 -258 -562 -15 -351 -132 927 553 1031 -289 -491 -538 257 -4 -382 317 714
3979 714 -101 -154 184 -504 -46 -28 159 277 602 -83 1031 583 -241 235 -407 -1145 -236 324 515 123
3999 123 549 -228 -821 -283 190 -300 -520 -787 113 15 -43 -583 -268 870 -158 -432 139 -117 -426 -196
4019 -196 -588 -523 876 205 -72 86 313 -391 -270 -188 70 -457 444 70 -717 340 245 -640 20 -129
4039a29J31O15p34q2L76l96M19k04M37j23o4o3m56L6J34J17j24L82j48j86n5J326
4061A209j600K22K85l84L48j62J62k82P26r02R00j76o51P37m4P40j585L51J99
4080I3m20O93n56q27J389n15N0N78m60N98m65N0m23R88n69r04J161j226J018q72
4100f19P90L19o55J194j866J394m83p51m11R86j07m83P54o06J129N62p23M25o94
4119A55n34K77L21j03M87l85j135K43J327p15J61n84P13p35K95Q40L8j65p00M93
4139B94L12N01j515K37k86L5p9O66k52K2k07p7k96P01k12P23j675J708o49n18
4159e67J98J00K13J24r36J115m78R4k50R05o05K01m62OJ17m15J237l13m41P9J319
4180A241p25q99O54K45l30K58k18r73Q17j58N75L02j236J127o10M19n06K44j15
$$ plain form
4039 -129 2 617 -117 -199 177 -219 200 -4 433 310 246 183 -273 -237 -103 14 -110 272 124 -62 -117 1209
4061 1209 -391 -169 116 -268 80 -82 80 -202 524 -378 522 346 -305 432 388 1128 -457 -106 93
4080 93 -327 366 -190 -1017 372 -143 -93 485 25 623 158 208 -215 773 204 -700 461 -765 253 -619
4100 -619 171 490 -165 1029 -837 557 74 -677 -1088 -102 -209 -692 62 -544 585 1147 424 849 155
4119 155 -379 -102 219 116 603 218 -917 -674 653 -62 99 -485 228 -507 -212 628 666 501 -199 294
4139 294 606 1107 -408 -171 -457 -422 -501 165 -87 -65 -272 -349 -645 56 -156 567 -1108 600 -49 -567
4159 -567 -369 -269 -56 68 -868 247 -231 -137 -387 518 -87 114 -348 -342 -225 -640 597 284 -157 -78 1241
4180 1241 516 -383 271 516 186 444 226 -747 70 -88 487 789 -447 680 70 489 -17 227 112
4199A12K31o50NK32o40K55N51n38Q94r90L40p56J170m39n77J129o19O48k88o42
4219e72L46k87K99J29O52k1p8j19m8q88M92K45K17M4m73j92J075j852Q14M74J11
4240C68r50N70M0k76kJ37m31M54L37o80K57Q3J19k96R08p19m20P64l48p31J001
4261A85R62j200M23L29j117Q44r63k41N15N73m35p28J750m15o93J164j343Q14
4279D24r93N70K7n3j4N09n02J14J20R4o13J64K79j09L91r86J45k64J286k39P74
4300A124p28m71M3o73J204j61o66J58Q81k10j283L16Q78Q8l86O1q32R50l48k77
4320c32N73J91n77k84Q05l79L40l09L95j56j30K39L77q26o9j11O64j116J635q33
4340I7l0R9k88M04k30M80q73o9L57L21k93k92N23l90n86P06r37P13m20o2M42J142
$$ plain form
4199 112 343 -307 -302 -70 -710 -455 96 -442 452 -538 -198 -954 216 -223 -800 329 -290 358 70 -572
4219 -572 -226 -513 -214 -85 567 546 468 349 301 -587 -95 150 367 411 -62 -254 821 -1031 -217 257 368
4240 368 -582 -12 28 -248 -250 -113 -544 -90 247 -433 -176 -93 26 -270 638 -81 -501 263 -85 -816 185
4261 185 1147 -53 370 699 -418 426 -537 -778 -263 310 -125 -853 897 482 -211 953 -390 424
4279 424 -569 1 28 -25 -39 470 -32 82 202 296 -317 -153 126 17 408 -578 -433 -697 589 350 1124
4300 1124 396 -75 -32 -705 499 338 -328 -170 711 501 -782 -466 412 500 114 175 -657 293 -55 -332
4320 -332 241 432 -145 -429 376 -3 337 28 423 267 137 376 753 -73 -142 -253 411 -705 930 97
4340 97 67 166 -122 282 52 532 -341 -410 -53 268 -25 -317 206 -184 -770 -64 -1001 -288 -708 -770 -328 814
4362H14rm63j191J135j005N28J400k217K68R74R16j073k31l3l30Q34o43o55K36
4381g45P28K86j88J77k26q55P09M09lq4j025J013K38M68j643M35Q91n73j69O85
4401E28j061M4J62j46Q36o43j013J822n57K44p91r6k8O35J69J24M8l14L95j106
4421g48l30J131L85j27o17N8N12q6j88Q6k0P87o43l3m13N08l77K25m01L94o91
4442e88P63p48k82K039j304M19l10o76k44J453j264J212o13L1K41M7j47j86o4
4461b21N25Q56r43qK53p40R70p0m3q79r5O30N38o1m88p02P65o30J024k97k42L86
4483E28r79L83L33L61nQj075J043M63j395K87M81J66j342L91K48P90j004Q24j069
4503e63P59O0k92l24Q23m6o31P31j323J034N01j125m17J278j202J744j568J107
$$ plain form
4362 814 805 342 -849 286 -719 -191 1209 -1008 -740 234 1150 77 -154 -187 -517 317 -326 -981 -745
4381 -745 -17 269 81 258 32 -823 -114 295 292 208 -817 196 434 902 -741 -306 585 12 -157 528
4401 528 -533 -489 -327 -473 363 -280 -1293 529 -28 216 -575 -671 -699 -64 105 229 277 -37 358 -748
4421 -748 -1078 53 438 311 -306 -248 264 178 -10 76 56 843 200 167 -246 262 -115 110 -291 103 -588
4442 -588 175 -573 -855 1184 -120 299 -11 -687 -931 522 -742 470 -143 -112 129 176 29 -157 -221
4461 -221 304 1160 217 209 462 -278 692 622 579 -300 -395 235 773 712 224 -478 287 -343 681 384 142 528
4483 528 -451 -68 265 626 621 629 -446 597 1060 -335 -48 433 599 -743 -352 -104 686 -318 506 -563
4503 -563 196 256 -36 -360 463 417 -214 517 -806 228 729 -396 -813 465 -737 1007 -561 546
4521E46n06K30J352j507l85n69M24O17l05M97k16P05q73O76j390L55n28K92k8
4540f13JK95k0O15j28J09j05J55N13n55J35k01l26r9M1O89r57o5Q5n12N93O38
4562B88l30k04J760k058J062j182R45r0j159J227p07P0R27r62l16J045o13m86
4580g83J037N8r04K44l22P13l50O27P6n66L12j032O08l48R40m36o66J147L44j41
4600E58j529J114J92r2k94P5M64k69k72R36j027L18m64L6N99j195J638J74j269
4619c07J33M62j93LK95k69m74J109j556R18M0n85K86j2J23m59M28K65q06Q5L21
4640a93J10j26M6l02J042m50j022P16J340j808J421r11L25k7L13m47j176J536
4658C87n91j06Q8N01p2o3j39o19J433r71j76J74r85J377j282O02L13J30K22P2
$$ plain form
4521 546 40 270 1622 115 -270 -839 -415 202 -103 394 178 883 10 686 -704 -349 -877 -585 -613
4540 -613 -612 -317 -337 278 150 259 154 309 822 267 402 201 -125 -224 -183 506 -451 -516 -431 -943 -350 288
4562 288 -42 -246 1514 -544 518 -664 281 191 -968 259 -448 -378 549 -413 -729 316 -297 -783
4580 -783 254 312 -592 -348 -670 43 -307 320 396 -170 142 -890 -282 -630 310 -126 -792 355 699 558
4600 558 -971 143 335 243 -51 24 488 219 -53 883 -144 174 -290 -254 345 -850 788 962 -307
4619 -307 -174 288 95 98 393 124 -350 759 -797 121 161 -424 -138 -150 -27 -486 -58 207 -599 -514 -193
4640 -193 -83 -209 -163 -465 577 127 -895 -179 1161 -647 774 -137 188 161 474 27 -1149 387
4658 387 -204 -310 -222 279 207 144 5 -614 819 -152 -328 -154 -1139 238 -1044 -442 -129 1 223 295
4678B95j016P79O13j223L16K64l01M40J02j058J059p69N55L18n31J67j64Kr1K25
4698a8N32o57L61k14m27J112p92m06K02O76P23n30m09N5j91Q39j028M29l5p51
4718e29r5Q10l29R58j58m53k18J90k23l19J012j024m17J325p76n8l74L16k24R43
4738C57j29r09N62O39k24j02q2p24J141J04q92J25R6P44q32L66k20K11j51M5r87
4759h62P61P6M55M31j519J712m18j22N62j020n83J087K81l04l80k66j55P55l40
4778A51KQ7N19o54n15Q69o11J86n92Q74o49N14m50M55L37j201O66j70n51P27R5
4799H9o48M48kk75o33M31K48l24N92o38L22K03K11p24J083O7o87K33j82m21n41
4820a148J392l57m84P22O9M55p81k65J480j370m13O13K12K59m51K28n71R62o87
$$ plain form
4678 295 -721 58 671 -552 -236 28 -273 167 269 -789 270 -499 56 374 -157 10 -154 -152 -243 -18
4698 -18 514 -143 218 4 -423 689 -103 -509 -307 369 1092 562 153 208 17 856 -172 257 222 -529
4718 -529 -624 186 -143 815 657 204 -14 176 -47 -366 646 -378 -795 530 -246 -304 -678 -362 -586 357
4738 357 228 -681 -119 520 296 194 112 -612 529 633 -259 -134 -38 706 -126 240 20 231 80 125 -862
4759 -862 -101 -25 430 861 -658 1054 636 514 1076 56 -527 560 841 537 157 -109 -264 491 151
4778 151 153 240 759 105 -410 459 -152 34 -558 316 -333 181 -269 186 523 -678 -12 -182 -733 -6 89
4799 89 -559 -111 -113 -388 -1021 -590 -342 -666 -74 -712 -390 -187 24 -700 383 450 -237 -4 -186 -607 -1148
4820 -1148 244 -113 -597 125 194 649 -132 -397 1083 -287 -700 -87 125 384 -67 161 -410 552 -135
4839a35Q7o20J71L55N79p33L78o93N82q26P70K30N13n56j58L09q00N83P1m83K50
4860a26l11O18j45K55p05P59N03j104P37j117J411j537R76l94q43J412r68K79
4878c00L73J091j013L54J4j68j07o14L33p32J677j087N82p23O07J25m85M27n63
4897b09j91K14K68N09n64n77k85J011K22l25m21Q2N91l27M22J29k59m1p73K85
4917b39M86n36P83l9m76O58n69p69L03Q69o7m71J34M71m41K4l67K44L22n55J071
4938H36j271K95j95l56Q86l82l9P39j124O89J30j59l41n8Q44o37p73J155k20L46
4958C65o6k07L28q68J38l87R65L86m06O5j46L0k06m28Q92j394R47l55J114o87
4978H0m21M35k91Q15l6j121J85N52M6q07J06j73K087j367l74l74J194J33j464
$$ plain form
4839 -135 -48 -668 -497 -142 437 -296 82 -611 -29 -855 -85 145 658 102 -56 253 -547 36 107 -376 -126
4860 -126 -437 181 36 291 -414 345 848 -256 481 -636 775 -762 214 -180 -1023 389 -579 -300
4878 -300 73 1164 151 505 519 351 244 -370 -37 -769 908 -179 403 -320 287 412 -73 354 -209
4897 -209 -400 -186 82 591 27 -550 -835 176 398 73 -348 -266 325 -2 420 549 290 249 -524 -239
4917 -239 247 -289 494 455 -21 637 68 -701 -398 471 404 -67 67 538 97 121 -246 -2 320 -235 836
4938 836 -435 -140 -335 -691 195 -187 -226 513 -611 78 208 49 -292 -350 494 -143 -916 239 19 365
4958 365 299 92 420 -448 -310 -697 268 654 248 313 167 197 -9 -437 455 -939 8 -347 767 80
4978 80 -341 94 -197 618 582 -539 -354 198 244 -563 -457 -630 1457 90 -284 -658 536 669 -795
4997g95O31O24r52J028q86L03J32j93J68p63R31k92K66O81p56l17n36J476n54
5016A96J032r39m72Q10m31j62k10K11J46J92j183P10N02Q45r60L06j129N20k54
5035b70j67P68J80J1n16lk76P92K21o7l82r28J109j400P29R4J93J22M7k46L5J33
5057A79m77r0N33O95n23j168J062k99l19N74l20j07L0K90Mj89N9K93l20L59r50
5078f84J086r08L61k93m5M1N74j55m12J292j716M61J67Q1j251J523n31L31m18
5097d96K99J216o73n41j42L40r20P75Q94j219K65R06j076N36O30j38j13p58o20
5116h35J097J03N84l12q87l46M82K51j333J166M06r0PJ35m07K34l27N7L18j42
5136A61K46L65m70q2m02k83n48J461p75p9O31k37k32Q72m76j55J064j129J02j91
$$ plain form
4997 -795 -164 460 -492 536 -350 -47 85 -108 60 -703 228 -64 202 883 127 -190 -726 750 196
5016 196 1228 289 -183 627 196 34 -176 35 181 373 -810 -100 402 1247 287 593 -536 -16 -270
5035 -270 -437 331 511 522 6 3 -273 519 740 673 291 -637 472 -928 -199 -105 88 210 257 11 46 179
5057 179 -298 -388 145 840 317 -851 211 -88 -407 167 -153 -260 -230 60 64 -125 -66 227 -93 266 -684
5078 -684 402 -506 -145 -438 -483 -442 132 -23 -435 857 -859 -398 -231 -150 -1401 122 -409 -78 -496
5097 -496 -197 1019 346 -195 -337 3 -917 -142 752 -467 -202 704 -372 164 794 656 543 -215 -835
5116 -835 262 365 949 637 -250 -596 -114 137 -1196 -30 376 286 293 428 21 255 -72 -15 303 161
5136 161 407 772 302 220 -182 -465 -1013 448 -327 -406 225 -12 -244 628 152 -3 1061 -68 34 -157
5156a57m1m61Q47k46m96J138j658J15J324Q1K42j497O81J02k7P51J94j116R42
5175G18o67j96J61O0j57j97J18N11q18J03J104j57l87q3k28O34Kj387J444m19
5195A59p14P48J71O9o97m5n56O75m88K42K74k94P34K06K57j575Q97J36L37j299
5215g63J457m90m8k48L58J80p43O91N4p41q1J157j629M79l07M31N61J3p69j99
5235f37J538j447k20J060r5m24k40J20J57P04k38q80j76N75N97m98L47M08K54
5254I05R6j126l9Q57n19M8q74Q80k93M99oq43j02K11p8N17R48r48K28K95m4p06
5276i4L17j263Q58p2n28K10Q16l32O22k97L81R45k068J359j076P37j794N04J036
5295B61L01o77j30j40O30j0K77l85L13o90Q68j787R75O90o45J31KO18j255l42
$$ plain form
5156 -157 -198 -659 188 -58 -554 584 -1074 -959 365 446 688 -809 -128 -26 -53 698 892 -224 718
5175 718 51 -145 16 76 -81 -278 -160 351 -467 -364 740 583 196 113 -115 519 521 -866 578 159
5195 159 -555 193 364 433 -264 -309 -865 -190 -678 -436 -162 -456 278 484 741 -834 63 199 536 -763
5215 -763 694 204 156 -92 266 446 -297 394 448 -293 -374 783 -846 -367 -674 -243 318 331 -438 -637
5235 -637 901 -546 -766 294 199 -225 -465 -345 -188 516 278 -602 -778 -203 394 -104 243 651 905
5254 905 1001 -125 -164 693 174 222 -652 228 -65 434 428 -415 -517 -306 -384 133 1081 133 361 656 612 -94
5276 -94 223 -1040 -182 -254 -782 -572 244 -88 534 237 618 1563 -505 854 -222 515 -1279 -775 261
5295 261 562 -115 -245 -385 245 235 512 127 440 -250 618 -1169 -194 496 -149 -18 -16 602 -653 -995
5315i95O11L14m60M11m6j91j31M25l9N68q55m0k48J111n17M72N36j445P83Jm27
5336a62k36J042l94L2r79R53q23l12O20r4R08j01m02o0R09j561J171n55Q61j029
5356b12PJ94J15m60O34o44j17P00L47M42j084Q29j492J231MJ4p55M87r41K45J94
5377b62n8M29N79j264R23o15p5J026o5m44q24J437o96k49J310j422R9N86k19j678
5397a482J665m52K92O8K8m71L52l72j04P76j52o00L51J040r75M94n24J96j86k40
5417b96R9N69j61J61p86O83K36l84n97n12J359l91n28M76M18l42k14k4K12K25
5437B03L76p84p10O78J67Q4M77q69L68o9L68K74q83K88Q1l03O13j51O51j634J116
5458C41p04N66j145L75L65j51k43k1L48l26K68J05j73J279j524R90N5J37j78m74
$$ plain form
5315 -995 -384 -70 -530 -119 -165 -356 -487 -62 -101 467 -388 -428 -676 435 -82 390 926 -519 264 265 -162
5336 -162 -398 644 250 282 -697 256 -567 -879 -259 -353 555 454 52 -8 901 -660 511 -44 817 -212
5356 -212 -205 -11 104 -356 278 -366 -483 217 564 1006 -78 751 -741 490 494 508 -247 240 -701 -456 -262
5377 -262 -320 109 688 -576 347 -268 -343 683 618 174 -650 787 91 -158 1152 -270 -171 415 196 -1482
5397 -1482 183 -269 23 91 119 -352 0 -372 -476 300 148 -452 -101 939 -36 458 -66 130 -56 -296
5417 -296 -197 372 211 372 -414 269 505 121 -476 -988 371 -20 -548 -72 346 4 -210 -234 -22 203
5437 203 579 -205 -915 -237 -70 14 491 -378 -10 -79 289 563 -320 -32 49 -254 359 208 859 -775 341
5458 341 -363 203 -942 -567 -202 -353 -596 -617 -269 -595 -327 -222 -395 884 -640 350 405 542 364 -110
5478a10l8lk57K68j63k62n85R49n48K37J315q44JN77l70p59M64Q26r40K91N4j04
5500ak53M25m79l04J30M54m00Q94r44M35J8k07m45K79O9P25m64N45j52l54L73
5521C44j095P99K67j92k43R8p83J836j999J518m90K05q64P31n24R00q36k26N11
5540d3r7o26J376p14R08j160j85N14q7P09l87M69l50p32R52q9m70J14j121J259
5560B40l1J91J32P6j200L29O03m38L14p34n8L94N48l39K26p55J141l77m70M28
5580B20J55j58n7O29m15J37p21J60O58n49M79O8o24P78n33o75K45q89J411j201
5600h82Q28K55m16j05M17j66K25mJ81q34N86N95j267K29l11M25jL96m64M66N12
5621F65l97q3P99j307J143p54k39n06J005q08N15M08K18q11Q38r7r92O71l92R27
$$ plain form
5478 -110 -148 -151 -408 -140 -303 -565 -1150 -201 -749 -512 803 -41 -40 537 167 -592 -128 698 -242 49 103 -1
5500 -1 -254 171 -308 -612 -482 -28 -428 466 -478 -43 -25 -232 -677 -398 -329 396 -68 477 325 -29 344
5521 344 -751 48 315 123 -120 -22 -805 1031 -968 550 60 265 -599 132 -392 508 -328 -554 -43
5540 -43 -140 -766 610 -104 804 -356 -541 -27 -114 595 208 677 327 -405 547 458 -12 102 -1019 240
5560 240 209 400 532 608 -592 -263 340 -98 216 -518 -576 -182 366 27 253 -502 639 262 -208 220
5580 220 375 217 160 789 374 511 -210 -50 608 59 538 606 -18 760 227 -448 -203 -1092 319 -882
5600 -882 -54 201 -215 -320 97 -69 156 152 333 -501 85 680 -587 -358 -669 -244 -245 151 -313 153 665
5621 665 268 185 984 -323 820 66 -173 -679 326 -482 33 441 659 -152 686 589 -403 268 -124 803
5641H03j044L63j20l66M52N93q81l06J17M51r4R12k84o30o60O47l08N50l63M80
5661C12Ro60N52m31M15k51K49q17O25m50P43J00j054P25m12j36J90J085p29j9
5681D6p1M23p19k83P75l25j51R24L74j048m25N00O75n77J33j07n09P76k63m64
5701c16P4N62J66r74P5J568m30l5l65m15M9L54o44K54J68J18l12MK02o90R73N03
5723H89j316P20j086L87r4k30J029n29N57J68p29J094q94q3Q4K73l9k8l65J57
5743c5r60J472j096M4qK51J89j73P22J81j83QL03n19k2l27m3K55K16o86R74q56
5765b93L98l7O43l73j14m47j26K48j059O46J028o66J2O55q66K65O31m38O10j064
5785c47J211j136R18j62n51K26K96Qm83Q10j753J503m95L01l95m7K31j69l44j57
$$ plain form
5641 803 -241 122 2 -364 88 681 -200 -506 -389 62 -32 880 596 -34 -694 -47 -355 195 -168 312
5661 312 321 -339 213 -218 197 -54 195 -622 3 -447 296 396 -658 67 -345 -481 -291 794 65 46
5681 46 -25 398 -321 -604 171 -154 -305 619 993 -55 -480 20 695 118 251 144 -365 411 148 -316
5701 -316 -242 320 486 -488 -413 1155 725 690 325 -90 -41 313 -331 -77 91 209 -103 -99 103 -587 386 889
5723 889 -427 293 -793 -406 -500 -730 299 -230 327 495 -234 860 -34 -117 -33 240 201 173 -192 -35
5743 -35 -995 477 -619 -575 -583 -332 -143 -316 406 587 404 412 715 196 174 -153 -196 59 275 -411 563 -293
5765 -293 105 68 711 338 224 -223 -349 -101 -1160 -514 514 -152 -140 515 -351 -86 545 107 717 -347
5785 -347 864 -272 646 484 -67 159 455 463 -20 790 -963 540 45 346 -49 -96 135 -34 -378 -535
5805e35J210o66P93p04m63j08L80o80K09L9P57N1j121R77L03j196R49O98k13p21
5825d1K36N78n59j115P82j427K038K59p24J50K3o56N6J95J73L20R31p72p57P76
5845D66o45j56L87n19N65J93p2K06p81P50o20k85J577j656N85nm29J506j797O83
5865d7J9k59J43M82k22o40P45L16j47q52O53O00r10L62j640J336L49M37r40L17
5885A02r39P01m51M87J55K26J42J47m68n00o5M87L57J8m57n61J442n67p35k44
5905g23J56J197j042k79P75m48L24r4k0j08J049r55K54n50k03P71M62o56n7M82
5925C35p47m47J209m76O78M15j050J54l65J24m26J249j002j72K63m01L53N09j270
5944a067N13r5k70J230o53P2O38o5k4p35M26m21Q22k77K24L60m92L21k00n90L18
$$ plain form
5805 -535 675 9 802 98 -365 -473 -93 -773 -564 -525 232 283 -838 139 442 -754 195 893 680 -41
5825 -41 195 773 214 -901 -119 -1546 492 751 27 177 200 -456 -400 -205 -32 288 1219 447 -310 466
5845 466 -179 -335 52 -467 98 291 219 425 -356 394 -226 -511 1066 -590 -5 -10 -439 1067 -730 -47
5865 -47 -28 -287 -144 338 116 -524 221 537 390 -462 191 791 -119 243 -1397 -61 288 725 -215 102
5885 102 -837 -136 -587 -100 55 281 423 570 102 -398 -463 24 381 399 -58 -619 823 256 -479 -723
5905 -723 -567 630 -412 -691 84 -364 -40 -134 -154 -262 787 -168 86 -464 -667 104 566 -90 -147 335
5925 335 -412 -859 350 -126 552 967 -83 71 -294 -170 -596 653 -349 -521 -258 -659 -306 203 -1067
5944 -1067 -554 -649 -919 311 -342 -270 368 303 279 -456 -30 -451 371 94 318 678 186 507 307 -283 35
5965C5J25p93R34k53J1O12k47K18j411P18J439j201K95r5K3q9n84N43l58Q7L06
5986C15K59M6M79p99j037N25M64l97N28N69p38K78o09n23O27n55L18J84J36k04
6006a34M17o69J70n82N52j43N75N89p31n84L84r16J625k82p54P05k52Q83o7o11
6026A75J12k12j00n85O37K71k29p83Q05J15r28O13l28K02O22j011J327j491K32
6045e56O26n71K62j89O07L49n56k28N48O17o54N77j028N11l66J41j05l35L13j173
6065a210P10J081n43R56j088p10J436n65m87M89M02q46M21N97j226J059K69k066
6083a321P05J131j184n35K291j504P51Q6J47q83n41J393j076N62j97O43l00n99
6101d31J50M94l1j37P3N31O16l24j020K00R84j714J075p75K9J251q35N3r99J168
$$ plain form
5965 35 160 -633 301 48 59 671 424 642 -769 -51 1388 187 482 387 410 321 -263 280 -78 9 315
5986 315 574 620 1099 300 -737 -212 252 -145 383 952 214 492 -117 -640 -13 -568 -250 -66 70 -134
6006 -134 283 -386 -216 -798 -246 -389 186 775 44 -540 -156 -1072 553 271 -483 222 -30 853 786 175
6026 175 287 75 -25 -610 27 298 69 -714 91 206 -722 -109 -437 -235 387 -624 703 -788 -556
6045 -556 70 -501 -239 -428 179 528 -28 -256 292 909 255 832 -196 315 -51 90 -15 -350 -37 -1210
6065 -1210 -500 581 38 994 -94 -804 632 67 -420 69 471 -375 46 643 -583 476 745 -1321
6083 -1321 -616 515 -669 -1204 1087 -417 334 420 567 -316 -857 536 -540 22 -175 468 168 -431
6101 -431 -281 213 182 45 118 649 1265 941 -79 121 1105 -609 466 -309 -280 971 136 189 -810 358
6121C58J034j773j78J218q90k17R51p47n39J364l42j033L80n0Q2P32J15q03r2
6140d30j99O55M1Q87r70O77j124O02j50j92L24K8m32L36M15j054R43m84M21j51
6160A43l22P26j072L77O40q18m35J010o88M09m69K03M17m05M63p29R64k26J5r91
6180g88M13k67P11k45J314j496L03K62L43j017Q98j53Q6P42o18m35K43n5m4L8
6200B35m41m8m92R35n68K40J58K8Q71j022K87n39Q48o80J84L9k07M63k6n28m30
6221f93J3N97j82J93L18p09M37q93P88M97m03k53P0K37J26K38j061j94K66P29
6241A21K42M51q26J6k96K70J50l76o54J038R6L90p03k39k31K52N34o41j55J007
6261D46l61n6K28j8o08P43o9p45P60o75m47K57O37R91j463j1l78J226j071j55
$$ plain form
6121 358 1392 -381 -559 659 -231 -448 503 -244 -783 581 239 -794 -414 -464 -382 350 465 -338 -430
6140 -430 -629 26 67 954 -16 661 -463 139 -11 -203 121 149 -283 53 468 -586 357 -127 294 143
6160 143 -179 547 -525 -148 492 -326 -761 249 -439 -30 -499 -296 121 -284 179 -550 414 188 203 -788
6180 -788 -375 -642 69 -176 1138 -358 -55 207 550 -467 431 278 364 1106 488 53 296 241 197 235
6200 235 -206 -254 -746 189 -379 -139 19 47 918 -104 183 -356 492 -188 -4 35 -172 291 265 -263 -693
6221 -693 -680 -83 -265 -72 246 -463 -26 -919 -131 366 -37 -290 -220 17 143 381 -680 -874 -608 121
6241 121 363 814 -12 4 -292 -22 128 -248 -902 136 232 622 -81 -320 -551 -299 235 -406 -561 446
6261 446 85 29 257 239 -369 374 305 -440 320 -355 -802 -545 92 1083 -380 -391 -769 457 -614 -769
6281g69M61k90P69j5l17K10R77j305R0m83k74R05L85m8p4M63r86r1J430j629P40
6302A49k21N46l11j5l1n55J45J70j94l58J316j151o8O37k19L62J05o9l36K20J36
6323B58k80o1M25q27J587j177l10L91Q14q67j38j45J83O7r71Q54P39o79j13J093
6343H43o00j400J650j58j17q47O75q65m1N47O72j48l10r09R48M20n7j09k62J52
6363H4PM96k77l36L95l59m5k24l73P12k20J186o94K16o52J69p68m68Q94n97M50
6384d04n6o13J538j04p49l59M50J2M85k77M88m28k18N51l56r22Q16l53J075J7
6404E93p29O26j147M13L03m5N33m80n42n1M0K22O3q4k6J032l18k67j76O85k76
6425C69n87P09n32p41J864j129q2K1Q11r30L61p28L32M62j716K847j044p66Q26
$$ plain form
6281 -769 -308 -598 171 156 -161 49 1026 -279 -189 -672 -946 -41 344 296 222 685 -301 -392 1038 -591 149
6302 149 -72 474 163 148 117 -438 -293 -123 -317 -675 641 -510 -578 59 -160 202 307 238 -98 122 258
6323 258 -22 -83 342 -485 1102 -75 -385 6 820 -47 -185 -330 -147 -80 -1051 -197 542 -137 -250 843
6343 843 243 -1157 493 335 218 -629 46 -819 -860 -313 359 211 -99 -1008 -60 360 303 194 -68 84
6363 84 91 587 310 -26 369 10 -35 -259 -632 80 -140 1046 352 568 -84 85 -683 -1151 -257 -854 -404
6384 -404 -460 -1073 465 361 -388 -747 -297 -285 200 -77 411 -17 -235 316 -40 -962 -146 -499 576 593
6404 593 -136 490 -657 -244 59 14 547 67 -475 -526 -486 -264 -201 -285 -311 721 403 136 -40 645 369
6425 369 -218 491 -41 -782 1082 -47 -129 -108 703 -227 134 -594 -262 200 -1516 1331 287 -479 347
6444C47j65n04J65n56J808j490J089r04N89j203J335k2M00j000o46N74L74j84
6462GM71q53N47q9j93K84k52L55O35m56m74p6O94k44n70R91p67M91M63p06l62
6483a04r02R60p86J054o70K96m96k60J082j194J552n88l17L90q82J494l55o95
6501d21J89L62J11M3j37K3l28p95J055K99j026L99Q10q03L81R84j040L71j090
6520f13o9O66J5l24J074j441M29Q26q41J065n06o84O56p2K64p88K4K70p34M51
6540c32l32n08P59J318q34m54J21m57O50Q22p18K24n66Pj18M89m6J84p32j55O22
6561e6j3K43m90L2j93N41o88J175o81J06J66K53k00k34n67R39o20J13J025l89
6581D62mq8J23j093Q32O5l52o7n4N49J69k69M53m55o24O04n94Q40l62k47l15J384
$$ plain form
6444 347 182 -322 -157 -713 1095 -395 694 -210 379 -824 511 489 889 -111 -757 -183 191 7
6462 7 478 -375 172 83 -110 174 -78 277 912 456 -18 -94 600 356 -214 777 10 501 964 258 -104
6483 -104 -1006 -46 -832 222 -448 -152 -648 -908 174 -1020 532 -56 -373 17 -865 629 274 -421
6501 -421 -232 130 241 284 147 170 -158 -953 102 401 -625 -226 584 -219 162 1146 106 477 -613
6520 -613 -682 -16 -1 -325 749 -692 -263 563 -278 787 281 -403 253 181 445 -343 -319 -49 -783 -332
6540 -332 -664 -1172 -413 905 71 -383 -262 -719 -69 753 35 259 -307 -300 -418 71 25 209 -523 -678 -56
6561 -56 -69 174 -316 -284 -477 64 -624 551 -130 -24 142 395 195 -39 -606 333 -287 -174 851 462
6581 462 458 370 493 -600 232 297 -55 -122 -176 373 542 273 726 271 -353 251 -343 497 135 -112 -427 957
6603I57j229l84Q56m71M78o62o4N24J474j659k60j06L46K35r71J294q74P87m30
6622a59k50J44K12J95J62j20n54M54q04J095J8Q6j192K71J178r74M00o96J198
6641F64m80m40n32J233k06L77j96P13q82K39j337Q83n15m88J229l68R13R1q25
6660G3K72m47o74L75J709j231M08j074Q20m9m71J527j444L43m83L37m80J011o15
6679i3k04m44J360n25n08O5k05L1R65j005J023q49O86P85j018o83j67J297K22
6698G33j587J194L72r29Q7J93Q9p25P70o35R71n76M87r00N1J21N12j49j325J680
6718D34n08P65j133Q52r90O9P31N38j22p67P78j103P42q4p18P53L7k05j062J056
6738F3k12j10L41k45R96r45J48l82L25m04J14P08n16M55k51P52j335Q02J31n00
$$ plain form
6603 957 -272 -656 200 -271 207 -455 -519 5 1479 -180 -440 -546 -200 35 -936 358 -516 271 -159
6622 -159 -409 -265 -53 142 304 184 -370 84 -720 375 393 479 -713 -442 736 -238 162 -534 664
6641 664 184 -256 -788 445 239 616 420 1133 251 490 -847 36 -479 -967 262 -106 807 898 73
6660 73 345 -102 -776 -401 1308 77 485 -589 231 182 -289 1238 -206 137 -346 -9 -489 522 -93
6679 -93 -297 -741 619 94 -414 -349 -554 -523 442 -563 460 -389 297 1082 64 -619 -786 511 733
6698 733 -854 340 712 -217 -130 63 152 -573 197 -438 533 -43 444 -456 -405 -284 228 79 -1246 434
6718 434 -74 691 -442 410 -580 -511 220 758 636 -131 647 -456 286 202 -516 237 274 69 -993 63
6738 63 -149 -259 82 -163 833 -112 36 -346 -21 -425 -311 397 -119 336 85 837 -498 304 435 -65
6758f5L2j49J84m61Q44j90M84q32N23M95k18m07j343K16O15N89o95O85MJ06M04
6779H21q37m49P69q37J410q10q18P74k0l90M89N91j486J415r06Q30j053M37N23
6798D53Q1j154K57M34m05p5l40R48q85Q84m49O77p19J428j808R98r95j71Q34J96
6818A89m4M66m67O4K1j537J875p42J110k7j036Q89j307M63L35p32M19N91j92m06
6838f8r2L16l75L18l03l38R89p25J096j138K82K07K04n99J34P4O16k58m22k1j06
6859b09Q83j439J143m03J62m90Q94n55M80M95o11K58n73n56m0L31R06n99K28k85
6879B0M16Q56j153o54l31m2R05N29j207J033m40m0p5M1m11P66k56K55l29N7Q18
6900G58r26K93k14R12r83N14p48O74p40J3J54K51l70j51J030o78m12K74M70q11
$$ plain form
6758 -65 -33 -182 2 -459 385 195 679 -153 370 865 647 240 -1103 -887 -272 317 -378 307 311 417 821
6779 821 -16 -465 304 -533 877 67 -751 23 3 -387 102 693 -793 622 -284 546 -507 -70 453
6798 453 534 -620 -363 71 -334 -409 -749 199 -686 198 -251 426 -293 1135 -673 325 -670 -841 -7 189
6818 189 145 611 144 208 229 -1308 567 -175 935 908 -128 761 -546 -83 252 -480 -61 530 338 -68
6838 -68 -160 156 -219 99 -204 -542 447 -278 818 -320 -38 169 373 -226 -92 -18 598 340 -82 -103 -209
6859 -209 674 -765 378 -25 137 -353 541 -14 466 961 350 608 35 -521 -561 -230 676 77 305 20
6879 20 436 1292 139 -515 -846 -888 17 546 -661 372 -68 -108 -183 -142 -553 213 -43 212 -117 -60 758
6900 758 -168 125 -89 823 -160 354 -394 280 -460 -447 -293 -42 -412 -563 467 -211 -623 -349 121 -690
6920f90Q65k08O2L19o20p88Q84K8K11O71j326K56q3m74K006j727M5R13j64K30
6940D10j011J289m45r71k24Q09K88k67O09k08k84l04l20J192j053P72o40O6J274
6959I82r64P49q75K06q49J059m00o71P94J33o67P3M78J047j557P99K80n04K07
6978C20r87J210j74j254J442Rk66q5J72j098N39J01j87N56q54M73P4n01N28L72
6998C90p78L1P89q07N90k01p1M46j20M51j700Q35L42q39R49n63N70K46k83m98
7018b21L12j198J237J030j445M10r05M24K37M69j111J606j342Q40o15N55L59J97
7036H39n8j337m59P66J46J15M69k07R78r34n1q65m0Q25J17m82K02J174j384j08
7056b94n05J045o62Q52n05M6R7k33j22j22J091q92J099j448R15m27M6O33o98J25
$$ plain form
6920 -690 175 -33 29 348 -272 -1060 -176 -148 63 734 -592 -336 -419 -893 1113 -614 -569 344 180 410
6940 410 -601 688 243 -728 -952 -143 145 -122 487 279 -5 -309 -629 563 -490 282 -358 -292 982
6959 982 18 767 -108 98 -751 308 -92 -763 31 164 -503 -430 48 1095 -462 337 617 113 320
6978 320 -667 543 369 -885 557 566 300 215 387 -711 -172 -71 -258 298 -556 -83 -9 -510 18 390
6998 390 -388 -357 432 -375 215 14 -57 389 269 720 -980 -145 197 -642 307 -256 314 560 277 -221
7018 -221 91 -1107 130 1160 -285 125 -780 -356 -119 350 -761 845 -497 343 -272 283 642 839
7036 839 781 -556 -1015 -249 -103 12 481 274 1252 318 267 -598 -638 187 304 -178 24 1198 -186 -294
7056 -294 -799 246 -416 436 -69 -23 74 -159 -281 -403 688 -204 895 -553 362 -65 -19 614 -84 41
7076D1k8j80M34j084J087N5M6p78J73o3K74J74r85L0J227j089J786j771J899q40
7096D08n63p7P22j145R07L20j223L68L28m1j002J501l81n7k37p8P46j252J247
7115D91n07J88n07K09N49q53Q52r5o70RO39j055Q49n52PK24M95L36J19l42K09
7136E95j082J379n12j15J44J84j531n18K004n56l88N18J88P05j069L10r09M55
7154a98O45p78M48m02M09o8q81L67R2j82N75k27r3J104p06K07Q12K5j022l4m44
7175c51R65p31M67K8o89O68R7l07P24j402J07L1K47L38o19P2M94N13q8k31j069
7196g36J049m95k19K79O57j304M35L91J81l20R86k417J955R0j315P20P10j026
7214c79O47m17J188j016o9L59K0q9n69K00n89J306p44k86M71J94m88M50m53l69
$$ plain form
7076 41 13 -167 267 -817 270 325 371 -407 -234 -297 -23 151 -834 -804 423 -666 1120 -651 1248 408
7096 408 -155 -232 490 -655 252 572 -651 -283 45 4 -998 503 122 65 -172 -250 496 -756 491
7115 491 -16 172 -335 -126 423 -430 422 327 -343 -334 305 -750 99 -453 -446 -222 273 609 728 386 595
7136 595 -487 892 380 265 409 593 -938 -1456 548 -8 -396 122 310 1015 -54 256 -653 -198
7154 -198 447 -331 117 -285 124 56 -825 -458 -366 -548 27 -200 -293 811 105 312 1124 1149 127 93 -351
7175 -351 614 -117 350 378 -311 357 454 147 871 -531 -424 -393 -146 192 -427 -355 139 652 564 333 -736
7196 -736 313 -182 -401 -122 535 -769 -334 57 238 -82 904 -1513 442 532 -783 -63 647 -379
7214 -379 268 -149 1039 23 -46 313 333 244 -325 -125 -714 592 -152 -438 33 227 -261 189 -264 -633
7234f33J036k67p4M59m98l86j14r15R04l56J088o54N81j10J7k51L20j41J3K31
7254B50J87n20L52r10Q43R5j035J113q2n18P86l88J36j38j064J178k81P09j241
7273e28O05j034P44L54J67p16J463j699k56R47n64K75p2L37M48p40P20J92o70
7292b7L8k86R07J32l39r11J193m83m10m53R77k31k14m9o68P40L51k9O8q10K09
7313b95J35k49M74K00k85J62L14k69J6M42l85n69L75M51k60J88r52M53J28K4p9
7334A9n7j03m82J193P95p30m47O44k43o50l23J131j099P51q19O49n64O78j057
7353g14R81j125Q67j0m41K91o75J041o15N80K26J032j790P9O5O4K32M64l50j94
7373Hn40Q09r96j35r1o1J325j37jm51l70J012K08J88m40k30o27R99m54L94o83
$$ plain form
7234 -633 403 136 62 521 23 -363 -477 -1392 -488 -844 244 -410 171 61 78 -173 147 6 19 250
7254 250 437 -83 269 -641 202 297 -738 375 293 -225 561 173 309 171 -893 285 4 713 -528
7273 -528 77 -957 -213 141 308 -408 1055 -644 -900 47 -517 -242 -314 23 471 -269 451 643 -27
7292 -27 11 -275 632 764 425 -486 707 224 -186 -639 338 107 -107 -156 -824 -84 267 238 306 -504 -295
7313 -295 -160 -409 65 265 -20 142 456 187 203 645 260 -309 66 517 257 445 -507 -54 74 98 19
7334 19 -38 -141 -623 570 1365 635 188 832 589 -61 -384 747 -352 399 -420 229 -335 343 -714
7353 -714 267 -858 9 -1 -442 -151 -826 215 -400 180 406 1438 -352 -273 -208 -144 88 552 202 8
7373 8 -532 277 -719 -854 -945 -1006 319 182 181 -270 -640 372 580 768 328 98 -529 470 16 410 -273
7394b73L98r1L18n06N40l94M65j546J203N80j152L52L29j14P0k64j51n07J85J015
7414D57K07l82j37r01J148q98M09R9k3m6k34L44j73J70K61l09K42j074P87J99
7434A46m15L61O3r8P8n46L69N27M18m53j290J116Q78j608Q44n47n44L14J435l20
7454G28k78j201P88M21p48J092j001Q51o07k55M73j502P29R69j62n51J251j583
7472e86Q12p6K19o67r0J93N33m24kJ066r21k05m9l35p3Q72n51N00Q67k079N13
7493d83L91l12O77q54N64L91r38J292k92n02J18N8k65M80K09j644L04M65J01J77
7513f3n38L10L13q27Q36R4J15l60l54m41J456j131J11J53NJ3L20J13kL06o33J568
7535A364j535M46o8r59L63J16l33N55L82j4m45J104j308K66m81P52L24o16J88
$$ plain form
7394 -273 125 34 352 -154 386 -8 457 -1089 114 694 -458 -106 223 109 179 -85 -236 -743 -558 457
7414 457 664 282 145 -756 392 -506 -97 2 -21 -67 -301 43 -130 40 301 -8 234 -840 -53 146
7434 146 -269 92 155 57 135 -411 -42 485 903 450 -840 276 1154 -454 390 -157 -701 -387 1048 728
7454 728 450 -751 37 458 -290 802 -199 652 45 -210 263 -1239 -510 459 297 -254 997 -586
7472 -586 226 150 369 -298 -388 -195 338 -86 -88 978 57 -148 -197 -532 -605 267 -284 216 1083 -996 -483
7493 -483 -92 -404 273 -581 -17 374 -564 728 436 -66 52 110 -155 325 534 -1110 -806 -341 -240 -63
7513 -63 -601 -291 22 -805 31 125 240 -120 -474 -915 541 -590 -479 -326 -321 -308 12 125 123 429 -204 1364
7535 1364 -171 275 207 -752 -389 -273 -606 -51 331 317 -128 976 -332 -66 -547 205 529 -87 101
7554A01k14L9J74l3M86n41P21k61j97k79o03J186q28n33J034L44o66n57R39j67
7574A45J75K66n62N81k19n70m84R85p11Q68r0p03N97l37O7m43J9K54N84o68N39
7595B93N38m97k82k45k70j241J734L70j10j54N91O2l81k43R2l02o36L85M78K75
7615D57l68k81L27j37J055m08o37J35p43O89k30L72m21n80M00L1j49J034r48j83
7635e85J056K98l00j146M12j04M95N12m31O20p83J92n5J09l9o30M17k70O57n52
7655a27l55L42O65O4o36M99r32M42J50m7K45m48J65r03J55J596j170J5j77N18
7675F1o1l59J134k107J082L66R77j558O96n56J467j872N58O27j93k55L51o35R25
7694F48l07m16k87L75K83L10K14j097J502q53l1k20K09L96j06n18n07J041j554
$$ plain form
7554 101 -113 -74 100 67 553 12 733 472 275 -4 -607 579 -249 -782 252 596 -70 -627 312 145
7574 145 320 586 24 605 386 -184 -668 317 -394 474 384 -319 278 -59 8 -435 -416 -162 422 -246 293
7595 293 831 334 52 -193 -463 -1704 30 400 290 136 727 789 408 165 257 -45 -681 -296 182 457
7615 457 89 -192 135 -2 1053 645 8 143 -600 89 -141 231 -190 -770 -370 -339 -488 546 -402 -585
7635 -585 471 769 469 -677 -265 -369 126 638 207 827 44 236 181 290 251 -379 38 -232 425 -127
7655 -127 -482 -140 525 589 -47 452 -480 -38 112 65 310 -138 27 -876 -721 875 -295 -280 -457 61
7675 61 0 -359 775 -1332 -250 116 1093 -465 231 -325 1142 -730 -172 455 262 7 358 -277 648
7694 648 341 -75 -362 13 296 606 820 -277 1225 372 341 121 330 726 620 102 -405 636 -918
7713i18O75O44n06m73J404n80o07O12K83o67m8Q3P21j161L70L0O27r85j02O96
7733I8k71j27M08k54L85o50L45L85l79L95j369P01j3j9k34R30M53l06J01o96J52
7754C5j0n89O71L52o13l28Q07n03M44L83k49j46l83N20O13j431N41o05J09j13
7774d95J111o41l47M46O8n21J055o25l51R2Q81m55m91L61r65L27K08n6L69N73
7794E44p93K22R5l07j45R44j149O40j8k59K22N45j479Q25l00p41J769k14L73m80
7814B94r34P54l90J00N89J47k76J08r06K90m2L45k30K68n54J215Q2j135oN96k48
7835F7k94m97P17J38m49J48o98J583l81k88L04q0l94q4j67O55M05j072K41m40
7855e86J315o87ml09J176j220L61o20M84M14j259K3J230p11M68K05J66L56j123
$$ plain form
7713 -918 -243 401 -105 -578 826 246 -361 251 534 -133 -181 -98 623 -538 -168 -138 489 -496 -598 98
7733 98 -173 -300 108 -146 239 -411 -66 319 -60 335 -1034 -333 -346 -365 -599 331 784 478 579 -117 35
7754 35 25 -564 107 459 -154 -482 325 -178 266 649 400 254 -129 391 1004 -427 114 -491 -382 -495
7774 -495 616 -25 -372 74 142 -379 676 51 -300 -208 673 218 -273 88 -877 -550 -342 -398 -29 544
7794 544 -249 -27 68 -239 -384 560 -589 51 33 -226 -4 541 -938 -113 -413 -1154 615 401 774 294
7814 294 -640 114 -276 -176 413 560 284 392 -514 -224 -266 79 -151 117 -437 778 860 -275 -281 315 67
7835 67 -227 -724 -7 131 -318 -170 -868 715 334 46 350 270 -124 -208 -375 280 685 -387 -146 -586
7855 -586 729 42 38 -271 905 -315 46 -574 -90 324 -935 -912 318 -393 75 280 446 802 -321
7874c21kP38N66q18m26o3l2P44m67J43N4J41j199P04J415j056p34J035K63j480
7894g95O70L37Q4o57L11n33L95O28j67q93R36l45M52m66l14J187j322n04R42K07
7914A53K56q47K10L17j94l04L57M22k88K48q02Q29r67J417n72O78p80Q29j046
7933h4l72N97Q34j719J747j037k35k04N71k20n64L89K88m56o47R10O1M67q35N34
7953B5m14o1R57o31L32N13l45L33j184O01K75j075J606N1m49k25j450J392K53
7972E04p42l03J543j327J327j040L02q60J314m96j4n91k56J336l92p6q24P25o02
7991d72J116j265K317j417k56Q46o24q9O03o46k24j58L46n32P1J267p65M47m94
8010G1k22J06l01J48N23j37O1o36Q16m61ol31M93m34o91P29O19J05j390J559r15
$$ plain form
7874 -321 -323 415 981 163 -263 -326 -358 386 -81 62 116 257 -942 -238 1177 121 -613 422 685 -795
7894 -795 -125 212 296 -361 -50 -583 -188 440 273 -620 316 -29 423 -43 -357 830 -492 -996 -54 153
7914 153 409 -438 -228 89 -105 -409 -52 370 82 330 -472 357 -610 807 235 913 133 962 -84
7933 -84 -456 141 975 -744 1003 -34 -269 -473 98 -122 -686 -297 -9 -465 -1112 -202 -141 326 -509 25
7953 25 -389 -450 507 -124 208 721 376 709 -475 126 401 -674 932 983 534 309 -1141 251 504
7972 504 -238 -541 1002 -325 1002 -38 264 -596 718 222 208 -383 -639 697 305 229 -595 130 -472
7991 -472 644 -621 1696 279 23 869 245 156 759 113 -111 -269 77 -455 -384 883 118 565 71
8010 71 -151 -45 -346 -198 325 188 249 -387 429 -32 -38 -369 124 -310 -1001 -272 347 452 -938 621 -294
8031b94M97l85o0Q79o60o32R39l1n08N60R25j025J9q59J00J284j167J96K46o52
8051f28O04kj20N82m03J024j814N65L81O22o48J26r5q08R69m94k47R90J68j74
8071E98j13J2l48j45j44k78J67K25M94q41P46j061J445r36j70N82o88K30M37k64
8091e2Q38o90K87O56j34j741N69L53n31M54q9k83k37J354l83j287J206J4Pm00
8111h9O91q22Q35p87P50p75R2m4o66P78j34P23n46Mj291R50N43l59j68L29m38
8132d24q63K019l82q50kq9N71J16L3l01J70J79p1o92O13n29Q21k66N93O35j304
8153b3P69m01q59O66j87R05j327K20r87J695q26K68K43l53Mo24R82M79o72J80
8173A52n67j45LL65L22l63M13J62o49K24L22n19j92M12P52l86N7m20
$$ plain form
8031 -294 203 -182 -242 637 -23 -655 284 253 -255 305 1230 205 224 -635 -535 749 -418 -222 24 -628
8051 -628 -24 -26 -146 436 33 1057 -757 -192 189 811 163 289 194 -614 355 -139 -386 604 772 598
8071 598 485 497 149 4 -140 -418 -251 -26 468 -373 373 -688 757 -179 -349 233 -455 -225 212 -52
8091 -52 786 96 383 1039 905 -836 -267 86 -445 9 -80 -363 -600 754 371 -916 290 304 311 -89
8111 -89 602 -220 615 -172 578 -197 -105 -149 -815 -37 -171 552 6 10 -1281 -331 212 -147 -315 14 -424
8132 -424 -1287 732 350 -500 -502 -591 -20 96 129 -172 -2 177 106 -586 27 -502 319 53 646 1281 -23
8153 -23 746 345 -514 152 -35 870 -457 -237 -1224 471 -355 -87 156 -197 -193 -817 165 644 -28 152
8173 152 -415 -560 -557 -192 130 -233 180 342 -307 -83 239 -280 -472 -60 692 306 363 -57
8191e7
$$ Imaginary data points
##PAGE= N=2
##DATA TABLE= (X++(I..I)), XYDATA
0@%%%%%%%%%%%%%%%%%%%%j05K13k16K16k16K16k44L52m32M32n22O30o68P76q84
35d52R92j138J260j414J588j767J967k186K426k691K981l291L634m009M415m863
51b548N353n898O503p173P920q761R720j0821J2103j3600J5394j7610K0390k4019
65a3047K9005l6362M8647p4966K96109k12845J44571Q5286k22529J75857j03800
76A15926m1711M4523n6623m9385Q1485j36890J07503p1296m1582Q7774j09558
87f9834M8738O119k6713K0148K7366k8867L1055L0094o3315J02621q2703L9543
99C4252J4111o3998O9168l2054j6788M3283j4853m5150P8322q9764K0434M4532
111D1495j23433J16468p2041k0978P9931o7267K3231M6067n1620J9096M7203p7715
$$ plain form
0 0 0 0 0 0 0 0 0 0 0 0 0 0 0 0 0 0 0 0 0 0 -105 108 -108 108 -108 108 -136 216 -216 216 -306 324 -344 432 -452
35 -452 540 -598 662 -752 836 -931 1036 -1150 1276 -1415 1566 -1725 1909 -2100 2315 -2548
51 -2548 2805 -3093 3410 -3763 4157 -4604 5116 -5705 6398 -7202 8192 -9418 10972 -13047
65 -13047 15958 -20404 28243 -46723 249386 36541 181112 266398 43869 219726 115926
76 115926 74215 118738 62115 12730 94215 -42675 64828 -6468 -48050 39724 -69834
87 -69834 -21096 -14977 -41690 -21542 5824 -23043 8012 38106 -25209 77412 -5291 34252
99 34252 48363 -15635 53533 21479 4691 47974 33121 -12029 66293 -23471 -3037 41495
111 41495 -81938 34530 -37511 -58489 21442 -45825 -22594 23473 -28147 -9051 38152 -39563
123c9563P0112k6525j1106N6631n9894N7174p515j0610K9955m071k0494L2732
135F6826j8805l1070N5070o3732K8889P195m0368L7071k7897r465J7840k4918
147c364j2129L4460n0881K7903J4554m9845O8714l4433j595L7012m2491J8564
159F469J0025l9396K6968j442l6715M4629l5200J863K6711l9801K5897q758j8660
172c7410K0815j4391n138K5388k7080J3670K2773l3498L0219j435j9535K8538
184B916j6829q018K7408k2938R951J4790k3091L0736j2018j0474K9940k5081L718
197A010K2146k7628J5455J1874k7420L4237j1518o129K2399k3284J0799N34j6588
210E887J5670l762j6717K5117j8619M89K0727l1882K2963m052j5178J7009r923
$$ plain form
123 -39563 30549 4024 -7082 49549 -10345 46829 39314 28704 58659 54588 34094 66826
135 66826 48021 16951 72021 8289 37178 44373 4005 41076 13179 3714 21554 -3364
147 -3364 -15493 18967 -31914 -4011 10543 -39302 29412 -5021 -6616 30396 -12095 6469
159 6469 16494 -22902 4066 2624 -34091 10538 -24662 -22799 3912 -35889 -9992 -18750 -37410
172 -37410 -16595 -30986 -36124 -10736 -37816 -24146 -1373 -34871 -4652 -6087 -25622 2916
184 2916 -13913 -21931 5477 -17461 -7510 7280 -15811 14925 2907 -7567 22373 -2708 1010
197 1010 23156 -4472 10983 22857 -4563 29674 18156 12027 34426 11142 21941 22475 5887
210 5887 21557 17795 1078 26195 7576 8065 28792 -3090 19873 15821 643 17652 7729
223G729o018J3151r494m062K0878l0492K0696l245k0900K4809k4448N149N302
236i45j1849j502J2661j6018R743N011k2881L0076k6670Q801Q064j7902J8290
249e121p887j062O547L780j3091K2035j6686J056J7460l0075K9287j7135J349
262i543J3630j1243M256N997n709k329J9316k8332K2519m892j1641K2950k1800
275f821J5902l154p65K310N030j0013P346K270j6792K7000k6039J5533L041j4954
289a06J5810r909M034k051K474j0230J2965j2675M064P842k1966K6404k1880O199
303I75O015j3276P958k100l698j894J2108k0448J9798r973n097J7425k0900J6774
317C667q100j660L190J029o152N928L30r338J8415k2150J3696j160q108J1369
$$ plain form
223 7729 1711 14862 5368 1306 22184 -8308 12388 9143 -11757 13052 -11396 -6247 -945
236 -945 -12794 -14296 -1635 -17653 -7910 -2899 -25780 4296 -22374 -13573 -5509 -23411 -5121
249 -5121 -13008 -14070 -7523 -3743 -16834 5201 -11485 -10429 7031 -23044 6243 -10892 -9543
262 -9543 4087 -7156 -2900 3097 -2612 -4941 14375 -13957 8562 3670 -7971 14979 -6821
275 -6821 9081 5927 5162 7472 12502 2489 9835 12105 -4687 22313 -3726 11807 14848 -106
289 -106 15704 5795 9829 7778 10252 22 12987 312 4376 12218 -9748 16656 -5224 975
303 975 6990 -6286 1672 -428 -4126 -6020 6088 -14360 5438 -4535 -9632 7793 -13107 3667
317 3667 -4433 -6093 -2903 -1874 -8026 -2098 -1768 -11106 7309 -14841 -1145 -2305 -10413 956
331I56j0566N809n37J031l987R174q714P094L640j3758J9624j6054P715L167q060
346c466O454q44p43Q28L418j0968J4623j0344J069R130j4067J3392o007j116M803
361F162j831k374O422k587l196R996j3606J1596n251m241Q931q775M006j103k168
376A981j245L351p429N004Q40p876J1337j0651M761K615o567P403k983j979L744
391B306n06m985P311p370K001L469r613Q195m899j713L466l498k83L120l533k78
407f810K762n844P108m732N44M751m860L799J934m732L703J472m926O815l809
422b825L82N105o801M735J438n443M816l55l478N643m449n2M510n714M051k0l057
439a514M481j118j686M255l292L18M172n878O032k504k214N448m866K193K486
$$ plain form
331 956 -9610 -3801 -4338 -3307 -7294 1880 -6834 260 3900 -9858 9766 -6288 1427 4594 -3466
346 -3466 2988 2144 1401 2229 5647 -5321 9302 -1042 27 9157 -4910 8482 2475 1359 6162
361 6162 4331 1957 8379 5792 2596 12592 -1014 10582 5331 1090 10021 1246 5252 4149 1981
376 1981 736 4087 -3342 1662 2502 -5374 5963 -4688 73 2688 -3879 3524 541 -1438 2306
391 2306 1800 -3185 4126 -3244 -1243 2226 -7387 808 -4091 -5804 -2338 -5836 -6119 -2999 -6532 -6810
407 -6810 -4048 -9892 -2784 -7516 -6972 -2221 -7081 -3282 -1348 -6080 -2377 -905 -5831 984 -2825
422 -2825 -2443 2662 -4139 596 2034 -3409 1407 1052 -2426 3217 -1232 -1284 3226 -2488 1563 1543 -1514
439 -1514 2967 1849 163 4418 1126 1444 5616 -262 5770 3266 1052 6500 1634 3827 6313
454F313k510m29K068m085L237k510k796M134n144K308j52k647J324Qk416K143
470a154l01l797O534n185K628J422l123M016j600j038J067L92k792L433l833K21
486c110J767m959O166m435M97J152k328K330o55R07o55K470l619O184j743j598
502a629N201n736M706k006k09J769q63j16J901M70l905O070o030L345N08l283
518A93L299k332J097J11K63r70J306l239J756J607l639M848m864J432L98k374
534a108K693k831J053p38K107m182N135k132k985M377m577L817l063Q78O49j606
550b513r7J63r2l272M675n075L398j108r15L049k384J973j769O28P38K127k095
567b569M39K616l881M941m459L027M62j983L058j075m14J58J325k437L621l301
$$ plain form
454 6313 3803 3374 5442 1357 4594 2084 -712 3422 -1722 586 434 -2213 -889 -881 -3297 -1154
470 -1154 -1455 -5252 1282 -3903 -1275 147 -2976 1040 -560 -1598 -531 -139 -2931 502 -3331 -3110
486 -3110 -1343 -6302 -136 -4571 -4074 -2922 -5250 -2920 -3575 -2668 -3323 -853 -4472 1712 -31 -1629
502 -1629 3572 -2164 2542 536 327 2096 1233 1117 3018 3488 -417 5653 -377 2968 3476 193
518 193 3492 1160 2257 2368 2631 1661 2967 -272 1484 3091 -548 4300 -564 868 1266 -1108
534 -1108 1585 -1246 -193 -931 1176 -3006 2129 -3 -2988 1389 -3188 629 -2434 -1556 -907 -2513
550 -2513 -2610 -2447 -2539 -5811 -1136 -6211 -2813 -3921 -4836 -1787 -4171 -2198 -3967 -3339 -2601 -474 -2569
567 -2569 -2130 486 -3395 1546 -2913 114 576 -1407 1651 576 162 320 1645 -792 2829 -472
583d72J164P28l103M604l023J697J53n7jo2J194j673K711l159L015j500p30K764
601D250k474J225q34l79n17J962j772k0j27j078K999l308J953p66k636K182j085
618d25N56r43J03k87J600j750O30L95j506J288p30L84J496j617p6P92l91o58J444
637C05j011K18o1j548J697j313N09j9o18J263J79p12M75L74o39M33m57J530l07
656B98j28P47k76j64J514k554N60M43k11J065j048m74J253n51j044J512l94JL2
675E81r13Q45L8o65J123n91k8O95n55J07R59j499J358r27j224J828l98n09K01
694D26j286Q56o4r18K274j286k43J71n56M90K19r60N29n48L65n5m59M66Qk54P53
715g2J68j642J851p17n17O64q52J043j005N59mN01q59R37k31j0K3L96L19r58M7
$$ plain form
583 -472 692 1420 -1683 2921 -102 1595 1748 1691 1690 1628 2822 1149 3860 701 3716 2216 1486 4250
601 4250 1776 3001 2167 1788 1271 3233 1461 1441 1314 236 3235 -73 1880 1114 -1522 660 -425
618 -425 131 -812 -709 -996 604 -1146 -516 -121 -1627 -339 -1069 -685 811 -806 -882 -90 -481 -1139 305
637 305 -706 -488 -549 -2097 -400 -1713 -1204 -1223 -1841 -578 -399 -1111 -636 -262 -901 -468 -925 605 298
656 298 170 917 641 477 1991 -563 -3 440 229 1294 246 -228 1025 474 -570 942 548 549 581
675 581 -332 513 551 -114 1009 418 390 1085 530 637 1596 97 1455 528 -696 1132 734 225 426
694 426 -860 -4 -68 -986 1288 2 -241 -70 -626 -136 83 -877 -348 -896 -531 -586 -1045 -579 -571 -825 -72
715 -72 96 -1546 305 -412 -929 -265 -1117 -74 -1079 -520 -524 -23 -882 55 -176 -186 -163 233 552 -406 -359
736c59k48N77n72K09M41o06R47m13M26m03j73J535j496J67k29J146j176R17j352
755f62M78N42o71Q43l05L7J45L05n03L22%n5Q16j074M21l48l01P56j706J261l7
776B64k76N91k03Lj710R25k21J186j279K20J595j973Q79m7R26j186O29j72l70
795b19O64j095R08o31N36j9r1k29o41P40p31N89j39l32n45J705m15K04L39n50
815D8Qn42L58O01j165J119m03P55n32R41q45j13O71o64K20j53NL08r5N75k55M10
837A252r58L46n82O73n58L30M96k015J443L74o32n54O10K66p60R17n73N84m44
856B15p50N45k6N99j286R19o82P69k30m2P69j095J32l34M68K25o30M65J91o88
876d66M27q47M55L49j64P11n18o87J408j300P02o43O70n20l51O33j037J069n57
$$ plain form
736 -359 -607 -30 -602 -393 48 -558 389 -24 402 -1 -174 1361 -135 32 -197 949 -227 690 -662
755 -662 -184 358 -313 530 225 262 407 712 209 531 531 476 1292 218 639 291 -10 746 -960 301 264
776 264 -12 579 376 379 -1331 -406 -627 559 -720 -500 1095 -878 1 -46 880 -306 323 151 -219
795 -219 445 -650 258 -373 163 144 53 -176 -817 -77 -808 -219 -358 -690 -1235 470 55 259 598 48
815 48 56 -486 -128 473 -692 427 24 779 247 1188 343 230 901 237 457 304 309 617 522 1097 842 1252
837 1252 294 640 58 731 173 503 999 -1016 427 801 169 -385 225 491 -269 648 75 659 215
856 215 -535 10 -16 583 -703 216 -466 303 73 31 800 -295 -163 -497 -29 196 -434 31 222 -466
876 -466 -39 -886 -431 -82 -246 465 -53 -740 668 -632 70 -573 97 -423 -774 -141 -1178 -109 -666
895f66Q54j201J080j87N4q7O61l92l05J343j400J181o37j16M0J6n25N92k67q11
915g73O03P2O61j100k00P56k18O27n16K38J014r18l61P38k131P68K49N93n31o19
935a048Q97J68l25k33P81m51M0O02l48l65M68l23O20p97J122j276r3N24K26k57
955f8J289j476r4J097q15n86J351j452Q85m76K43p19J280o71n47L22J93n07L47
974d04P22j237O72O57j54r74Q49m26Q07j418J520o27k15K56L51m27L09o2j156
993i57J96J583l79q5r22J132L57m93K86m72O31n02n47L6K6n18N83R22j53q58P35
1014F01j445R43k00R54k41o03L95J26j145J938l41j221M03k28k54k94N68Q58j173
1033c59M88j07j75r6K25P87r96j23j263J950m50j070J918l12o70n16K02M21j45
$$ plain form
895 -666 188 -1013 67 -120 -66 -153 508 116 -189 1154 -246 935 298 182 222 238 -287 305 38 -773
915 -773 -170 -98 563 -537 -737 19 -199 428 -88 150 1164 246 -115 623 -1508 -740 -491 102 -429 -1048
935 -1048 -151 17 -308 -541 240 -211 -171 431 83 -282 186 -137 483 -314 808 -468 -561 -37 189 -68
955 -68 1221 -255 -349 748 -67 -653 698 -754 131 -345 -102 -821 459 -212 -759 -437 -244 -751 -404
974 -404 318 -919 -247 410 256 -718 131 -295 512 -906 614 -13 -228 28 379 -48 261 199 -957
993 -957 -761 822 443 358 -564 568 925 432 718 246 877 375 -172 -136 -110 -628 -45 877 724 -134 601
1014 601 -844 99 -101 853 612 9 404 530 -615 1323 982 -239 164 -64 -318 -612 -44 814 -359
1033 -359 129 22 -153 -249 -24 763 -233 -356 -1619 331 -119 -1189 729 417 -253 -769 -567 -146 -291
1052b91n31R40k95j26R52q99N94K02k11Q8o68L93n5l07P05nm16n23N82j148K14
1073h05J99o2K81P87k79J55K35j719J328L7m11K30j82M89M04k51L61k94l52J39
1093B90L18o19K40Q01k60j297J185k87q98J424q11NO53p24l02Q28n03k20J33l6
1113h0k18J95K22K25m32n68R71j013O00l65R42J68j019P59k10o4P5r41J201n13
1133f5K09k85l05O87q9p59M93M48q67R46j114M31K56L57n19r0j05k46Q11J47K30
1154E71q89Q80p51R46l92j435J104n32J438n06l55Q93r35o6j41N47M91k87l83
1173A98j55j45L81k10M53K79p56k79l00L12K27O28m54r01J057m24J46m79M88l76
1193c10K08m4K89q36R22l48r6K07M65o06N45k76o09J125j071P60N3j147J011n59
$$ plain form
1052 -291 -822 118 -177 -303 649 -250 344 546 335 423 -245 148 93 -214 491 486 70 -453 129 -1019 -805
1073 -805 -606 -668 -387 400 121 276 511 -1208 120 157 -254 -24 -206 283 687 436 797 503 151 290
1093 290 608 -11 229 1030 770 -527 658 371 -527 897 86 91 744 20 -282 546 43 -177 -44 -80
1113 -80 -298 -103 119 344 -88 -656 315 -698 -98 -463 479 647 -372 387 177 113 188 -753 448 -65
1133 -65 144 -141 -446 241 152 -607 -114 334 -533 413 -701 -270 -14 343 -176 -266 -371 -617 194 341 571
1154 571 -318 562 -189 757 365 -1070 34 -498 940 434 79 972 37 -29 -170 377 868 581 198
1173 198 43 -102 279 69 522 801 45 -234 -534 -222 5 633 179 -722 335 -89 57 -422 66 -310
1193 -310 -102 -146 143 -693 229 -119 -215 -8 457 -149 396 120 -489 636 -435 325 378 -769 242 -317
1213c17P66j252N06J11J96k63N01r47P38K42o60o47r4J695l91n12M29r02Q01N28
1233E28l11P26p02J25m74Q7l79J199j039l74O21r65J136J81m95K60k24j91J331
1252A040j253o52J198N09j097k93L22m66N14R05j367R47n54j21O05n86Q06o17
1270a60l34N98J83K52k50n67O62l63l35K01r44J235j78P76o16q90K25O17k13r6
1290a97m81N54m59j82N6P31l26N51j98j8l64K68q25j65N27P19k81L33l50P24q26
1311b09j95L3k43K55O08k15J25p01P45l42R35o79j02N4N05p40R24n21l51M27k37
1332G6p94J119r32K90J329p38J14l25j91k90N54m36n08P73O9J66q86K12L88N37
1352E27r59j26l8pQ44M45l02J16q65n69N84M95j26o17O23k76q5L76l58m16L17
$$ plain form
1213 -317 449 -803 -297 -186 10 -253 248 -699 39 281 -379 -1026 -1120 575 184 -328 101 -801 0 528
1233 528 217 943 241 366 -108 -21 -400 799 -240 -614 7 -958 178 359 -136 124 -100 -291 1040
1252 1040 -213 -865 333 842 -255 -548 -226 -692 -178 727 -640 307 -247 -368 237 -349 457 -160
1270 -160 -494 104 287 539 289 -278 384 21 -314 -113 -1057 178 0 776 160 -730 -505 112 -101 -197
1290 -197 -678 -124 -583 -765 -709 22 -304 247 49 31 -333 -65 -890 -1055 -528 191 -90 243 -107 617 -209
1311 -209 -404 -371 -614 -359 249 34 159 -542 203 -139 796 117 15 69 574 -166 758 237 -114 313 76
1332 76 -718 401 -531 -241 1088 350 464 139 -52 -342 212 -224 -732 41 110 276 -610 -398 -10 527
1352 527 -432 -558 -596 -603 241 686 384 500 -365 -934 -350 145 19 -598 25 -251 -336 40 -318 -734 -417
1373d17m45R80R3K64j417L91L52O24l98M19K26r81p18O20J44K59Q2K3J39M58j000
1394c02n89N02j95K85k44L6J389r49P19l38m20k00P8r9N72K19Nm14l73J74m69
1415f13m39J241O7L5jl15R6P37n41k31R85r89M7P27n93j050N16L99L43j327N31
1436c75p00N96Q8R93j56K80j517J138j288J849n05k68r7J35q8n15L78k37R43n51
1456A03J89r77L95K80j93N45j168Q59k77R18o11n01K62m17R65Ql37L26j01j02
1476A66L28j223J388o67M74j67K19k51n7n38l39M5O49Q60j086N75n99o46K57M99
1496a13J78M15m79j44o80O46l55R15P26r10l71l9n7L50J30l40L01lp7J69k08K55
1518C09n49P11j482K09R47M76o98p09N18M59r3J081j385P55m63m10j3K1k19J74
$$ plain form
1373 -417 -862 118 211 475 -942 -551 -199 425 27 446 672 -309 -1027 -407 -263 -4 78 101 240 698 -302
1394 -302 -891 -389 -584 -299 -543 -507 882 -67 652 314 -106 -306 -228 -327 245 464 469 55 -318 -144 -613
1415 -613 -1052 189 256 291 290 -25 71 808 267 36 1021 32 79 806 213 -837 -321 78 421 -906 -375
1436 -375 -1075 -479 -391 602 446 726 -791 347 -941 908 403 135 38 173 85 -430 -52 -289 654 103
1456 103 292 -685 -290 -10 -203 342 -826 33 -244 674 63 -438 -176 -593 372 380 43 369 268 166
1476 166 494 -729 659 -8 466 299 518 267 210 -328 -667 -622 27 887 -199 376 -223 -869 -612 -113
1496 -113 65 480 1 -143 -823 -177 -532 383 1109 199 -172 -211 -268 82 212 -128 173 170 93 262 54 309
1518 309 -240 471 -1011 -802 145 621 -77 -786 -268 191 98 1179 -206 549 86 -324 -337 -316 -535 -361
1538c61O40r7M39q55M29K5q58Q26o34O14Q56r11o0m19n63M05K67K87N35J1l83
1559A93J52N30j520L12J95J91p45L57P52k80k84l82J550j676Q16n27Q06O79j444
1578c25K07l0O62r04m23J320j6k85k96oK77j001J67L75M94j36K13o40l89J198
1598D62M09p90j10q91J366l40J38j20m92n8P69l09k92O22j66o36P75N5J60q63
1618c11J323j659n92J348M71m26J18Q3j87l55K11O63k69j92q11J048P6m82J57
1637B14n91K13P21n74nj88J88N80o70J00o12K14O42n52J148o65m29O69R1m17J21
1658A98n21n0M51n59o08J576o30p11P43J174q45L80l37j87L79j82R4j57l72n76
1678g40K64Q28r24Q40P0r66j39J182l19J28j28J71q0k57N0r51J363p50j26M81
$$ plain form
1538 -361 279 182 621 -234 195 220 -638 188 -446 168 1024 113 53 -366 -929 -524 -257 30 565 576 193
1559 193 345 875 -645 -333 -138 53 -692 -335 417 137 -147 -529 1021 -655 161 -366 440 1119 -325
1578 -325 -118 -148 514 -390 -813 507 491 206 -90 -96 181 -820 -653 -278 216 80 293 -347 -736 462
1598 462 871 81 -29 -920 446 106 244 124 -368 -426 343 34 -258 364 198 -438 337 392 552 -311
1618 -311 1012 -647 -1239 109 580 154 272 355 168 -187 24 687 418 226 -585 463 539 57 214
1637 214 -377 -164 557 -17 -22 -210 -22 558 -112 -12 -624 -410 232 -320 828 163 -266 403 494 77 198
1658 198 -323 -373 78 -481 -1089 487 -143 -854 -111 1063 218 598 261 74 453 271 365 208 -164 -740
1678 -740 -476 352 -572 268 338 -628 -767 415 96 224 96 267 187 -70 -20 -971 392 -358 -484 -3
1698cj34R3O88j142P80n16p2QN08q67l97J593n89mp4j9J29J321k310P57J09q4
1720b25K96p95J317q73K24R7O71j104j39L92R0p40K85Q59o16N62m62M14j620J523
1740A56N52j740P69L65l19Q00n43k13j79j72K86J45k19L57n80Q36m20l20p9J269
1760G51q48j3N93m30j249J270j95M14K25q75J237r03J48j61R97n87k85n62L91
1779h2M2K6O50N2o90o74J153m60j88o46J033o42O71K93j079N80n7r76P59j268
1799a503J577M98j126J343j336J010r69J125o20P4M96j504P39R2J95j76K40M98
1817F53p06j19P9J247j297K55K74l08l8n47J427j329K15j47J25M67o11K44M49
1836C33j67R34r69j51m83J092p09q37P31L3J089r28J03N8J86r11J310k64J86k3
$$ plain form
1698 -3 -137 -44 644 -498 282 -234 -306 -298 210 -657 -1054 539 -50 -54 -128 -147 -18 1303 -1007 -250 -141 -225
1720 -225 71 -724 593 -280 -56 41 712 -392 -531 -139 -49 -789 -504 355 -261 301 -161 253 -1367 156
1740 156 708 -1032 -263 102 -217 583 40 -173 -352 -524 -238 -93 -312 45 -535 301 -119 -439 -518 751
1760 751 -97 -110 483 53 -1196 74 -121 293 518 -357 880 -23 125 -36 961 374 89 -473 -82
1779 -82 -40 -14 636 688 -2 -676 477 17 -171 -817 216 -426 245 538 -541 39 -18 -994 -235 -1503
1799 -1503 74 572 -554 789 -547 463 -506 619 -1 73 569 -935 -196 -104 91 -85 155 653
1817 653 -53 -172 -93 1154 -143 112 386 78 40 -507 920 -409 -194 -341 -216 251 -360 -116 333
1836 333 166 1100 131 -20 -503 589 -120 -957 -226 -193 896 -32 71 129 315 -596 714 450 636 613
1856F13n34Mp9L10r0r31M27m03J355j322M60l68K76R35j318L3j39J009L5n78K41
1877f4m56J198J89p35n15n38J878o48K98r74M23M53j091P48M25n20M34p85L6m04
1897f48J90J117k94l53K52n53J244j509P94m30K21K86l58k97J01M72o5j335O14
1916e51J111m17O17j189M77k52M7Q17n04m81j67n50J194o19L85k39j42M86j453
1935a430R88L29M16q50N0k15O23N61j247J449K73r89n14P62L87q02K43J030j247
1954a83J168p61j039J701L83j697j24L67j92P61l4L76n36p59Q05l72M5l10N6J011
1974F66l20l75J93J92J3r66O02M56j82L33j559J033k76k40O5k7O15K11K67r65
1994b64k97L2P1R41l88K99m81k07Q59j163O4K94j92L86k99k20P85P26r53O5M28
$$ plain form
1856 613 79 83 4 314 224 -707 -280 -683 672 -650 -190 -558 -282 653 -665 -632 -771 238 273 -305 -64
1877 -64 -520 678 867 132 -383 -921 957 309 607 -367 56 509 -582 166 591 71 505 -280 -244 -648
1897 -648 -458 659 365 12 264 -289 955 -554 240 -190 31 317 -41 -338 -237 235 170 -1165 -551
1916 -551 560 143 760 -429 48 -204 -157 660 156 -325 -492 -1042 152 -467 -82 -321 -463 23 -1430
1935 -1430 -442 -113 303 -547 -497 -712 -89 472 -775 674 947 -42 -556 206 593 -209 34 1064 -183
1954 -183 985 224 -815 886 1269 -428 -552 -185 -377 384 350 726 190 -569 236 -136 -91 -401 -345 666
1974 666 346 -29 164 356 369 -597 5 461 279 612 -947 86 -190 -430 -365 -392 223 434 701 -264
1994 -264 -561 -529 -458 483 95 394 -87 -294 565 -598 -534 -240 -432 -46 -345 -565 220 946 -7 58 486
2015D86k46K16M90j143n41O00r4l44N81O02q07j32j239J051R13K44l76l28m82
2034e49R05R3o63P24r26L46M19l83l86N92K75M68m89j69O81j446M49kP83q12N28
2055D38q14J090o55k45K09M4j67K44n2L33j372nR49M64k91o76J410j88n91l18
2075a93O91J44k51l45m24J112K75j050O20n41j25K5q0m44J632j617o87J380L13
2094D35j151R70n59Q7P42p39k02J502q34j308J110l43J188l17J7J10m89p08K040
2113A551j589ll83L54Q69M8j094l4Q87j91k76m82Q19r94J76O9P37M49j437j14
2133f38P77P88j471R79n56p37P94l43k35J240r28Q19j217J550k05n93J93j077
2151h60J037O56l59J44j358K36K20K23l44N84J04K20O27j089O17r68j86J160n00
$$ plain form
2015 486 240 456 946 -197 -738 -138 -232 -576 5 607 -200 -332 -1571 -520 393 637 261 -67 -549
2034 -549 356 449 -214 510 -416 -70 349 -34 -420 172 447 915 426 257 938 -508 -59 -61 722 -90 438
2055 438 -376 714 59 -186 23 67 -100 144 92 425 -947 -952 -3 461 170 -506 904 716 125 -193
2075 -193 498 642 391 46 -378 734 1009 -41 579 38 -87 -62 -142 -586 1046 -571 -1258 122 435
2094 435 -716 254 -305 -218 524 -215 -417 1085 251 -1057 53 -290 898 581 598 708 219 -489 1551
2113 1551 -38 -41 -424 -70 799 847 -247 -281 606 415 139 -343 476 -518 -342 -273 464 913 -524 -638
2133 -638 139 927 -544 435 -121 -858 -64 -407 -642 598 -330 489 -728 822 617 24 217 -860
2151 -860 177 833 474 618 -740 -504 -284 -61 -405 179 283 503 1130 41 658 -310 -496 664 164
2170A64K34j36k35k63K70j63K00j33j38q9R85o01m70L56Q34k55p13K51J71o41
2190c72J25N47j71p85l50J213L06j033j15J98K53l18j1J008o82M18K42n78J23
2209A8O2L67m8q76o09Q76R3Q75l02J37m72M44n04j5q57Q32K39q04k0J195n55J18
2231A94N45k17j99q74O6R78o23N65j153R57N8l26m41M20l33P88k91m01K30j88
2251b45mL44jr87J434q81Q77k70m21M32N16l84j102J256p17m83P88k53O2k82J129
2272H08j118j98O85k35p76P18K13L34l58k21K74K27k25J26j86M22l09n9J76M17
2292G15M41k342Q96K09J091j087p28J185n96n7K48j58l72N22l38M14k4r84Q77
2311h8j01K36N70k177J480l36R65r4L8on99O47jn31n5J5l35J506j421M23q87N60
$$ plain form
2170 164 398 262 27 -236 34 -129 71 -62 -200 -289 696 95 -375 -19 815 560 -153 98 269 -372
2190 -372 -247 300 129 -656 -1006 207 513 -520 -635 -437 -184 -502 -513 495 -187 231 473 -105 18
2209 18 80 447 399 -477 -1086 -210 -117 758 456 593 121 565 61 46 -811 21 260 -544 -564 631 76 194
2231 194 739 522 323 -551 -485 493 -130 435 -718 239 297 -29 -470 -50 -383 405 114 -287 -57 -245
2251 -245 -249 95 94 -893 541 -340 537 267 -154 278 794 410 -692 564 -153 -636 152 -101 -39 -321 808
2272 808 -310 -508 177 -58 -834 -116 97 431 73 -148 126 353 128 254 68 490 181 122 298 715
2292 715 1156 -1186 -290 -81 1010 -77 -805 380 -216 -273 -25 -183 -555 -33 -371 43 19 -965 -88
2311 -88 -189 47 617 -1560 -80 -416 549 455 493 487 -112 535 534 3 -52 -37 -372 1134 -287 136 -751 -191
2333a91m6j88M72j028Q99J203j139l96R65l16m4R85n33q14Q8L73L64j208Q99j479
2353a134J236q6M23J29p14R67j679P71k19n27O89n42M54J50j32M40l21N3r5J90
2373E3O01p95N52m68K54j26j58k08l10P10p92K50O62n40j77k97J274r13J035p9
2393E28N37q57o35j22O02l25o37M34N01k19j97L6Q7L73m5O28m59r85P21P22n79
2414A09J5L48l84l35N72o06k78j18R69K22j259J485j220OQ69K74j170O18j49m88
2434e20lL06R84r13M98N54j073K43l30P30j089J61M92m04J225j291j3J90p3J71
2454a55n40J402j79p66M15N12j61p22P45j133P71M40K95j029L27n41L13M8K84
2473C26L21p46K29r94N68k79J160l59n55P25j131L84J072q93J07J84K54o01M26
$$ plain form
2333 -191 -237 -425 47 -981 -82 1121 -18 -414 551 235 191 1176 643 -171 -83 290 654 -554 345 -1134
2353 -1134 102 16 439 568 -146 821 -858 -87 -306 -833 -144 -686 -232 -82 -214 226 -95 -42 -137 53
2373 53 654 -141 411 -57 197 71 -87 -295 -605 105 -687 -437 225 -315 -492 -789 485 -428 607 528
2393 528 1065 208 -427 -549 53 -272 -909 -475 26 -193 -390 -354 -267 106 61 689 230 -755 -34 688 109
2414 109 124 472 88 -247 325 -281 -559 -677 292 514 -745 740 -480 -474 395 669 -501 117 -32 -520
2434 -520 -523 -217 767 -146 352 906 -167 76 -254 476 -613 -452 40 -364 861 -430 -443 -253 -326 -155
2454 -155 -695 707 528 -238 177 689 528 -194 551 -582 189 629 924 -105 222 -319 -6 42 326
2473 326 647 -99 130 -864 -296 -575 585 226 -329 396 -735 -351 721 -172 -65 119 373 -228 198
2492A98j6l40J56k03K20k24P9k59J588p84J98k40m00l00J221r61P51O85j283N52
2512F38j169M53J41K8n5p06R58n97k0Q84q66M90l41n24m7L30N39m20J257p11j020
2533g58N53K45P46j415Q10q78P27R59n12p31K3J99k31n62J653j625J072l34l0
2552h9N07M88j358N36o75J3K61N28L01r93L13M32Lj32p52J19J104Q2k40N41l39
2573F50p83k27K13J022q15M5K42M79j135P66l0q43n51L6O59J37N7l35K51o06K52
2594e16M60m62J073p72L09M61j143M99o16J065j85q93R20k24n69Q36L8o68K79
2613a08J89L70k71o88L9L05K8l44O63O83j273K72m20O18j51k66P9M37k0m30K79
2634ij59l02J364n03L03o70J14P1q2K29k6m14k84J43K33K1n89N49J043q41P01
$$ plain form
2492 198 182 -158 -2 -205 15 -209 -130 -389 1199 415 613 373 -27 -327 894 -67 684 1369 86 638
2512 638 -531 -78 63 91 36 -670 288 -309 -329 555 -311 179 -162 -686 -733 -403 136 -284 973 262 -758
2533 -758 -205 40 786 -629 181 -697 30 989 477 -254 -231 -32 -263 -825 828 -797 275 -59 -89
2552 -89 418 906 -452 84 -591 -578 -317 211 512 -481 -168 264 267 135 -617 -498 606 688 448 989 650
2573 650 -133 -360 -147 875 60 105 347 826 -309 457 427 -416 -967 -931 -272 -135 -78 -413 -162 -768 -516
2594 -516 -56 -518 555 -217 92 553 -590 -91 -707 358 173 -720 200 -24 -593 243 281 -387 -108
2613 -108 81 451 180 -508 -469 -164 -136 -480 183 866 -407 -135 -555 63 -88 -354 -275 162 142 -288 -9
2634 -9 -168 -470 894 391 694 24 138 209 127 356 330 -84 -368 -225 8 29 -560 -11 1032 191 892
2655H92j029K30J25K53J38m14J56j064N95p05J86R81j139K78N31n64P58p0r2L91
2675D37k89R1q41L22P7j97P62n69R20j200R7q4M81m98Q18P18p39q06J42O92p76
2696d42o70N41P10M3l80P95k36j57J7rm46L68n1J40P16j196O95k33k56m83J155
2717F21p42k14K66J53l46P21N65o06p55O38l07l93P79M45j624q58J643l70o29
2736a013J309R47j119r16O02o2j53J033n99l72j04J03m89J237n58l48L72K66o
2755A30O69o4j360K94O70M8n16J54n17P09j42l37M68o7k89j156Q48O80N03q32
2775a07O44l14r23P20k76N22j26L19l00q26L69K25K12L78r20N1J073j667J577
2794F31o34j67J95p45O35n40M45R3m12K19l6Q21j73o6N2o78M58Q7j41J10L86l99
$$ plain form
2655 892 -137 93 218 471 609 195 351 -713 -118 -823 -637 344 -795 -517 14 -550 208 138 46 437
2675 437 148 239 -602 -280 -203 -400 362 -207 713 -487 -390 -474 7 -491 327 1045 306 -500 -358 334 -442
2696 -442 -1112 -571 139 182 -198 597 361 204 221 212 -234 134 83 223 939 -257 438 205 -51 -534 621
2717 621 -121 -335 -69 84 -262 459 1024 418 -337 301 -6 -399 380 825 -799 -1657 -14 -384 -1013
2736 -1013 296 1243 124 -792 -190 -252 -405 628 29 -343 -447 -344 -833 404 -154 -502 -130 136 130
2755 130 799 735 -625 -331 339 387 -129 25 -492 217 75 -262 206 139 -150 -1306 -458 222 725 -107
2775 -107 537 223 -700 20 -256 266 140 459 159 -667 -298 -73 139 517 -403 -352 721 -946 631
2794 631 -3 -170 25 -720 -85 -625 -180 -87 -499 -280 -316 505 332 266 318 -360 98 185 44 154 540 141
2816A41Q0R0m28n08O41J9O03q42l93MO09n37L36n04R6M14q6K6k60O76K85K31j553
2839h60J282m40J1j08J02k52l4L24k17j82O53J1J16p02L62J96k12M39k57n37J374
2860A069j417j209J931L4j1p00N46l11N84j552K103j724J326p30P58M0j884J656
2878E09L83q42QL64j388J527p52j20M92K84n72K75J50M67j231P94q2N14r68L29
2898A41K66m07p21R28M2j048J491n02J044j103o04Q99J24j031k41l5R46l3n87
2917d31J182j803J532j027N24M76j163qO32J75l10M46k75K1P38q93P82j902M69
2936h35J217j072J233J49n24o57M52M26n75q2O22k05N58N0k23j18L89j158K1M76
2956A44J46n26m84J532q18M38n21m60J84J12K98j60m55Q16N55j067j40R17k39
$$ plain form
2816 141 221 311 -117 -625 16 35 638 -204 -597 -593 16 -521 -185 -689 -593 -179 -265 -239 -499 177 462 693 -860
2839 -860 422 -18 -7 -115 -13 -265 -299 25 -192 -374 279 290 406 -296 66 262 50 489 232 -305 1069
2860 1069 -348 -1557 374 408 397 -303 243 -68 516 -1036 1067 -657 669 -61 697 737 -1147 509
2878 509 892 50 58 422 -966 561 -191 -311 181 465 -107 168 318 785 -446 348 266 780 -188 141
2898 141 407 0 -721 207 249 -799 692 190 1234 131 -473 426 550 -481 -722 -757 189 156 -431
2917 -431 751 -1052 480 -547 -23 453 -710 -718 -86 89 -221 225 -50 -29 709 -184 598 -1304 -835
2936 -835 382 -690 543 692 168 -489 -37 389 -186 -268 354 149 707 757 534 416 805 -353 -332 144
2956 144 290 -236 -720 812 -6 432 -89 -549 -365 -253 45 -115 -570 246 801 -266 -406 511 272
2975B72j185Q14P38J16o68n32PL84ML73J62k88n46J66P90l04P80q20m89J24J085
2996I83l18n31K63o86J65r09P03m6L4J594q01j402K320j624L02J4n12L06L03q88
3016g30j3P62n61j06J31J91l06M38R48j333O80J96K31j067R25j36N57j283J484
3035A008j365M53m47j38O54L8L38l74k84L18Np91Q27l71J03q89J131j171J306
3054C51r8m58o62K97L91l71R11J4l94R4n77J12J065p61l11J5M17P82q37k86N9
3075b47R18l81k67N9o33k9L41Q56m47O49m85p74J27J91L04O25j216J159j65j098
3095e13O74m30J455j095k9l55k43K33J161j594R21m29j05K33J33J2J30m1L58r20
3115d44J695n94j040P25K2o79K14j69j50j5P7N78q6n4K48k11j72M07J27j5o98
$$ plain form
2975 272 -913 -99 639 755 87 -445 -438 -54 -50 323 485 197 -349 -183 607 303 1083 263 -226 -102 983
2996 983 665 134 397 -289 -124 -1033 -330 -376 -342 1252 451 -951 1369 -255 47 61 -451 -145 158 -730
3016 -730 -743 19 -542 -648 -517 -326 -632 -194 754 -579 101 297 528 -539 386 250 807 -476 1008
3035 1008 -357 96 -351 -489 165 203 541 167 -117 201 206 -585 242 -129 -26 -915 216 -955 351
3054 351 253 -205 -867 -570 -179 -550 361 375 -19 75 -502 -390 675 -86 -397 -382 35 817 -20 -306 -247
3075 -247 671 290 23 82 -551 -580 -239 617 170 819 334 -440 -313 -122 182 807 -409 750 585 -513
3095 -513 161 -269 1186 91 62 -293 -536 -303 858 -736 185 -244 -349 -116 17 29 159 118 476 -444
3115 -444 1251 657 -383 342 364 -315 -101 -270 -420 -435 -358 220 134 80 328 117 -55 352 479 464 -234
3136b34K71p83L40N04J080r10o00N05l46J53j16O57o49L2l28m4k89J359q12m41
3156f51O87L2N27m93K36p11L31Q44p01P17l19l75N62o35L34o62L47l68M14N44
3176F60j151N63L74j701R44L04J09k17m0M90m3k60L39j28o54L86k87N87k41R18
3196I52m54n95L81n34k17L44N20J98k99J11m01P86j015L87J21j099J127n90K0
3215b57J83n9K2L26o46j04K72N5N6K36L05p7P3l97o5K31N00r63l44J794m64r67
3237b90j29N80N4L32J49j1Q2M03j699J80R9l75K28O99n25M59Q6o04o03J109R94
3258A218q88j23m32N7M09m35K04rO37q80L80j83L77j401J254o51J028m98m24J150
3278G90J44j055M89N4q86r7Q25k62o91O07L55n85K83J90L2m05O26j03k26r3l57
$$ plain form
3136 -234 37 -746 -406 98 1178 268 -332 173 -173 -20 -136 521 -128 -96 -424 -468 -757 602 -210 -651
3156 -651 36 68 595 102 338 -373 -42 802 101 818 499 124 686 51 385 -277 70 -298 116 660
3176 660 -491 72 446 -1255 -311 -7 102 -115 -155 335 292 32 371 243 -411 -25 -312 275 34 952
3196 952 498 -97 284 -250 -467 -123 397 595 296 407 6 792 -223 164 285 -814 313 -277 -257
3215 -257 -74 -133 -111 215 -431 -535 -263 -208 -152 84 389 312 385 -12 -77 154 654 -309 -653 1141 677 -290
3237 -290 -419 161 215 547 696 685 767 1170 -529 -349 -250 -625 -397 302 -223 236 322 -282 -885 224 1218
3258 1218 330 207 -225 -168 241 -194 10 1 638 -242 138 -45 332 -1069 185 -466 562 64 -360 790
3278 790 934 -121 368 422 -464 -561 264 2 -689 -82 273 -312 -29 161 193 -212 414 311 85 -8 -365
3299c65K41l08J69L27m09J67Q6K91K56j78o33O44m05k7M90l85R68k26l91n49k
3320b39J287k6k43q91L58P9L68j150j39M82k15J100j717N58N09m27l44k09J023
3339A64m40O26q68M90j19k3l85P34n26L47J57p49J092l27O5P17p8j573L47m5K75
3360a19j83o15Q44N55m51J91j05M83p49Q9L98O30j185J16Q47j394P53j18p33M79
3380b67J030j568P40O29l12q63K65K94N9J11M9P14j564Q99M06q04q5M49P05m69
3400D18j33o31M38j9l09M38Q16r40j77P1j038o3P96K54N66m13o03R59p65K30M11
3421C06J5m95k9m10R38J7o30J82K6J86J77j09K39O97q83j85p7J090j224p73J815
3442H73r39j7k77K97K47q7q61Q42K27k49j70J72Q1j96M34p63R08j241K090q37
$$ plain form
3299 -365 -124 -432 -263 64 -345 -178 -92 199 455 277 -356 288 -117 -144 346 -39 929 703 312 -237 -239
3320 -239 1048 1022 779 -112 246 325 693 -457 -596 -114 -329 771 -946 -388 121 -306 -650 -859 164
3339 164 -276 350 -518 -28 -147 -170 -555 179 -347 0 157 -592 500 173 238 955 877 -696 -349 -394 -119
3360 -119 -302 -917 -73 482 31 222 117 600 -149 -60 338 968 -217 -101 746 -648 105 -13 -746 -267
3380 -267 763 -805 -65 564 252 -611 -346 -52 7 118 167 881 -683 216 622 -182 -267 182 887 418
3400 418 285 -346 92 73 -236 202 1018 78 -99 -28 -1066 -1129 -333 -79 487 74 -529 430 -335 -105 306
3421 306 321 -174 -203 -613 325 342 -288 -106 -80 106 283 174 413 1110 227 42 -35 1055 -169 -942 873
3442 873 -66 -83 -360 -63 184 97 -764 78 305 56 -114 58 139 -57 377 -386 522 -719 1371 534
3462E34O3j75j58L38j016O92k19j82M76k41j6j52k12J068r17k84L98j90k72J58
3482c07L09k43J12j228J280J38m11O75o60M64j044N31O16l54M11l78K21j019Q21
3501f6M06k58l10J99J7Q4j299J343N04j001O88q72R86J83q12m9O11q03P85K43
3521E79N51j627L73L08n41l55J203M65j291NJ373p42o20L15p49J206o87L5N07
3540C08n7m79Q8K29p12P08N86n36L40l13J61n67N4k63Q14m39O61j406J404j182
3560f01O9N43n78O59M29m65O97R57j948m28M85L19R59m38q82N0L30K43k18o00
3580d18J177m59K93l42k70L82j82n57j30J651j138k6k31R03j160n56R36Q15j46
3599E42q74M52m66L52m59J264j051K38n99J60k78R42J75m0K37n13m90L83L06n59
$$ plain form
3462 534 597 422 264 602 -414 278 59 -123 353 112 96 -56 -268 800 -117 -401 -3 -193 -465 -307
3482 -307 2 -241 -129 -1357 -77 61 -350 325 -335 129 -915 -384 232 -122 289 -89 132 -887 -66
3501 -66 340 82 -228 -29 -12 72 -1227 116 620 -381 307 -565 421 604 -208 -257 354 -449 336 579
3521 579 1130 -497 -124 184 -357 -712 491 956 -335 -330 1043 301 -319 -4 -753 453 -234 -199 308
3540 308 251 -228 -140 89 -623 85 671 135 475 162 323 -244 -190 -453 361 -78 583 -823 581 -601
3560 -601 -532 11 -567 92 521 56 753 1710 -238 -666 -181 138 1097 659 -223 -173 157 400 182 -418
3580 -418 759 300 593 251 -19 363 181 -376 -506 1145 7 -19 -250 653 -507 -1063 -127 688 542
3599 542 -332 120 -346 6 -453 811 -240 -2 -601 -441 -719 223 398 358 595 82 -408 -25 281 -278
3619b78J04O21p35J045m43r54J242j078L79L09j85R2j6L09jk62M11o23N0k73Q2
3640b04K30j50N35k25J22r33J013k98k84o54Q70k07L43q4l48R1R24r46k45K36
3660b14M64n4l2j40N18o73N4K97J29j044K53L2O98j76M88j489J390o55K48lj33
3681d2K90k43l36n13Q44l30j4m74R53Q13k18q76N05n23n23N79j39L37j20k2j030
3702a082J548r46J11m22Q91j21k57K87M54M55j144l8J6R8K8P16J60q08q97J066
3722A15n0k3r05R01J55q80L68k20N35l08P47l51l43P52q08L9J46J392j337j43
3742b18o5n08n40Q99K36O93Q93j662J261o35j038K07P00k61m28Q88K98n65J04
3761B59q92j55J007m49J49j0j60N79n21J83J03K03q39K42M56q50J62L79J54O3
$$ plain form
3619 -278 -174 447 -288 757 314 -640 602 -476 -97 212 27 119 103 412 411 149 560 -63 -13 -286 -204
3640 -204 26 -124 411 186 308 -625 388 90 -194 -848 22 -185 158 74 -274 -183 741 -205 -450 -214
3660 -214 250 196 164 24 542 -131 -77 220 349 -695 -442 -410 288 112 600 -889 501 -154 94 91 -42
3681 -42 248 5 -331 -844 0 -330 -344 -818 135 948 730 -146 359 -164 -687 -108 -247 90 -30 -52 -1082
3702 -1082 466 -480 -369 -791 100 -21 -278 9 463 918 -226 -264 -248 -150 -122 594 754 -54 -951 115
3722 115 65 42 -863 38 193 -687 -319 -539 -4 -312 435 84 -259 493 -315 -276 -130 1262 -75 -218
3742 -218 -283 -791 -1331 -432 -196 497 1390 -272 989 354 -684 -477 223 -38 -466 422 720 155 259
3761 259 -633 -788 219 -230 -81 -91 -251 328 -193 -10 93 296 -543 -301 155 -695 -533 -154 0 63
3781F3O54o96m01N28M53j56J65j089k88j35R56m2P88j25J26r03o80O01q8p84r1
3802a144J127J080j227M26m38o1K31M33r30Q98o32J01k87N35P68j128j022J512
3820B42p31Q48j47rq66P96Q05n80l87j45J88Q5k73J44J67k81M67k46J41l59Q37
3841F96j307N70Q35n16L45m74N2N93l26q3n81R29j207l02L67J148p89Q39r58p02
3861h71Q90k65M90P62j045p36R70q2p69Q86q34J033m58n19K18L34m8o31j45J413
3881E93r55P32n37M25k40p2K46l58n8O79o02p0p81P74M15o59M10K31j85M6k58
3902b24J37j9N19m13m52J523j753L08N8n64P03m05M14J406j247M83o14j40L56
3921G6k28k62J69L1L50l37l31R55p1K11j273J72L14n62J082l93N64R9n71L20j204
$$ plain form
3781 63 717 21 -380 148 601 445 610 -479 -767 -902 54 12 800 675 801 -102 -782 -181 -269 -1053 -1144
3802 -1144 -17 1063 -164 262 -176 -237 -6 427 -503 395 -237 -136 -423 112 880 -248 -1270 242
3820 242 -489 359 212 203 -663 133 938 358 -29 -174 14 99 -174 -30 137 -144 323 77 218 -141 696
3841 696 -611 -41 794 278 623 149 201 794 468 385 -196 733 -474 -776 -409 739 -50 789 -169 -871
3861 -871 19 -246 244 1006 -39 -775 195 113 -656 230 -604 429 -29 -548 -330 4 -44 -675 -820 593
3881 593 -362 370 -167 258 18 -54 192 -166 -224 455 -147 -217 -998 -224 191 -468 -58 173 -12 34 -224
3902 -224 -87 -106 413 0 -452 1071 -682 -374 -316 -880 -177 -582 -168 1238 -9 474 -140 -280 76
3921 76 -152 -414 -245 -214 136 -201 -532 423 352 563 -710 -538 -224 -786 296 -97 467 566 -5 315 -889
3942h89J389n35j38O12n71j93m43J287j060L84l1l81N99J013k037J383K07o71
3960g5o09Q0o1P34J92j087P59R16n11P4k98O82j139P83l47k38k54l86J343q66
3980c08R2j52R76K76j035L72N06k51m66n85L22N40O91j542J917j230j28M51j62
3999B84J07l52m50J27L13O21l11p50J111k97k32K07k64J23l28j74K0J65J40l76
4019c16K40q48J124l28K21r3J15n41J80N23q86L16O19jk66N4k35J76L39k73n90
4040d70M71K4n87j41J440j70n96K23m81J54M32m36m69R92p54J010j363R84K46
4059E09r07J136j477M76K4m56R24p83J165n97Q9K6k11J82o34m17R7J469o97Q27
4079G45l98l16m65k30R73q92k74N03p0j64O57%M4j22M01N96j539J853j822O25
$$ plain form
3942 -889 500 -35 -173 439 -132 -325 -768 519 -541 -157 -188 -569 30 1043 -994 389 596 -75
3960 -75 -684 -604 -665 69 261 -826 -67 849 338 412 114 796 -343 440 93 -145 -399 -785 558 -308
3980 -308 -216 -368 608 884 -151 221 727 476 10 -575 -253 287 978 -564 1353 123 -5 446 284
3999 284 391 39 -411 -284 29 650 339 -411 700 403 171 378 114 237 -91 -265 -245 -80 60 -316
4019 -316 -76 -924 200 -128 93 0 115 -426 -246 277 -609 -293 326 325 59 113 -122 54 393 120 -470
4040 -470 1 25 -562 -703 737 567 -29 194 -287 -133 299 -137 -606 386 -368 642 -721 263 509
4059 509 -398 738 -739 -263 -239 -695 229 -554 611 14 103 129 -82 100 -534 -951 -854 615 -82 745
4079 745 347 31 -434 -664 309 -583 -857 -354 -424 -588 69 69 113 -9 392 988 -551 1302 -520 105
4099A05Q09j053K7j18L64r36J134p61j26N23m78M97K78j251M23K78N8k57Q54j000
4119f30P62n43L02J264p04k7K23j95J05K10q18q15N67K83Q09j182N6o37J166o68
4139d72P75n88k05R85L22l83q76l08J43m3J102j29j282J364l45k48N57l42j6N07
4159E18j247P61N26n86K27j307J400m15O92j36o84N59Ro33O48l72p68J243K56
4178F91m18l51n31n67J894r62N97k49J5n61RM28J6N81n19L77p75L68o09O93k74
4199a47n42P76P3m39p00L69R88l89J1J269j085m37P18N39r04K45p92P2j93N18
4219e0o5N8o39P48n25J47k35J131p22M16j93j010R36J019j169J84K14O2l78m02
4239d73P84j310j50J219k94L63mL60j769J670l71LP46p88L12M10o47O07m76K06
$$ plain form
4099 105 914 -139 -112 -230 134 -802 332 -429 -555 -32 -510 -13 265 -986 -563 -285 -227 -484 370 -630
4119 -630 132 -411 -109 1155 451 424 647 452 557 767 -51 -866 -299 -16 793 -389 -333 -970 196 -472
4139 -472 303 -285 -490 495 817 434 -442 -750 -607 -650 452 323 -959 405 60 -188 369 27 11 518
4159 518 -729 32 558 -28 199 -1108 292 -123 569 433 -251 308 317 -316 332 -40 -808 435 691
4178 691 273 -78 -609 -1176 718 -244 353 104 119 -442 -433 -5 11 592 73 450 -325 43 -566 127 -147
4199 -147 -689 87 160 -279 -979 -610 378 -11 0 1269 184 -253 465 1004 100 345 -447 -375 -568 -50
4219 -50 -115 -57 -696 52 -473 -326 -561 570 -152 264 71 -939 -3 1016 -153 31 245 307 -71 -473
4239 -473 311 -999 -1149 70 -224 139 135 495 -1274 396 25 28 774 -14 298 708 61 668 192 398
4259C98n48N6n14J524j485Q73J33j103L98L83J81n49J256j320l22Q87o42M08k83
4278b69K36k33k86M67L14o44m21O68K0k51k31J094q57N75P8J42n60j88O77l92
4298f1p84R67k30j91k93O64O6j23K37k0N77K06n36r1l99P48n96J5j20Q6l16J72
4320b2P32j110L83n93J002m28P32p10L25k40q84J66O84L73n23K44l39M72l1m56
4340b23O57j268P26J394j410l96Q26o4m60L36L41q89K62K7Q83K82r84N25l89K50
4360D26l1p24j69J07K69N76k12J73K28q63M90r20J372j470M74j47R7J89O84p80
4380b31R5o68P33J96n75J17p87P88K46q01N23L23m12O02n48J187j434J221j21
4399D54m35m05m52O13J214r89K74j093L84L46M53l62P2R86j225R01m74k47q04
$$ plain form
4259 398 -150 -94 -608 916 -569 304 437 -666 -268 115 296 -253 1003 -317 -639 248 -394 14 -269
4278 -269 -33 -266 -552 -85 229 -415 -836 -168 -148 -399 -630 464 -393 182 260 402 -158 -346 331 -61
4298 -61 -845 122 -108 -299 -592 72 138 15 252 232 809 1015 479 388 -11 737 141 156 36 122 -194 -22
4320 -22 710 -400 -17 -610 392 -36 696 -14 311 71 -813 -647 37 410 -113 131 -208 264 233 -223
4340 -223 434 -834 -108 1286 -124 -520 306 242 -218 118 459 -430 -168 -141 742 1024 40 565 176 426
4360 426 395 -329 -498 -391 -122 454 242 415 643 -220 270 -650 722 -748 -274 -421 -324 -135 549 -231
4380 -231 -136 -804 -71 125 -450 -333 -1120 -332 -86 -887 -364 -41 -453 149 -399 788 -646 575 454
4399 454 19 -386 -838 -225 989 0 274 -819 -435 -89 364 2 74 1060 -165 736 262 15 -789
4418g89R04o1n46J21J118J51j206M93n3m25m9k62M93j58J34L27m6l88M26L45k59
4439B70n0O64o22n13Q64n45o49P3k45P20j92J134k95j147j2K03rK98N65r98M40
4460d6l46J292j268O6K62j26L46n5L88p10n11J119m34m41M00O50j790J231j00
4479g3Q91q30K24m20L82l44K93J33k20K28k49L87j13r33J114n26j21L11k68J83
4499D9j18J20n90M33O1M14l79K09l65J3O34m75q17L66L33P62j682J258J18l49
4519eo90R65j80P15p93Q43r08M7J12P82n09j136J315o65K10J11j76m8N1n50O13
4540A04m27l68l58J003k27J89J088k9q56M72K8j343J352p5J77r78R25j184M12
4559i5O0O86j245L98jJ69j122J243l80M1J086r36j4J56l18j55J168J14n88l08
$$ plain form
4418 -789 115 54 -492 -371 747 898 -308 185 132 -293 -342 -604 -111 -269 -135 192 146 -242 184 529 270
4439 270 220 884 262 -251 613 68 -581 -508 -753 -33 -225 909 614 -533 -545 -342 -351 -53 512 -486 -46
4460 -46 -392 900 -368 -302 -40 -166 180 125 513 -197 -708 411 -23 -464 -64 586 -1204 27 -73
4479 -73 818 -12 212 -208 174 -170 123 256 36 264 15 402 289 -644 470 -56 -177 134 -134 49
4499 49 -69 51 -539 -106 -45 369 -10 199 -166 -153 481 6 -811 -445 -112 650 -1032 226 344 -5
4519 -5 -695 270 90 805 12 855 -53 -6 106 888 379 -757 558 -107 103 214 38 -10 41 -509 104
4540 104 -323 -691 -1049 -46 -273 -84 1004 975 119 591 619 -724 628 553 730 -248 677 -507 -95
4559 -95 -35 651 -594 -196 -197 -28 -1150 93 -287 -246 840 -96 -110 46 -272 -427 741 855 267 -41
4579d1N35j84o46N3p84Q78N92o65O06l96N33m16Q02j618R53m87M26oK04J07n35
4600h9P78r54L11q72Q97M01j301N68N1Q44p84L54j67o27O50n56Q1J4Q30J38j819
4621a252P27Q10j364J296l78k66O99J69N66j029J19j7R43j059p14J039r50j21
4639g82O94k72j60Q42j367J434q52M16K6j70J058j782J458j30r50Q58l67J83o55
4658e18J006k75K1p68J129j11m84K15N24m71m22N13L71j007N82q48q50J519o33
4677e07M32j89K23p94Q62J24p06N25j66L10O25k62j149P36j19o37Q19q79K33J50
4697c69O19J43p44p1M41m36L40K45l35Q88l41q36J7L9K38O85k65p00N37O87j678
4718h96J450j085J98P4M03l92J19J27J005j386J13n02J065J34n07O40O8L62j444
$$ plain form
4579 -41 494 310 -336 -283 -1067 -189 403 -262 344 -52 481 65 867 -751 202 -285 141 135 339 446 -89
4600 -89 689 -265 46 -826 71 472 -829 -261 -210 634 -150 204 37 -590 60 -496 -415 -401 429 567 -1252
4621 -1252 -525 285 -1079 217 -161 -427 272 441 1007 -22 97 80 1023 -36 -750 289 -661 -782
4639 -782 -88 -360 -520 322 -1045 389 -463 -47 -21 -191 867 -915 543 413 -537 321 -46 137 -518
4658 -518 488 213 234 -534 595 484 0 215 739 268 -154 359 730 -277 305 -543 -1393 126 -507
4677 -507 -75 -264 -41 -835 27 151 -555 -30 -196 114 739 477 -672 64 -55 -692 127 -752 -519 -369
4697 -369 250 393 -351 -422 19 -417 -77 168 -167 721 380 -456 -439 -400 -162 523 258 -442 95 782 -896
4718 -896 554 -531 -333 -259 144 -248 -129 -2 1003 -383 -270 -772 293 427 -80 560 628 990 -454
4737d54R40p23l65K32M38K90K57p4p88J62p47M36L15M05m77j16j46Q63l9q04P27
4758C32m02O11k48m71l6m37J240n64m77J484n33j82l05O44q55O37j216J011K47
4777D80l19L03p50k56M88l06N39r17R93m36J80J05l61L6k45L58k09P13k22k87
4797a13l15J084n70l93N92q9J71q64P23q58J131l93l00J58q66N69j3M77m03J40
4817a32O36k87L74n43M04r21J484r72n61N74n41R46n06M30Q6j64j83o57K17n68
4837h84P07Q41m35p68O24M11n88Q7l75p7j77P33l87O2P95j189M37J44N00j90O4
4858C35j293J381n88n8M40l11m48N16Q43j578N57L80M7K57k22N80j768Q11J099
4877I80p90k93o5m45K34J74j3l15K53K29m3k74m19K45R24p69R86k17j06o3m19
$$ plain form
4737 -454 486 -237 -602 -370 68 358 615 541 -247 -85 -832 -396 -81 324 -153 -269 -415 448 409 -395 332
4758 332 -70 541 293 -178 -214 -651 589 25 -452 1032 499 317 12 656 -199 438 -778 233 480
4777 480 161 464 -286 -542 -54 -360 179 -738 255 -181 -1 104 -257 -221 -466 -108 -317 396 174 -113
4797 -113 -428 656 86 -307 285 196 367 -497 226 -632 499 106 -194 -36 -902 -333 -346 131 -272 -132
4817 -132 504 217 591 48 452 -469 1015 43 -518 56 -485 461 -45 385 471 307 124 -533 -316 -884
4837 -884 -177 664 229 -539 85 496 -92 -5 -380 -457 -634 99 -288 -226 569 -620 -183 -39 461 271 335
4858 335 -958 423 -165 -223 217 -94 -542 -26 817 -761 -204 176 223 480 258 838 -930 -119 980
4877 980 190 -103 -168 -613 -379 -205 -218 -533 -280 -51 -94 -368 -787 -542 382 -387 599 382 276 213 -206
4898b06j4O29j600P72K84m66R16p08Q6j21QP76k43r90J150N7n33L55o83R5M24
4919a2m76J145n04o19O61J57n97P40j277R04pM61l60J64p2L06n36j38L64N3l93
4940c6R32p04k14j373J346j210J002R47j350Q8P07k75N53P2p09P90j212J33J158
4959F45j251J128p1j98N54p17m47K75l96QJ477j239J05m00M71o1j95R33k64L58
4979G15o10j91q0L12J80R2o73L73J22l25P26o83J529j929Q96j317Q10q17J589
4998G19j399N60q9L57K43k36n94L00R12m20n98k64Q68J68q55k29N54J72J30l20
5018b1M42m68k31m4j20N62j8l54J52k80O30j62l09r9k51M13k11J205p61o64L56
5039b33k10j14P57J25j56l4J06j17o20J53n41J201p34N38o28Q1O66k48p42M84
$$ plain form
4898 -206 -220 409 -1191 -419 -135 -601 315 -393 -307 -428 -420 356 113 -877 273 330 -203 152 -531 -436 -12
4919 -12 -488 657 153 -466 195 352 -245 495 -782 122 115 576 216 380 308 614 78 -60 304 357 -36
4940 -36 896 192 -22 -1395 -49 -1259 -257 690 -660 -572 135 -140 413 485 -224 566 -646 -513 645
4959 645 -606 522 451 253 807 90 -357 -82 -478 -470 1007 -232 -127 -527 -56 -117 -312 621 357 715
4979 715 105 -86 -166 146 326 418 -255 118 240 -85 641 -42 1487 -442 454 -863 -53 -870 719
4998 719 -680 -120 -209 148 391 155 -439 -139 773 353 -245 -509 359 527 -328 -557 -3 169 299 -21
5018 -21 421 -47 -278 -322 -442 120 102 -252 -100 -380 250 88 -221 -320 -571 -158 -369 836 75 -589 -233
5039 -233 -443 -557 200 325 169 135 241 124 -496 -343 -884 317 -417 121 -507 -426 240 -8 -750 -266
5059b66K70o76K89K66l39J060j1r59Q6P07q64N80P4r51R93O3k62q01M61Q33n67
5080a4k82O27j340J386M19j434o9O7R03k36N88l96L37r54L50m24J222j259P7J031
5100E99K0j235J028p46J03N14o79j88N18O36r65J23L23K61K2p42J57Q06j399q0
5120i24L45Q18K10k50k45m92Q65k61q9N09r18j83P05L75j233LP02l87Q99k53n94
5141c98j81J64J98O40J5j188M11J421j018j015N87Q33j007J148j113N55K35N51
5159H38l24p07l74Q62K80p21l13q6J90P01j038O27M09j012Q58M26J67o14l56K44
5179E7n59K15P89l8j027Q13k70J69m63p4N62l79J84L03m67O22j144R33q21J091
5199D96o93m33J182m3M10p94O46p67j05o87Q29o9j43L59m56k96N21P24o28J93
$$ plain form
5059 -266 4 -672 -383 -117 -456 604 593 -366 -280 427 -437 143 217 -734 259 322 60 -741 -280 553 -14
5080 -14 -296 331 -1009 377 796 -638 -707 -640 263 27 615 219 556 -398 -48 -472 750 -509 -432 599
5100 599 619 -616 412 -334 -231 283 -396 -584 -66 570 -395 -272 51 312 334 -408 -251 555 -844 -924
5120 -924 -579 239 449 199 -46 -538 327 66 -23 486 -432 -615 90 465 -768 -765 -63 -450 449 196 -398
5141 -398 -579 -415 -217 423 438 -750 -339 1082 64 -951 -364 469 -538 610 -503 52 287 838
5159 838 514 -193 -567 295 575 -146 -459 -545 -355 346 -692 -65 344 -668 190 616 783 169 -187 57
5179 57 -502 -287 502 464 -563 250 -20 149 -314 -388 174 -205 -21 282 -185 437 -707 226 -595 496
5199 496 -197 -630 552 509 919 125 771 4 -101 -788 41 -28 -171 188 -268 -564 -43 681 53 246
5219B46p46N47K91n2o86J026o88k10R63r43j58J322j95J25j951J045O33q46K54
5238b3l29K06J13L5j19R45j098m3J301j346R35j745O87P26q67N14n32R5R12l18
5258D9l92J47Q90l53q83K3R39o39J90j06N65o01j27m20J114k53j85q26O15M10
5278A57K56r50L46m07K68N08q24J127j81j2j204N74j83P49k69j085L18J779j763
5297g96P44k14l04r7P07K42J61k24K96P14j003p0o64J386j260j71J62K35m89P54
5317A09J5r09K60N48L42l08P09p37m63m01P79K49J48j572R75P22MO7k95r6M5M11
5339F02n5j204J075n02L95p59M42p6R01l23m02J02N94p17m05R69j385P1J307r79
5359c49K62p45P91l41K46q0j00n07Q83m31J084j194k65P85j59l93N35l64L60q97
$$ plain form
5219 246 -500 47 338 286 -400 626 -62 -272 691 -252 -410 912 717 842 -1109 -64 569 -277 -23
5238 -23 -352 -146 -33 2 -117 828 -270 -313 988 -358 577 -1168 -481 245 -622 -108 -640 -545 367 49
5258 49 -343 -196 694 341 -542 -519 420 -219 -29 -135 430 -171 -298 -718 396 143 -42 -868 -253 157
5278 157 413 -537 -191 -598 -330 178 -646 481 300 288 -916 -342 -525 224 -45 -1130 -812 967 -796
5297 -796 -52 -266 -570 -667 40 282 443 219 515 1229 226 156 -508 878 -382 -553 -391 -156 -645 109
5317 109 124 -785 -525 23 365 57 766 29 -434 -835 -56 193 341 -1231 -256 466 470 537 242 146 191 602
5339 602 547 -657 418 -84 311 -448 -6 -82 819 496 94 196 790 73 -332 637 -748 -677 630 -349
5359 -349 -87 -832 -41 -382 -136 -216 -316 -823 60 -371 713 -481 -746 39 -120 -513 22 -342 18 -879
5379h79N32K38K28K52J43p76p4k69L56j7J224q38m75K32k87K91p1P71j403N02
5399c20Q99j15j057R05P39p97m52N29J14q70J219n24k75Q9l71o24O83M46p05J275
5419G88j493K07L74O15j057j02N96o28K47M68P4M73r56R03p06N79j6r65P61m52
5439b90J00K26k5N54j198J71J137o0m61n09J058r84J394l60j345k32J357p23J674
5458A484o54k96o62q10j52J381m89J132r38M28J08r36N70k15L02q82k25J051K51
5477D48J49n90j06J21j42o84K80O75l91j36K28N45j91j197J95O61K38P08r67K60
5497A04K39q5p03K43l31K03N49L87p24n3N76L82q43l65J019r69N94K62o7l8J23
5518E03m17l48R56p03N13j347J049J10o51J47l47O58m89K23J173p75n88N14k48
$$ plain form
5379 -879 -347 -109 119 371 514 -262 -336 -605 -249 -266 958 120 -355 -123 -410 -119 -190 581 -822 -320
5399 -320 579 464 -593 312 1051 254 -198 331 445 -425 794 270 -5 84 -287 -911 -228 218 -487 788
5419 788 -705 -498 -124 491 -566 -668 -72 -700 -453 15 89 562 -394 509 -197 382 366 -599 162 -290
5439 -290 -190 36 11 565 -633 -462 675 615 154 -355 703 -281 1113 753 -592 -824 533 -190 1484
5458 1484 830 534 -128 -938 -1090 291 -198 934 -4 424 532 -404 166 -49 253 -629 -854 197 448
5477 448 597 7 -99 22 -120 -804 -524 151 -240 -376 -148 397 206 -991 -796 -135 103 811 -156 104
5497 104 343 258 -445 -202 -533 -330 219 606 -118 -171 405 787 -56 -421 598 -371 223 485 418 380 503
5518 503 86 -262 694 -9 504 -843 206 316 -335 -188 -535 123 -366 -143 1030 255 -333 181 -67
5537f7q14J216j117P00K76k98l73m21K10K52Q55j312K082j794J44R43l81N69m22
5556B48P25j610j18L75K45L10L46l30n41j88j87O93n7L84q77N27p20J378j163
5575e60K04N29o09O46k54K35o69J152m86N5M48q87J081j086j33O42j29j205R46
5594h0M5J540k111L49M61O70r40Lk57O62L44j09j083j4P18q03O11j34K12m9Q5
5615A20J74o48N91q96J027l40K73m21O74l80J15q98J058p07N9O6k28M58N03j469
$$ plain form
5537 -67 -881 335 -782 -82 194 -104 -477 -898 -688 -436 419 -893 1189 -605 -461 482 101 670 248
5556 248 973 -637 -755 -380 -135 175 521 191 -350 -538 -725 -32 -89 295 -582 -55 -775 603 -560
5575 -560 -356 173 -436 210 -44 191 -478 674 188 243 691 -196 885 -201 -334 308 179 -1026 -80
5594 -80 -35 1505 -606 -257 204 874 -66 -63 -320 342 686 577 -506 -520 198 -605 6 -128 84 35 120
5615 120 294 -354 237 -659 368 28 301 -120 554 174 289 -609 449 -258 -199 -133 -361 97 600 -869
$$ [...]
8191f9
##END NTUPLES=NMR FID
##END=
