##TITLE=1H_SA_15.222
 DMSO-d6, 8 sc, 
 28.8.2020
##JCAMPDX= 6.0         $$ Bruker NMR JCAMP-DX V2.0
##DATA TYPE= NMR FID
##DATA CLASS= NTUPLES
##ORIGIN= UXNMR, Bruker Analytische Messtechnik GmbH
##OWNER= root
$$ XWIN-NMR		Version 3.5
$$ Fri Aug 28 12:10:15 2020 Russian Standard Time (UT+4h)  she@DPX200
##.OBSERVE FREQUENCY= 200.1315066352
##.OBSERVE NUCLEUS= ^1H
##.DELAY= (6, 6)
##.ACQUISITION MODE= SIMULTANEOUS
##.ACQUISITION SCHEME= undefined
##.AVERAGES= 8
##.DIGITISER RES= 18
##SPECTROMETER/DATA SYSTEM= spect
##.PULSE SEQUENCE= zg30
##.SOLVENT NAME= DMSO
##.SHIFT REFERENCE= (INTERNAL, DMSO, 0, 15.7039)
##AUDIT TRAIL= $$ (NUMBER, WHEN, WHO, WHERE, WHAT)
$$ ##TITLE= Audit trail, XWIN-NMR		Version 3.5
$$ ##JCAMPDX= 5.01
$$ ##ORIGIN= Bruker BioSpin GmbH
$$ ##OWNER= she
$$ F:/spectra/data/she/nmr/H-F/1/audita.txt
$$ ##AUDIT TRAIL=  $$ (NUMBER, WHEN, WHO, WHERE, WHAT)
(   1,<2020-08-28 12:08:44.01 +0400>,<she>,<DPX200>,
      <created by zg, POWCHK disabled, PULCHK disabled
       configuration hash MD5:
       00 E9 B6 7A A2 85 ED C7 34 08 36 98 17 FE 4E 26
       data hash MD5: 16K
       71 57 1F 9D 95 FE 5B 44 00 A2 19 EA 59 61 C0 01>)
$$ ##END=
$$ 
$$ hash MD5
$$ 43 11 AF CE 1A F1 DA E9 DB D8 92 31 21 05 19 49
##$RELAX= 
##$RELAX= 
##$RELAX= 
##$RELAX= 
##$RELAX= 
##$RELAX= 
$$ Bruker specific parameters
$$ --------------------------
##$DU= <F:/spectra>
##$EXPNO= 1
##$NAME= <H-F>
##$PROCNO= 1
##$TYPE= <nmr>
##$USER= <she>
##$AMP= (0..31)
100 100 100 100 100 100 100 100 100 100 100 100 100 100 100 100 100 100 
100 100 100 100 100 100 100 100 100 100 100 100 100 100 
##$AQSEQ= 0
##$AQ_mod= 1
##$AUNM= <au_zg>
##$AUTOPOS= <>
##$BF1= 200.13
##$BF2= 200.13
##$BF3= 200.13
##$BF4= 200.13
##$BF5= 200.13
##$BF6= 200.13
##$BF7= 200.13
##$BF8= 200.13
##$BYTORDA= 1
##$CFDGTYP= 0
##$CFRGTYP= 5
##$CHEMSTR= <none>
##$CNST= (0..31)
1 1 145 1 1 1 1 1 1 1 1 1 1 1 1 1 1 1 1 1 1 1 1 1 1 1 1 1 1 1 1 1 
##$CPDPRG= <>
##$CPDPRG1= <>
##$CPDPRG2= <>
##$CPDPRG3= <>
##$CPDPRG4= <mlev>
##$CPDPRG5= <mlev>
##$CPDPRG6= <mlev>
##$CPDPRG7= <mlev>
##$CPDPRG8= <mlev>
##$CPDPRGB= <>
##$CPDPRGT= <>
##$D= (0..31)
0 1.2 0 0 0 0 0 0 0 0.06 0 0.03 0 0 0 0 0.0002 0 0 0 0 0 0 0 0 0 0 0 0 
0 0 0 
##$DATE= 1598602123
##$DBL= (0..7)
120 120 120 120 120 120 120 120 
##$DBP= (0..7)
150 150 150 150 150 150 150 150 
##$DBP07= 0
##$DBPNAM0= <>
##$DBPNAM1= <>
##$DBPNAM2= <>
##$DBPNAM3= <>
##$DBPNAM4= <>
##$DBPNAM5= <>
##$DBPNAM6= <>
##$DBPNAM7= <>
##$DBPOAL= (0..7)
0.5 0.5 0.5 0.5 0.5 0.5 0.5 0.5 
##$DBPOFFS= (0..7)
0 0 0 0 0 0 0 0 
##$DE= 6
##$DECBNUC= <off>
##$DECIM= 32
##$DECNUC= <off>
##$DECSTAT= 4
##$DIGMOD= 1
##$DIGTYP= 9
##$DL= (0..7)
0 120 120 120 120 120 120 120 
##$DP= (0..7)
150 150 150 150 150 150 150 150 
##$DP07= 0
##$DPNAME0= <>
##$DPNAME1= <>
##$DPNAME2= <>
##$DPNAME3= <>
##$DPNAME4= <>
##$DPNAME5= <>
##$DPNAME6= <>
##$DPNAME7= <>
##$DPOAL= (0..7)
0.5 0.5 0.5 0.5 0.5 0.5 0.5 0.5 
##$DPOFFS= (0..7)
0 0 0 0 0 0 0 0 
##$DQDMODE= 0
##$DR= 18
##$DS= 0
##$DSLIST= <SSSSSSSSSSSSSSS>
$$ [...]
##$SUBNAM2= <"">
##$SUBNAM3= <"">
##$SUBNAM4= <"">
##$SUBNAM5= <"">
##$SUBNAM6= <"">
##$SUBNAM7= <"">
##$SUBNAM8= <"">
##$SUBNAM9= <"">
##$SW= 16.880792210976
##$SWIBOX= (0..15)
0 0 2 0 0 0 0 0 0 0 0 0 0 0 0 0 
##$SW_h= 3378.37837837838
##$TD= 16384
##$TD0= 1
##$TE= 0
##$TE2= 300
##$TE3= 300
##$TEG= 300
##$TL= (0..7)
0 120 120 120 120 120 120 120 
##$TP= (0..7)
150 150 150 150 150 150 150 150 
##$TP07= 0
##$TPNAME0= <>
##$TPNAME1= <>
##$TPNAME2= <>
##$TPNAME3= <>
##$TPNAME4= <>
##$TPNAME5= <>
##$TPNAME6= <>
##$TPNAME7= <>
##$TPOAL= (0..7)
0.5 0.5 0.5 0.5 0.5 0.5 0.5 0.5 
##$TPOFFS= (0..7)
0 0 0 0 0 0 0 0 
##$TUNHIN= 0
##$TUNHOUT= 0
##$TUNXOUT= 0
##$USERA1= <user>
##$USERA2= <user>
##$USERA3= <user>
##$USERA4= <user>
##$USERA5= <user>
##$V9= 5
##$VALIST= <valist>
##$VCLIST= <CCCCCCCCCCCCCCC>
##$VD= 0
##$VDLIST= <DDDDDDDDDDDDDDD>
##$VPLIST= <PPPPPPPPPPPPPPP>
##$VTLIST= <TTTTTTTTTTTTTTT>
##$WBST= 1024
##$WBSW= 4
##$XGAIN= (0..3)
0 0 0 0 
##$XL= 0
##$YL= 0
##$YMAX_a= 108148
##$YMIN_a= -104758
##$ZGOPTNS= <>
##$ZL1= 120
##$ZL2= 120
##$ZL3= 120
##$ZL4= 120
##$ABSF1= 10
##$ABSF2= 0
##$ABSG= 5
##$ABSL= 3
##$ALPHA= 0
##$AQORDER= 0
##$ASSFAC= 0
##$ASSFACI= 0
##$ASSFACX= 0
##$ASSWID= 0
##$AUNMP= <proc_1d>
##$AZFE= 0.1
##$AZFW= 0.1
##$BCFW= 1
##$BC_mod= 2
##$BYTORDP= 1
##$COROFFS= 0
##$CY= 11.3945322036743
##$DATMOD= 1
##$DC= 2
##$DFILT= <>
##$DTYPP= 0
##$F1P= 16.9975609425685
##$F2P= -3.02152046262296
##$FCOR= 0.5
##$FTSIZE= 0
##$FT_mod= 4
##$GAMMA= 1
##$GB= 0.15
##$INTBC= 1
##$INTSCL= 1
##$ISEN= 128
##$LB= 0.24
##$LEV0= 0
##$LPBIN= 0
##$MAXI= 10000
##$MC2= 0
##$MEAN= 0
##$ME_mod= 0
##$MI= 1.114404
##$NCOEF= 0
##$NC_proc= 0
##$NLEV= 6
##$NOISF1= 3.799351
##$NOISF2= 2.8
##$NSP= 1
##$NTH_PI= 0
##$NZP= 0
##$OFFSET= 15.70392
##$PC= 1
##$PHC0= -9979.944
##$PHC1= 14.80092
##$PH_mod= 1
##$PKNL= yes
##$PPARMOD= 0
##$PSCAL= 0
##$PSIGN= 0
##$REVERSE= no
##$SF= 200.130013532006
##$SI= 16384
##$SIGF1= 3
##$SIGF2= 2
##$SINO= 400
##$SIOLD= 16384
##$SREGLST= <1H.CDCl3>
##$SSB= 0
##$STSI= 0
##$STSR= 0
##$SW_p= 3612.71676300578
##$SYMM= 0
##$S_DEV= 0
##$TDeff= 0
##$TDoff= 0
##$TI= <>
##$TILT= no
##$TM1= 0
##$TM2= 0
##$TOPLEV= 0
##$USERP1= <user>
##$USERP2= <user>
##$USERP3= <user>
##$USERP4= <user>
##$USERP5= <user>
##$WDW= 1
##$XDIM= 8192
##$YMAX_p= 0
##$YMIN_p= 0
$$ End of Bruker specific parameters
$$ ---------------------------------
##NTUPLES= NMR FID
##VAR_NAME=  TIME,          FID/REAL,        FID/IMAG
##SYMBOL=    X,             R,               I
##VAR_TYPE=  INDEPENDENT,   DEPENDENT,       DEPENDENT
##VAR_FORM=  AFFN,          ASDF,            ASDF
##VAR_DIM=   8192,          8192,            8192
##UNITS=     SECONDS,       ARBITRARY UNITS, ARBITRARY UNITS
##FACTOR=    0.000296,      1,               1
##FIRST=     0,             0,               0
##LAST=      2.424536,      0,               0
##MIN=       0,             -104758,         0
##MAX=       2.424536,      108148,          0
$$ Real data points
##PAGE= N=1
##DATA TABLE= (X++(R..R)), XYDATA
$$ plain form
0 0 0 0 0 0 0 0 0 0 0 0 0 0 0 0 0 0 0 -8 8 -8 8 -8 9 -16 16 -16 24 -24 30 -32 40 -44 49 -56 64 -72 81 -91 101
39 101 -114 126 -140 157 -173 191 -212 234 -258 284 -314 345 -380 419 -461 509 -563 625 -695 776
59 776 -869 979 -1114 1282 -1495 1778 -2174 2770 -3788 6007 -24664 35404 2272 -104758
73 -104758 -46050 3227 -30956 -55525 -28450 -21671 -12883 -7226 -27577 -23033 21293 4176 -34614
86 -34614 -2219 31725 -11686 -27353 17916 16124 -19720 2346 22573 -3907 -1615 24687 4458
99 4458 -5913 23900 14171 -16448 7751 23233 -14248 -15407 19396 -23 -25024 5411 10957
112 10957 -20099 -4298 16962 -10891 -17732 13186 265 -25386 -705 6682 -25940 -16554 8592
125 8592 -14912 -25291 6749 4447 -20718 603 18696 -7278 -5083 21901 4855 -12915 11750
$$ packed form
0@%%%%%%%%%%%%%%%%%qJ6j6J6j6J7k5L2l2M0m8N4o2P2q4R3j05J20j36J53j72J92
39A01k15K40k66K97l30L64m03M46m92N42n98O59p25P99q80R70j072J188j320J471
59G76j645J848k093K396k777L273l952M944o558R795l0671O0068l3132j07030
73a04758N8708M9277l4183k4569K7075O779Q788N657k0351M544M4326j7117l8790
86c4614L2395L3944m3411j5667M5269j792l5844K2066K0227k6480K292K6302k0229
99D458j0371K9813r729l0619K4199J5482l7481j159L4803j9419k5001L0435N546
112A0957l1056J5801K1260k7853o841L0918j2921k5651K4681P387l2622R386K5146
125H592k3504j0379L2040k302k5165K1321J8093k5974K195K6984j7046j7770K4665
$$ plain form
138 11750 11594 -18026 -6563 12307 -13275 -20921 6813 -1967 -22334 2012 12066 -13868 -4318
151 -4318 20467 -846 -11990 15377 9348 -16073 849 11111 -16385 -14923 8189 -8930 -24102
164 -24102 648 2329 -20464 -7011 11356 -8130 -10769 14224 5799 -11991 9633 18007 -5832
177 -5832 920 22227 5352 -4187 19216 15937 -5420 11011 21809 -3244 -3061 17597 1329
190 1329 -15232 4319 2688 -20629 -10235 2563 -18217 -20972 1242 -7698 -22919 -3521 3755
203 3755 -16150 -8675 8626 -7108 -13799 6427 2277 -16096 -1813 8810 -10906 -9733 10464
216 10464 -689 -10724 9583 11194 -7245 4831 19531 2122 -1401 18472 10720 -4763 10369
229 10369 14435 -5301 358 14647 -1556 -8641 9787 5767 -10847 1901 9609 -8019 -5892
$$ packed form
138A1750j56k9620J1463J8870k5582p646K7734q780k0367K4346J0054k5934R550
151d318K4785k1313j1144K7367o029k5421J6922J0262k7496J462K3112j7119j5172
164b4102K4750J681k2793J3453J8367j9486k639K4993q425j7790K1624Q374k3839
177e832O752K1307j6875r539K3403l279k1357J6431J0798k5053J83K0658j6268
190A329j6561J9551j631k3317J0394J2798k0780k755K2214q940j5221J9398P276
203C755j9905P475J7301j5734o691K0226m150j8373J4283J0623j9716J173K0197
216A0464j1153j0035K0307J611j8439J2076J4700j7409l523J9873p752j5483J5132
229A0369M066j9736N659J4289j6203p085J8428m020j6614J2748P708j7628K127
$$ plain form
242 -5892 10021 -2483 -11635 5172 4566 -11742 -3077 7804 -6735 -8509 7334 24 -11338
255 -11338 3451 7292 -9222 -4096 9297 -2901 -9620 6049 3098 -11288 173 7580 -9029
268 -9029 -6338 9169 -1509 -10157 6115 5870 -8594 783 10216 -3943 -3998 10524 2763 -6792
282 -6792 5783 8642 -5007 -20 10272 -382 -4280 8444 4959 -6369 4113 10152 -3230
295 -3230 -1843 10758 2684 -4132 8157 7797 -4415 2821 10886 -2127 -3433 9484 2279 -7219
309 -7219 3597 5228 -7073 -1931 6854 -3546 -7078 5728 1911 -8414 1138 5597 -5765 -3442
323 -3442 5588 -2534 -7133 4088 2227 -7864 -529 5877 -4045 -4060 5781 1059 -5268 3879 5005
338 5005 -5045 -1289 6640 -1970 -5750 4102 1824 -6255 1032 5473 -3239 -354 9462 2875 -1480
$$ packed form
242e892J5913j2504r152J6807o06j6308Q665J0881j4539j774J5843p310j1362
255a1338J4789L841j6514N126J3393j2198o719J5669k951j4386J1461P407j6609
268i029K691J5507j0678q648J6272k45j4464R377R433j4159n5J4522p761r555
282f792J2575K859j3649M987J0292j0654l898J2724l485j1328J0482O039j3382
295c230J387J2601q074o816J2289l60j2212P236Q065j3013j306J2917p205r498
309g219J0816J631j2301N142Q785j0400l532J2806l817j0325R552M459j1362K323
323c442R030q122m599J1221j861j0091P335O406r922j5R841m722o327R147J126
338E005j0050L756P929q610l780R852k278q079P287M441q712K885R816o587m355
$$ plain form
353 -1480 9285 8829 -388 5692 10151 231 676 8145 1289 -4466 3187 3333 -5138 -1364 4792 -1448
369 -1448 -2437 5607 3103 -2463 3713 6373 -1501 -781 5772 -175 -5624 1308 137 -7616 -3041 746
385 746 -7025 -6575 732 -3531 -8373 -1328 111 -6835 -3079 1508 -4509 -4661 2705 438 -3773 3011
401 3011 6321 1307 4314 10373 6392 5139 11305 9881 4009 7509 9468 2477 1166 5640 1322
416 1322 -2900 1644 1734 -3595 -683 3610 -1147 -1928 4517 2747 -1906 1984 3016 -2985 -2265 1293
432 1293 -3808 -6160 -838 -2052 -6528 -2279 1216 -2251 -452 4782 2237 1203 6566 6177 1713
447 1713 3999 5916 1681 153 2898 689 -2136 334 967 -2886 -1752 1920 -317 -2286 1696
462 1696 1617 -1997 273 2349 -1341 -948 3226 803 -780 3512 4853 1295 4251 6937 3988 4346
$$ packed form
353a480J0765m56r217O080M459r920M45P469o856n755P653J46q471L774O156o240
369a448r89Q044k504n566O176K660p874P20O553n947n449O932j171p753M575L787
385G46p771M50P307m263m842P045J439o946L756M587o017j52P366k267m211O784
401C011L310n014L007O059l981j253O166j424n872L500J959o991j311M474m318
416A322m222M544R0n329K912M293m757p81O445j770m653L890J032o001P20L558
432A293n101k352N322j214m476M249L495l467J799N234k545j034N363l89m464
447A713K286J917m235j528K745k209k825K470O33l853J134L672k237j969L982
462A696p9l614K270K076l690L93M174k423j583M292J341l558K956K686k949L58
$$ plain form
478 4346 7107 4178 1571 3875 3113 -1052 -1173 173 -2614 -3382 -825 -1253 -2137 877 3104 1867
494 1867 2825 6355 5464 3905 5562 5457 2033 2092 2568 -1790 -3320 -1458 -3562 -6248 -4148 -3558 -5482
511 -5482 -3934 -1791 -3061 -2832 -128 -299 -2119 -156 979 -887 -334 1373 596 527 2881 3179 2017
528 2017 4382 6116 4723 5016 6564 6160 5294 5641 5266 3483 3461 4023 2463 946 2373 2029 754
545 754 1207 2033 124 111 878 -624 -2615 -1498 -2394 -5004 -4242 -3793 -4984 -4433 -3250 -3384 -2621 -6
563 -6 856 1125 2832 4375 4043 4606 4644 4061 3419 2862 2009 561 -178 122 -663 -1872 -1190 -305 -829 -44
583 -44 1417 832 1302 2709 2329 1867 2911 3079 2137 2074 2554 1526 1881 2224 1895 1489 2430 2466 1765 1645
603 1645 2009 1420 1402 1400 620 259 672 797 378 422 1116 1554 1515 1714 1847 2025 2187 2380 1654 787 1020 487
$$ packed form
478D346K761k929k607K304p62m165j21J346k787p68K557m28q84L014K227j237
494A867R58L530q91j559J657j05l424N9M76m358j530J862k104k686K100N90j924
511e482J548K143j270K29K704j71j820J963J135j866N53J707p77o9K354K98j162
528B017K365J734j393K93J548m04q66L47l75j783k2N62j560j517J427l44j275
545G54M53Q26j909j3P67j502j991J117q96k610P62M49j191N51J183j34P63K615
563fQ62K69J707J543l32N63L8n83o42n57q53j448p39L00p85j209O82Q85n24P85
583d4J461n85M70J407l80m62J044J68r42o3M80j028L55L43l29m06R41L6p01j20
603A645L64n89j8kp80l61M13J25m19M4O94M38l9J99J33J78J62J93p26q67K33n33
$$ plain form
625 487 -778 -1310 -1088 -1896 -2140 -1610 -1995 -1827 -469 -354 -696 368 1083 1210 1344 1458 1169 1436 1673
644 1673 1039 930 1321 1328 1047 1518 1653 1970 2762 2666 2688 3276 3582 3800 3888 3599 3230 3635 3290 2636 2217 1984
666 1984 1765 1666 1099 360 780 548 -196 -210 -360 -776 -634 -652 -1568 -1475 -868 -1050 -1033 -895 -982 -432 -188 -650
688 -650 -610 272 294 -63 265 147 477 870 303 44 508 736 392 654 624 684 1313 1181 1223 1357 1779 2043
710 2043 1743 1902 2069 2152 2387 1953 1919 1801 1899 1721 1297 1197 732 1082 966 125 306 471 304 33 198
731 198 364 341 475 346 214 568 293 84 -155 -389 -565 -395 -847 -1223 -975 -830 -1171 -754 -684 -978 -534
752 -534 -194 -1014 -723 90 -685 -545 -113 -509 -316 186 -82 187 723 821 1032 1161 1167 1421 1845 1299 948
773 948 1090 439 188 424 -531 -548 -63 125 -381 157 768 685 1343 1310 1187 1631 1901 1335 1178 796 433
$$ packed form
625D87j265n32K22q08k44N30l85J68J358J15l42J064P15J27J34J14k89K67K37
644A673o34j09L91Pk81M71J35L17P92r6K2N88L06K18Q8k89l69M05l45o54m19k33
666A984k19r9n67p39M20k32p44j4j50m16J42j8r16R3O07j82J7J38q7N50K44m62
688f50M0Q82K2l57L28j18L30L93n67k59M64K28l44K62l0O0O29j32M2J34M22K64
710B043l00J59J67Q3K35m34l4j18R8j78m24j00m65L50j16q41J81J65j67k71J65
731A98J66k3J34j29j32L54k75k09k39k34j76J70m52l76K48J45l41M17P0k94M44
752e34L40q20K91Q13p75J40M32l96J93N02k68K69N36R8K11J29OK54M24n46l51
773I48J42o51k51K36r55j7M85J88n06N38O11q3O58l3j23M44K70n66j57l82l63
$$ plain form
794 433 44 -277 -1079 -1461 -1486 -1441 -2096 -1927 -1337 -1717 -1497 -1540 -1414 -1393 -1054 -1159 -1460 -1298 -1196 -1189 -1108 -1240 -813
817 -813 -953 -414 -369 -190 153 583 483 48 313 253 -16 -543 -584 -672 -1036 -323 -137 -233 275 1015 844 1167
839 1167 1841 1938 1743 2085 1220 847 809 362 -490 -690 -792 -1105 -944 -956 -872 -450 -462 -37 163 -98 248 316
861 316 -603 -1283 -1262 -1945 -2600 -2991 -3175 -3853 -3096 -3117 -3302 -2938 -1763 -1520 -1232 75 -90 379 969 1073
881 1073 872 1058 1108 912 1090 934 793 1008 892 695 404 499 466 -110 -542 -596 -750 -1418 -1722 -1548 -1900
902 -1900 -2061 -1020 -1396 -1274 -295 718 781 1061 1912 1658 1694 1959 1061 525 467 -159 -1271 -1789 -1868 -2241
922 -2241 -2725 -2253 -2182 -2298 -1811 -1271 -1110 -743 -71 -388 -623 -684 -721 -901 -1105 -1080 -1472 -1810 -1133 -1057 -1024 -867
944 -867 263 411 149 861 1055 919 1306 1091 434 464 882 75 -227 73 -293 -395 307 -252 -244 217 387
$$ packed form
794D33l89l21q02l82k5M5o55J69N90l80K20m3J26K1L39j05l01J62J02PQ1j32M27
817h13j40N39M5J79L43M30j00m35K65o0k69n27m1q8l64P13J86r6N08P40j71L23
839A167O74R7j95L42q65l73l8m47q52k00j02l13J61j2Q4M22j2M25K00k61L46O8
861C16r19o80K1o83o55l91j84o78P57k1j85L64J175K43K88J307j65M69N90J04
881A073k01J86N0j96J78j56j41K15j16j97k91R5l3n76m32n4j54o68l04J74l52
902a900j61J041l76J22R79J013O3K80Q51k54L6K65q98n36n8o26j112n18p9l73
922b241m84M72P1j16M87N40J61L67O72l17k35o1l7j80k04K5l92l38O77P6L3J57
944h67J130J48k62P12J94j36L87k15o57L0M18q07l02L00l66j02P02n59QM61J70
$$ plain form
965 387 -263 -260 -159 -253 -513 -499 -578 -793 -730 -362 -191 -374 234 714 666 355 787 573 109 -159 -862 -1703 -1790
988 -1790 -1921 -3097 -3041 -2994 -3361 -3365 -2866 -2414 -2453 -1324 -739 -831 168 700 689 647 970 885 794 514 499 -4 -65
1011 -65 371 30 -396 -106 137 -128 149 359 87 -176 242 -81 -247 -282 -140 -331 -389 -272 -626 -806 -144
1032 -144 -204 -757 -392 -151 -935 -951 -539 -1024 -1749 -1346 -1673 -2035 -1298 -1634 -1849 -1550 -1156 -874 -797 -712 -762 -562
1054 -562 -605 -794 -1097 -981 -1282 -957 -1179 -1678 -1207 -1177 -1318 -812 -600 -550 -67 503 -287 376 1180 741 580
1075 580 662 236 108 412 -294 -650 -235 -187 -532 -642 -257 -636 -545 -563 -145 -342 -380 -119 -102 -363 -138 -186
1097 -186 -293 -215 -467 -515 -425 -466 -499 -900 -484 -842 -896 -1178 -792 -964 -1273 -821 -929 -1158 -899 -622 -1296 -789
1119 -789 -644 -784 -642 -380 -89 -293 -40 58 -34 216 83 165 166 222 110 392 100 290 145 365 829 622
$$ packed form
965C87o50LJ01r4k60J4p9k15O3L68J71j83O08M80m8l11M32k14m64k68p03q41q7
988a790j31j176N6M7l67mM99M52l9J129N85r2R99N32j1m2L23q5r1k80j5n03o1
1011f5M36l41m26K90K43k65K77K10k72k63M18l23j66l5J42j91n8J17l54j80O62
1032a44o0n53L65K41p84j6M12m85p25M03l27l62P37l36k15K99L94K82P7Q5n0K00
1054e62m3j89l03J16l01L25k22m99M71L0j41N06K12N0M83N70p90O63Q04m39j61
1075E80Q2m26j28L04p06l56M15M8l45j10L85l79R1j8M18j97l8K61J7k61K25m8
1097a86j07P8k52m8R0m1l3m01M16l58n4k82L86j72l09M52j08k29K59K77o74N07
1119g89J45j40J42K62K91k04K53R8r2K50j33Q2JN6j12K82k92J90j45K20M64k07
$$ plain form
1141 622 514 549 666 882 549 778 1060 886 709 769 577 611 495 81 -256 -118 12 -647 -440 -507 -867
1162 -867 -286 -403 -639 -718 -450 -659 -149 -301 -611 -310 -169 -520 -266 -219 -456 -102 -166 -335 99 195 -35
1183 -35 99 200 33 400 816 217 158 543 395 369 431 332 448 937 763 700 1122 1243 1070 1210 1090 1113
1205 1113 1250 1021 581 614 481 395 35 26 -213 -37 36 -157 20 0 280 -8 257 224 71 381 290 -66
1227 -66 -31 135 -151 -199 -166 -292 -73 170 -76 -240 452 220 301 422 166 87 607 221 -45 101 95 -87 287
1250 287 139 394 728 1015 628 982 1316 936 1192 1127 776 938 1068 760 328 396 446 573 967 449 897
1271 897 1080 815 742 880 739 565 429 35 -500 -467 -740 -1181 -846 -910 -1126 -671 -513 -578 100 506 548 557
1293 557 694 752 1009 1013 770 584 588 314 -117 26 -133 -119 -141 -67 -235 -179 50 -16 -369 66 -108 -145 46 -46
$$ packed form
1141F22j08L5J17K16l33K29K82j74j77O0j92L4j16m14l37J38J30o59K07o7l60
1162h67N81j17k36p9K68k09N10j52l10L01J41l51K54M7k37L54o4j69M34R6k30
1183c5J34J01j67L67M16n99n9L85j48k6O2r9J16M89j74o3M22J21j73J40j20K3
1205A113J37k29m40L3j33q6l60rk39J76P3j93J77k0K80k88K65l3j53L10r1l56
1227f6L5J66k86m8L3j26K19K43k46j64O92k32Q1J21k56p9N20l86k66J46oj82L74
1250B87j48K55L34K87l87L54L34l80K56o5l51J62J30l08m32O8N0J27L94n18M48
1271H97J83k65p3J38j41j74j36l94n35L3k73m41L35o4k16M55J58o5O78M06M2R
1293E57J37N8K57Mk43j86Mk74m31J43j59J4k2P4j68N6K29o6l53M35j74l7J91r2
$$ plain form
1317 -46 202 359 337 814 915 1014 1461 1472 1848 1209 1593 1388 887 1009 626 264 137 -214 -531 -776 -373
1338 -373 -235 -583 -462 -483 50 182 -158 368 423 -40 73 -163 -154 -534 -306 -656 -624 -627 -523 -474 -276 -48 -78
1361 -78 627 536 624 968 641 479 747 461 356 222 214 -108 -189 -206 -86 242 48 82 632 886 252 664 625
1384 625 603 969 980 760 646 886 672 464 1195 901 588 909 650 332 151 196 -526 -779 -719 -786 -1189 -925
1406 -925 -1015 -975 -854 -525 -292 -203 224 435 538 796 768 1200 1065 1162 866 228 289 369 20 -437 155 -160
1428 -160 -388 -73 63 -31 264 513 176 500 744 480 379 537 806 198 629 797 142 387 803 610
1448 610 556 899 661 902 1042 712 662 483 599 353 58 255 506 -51 234 308 238 -234 -10 43 -469 -200
1470 -200 93 -357 -604 83 -298 -857 -229 -320 -640 -193 18 -4 140 429 715 321 569 1143 707 866 811
$$ packed form
1317d6K48J57k2M77J01R9M47J1L76o39L84k05n01J22l83l62j27l51l17k45M03
1338c73J38l48J21k1N33J32l40N26N5m63J13k36Rl80K28l50L2lJ04M9J98K28l0
1361g8P05r1Q8L44l27j62K68k86j05j34ql22q1j7J20L28j94L4N50K54o34M12l9
1384F25k2L66J1k20j14K40k14k08P31k94l13L21k59l18j81M5p22k53O0o7m03K64
1406i25r0M0J21L29K33Q9M27K11J03K58k8M32j35R7k96o38O1Q0l49m57N92l15
1428a60k28L15J36r4K95K49l37L24K44k64j01J58K69o08M31J68o55K45M16j93
1448F10n4L43k38K41J40l30n0j79J16k46k95J97K51n57K85P4p0m72K24N3n12K69
1470b00K93m50k47O87l81n59O28r1l20M47K11k2J44K89K86l94K48N74m36J59n5
$$ plain form
1491 811 549 200 576 505 25 168 673 300 48 526 596 325 674 1112 570 590 1165 730 498 787 579
1512 579 316 310 713 214 -14 838 -145 -647 417 270 -328 -135 271 -358 -309 412 -61 -452 236 290 -133
1533 -133 123 540 169 -379 282 144 -184 -76 583 161 -457 308 178 -600 159 252 -235 2 623 63
1553 63 -433 599 495 -214 593 775 86 171 1090 167 245 855 869 -21 382 1017 80 244 717 230 -98
1574 -98 734 507 -141 -36 531 -67 -173 543 74 -327 246 369 -673 -654 45 -453 -1052 -97 -449 -1175
1594 -1175 -482 -151 -1046 -800 292 -623 -893 168 -118 -705 -232 412 -407 -708 315 -207 -352 390 485
1613 485 -274 10 809 310 -66 717 404 -250 269 448 -499 -233 464 -48 -947 -91 100 -992 -139 292
1633 292 -572 -835 573 -105 -1044 230 270 -959 -607 368 -704 -1069 337 -6 -1149 -130 -264 -924
$$ packed form
1491H11k62l49L76p1m80J43N05l73k52M78P0k71L49M38n42K0N75m35k32K89k08
1512E79k63oM03m99k28Q52r83n02J064j47n98J93M06o29M9P21m73l91O88N4m23
1533a33K56M17l71n48O61j38l28J08O59m22o18P65j30p78P59R3m87K37O21n60
1553F3m96J032j04p09Q07J82o89Q5R19r23P8O10J4q90M03O35r37J64M73m87l28
1574i8Q32k27o48J05N67n98j06P16m69m01N73J23j042J9O99m98n99R55l52p26
1594a175O93L31q95K46J092r15k70J061k86n87M73O44q19l01J023n22j45P42R5
1613D85p59K84P99m99l76P83l13o54N19J79r47K66O97n12q99Q56J91j092Q53M31
1633B92q64k63J408o78r39J274M0j229L52R75j072l65J406l43j143J019j34o60
$$ plain form
1651 -924 -635 183 -522 -879 226 185 -977 -432 56 -944 -1160 -106 -458 -1130 -350 39 -1235 -666 300
1670 300 -690 -798 384 -72 -919 -39 510 -563 -469 547 -337 -847 627 514 -531 356 745 -328
1688 -328 -404 797 344 -439 374 601 -1058 -423 456 -439 -1039 54 187 -1163 -7 400 -743 -422
1706 -422 717 194 -492 258 101 -1129 -507 134 -1004 -1274 -124 -896 -2094 -434 -433 -1576 -776 303
1724 303 -778 -693 345 -227 -924 395 725 -490 -135 990 268 -357 854 946 170 625 1193 -193
1742 -193 180 938 442 -625 284 501 -1065 -805 311 -604 -1024 29 -207 -1446 23 315 -910 -458
1760 -458 791 -327 -994 765 54 -757 -31 583 -451 -432 684 -123 -650 340 657 -635 -95 758
1778 758 3 -539 771 157 -894 -45 323 -1228 -1000 353 -809 -1489 11 -154 -1394 -229 725
$$ packed form
1651i24K89Q18p05l57J105m1j162N45M88j000k16J054l52o72P80L89j274N69R66
1670C00r90j08J182m56q47Q80N49j073R4J016q84n10J474j13j045Q87L89j073
1688c28p6J201m53p83Q13K27j659O35Q79q95o00J093J33j350J156M07j143L21
1706d22J139n23o86P50j57j230O22O41j138k70J150p72j198J660Jj143Q00J079
1724C03j081Q5J038n72o97J319L30j215L55J125p22o25J211R2p76M55N68j386
1742a93L73P58m96j067R09K17j566K60J116r15m20J053k36j239J469K92j225M52
1760d58J249j118o67J759p11q11P26O14j034J9J116q07n27R90L17j292N40Q53
1778G58p55n42J310o14j051Q49L68j551K28J353j162o80J500j65j240J165R54
$$ plain form
1795 725 -611 -53 1247 75 -310 874 1029 -407 242 1373 -98 -90 852 474 -478 482 734 -592
1813 -592 -188 877 -349 -664 400 151 -833 20 612 -639 -486 622 -208 -523 716 649 -346 122
1831 122 978 -109 -407 750 291 -1135 32 265 -1085 -812 288 -1016 -1143 301 7 -1053 20
1848 20 658 -819 -337 769 84 -382 495 623 -622 392 739 -76 -197 988 601 -508 678 1184
1866 1184 168 183 1236 177 -468 807 534 -824 -110 548 -693 -458 654 -525 -877 177 25
1883 25 -1191 -74 662 -756 -469 429 -94 -807 160 441 -559 -437 535 -3 -550 638 94 -594 121
1902 121 1035 -656 -448 703 3 -856 392 286 -931 -240 282 -622 -400 776 -158 -528 483 853
1920 853 -554 104 1161 98 -275 771 382 -622 426 838 -687 -218 857 -65 -869 131 135 -611
$$ packed form
1795G25j336N58J300j172l85J184J55j436O49J131j471QR42l78r52R60K52j326
1813e92M04J065j226l15J064k49r84Q53N92j251J53J108q30l15J239o7r95M68
1831A22Q56j087k98J157m59j426J167K33j350K73J100j304j27J444k94j060J073
1848B0O38j477M82J106o85m66Q77J28j245J014L47q15j21J185l87j109J186N06
1866A184j016J5J053j059o45J275k73j358P14O58j241K35J112j179l52J054j52
1883B5j216J117P36j418K87Q98n23p13R67K81j000J22R72n38n47J188n44o88P15
1902A21R14j691K08J151p00q59J248j06j217O91N22r04K22J176r34l70J011L70
1920H53j407O58J057j063l73J046l89j004J048M12j525M69J075r22q04J000Mp46
$$ plain form
1938 -611 31 649 -159 -189 730 346 -601 181 462 -729 -376 598 -240 -703 454 -103 -981 -12 690 -577
1958 -577 -454 465 -234 -575 264 80 -965 276 441 -450 -474 779 297 -589 650 542 -305 -16 838
1977 838 -227 -348 427 333 -413 247 780 -316 -149 632 112 -427 932 785 -377 362 781 -208 -127
1996 -127 861 326 -555 488 441 -526 2 599 -180 -390 452 30 -442 281 145 -443 -95 573 -39 -630
2016 -630 575 218 -638 -71 201 -501 -376 396 -151 -790 369 374 -554 -195 565 -226 -404 582 196 -501
2036 -501 507 662 -406 308 810 89 -237 424 253 -458 288 527 -120 30 608 184 -212 196 316
2055 316 -428 21 431 -285 -458 146 -80 -727 10 195 -443 -281 411 -221 -464 216 14 -897 -213 317
2075 317 -748 -520 219 -158 -479 130 307 -415 -127 431 -94 -15 513 224 -182 442 456 -243 141 709
$$ packed form
1938f11O42O18q08l0R19l84r47P82K81j191L53R74q38m63J157n57q78R69P02j267
1958e77J23R19o99l41Q39j84j045J241J65q91k4J253m82q86J239j08q47K89Q54
1977H38j065j21P75r4p46O60N33j096J67P81n20n39J359j47j162P39M19r89Q1
1996a27R88n35q81J043m7r67N28N97p79k10Q42m22m72P23j36n88L48O68o12n91
2016f30J205l57q56N67K72p02J25P72n47o39J159Nr28L59P60p91j78R86l86o97
2036e01J008J55j068P14N02p21l26O61j71p11P46K39o47J50N78m24l96M08J20
2055C16p44M49M10p16j73O04k26o47P37J85o38J62O92o32k43O80k02r11O84N30
2075C17j065K28P39l77l21O09J77p22K88N58n25P9N28k89m06O24J4o99L84N68
$$ plain form
2095 709 28 -319 41 189 -427 -182 102 -286 -456 262 -264 -568 -70 199 -537 -279 6 -132 -353 522
2115 522 189 -284 484 510 -221 226 641 203 -165 654 379 -142 375 104 -468 -105 237 -375 -531 -250
2135 -250 69 -670 -318 -140 -610 -411 220 -342 -401 -7 110 -408 -402 112 -215 -363 -19 367 -561 49 137
2156 137 -335 -16 157 152 -261 253 70 -184 144 437 -339 -49 294 55 -67 240 251 138 220 603 56
2177 56 6 408 285 8 92 237 -299 -43 -225 3 -500 49 -66 -485 -149 4 -462 -397 35 -393 -530
2198 -530 -213 -142 -678 -399 -11 -610 -586 10 -67 -250 274 316 9 277 259 96 102 431 355 -12 390 226 56
2221 56 -221 304 -36 -173 -259 40 -483 0 90 -307 -286 -159 -58 -296 -52 -9 -203 17 384 2 41 208
2243 208 141 -34 452 126 35 -30 257 76 -62 44 -135 -315 -192 21 -152 -125 -110 74 -471 -368 72 -203
$$ packed form
2095G09o81l47L60J48o16K45K84l88j70P18n26l04M98K69p36K58K85j38k21Q75
2115E22l33m73P68K6p31M47M15m38l68Q19k75n21N17k71n72L63L42o12j56K81
2135b50L19p39L52J78m70J99O31n62n9L94J17n18ON14l27j48L44L86r28O10Q8
2156A37m72L19J73nm13N14j83k54L28K93p76K90L43k39j22L07J1j13Q2L83n47
2177E6n0M02j23k77Q4J45n36K56j82K28n03N49j15m19L36J53m66O5M32m28j37
2198e30L17P1n36K79L88n99K4N96p7j83N24M2l07K68j8j63OL29p6l67M02j64j70
2221E6k77N25l40j37q6K99n23M83R0l97K1J27J01k38K44M3j94K20L67l82L9J67
2243B08o7j75M86l26r1o5K87j81j38J06j79j80J23K13j73K7J5J84n45J03M40k75
$$ plain form
2265 -203 -170 -137 3 -359 -135 -133 -201 -308 87 -221 -398 164 72 -231 277 39 -190 127 -102 -69 94 151 69
2288 69 6 246 63 -250 123 -33 2 -60 -11 -26 -118 23 262 68 -31 104 183 96 68 66 -40 -253 81 -186
2312 -186 -244 31 48 -255 -171 101 -273 -226 -176 -176 -370 8 -60 -225 -45 8 -313 -309 45 71 144 -133 345 92
2336 92 11 120 80 235 90 169 2 75 143 -49 138 -7 56 -113 174 44 136 -232 51 -128 56 84 -76
2359 -76 -309 77 25 -104 26 -39 27 29 -181 -352 46 -117 -201 8 119 197 -72 -12 -42 -124 125 -229 -209 -13
2383 -13 44 -88 41 43 -60 -18 -29 -108 225 69 -8 -253 5 -80 -246 -86 27 186 -118 163 -271 -32 116
2406 116 -52 -103 -215 -180 -158 -50 -28 -23 129 -45 -27 27 -197 -83 30 64 133 98 -74 63 90 -132 171 137
2430 137 91 345 -225 127 -14 -142 -163 58 -274 16 -172 -102 -190 15 -221 -74 -275 -246 -151 -287 -74 -51
$$ packed form
2265b03L3L3J40l62K24Ko8j07L95l08j77N62r2l03N08k38k29L17k29L3J63N7q2
2288F9o3K40j83l13L73j56L5o2M9j5r2J41K39j94r9J35P9q7k8kj06k13L34k67
2312a86n8K75J7l03Q4K72l74M7N0%j94L78o8j65J80N3l21ML54K6P3k77M78k53
2336I2q1J09m0J55j45P9j67P3O8j92J87j45O3j69K87j30R2l68K83j79J84K8j60
2359g6k33L86n2j29J30o5O6Kk10j71L98j63q4K09J11P8k69O0l0q2K49l54K0J96
2383a3N7j32J29Kj03M2j1p9L33j56p7k45K58q5j66J60J13J59l04K81m34K39J48
2406A16j68n1j12L5K2J08K2NJ52j74J8N4k24J14J13L4O9l5j72J37K7k22L03l4
2430A37m6K54n70L52j41j28k1K21l32K90j88P0q8K05k36J47k01K9R5j36K13K3
$$ plain form
2452 -51 -109 -126 5 -387 -237 56 82 -44 -39 -102 69 -88 58 -38 271 66 -15 75 260 279 -94 47 73 191
2476 191 -58 47 368 35 115 167 98 -191 -122 188 175 148 -111 197 -301 4 -229 -74 -58 96 58 -95 -216
2499 -216 81 84 -228 44 -143 -222 157 4 80 60 -42 -57 -55 -148 203 69 21 189 -3 235 248 245 195 86 63
2524 63 143 179 10 301 132 -13 51 38 223 22 4 -116 69 -163 315 60 116 -5 -124 24 -37 -109 -180
2547 -180 165 -338 -96 177 -111 7 189 40 -85 87 139 52 64 -86 -29 273 238 72 -71 -137 93 -103
2569 -103 16 -70 -94 -170 -461 -123 -341 -115 -134 -170 -247 -125 43 -9 94 210 -82 49 -259 78 72 188 155
2592 155 258 31 53 265 94 88 42 189 103 47 195 95 69 -261 -173 -149 -195 14 35 -74 -346 -135 -151 137
2616 137 -188 -150 -137 -122 -34 -81 -60 66 3 48 18 32 207 99 -64 -88 8 -36 226 108 -417 16 -87 88
$$ packed form
2452e1n8j7J31l92J50K93K6j26No3J71j57J46r6L09k05q1R0J85J9l73J41K6J18
2476A91k49J05L21l33Q0N2o9k89O9L10j3k7k59L08m98L05k33J55J6J54l8j53j21
2499b16K97Ll12K72j87p9L79j53P6k0j02j5Kr3L51j34m8J68j92K38J3ln0j09k3
2524F3Q0L6j69K91j69j45O4j3J85k01j8j20J85k32M78k55N6j21j19J48o1p2p1
2547a80L45n03K42K73k88J18J82j49j25J72N2q7J2j50N7L02l5j66j43o6K30j96
2569a03J19q6k4p6k91L38k18K26j9l6p7J22J68n2J03J16k92J31l08L37oJ16l3
2592A55J03k27K2K12j71om6J47q6n6J48j00k6l30Q8K4m6K09K1j09k72K11j6K88
2616A37l25L8J3J5Q8m7K1J26o3M5l0J4J75j08j63k4R6m4K62j18n25M33j03J75
$$ plain form
2640 88 -136 29 -254 -147 -24 -172 -123 -132 -271 45 218 86 25 155 -21 88 145 -44 -79 -86 -34 18 48 -132
2664 -132 -175 178 -272 -178 -211 -208 -170 -76 -137 0 -272 -146 -135 -74 -99 -278 35 12 -121 -37 39 -80 65 -23 -103
2689 -103 76 140 37 -22 -76 -127 -45 -224 -100 -94 -214 2 -223 -94 -209 -129 -182 -166 -194 -364 30 -104 -47 110
2713 110 -197 -114 -58 -190 -35 -10 120 32 204 -106 -216 -68 -115 -287 9 168 -76 -160 162 -270 -90 102
2735 102 -295 123 139 -314 200 74 -209 44 69 -177 116 59 46 46 206 245 1 -218 -249 -176 -5 -136 -103
2758 -103 -53 124 7 -159 -152 34 -236 41 -155 -178 89 -32 -6 22 182 173 36 20 20 -120 -20 362 -41 -321
2782 -321 -437 135 -177 -11 300 -178 -76 105 -31 -139 -77 22 -20 50 78 147 74 105 -107 -322 -4 -18 -29
2805 -29 102 -80 -130 119 23 -51 -97 -20 50 93 -26 -69 -3 -95 80 101 11 -57 313 -80 64 85 0 -60 43 152
$$ packed form
2640H8k24J65k83J07J23j48M9rj39L16J73j32o1J30j76J09N7j89l5pN2N2L0j80
2664a32m3L53m50R4l3LL8R4o1J37k72J26J1O1k5j79L13k3j33Q4P6j19J45q8q0
2689a03J79O4j03n9n4n1Q2j79J24Oj20K16k25J29j15Q0n3J6k8j70L94j34N7J57
2713A10l07Q3N6j32J55K5J30q8J72l10j10J48m7j72K96J59k44q4L22m32J80J92
2735A02l97M18J6m53N14j26k83K53K5k46K93n7j3%J60L9k44k19l1P3J71j31L3
2758a03N0J77j17j66PJ86k70K77j96k3K67j21K6K8J60rj37j6%j40J00L82m03k80
2782c21j16N72l12J66L11m78J02J81j36j08O2R9m2P0K8O9p3L1k12k15L18j4j1
2805b9J31j82n0K49r6p4m6P7P0M3j19m3O6r2J75K1r0o8L70l93J44K1q5o0J03J09
$$ plain form
2831 152 -130 29 134 124 -18 144 332 123 -27 57 167 -95 -125 -92 134 -78 99 39 61 14 -286 34
2853 34 -232 152 -101 54 139 148 -42 82 26 58 27 -55 -63 197 -6 93 -145 369 -218 -54 -16 -6 127 32 -152
2878 -152 -44 -23 22 -114 -76 -17 -64 96 -21 97 -360 82 -16 -32 77 -46 -132 227 57 -106 202 24 2
2901 2 57 -114 -89 12 46 169 20 92 209 71 160 101 142 116 184 61 48 76 7 49 -18 -51 69 -60 -101 198
2927 198 89 111 -169 127 160 22 -5 -66 43 139 188 143 -86 20 41 53 16 -76 67 173 151 87 90 -112 105
2952 105 79 106 -27 267 51 -30 8 95 -29 129 -19 133 35 -101 112 144 -37 12 -10 33 7 -95 -7 -136
2976 -136 48 223 116 -35 -201 -66 237 302 -96 -103 2 -240 153 129 -6 66 -230 127 100 16 92 231 285
2999 285 -141 -47 -36 164 205 38 74 -143 109 -18 -38 51 -178 -124 9 -31 -55 -105 -92 13 144 3 -285 -275
$$ packed form
2831A52k82J59J05j0j42J62J88k09j50Q4J10k62l0L3K26k12J77o0K2m7l00L20
2853C4k66L84k53J55Q5Rj90J24n6L2l1q2qK60k03R9k38N14n87J64L8J0J33r5j84
2878a52J08K1M5j36L8N9m7J60j17J18m57M42r8j6J09j23q6L59j70j63L08j78k2
2901BN5j71K5J01L4J23j49P2J17j38Q9n9M1k6O8j23j3K8o9M2o7l3J20j29m1K99
2927A98j09K2k80K96L3j38k7o1J09R6M9m5k29J06K1J2l7r2J43J06k2o4Lk02K17
2952A05k6K7j33K94k16q1L8Q7j24J58j48J52r8j36K13L2j81M9k2M3k6j02Q8j29
2976a36J84J75j07j51j66J35L03O5l98pJ05k42L93k4j35P2k96L57k7q4P6J39N4
2999B85m26R4J1K00M1j67L6k17K52j27k0Q9k29N4J33m0k4n0J3J05J31j41k88J0
$$ plain form
3023 -275 136 212 -114 -134 -223 96 34 -93 122 123 6 209 131 176 -5 72 97 90 81 -4 -147 -42 -197 -86 -130
3048 -130 -237 -101 -13 -42 -57 163 -130 19 10 -3 -109 -160 -251 -74 -100 122 227 134 93 -45 82 110 71 215
3072 215 5 -53 -81 37 42 -5 79 14 114 69 99 101 102 131 51 -67 141 -86 -1 39 134 -200 54 -51 213 126
3098 126 -4 211 190 57 -60 114 79 -38 71 -77 -161 -85 31 102 -7 51 97 -193 -14 -185 -31 42 16
3121 16 -195 57 -137 74 203 -105 84 58 127 154 -256 -137 -122 -11 -2 -191 35 -89 114 15 270 112 -77
3144 -77 23 110 -108 -62 57 145 16 17 -54 -92 22 -68 -129 23 38 48 -209 -7 -7 -36 84 234 42 168 -75
3169 -75 -52 -10 -58 165 -153 230 164 53 146 -221 -63 -135 -124 -243 101 -239 -202 -4 218 37 -133 -191 30
3192 30 193 -187 -158 -115 86 191 277 -207 143 45 -14 -13 -56 -79 -148 -148 -284 -109 277 -87 354 50 115 -16 -64
$$ packed form
3023b75M11P6l26k0q9L19o2j27K15Jj17K03p8M5j81P7K5prq5j43J05j55J11m4
3048a30j07J36Q8k9j5K20k93J49rj3j06n1r1J77k6K22J05r3m1j38J27K8l9J44
3072B15k10n8k8J18Nm7Q4o5J00m5L0KJK9q0j18K08k27Q5M0R5l34K54j05K64q7
3098A26j30K15k1j33j17J74l5j17J09j48q4P6J16P1j09N8M6k90J79j71J54P3k6
3121A6k11K52j94K11J29l08J89k6O9K7m10J19J5J11Rj89K26j24K03r9K55j58j89
3144g7J00Q7k18M6J19Q8j29Jp1l8J14r0o1J52J5J0k57K02%k9J20J50j92J26k43
3169g5K3M2m8K23l18L83o6j11R3l67J58p2J1j19L44l40L7J98K22j81j70n8K21
3192C0J63l80K9M3K01J05Q6m84L50r8n9Jm3k3o9%j36J75L86l64M41l04O5j31m8
$$ plain form
3217 -64 30 98 177 -111 29 -51 -87 -229 6 35 -119 -45 93 -48 209 -279 -131 -185 -85 104 -131 -45 -85 -174
3241 -174 13 8 17 44 -85 -1 9 -122 20 8 7 67 62 -20 -166 34 -107 135 -33 -138 157 1 119 -139 200
3266 200 7 -57 -215 -321 -27 -11 98 20 35 134 63 169 130 -9 52 150 77 -53 62 75 -56 -189 50 -119
3290 -119 -87 -46 78 -148 -162 84 -77 56 111 112 -104 -55 -83 -11 31 143 -3 -88 -124 32 113 -5 -88 -231 -5
3315 -5 70 73 -57 -206 -106 -119 32 -205 136 -11 208 -6 30 35 4 86 352 34 -56 -104 103 7 -95 60 78
3340 78 144 167 -160 -125 -5 48 -97 -176 -62 -91 44 201 201 -52 127 -212 156 -61 97 95 48 68 132 78 -29
3365 -29 13 160 -178 -104 -83 -123 -136 180 67 -134 28 -128 -100 -192 102 -188 -115 166 191 -50 -83 -41 -200 48
3389 48 2 -256 -140 -101 31 -178 -162 -117 153 -79 -185 39 -263 117 -34 -4 39 66 -108 -298 -66 102 -111
$$ packed form
3217f4R4O8P9k88J40q0l6j42K35K9j54P4J38j41K57m88J48n4J00J89k35Q6m0q9
3241a74J87nRK7j29Q4J0j31J42j2jO0nq2j46K00j41K42j68j05K95j56J18k58L39
3266B00j93o4j58j06K94J6J09p8J5R9p1J06l9j39O1R8p3j30J15J3j31j33K39j69
3290a19L2M1J24k26j4K46j61J33N5Jk16M9k8P2M2J12j46q5l6J56Q1j18q3j43K26
3315eP5Lj30j49J00j3J51k37L41j47K19k14L6Nl1Q2K66l18r0m8K07r6j02J55J8
3340G8O6K3l27L5J20N3j45p9J14k9J35J57%k53J79l39L68k17J58km7K0O4n4j07
3365b9M2J47l38P4K1m0j3L16j13k01J62j56K8r2K94k90P3K81K5k41l3M2j59K48
3389D8m6k58J16L9J32k09J6M5K70k32j06K24l02L80j51L0M3K7j74j90K32J68k13
$$ plain form
3412 -111 -94 206 16 -171 99 212 -25 113 -48 147 -70 190 -75 41 146 -10 -139 337 198 123 -158
3433 -158 7 103 -134 251 132 -227 118 146 -257 26 -30 -41 -41 84 -77 -217 -35 59 -2 23 283 -114 -43
3456 -43 -45 -46 -72 -131 -97 51 -197 -209 85 112 157 -49 47 -129 -128 202 46 -92 -129 -114 -307 -24 -227 34 257
3481 257 109 -123 -69 196 -308 139 -94 68 -133 115 -66 -4 96 -9 -46 -32 -57 12 51 -163 8 80 -208
3504 -208 101 -45 142 286 126 54 -39 146 166 -58 137 -79 -52 233 -62 -65 -212 56 -167 -59 251 11
3526 11 -97 -29 -2 88 -185 -57 -313 -154 -77 -200 -189 266 239 -118 47 38 -23 -202 115 110 -3 -142 199 -137
3550 -137 30 -38 23 -78 25 -74 -87 -60 100 133 27 -276 96 -67 -81 69 69 -64 -18 -256 -102 328 -36
3573 -36 -240 -20 112 104 -114 132 11 -105 -3 -67 -137 63 213 -94 97 75 137 -187 207 87 -127 -130 -177
$$ packed form
3412a11J7L00j90j87K70J13k37J38j61J95k17K60k65J16J05j56j29M76j39p5k81
3433a58J65R6k37L85j19l59L45K8m03K83n6j1%J25j61j40J82R4o1K5K60l97P1
3456d3kjk6n9L4J48k48j2K94K7M5k06R6j76JL30j56j38l7J5j93K83k03K61K23
3481B57j48k32N4K65n04M47k33J62k01K48j81O2J00j05l7J4k5O9L9k14J71P2k88
3504b08L09j46J87J44j60p2r3J85K0k24J95k16K7K85k95lj47K68k23J08L10k40
3526A1j08O8K7R0k73J28k56J59P7j23J1M55k7l57J65ro1j79L17nj13j39L41l36
3550a37J67o8O1j01J03r9j3K7J60L3j06l03L72j63j4J50%j33M6k38J54M30l64
3573c6k04K20J32qk18K46j21j16J02o4p0K00J50l07J91k2O2l24L94j20k14lm7
$$ plain form
3596 -177 59 98 74 59 40 217 57 78 76 111 -12 -50 164 -42 -166 158 -6 -66 128 -83 -122 -159 79 -130
3620 -130 -60 -82 164 1 32 53 84 -103 79 292 -102 42 66 52 -253 185 12 -54 112 235 192 51 132
3643 132 53 -60 -51 237 -127 -114 40 12 -124 11 20 7 24 -4 -139 -176 -27 118 -212 -9 -354 -8 336 183
3667 183 -141 -134 -15 138 97 0 -51 -239 -116 9 308 79 178 134 -232 21 -6 -221 -243 149 -120 -154 -76 29
3691 29 -46 100 -58 55 -31 21 -15 -64 12 -25 -24 -24 72 -107 -100 -36 60 -333 6 43 -5 46 -93 -40 2 37 159 178
3719 178 143 283 -9 275 56 -59 92 224 94 35 -177 -158 -207 335 -148 -235 203 94 -139 -168 24 -5
3741 -5 18 -122 -103 -95 14 61 -28 -48 -19 -92 56 -43 86 -11 -161 -92 -35 -187 127 20 353 156 13 103 70 -36
3767 -36 36 -65 -308 -82 -119 -184 -69 437 -177 59 36 97 136 -80 -98 -202 113 77 135 -38 155 120 5 -69
$$ packed form
3596a77K36L9k4j5j9J77j60K1kL5j23l8K14k06j24L24j64o0J94k11l9l7K38k09
3620a30P0k2K46j63L1K1L1j87J82K13l94J44K4j4l05M38j73o6J66J23m3j41Q1
3643A32p9j13RK88l64J3J54k8j36J35Rj3J7k8j35l7J49J45l30K03l45L46L44j53
3667A83l24PJ19J53m1r7n1j88J23J25K99k29R9m4l66K53k7k15k2L92k69l4P8J05
3691B9p5J46j58J13q6N2l6m9P6l7J%R6j79PO4R6l93L39L7m8N1j39N3M2L5J22J9
3719A78l5J40k92K84k19j15J51J32j30n9k12J9m9N42m83q7M38j09k33k9J92k9
3741eK3j40J9QJ09M7q9k0K9p3J48r9J29r7j50O9N7j52L14j07L33j97j43R0l3j06
3767c6P2j01k43K26l7o5J15N06o14K36k3O1L9k16j8j04L15l6N8j73J93l5j15p4
$$ plain form
3791 -69 -54 -26 99 9 95 46 -21 123 60 172 226 -35 151 190 -21 -112 -26 -68 107 115 -168 32 64 -120 215
3816 215 7 -3 30 -34 -236 -80 4 139 117 36 -315 -35 -140 130 -54 80 -26 -95 170 61 27 50 -67
3839 -67 -183 233 67 104 161 -11 -9 25 144 352 -51 25 66 51 -36 68 129 -177 -38 64 -48 12 104 -86
3863 -86 -349 -144 70 194 83 -23 56 15 -128 52 -21 105 76 -88 -176 -107 85 -163 36 -105 -153 -143 67
3886 67 179 179 140 -114 -47 -93 -149 -202 67 6 84 -34 -120 126 9 66 27 -31 103 109 -20 -90 -25 175 161 -19
3912 -19 -169 -36 -119 14 -13 114 116 32 192 143 28 -214 -62 -35 -261 56 -41 -113 -126 -168 27 229 51 63
3936 63 106 -133 -247 23 71 -99 -63 -208 -129 -196 -87 9 -160 -37 -24 73 32 97 -222 -41 205 309 146 -1
3960 -1 -193 -151 66 11 37 -31 162 26 -31 -159 285 -69 293 201 117 124 -52 -114 -45 234 28 -64 128 -240 214
$$ packed form
3791f9J5K8J25r0Q6m9o7J44o3J12N4k61J86L9k11r1Q6m2J75Qk83K00L2j84L35
3816B15k08j0L3o4k02J56Q4J35k2q1l51K80j05K70j84J34j06o9K65j09l4K3j17
3839f7j16M16j66L7N7j72KL4J19K08m03P6M1j5q7J04O1l06J39J02j12O0R2j90
3863h6k63K05K14J24j11j06P9m1j43J80p3J26k9j64q8O9J92k48J99j41m8J0K10
3886F7J12%l9k54O7m6n6n3K69o1P8j18q6K46j17N7l9n8J34Oj29p0O5K00j4j80
3912a9j50J33q3J33k7J27Kq4J60m9j15k42J52K7k26L17r7p2j3m2J95K02j78J2
3936F3M3k39j14K70M8j70L6j45P9o7J09R6j69J23J3R7m1O5l19J81K46J04j63j47
3960aj92M2K17n5K6o8J93j36n7j28M44l54L62r2q4Pj76o2O9K79k06r2J92l68M54
$$ plain form
3985 214 -117 -113 239 -5 -32 285 65 -168 360 -90 -94 -26 -148 -97 -55 -84 -138 -117 74 -49 55 -53 58 -87
4009 -87 -114 21 -60 30 -55 110 -108 -225 -51 -25 6 123 38 -16 4 -36 68 -207 -26 -135 4 39 208 58
4033 58 -144 -76 81 -33 25 40 -255 58 53 42 -87 22 -116 20 -37 -243 -90 295 -19 -159 62 -158 137
4056 137 -370 133 -161 -37 -67 29 88 -98 -135 -26 29 -47 260 175 255 -95 -21 140 -17 -34 68 286 -111
4079 -111 -271 140 -116 36 -179 215 -40 119 -245 13 29 -107 -61 29 11 -104 88 98 283 8 159 -50
4101 -50 193 79 -63 -86 35 223 168 -152 -73 140 69 84 -85 -58 6 124 -55 -40 37 -38 -55 46 -186 -277
4125 -277 149 -50 -4 -59 -10 -120 170 -2 -277 -47 147 21 -47 -127 -43 -109 -201 50 -139 -71 37 -58 -54 -128
4149 -128 -186 -89 -88 -184 -20 133 135 -30 -65 198 -32 90 112 68 0 -55 -107 104 -11 -22 -92 -88 -32 -9 -97 -100 -158 36
$$ packed form
3985B14l31ML52k44k7L17k20k33N28m50mO8j22N1M2k9n4K1J91j23J04j08J11j45
4009h7k7J35q1R0q5J65k18j17J74K6L1J17q5n4K0m0J04k75J81j09J39L5J69j50
4033E8k02O8J57j14N8J5k95L13nj1j29J09j38J36n7k06J53L85l14j40K21k20K95
4056A37n07N03k94J24l0R6N9j86l7J09N5p6L07q5Q0l50P4J61j57j7J02K18l97
4079a11j60M11k56J52k15L94k55J59l64K58J6j36M6R0j8j15J92J0J85k75J51k09
4101e0K43j14j42k3J21J88n5l20P9K13p1J5j69K7O4J18j79J5P7p5j7J01k32r1
4125b77M26j99M6n5M9j10K90j72k75K30J94j26o8q0Q4o6r2K51j89O8J08r5Mp4
4149a28n8R7Jr6J64J53Kj65l5K63k30J22K2m4o8n5n2K11j15j1p0MN6K3q8ln8J94
$$ plain form
4177 36 217 -110 157 8 -88 66 -13 103 -9 259 -61 -24 -26 -195 8 98 -163 -9 148 -195 117 -84
4199 -84 94 -35 184 -24 -137 76 -65 54 -133 -119 33 -200 111 54 -29 78 52 -55 -242 -43 -101 -134
4221 -134 -17 98 123 -25 84 -14 -30 -29 1 -3 116 171 14 -178 210 150 76 4 73 152 52 82 60 -97 371
4246 371 3 -21 -245 31 -91 88 -160 -82 26 20 150 -100 -61 -70 61 50 5 -205 112 -128 61 -168 5
4269 5 -85 41 21 -188 -130 86 -88 242 -233 -29 -87 -207 189 -151 -233 -148 77 -113 -128 99 158 -53 248
4292 248 60 -32 155 136 221 56 -61 -152 -44 -232 181 -114 -119 -118 -118 160 5 -57 -112 -24 4 87 -6 -30 235 10
4318 10 204 89 208 -54 201 111 31 8 63 -42 -124 -23 55 -9 -300 139 -77 136 14 56 74 -165 -120 -156
4342 -156 -93 159 -71 -81 -170 -58 31 -110 -34 183 19 148 -86 -176 -22 143 -151 273 53 86 32 13 -41
$$ packed form
4177C6J81l27K67j49r6J54p9J16j12K68l20L7kj69K03R0k61J54J57l43L12k01
4199h4J78j29K19k08j13K13j41J19j87J4J52k33L11n7q3J07k6j07j87J99n8l3
4221a34J17J15K5j48J09r8j6JL0mJ19N5j57j92L88o0p4p2O9P9j00L0k2j57M68
4246C71l68k4k24K76j22J79k48P8J08oJ30k50L9rJ31j1m5k10L17k40J89k29J73
4269Er0J26k0k09N8K16j74L30m75K04n8j20L96l40q2Q5K25j90j5K27N9k11L01
4292B48j88r2J87j9Q5j65j17r1J08j88M13k95nJ%K78j55o2n5Q8K8Q3r3k4K65k25
4318A0J94j15J19k62K55r0q0k3N5j05q2J01P8o4k91M39k16K13j22M2J8k39M5l6
4342a56O3K52k30j0q9J12Q9j41P6K17j64J29k34r0J54J65k94M24k20L3n4j9n4
$$ plain form
4365 -41 -315 -20 167 97 -23 -169 -231 -46 -109 92 -391 -126 183 28 -2 -11 -30 -331 -123 -325 170 -71 155
4388 155 91 -5 42 97 -84 10 -159 -61 157 -113 188 -88 20 30 -95 96 -65 3 85 -181 17 59 112 -158
4412 -158 -106 91 -97 -153 -246 -96 -6 -133 215 -163 -159 -126 10 -172 59 -42 -92 324 56 -78 45 -73 99
4435 99 -6 222 -63 254 117 21 -109 -61 -13 -45 187 81 -87 -40 77 -181 11 -51 178 13 -202 -134 16
4458 16 -205 -6 120 -51 239 -224 -101 108 10 -89 77 127 132 -59 -159 -292 12 87 -22 -168 109 -269
4480 -269 -235 81 -23 -250 -301 42 -54 70 -240 -79 -184 69 -10 -198 123 146 72 369 142 58 124 111 -1
4503 -1 -177 -47 114 -29 -79 88 -98 20 65 -156 156 292 118 170 38 265 -6 250 35 73 -31 -73
4525 -73 -29 -48 40 -160 76 -30 -23 -3 -24 -124 -177 -157 -54 -223 -110 -117 -188 -11 49 103 147 99 140 186 -31 -18 31
$$ packed form
4365d1k74K95J87p0j20j46o2J85o3K01m83K65L09j55l0rj9l01K08k02M95k41K26
4388A55o4r6M7N5j81R4j69R8K18k70L01k76J08J0j25J91j61O8Q2k66J98M2N3k70
4412a58N2J97j88n6r3J50R0j27L48l78ML3J36j82K31j01n0M16k68j34J23j18J72
4435I9j05K28k85L17j37r6j30M8M8l2K32j06j68M7J17k58J92o2K29j65k15O8J50
4458A6k21J99J26j71K90m63J23K09r8r9J66N0Nj91j00j33L04P5j09j46K77l78
4480b69L4L16j04k27n1L43r6J24l10J61j05K53p9j88L21K3p4K97k27q4O6j3j12
4503aj76J30J61j43n0J67j86J18M5k21L12J36j74N2j32K27k71K56k15L8j04m2
4525g3M4j9Q8k00K36j06PK0k1j00n3K0J03j69J13pp1J77O0N4M4m8M1M6k17J3M9
$$ plain form
4552 31 43 46 48 14 -73 -5 -74 93 -205 -16 -39 38 148 -127 273 209 -187 25 -141 -74 125 -247 -129 162 -188
4577 -188 -90 -73 165 48 121 -30 1 85 -83 -70 -51 72 -224 56 120 39 -85 247 78 142 -46 -13 416 163
4601 163 190 2 -87 53 -12 -39 -94 133 128 107 -55 74 -79 -81 -344 -150 -142 119 -30 242 49 -39 132 22
4625 22 -43 24 62 101 -33 139 102 -190 219 -151 342 -51 -138 -17 -19 -19 91 -33 -71 265 84 -5 125 2
4649 2 -174 67 -176 78 240 -234 106 139 39 27 38 70 95 191 -132 2 21 38 9 125 126 5 151 -53
4673 -53 -3 -84 -317 105 55 85 79 178 136 -116 54 214 -15 96 -147 -82 67 -190 -18 -28 103 94 58 109 168
4698 168 97 -296 -18 157 98 300 -135 196 -28 60 -95 -43 231 -81 205 157 53 201 373 -189 86 212
4720 212 -89 147 -109 75 -64 -21 -82 -36 33 -17 173 17 173 131 -8 114 -185 -223 -66 -215 -28 49 145
$$ packed form
4552C1J2LKl4q7O8o9J67k98J89k3P7J10k75M00o4l96K12j66O7J99l72J18K91l50
4577a88R8J7K38j17P3j51L1Q4j68J3J9J23k96K80O4q1j24L32j69O4j88L3M29k53
4601A63K7j88q9J40o5k7n5K27nk1j62J29j53kk63J94QK61j49K72j93q8J71j10
4625B2o5O7L8L9j34J72l7k92M09l70M93l93q7J21k%J10j24l8L36j81q9J30j23
4649Bj76K41k43K54J62m74L40L3j00j2J1L2K5R6l23J34J9J7k9J16Jj21J46k04
4673e3N0q1k33M22n0L0oR9m2k52J70J60k29J11k43O5J49k57J72j0J31rl6N1N9
4698A68p1l93K78J75n9K02m35L31k24Q8j55N2K74l12K86m8j04J48J72n62K75J26
4720B12l01K36k56J84j39M3o1M6O9n0J90j56J56m2j39J22k99l8J57j49J87P7R6
$$ plain form
4743 145 89 15 69 186 163 72 60 67 -74 28 17 -31 -10 4 -126 -124 -65 12 21 34 -237 -7 49 -88 176 302 30
4770 30 157 -71 -162 156 51 -127 111 -127 4 -196 -26 284 -2 34 -27 -6 -6 -68 127 -67 63 32 25 -24
4794 -24 -27 66 119 -11 -127 -139 22 -115 22 107 -110 32 -132 24 -180 -205 -125 68 29 124 -15 175 16 45
4818 45 80 -269 145 -126 -10 15 61 35 -137 24 -2 119 -105 -109 -39 -168 175 -109 8 -50 -100 -245 84 23
4842 23 211 -76 -88 -20 58 91 39 -26 -283 4 365 -85 -51 148 18 226 -73 119 119 -220 102 -56 182
4865 182 41 -25 -33 -135 47 -84 95 46 -106 19 82 293 73 -105 105 -234 -46 164 -9 -55 40 -187
4887 -187 -9 55 148 29 -66 -46 -90 -386 -154 -85 -24 18 56 -83 87 -163 247 204 -190 60 -152 102 85 -75
4911 -75 -194 1 12 128 83 81 50 -98 -54 -4 103 3 126 -54 67 -55 54 69 -206 18 -172 67 -149
$$ packed form
4743A45n6p4N4J17k3r1j2Pj41J02j1m8K1J4j30KN9P7RJ3k71K30N6j37K64J26k72
4770C0J27k28r1L18j05j78K38k38J31k00J70L10k86L6o1K1%o2J95j94J30l1pm9
4794b4lR3N3j30j16j2J61j37J37Q5k17J42j64J56k04k5Q0J93l9R5j39J90j59K9
4818D5L5l49M14k71J16K5M6k6j72J61k6J21k24mP0j29L43k84J17n8n0j45L29o1
4842B3J88k87j2O8P8L3n2o5k57K87L61m50L4J99j30K08k99J92%l39L22j58K38
4865A82j41o6qj02J82j31J79m9j52J25O3K11k20j78K10l39J88K10j73m6R5k27
4887a87J78O4R3j19r5K0m4k96K32O9O1M2L8j39J70k50M10m3l94K50k12K54j7j60
4911g5j19J95J1J16m5kl1j48M4N0J07j00J23j80J21j22J09J5k75K24j90K39k16
$$ plain form
4934 -149 56 -235 -256 141 131 97 123 39 -16 208 -61 -89 -234 62 61 -41 -9 167 -61 -172 -25 -50 80 61
4958 61 5 103 -119 141 222 -144 -9 -85 -115 -216 -280 132 -188 2 -74 -79 -90 -70 26 144 162 -156 185 -15 -84
4983 -84 219 72 -164 112 -11 57 12 -121 106 -282 -45 -194 39 -23 25 99 152 86 -10 11 35 -27 10 35 9
5008 9 157 40 16 -37 90 120 -30 387 -370 -193 -37 37 241 -121 -78 188 -55 35 53 112 106 103 94 105 283 -102
5034 -102 -94 134 -6 1 -98 -192 85 -170 150 -46 148 35 493 172 -82 10 -56 -20 -152 -19 -68 -49 199 -59
5058 -59 -157 98 -106 133 -61 36 77 175 -50 -59 89 -98 17 -132 -189 -175 -66 113 -32 -28 54 115 50 133 -68
5083 -68 -28 -151 -6 -115 24 144 -195 -4 -11 -28 -44 135 111 -94 189 171 195 -266 -18 169 -127 135 59
5106 59 -247 -11 -35 -118 91 181 -167 266 -35 362 132 -1 -69 -360 69 207 -39 -35 24 -81 -102 73 162
$$ packed form
4934a49K05k91k1L97j0l4K6q4n5K24k69k8j45K96jj02L2J76k28j11J47k5J30j9
4958F1n6R8k22K60Q1l66J35p6l0j01o4M12l20J90p6nj1K0R6J18J8l18L41k00o9
4983h4L03j47k36K76j23O8m5j33K27l88K37j49K33o2M8P4N3o6r6K1K4o2L7K5k6
5008IJ48j17k4n3J27L0j50M17p57J77J56P4K04l62M3K66k43R0J8N9olrJ1J78l85
5034a02QK28j40Pr9r4K77k55L20j96J94j13M58l21k54R2o6L6j32J33m9J9K48k58
5058e9r8K55k04K39j94R7M1R8k25rJ48j87J15j49n7J4J09J79j45MQ2O1o5Q3k01
5083f8M0j23J45j09J39J20l39J91pj7j6J79k4k05K83j8K4m61K48J87k96K62p6
5106E9l06K36k4q3K09R0l48M33l01L97k30j33o8k91M29J38k46MN9j05k1J75Q9
$$ plain form
5129 162 289 199 8 -129 -28 -63 -308 -85 63 112 -87 117 -44 -49 45 88 50 -109 48 119 -80 1 113
5152 113 -10 -52 -49 -204 -25 -80 215 96 -184 88 201 146 27 -47 -192 -28 -159 -98 -79 85 -1 61 -101
5175 -101 81 70 -196 -206 84 -44 138 -85 -148 350 -181 -117 217 -9 160 -121 -254 -270 -52 -219 -113 -277
5197 -277 -186 -86 21 -204 -179 178 179 83 224 -16 -105 123 332 205 -1 -1 147 -101 -146 -173 115 98 -140 154
5221 154 147 -53 67 -19 141 205 17 -97 154 -38 -118 -212 -32 64 -54 -75 -175 -155 -210 254 92 139 -62 63
5245 63 28 -37 188 59 -44 -104 72 -11 -67 21 -22 25 232 98 -84 18 -9 64 -39 -126 131 0 73 -154
5269 -154 -129 79 131 -75 -9 -272 85 267 -112 -54 -75 -17 62 -19 -122 -88 70 -34 -109 -33 85 139 -306 176
5293 176 -203 -90 36 -225 17 -46 -23 -88 -31 10 -13 135 121 -9 -134 9 121 12 67 -31 53 -52 -41 40
$$ packed form
5129A62J27r0j91j37J01l5k45K23J48M9j99K04j61nR4M3l8j59J57P1j99Q1J12
5152A13j23m2Lj55J79n5K95j19k80K72J13n5j19p4j45J64j31O1J9J64q6O2j62
5175a01J82j1k66j0K90j28J82k23o3M98n31O4L34k26J69k81j33j6K18j67J06j64
5197b77R1J00J07k25K5L57Jr6J41k40q9K28K09j27k06%J48k48m5k7K88j7k38K94
5221A54pk00J20q6J60O4j88j14K51j92q0r4J80R6j18k1j00K0n5M64j62M7k01J25
5245F3l5o5K25j29j03o0J76q3n6Q8m3M7K07j34j82J02k7P3j03q7K57j31P3k27
5269a54K5K08N2k06O6k63L57J82l79N8k1N8P9q1j03L4J58j04p5P6J18N4m45M82
5293A76l79J13J26k61K42o3K3o5N7M1k3J48j4j30j25J43J12j09N5r8Q4j05J1Q1
$$ plain form
5317 40 120 -44 13 -68 45 -116 138 -210 -137 71 -35 -26 -121 -124 297 205 -9 -49 -12 325 261 -8 -213 45 -11
5342 -11 -119 48 87 -77 116 -2 -227 82 -194 -105 65 -127 -103 45 184 110 -27 -2 255 -17 -19 19 -10
5365 -10 63 280 -334 -16 125 144 -5 -102 -13 -64 39 150 98 132 45 -71 -16 124 121 27 45 -96 96 60 -156
5390 -156 -221 37 1 44 40 -38 -13 -184 -39 -73 11 141 -27 -134 -126 41 54 -327 2 -104 -79 -104 -43 -179 139
5415 139 105 -166 106 20 -58 126 -29 95 106 25 -52 -51 522 -163 38 -211 -63 17 -200 -43 -263 -9 -102
5438 -102 -76 17 130 -11 107 29 45 -209 -31 -27 -32 245 55 -7 -196 69 88 204 -48 -146 -132 76 139 -22
5462 -22 -107 -97 27 -175 -26 100 -164 -93 49 -80 242 -23 -193 -193 96 146 28 -189 -227 -182 45 -138 106
5485 106 -158 131 38 -277 134 -172 227 -168 39 138 -155 -50 4 -206 173 5 53 -298 130 239 -13
$$ packed form
5317D0Q0j64N7q1J13j61K54l48P3K08j06Rr5lM21r2k14m0L7L37o4k69k05K58n6
5342a1j08J67L9j64J93j18k25L09k76Q9J70j92K4J48J39p4j37K5K57k72kL8k9
5365a0P3K17o14L18J41J9j49r7Q9n1J03J11n2L4q7j16N5J40lr4J8j41J92l6k16
5390a56o5K58l6M3mp8K5j71J45l4Q4J30j68j07QJ67J3l81L29j06K5k5O1j36L18
5415A39l4k71K72q6p8J84j55J24J1q1p7JN73o85K01k49J48Q0k17J57k20K54r3
5438a02K6R3J13j41J18p8J6k54J78MnK77j90o2j89K65J9J16k52r8J4K08O3j61
5462b2q5J0J24k02J49J26k64P1J42j29L22k65j70%K89N0j18k17l8M5K27j83K44
5485A06k64K89r3l15M11l06L99l95K07R9k93J05N4k10L79j68M8l51M28J09k52
$$ plain form
5506 -13 -155 -103 -37 -95 233 39 87 -125 201 -120 -137 55 -134 -134 1 42 -127 14 57 62 -179 -59 86 91 -140
5531 -140 -125 -182 238 132 -206 91 109 40 -215 -59 -48 11 180 188 -39 -59 -68 33 0 -63 -120 -13 59 -51 -122
5556 -122 136 -149 31 -48 121 -142 131 -163 -113 119 -346 177 -103 -301 -114 66 -66 -38 -4 17 15 -20 212
5579 212 61 51 32 -222 -50 -138 -208 -52 -151 -78 56 -17 -33 -110 128 -41 -42 2 -136 -73 72 215 348 -121
5603 -121 87 -48 95 9 -125 112 -138 19 -72 -137 -55 5 42 193 -132 -192 20 229 -34 26 -1 -147 68
5626 68 -89 5 157 45 243 -171 -58 -128 73 -139 -27 147 68 -281 -33 -40 -16 -30 -287 83 33 151 107
5649 107 -42 -110 192 -99 168 7 62 50 -50 122 -70 30 -57 -68 0 -79 189 210 -132 -23 -154 -29 186
5672 186 14 -59 80 1 -6 92 14 188 -173 27 -173 -118 -102 76 -60 -205 -29 -43 -344 -91 -54 -19 -112 -167
$$ packed form
5506a3j42N2O6n8L28j94M8k12L26l21j7J92j89%J35M1j69J41M3Nk41J20J45Nk31
5531a40J5n7M20j06l38K97J8o9k55J56J1N9J69Qk27k0rJ01l3o3n7J07P2j10p1
5556a22K58k85J80p9J69k63K73k94N0K32m65N23k80j98J87J80j32K8L4K1kl5K32
5579B12j51j0j9k54J72q8p0J56r9P3J34p3j6p7K38j69jM4j38O3J45J43J33m69
5603a21K08j35J43q6j34K37k50J57r1o5Q2O0L7J51l25o0K12K09k63O0k7j46K15
5626F8j57R4J52j12J98m14J13p0K01k12J12J74p9l49K48pK4j4k57L70n0J18m4
5649A07j49o8L02k91K67j61N5j2j00J72j92J00q7j1O8p9K68K1l42J09j31J25K15
5672A86j72p3J39p9pR8p8J74l61K00k00N5J6J78j36j45J76j4l01K53L7L5r3n5
$$ plain form
5696 -167 -82 -128 -153 177 -29 -7 324 -79 -75 98 -4 -253 207 -146 -54 -4 -246 178 144 -113 165 124 24
5719 24 78 -24 -91 85 55 -217 -309 -114 18 66 118 103 104 -65 -159 -109 -93 -172 1 -22 -164 -120 292 80 -331
5744 -331 203 -110 -172 -89 -272 163 53 27 27 33 23 -157 121 162 151 -35 122 -9 119 -84 -176 -162 -97 94
5768 94 -1 -285 -37 22 191 199 206 -89 -32 7 -25 -22 -66 36 -24 -129 -55 232 -138 -80 -71 60 -70 129 -13 87
5794 87 14 -57 -161 57 302 -156 87 -76 -125 138 140 -39 -129 41 6 -92 156 114 -30 176 -87 -53 92 -143
5818 -143 57 204 62 -92 -263 -189 205 -21 104 -24 19 44 -77 -236 -229 109 28 58 -65 90 -104 31
5840 31 -300 -218 -196 37 -15 -88 13 -7 157 78 38 -36 40 -24 63 -45 343 176 251 -485 -791 -915 -160 -200 -199
5865 -199 -90 16 -8 -203 4 68 252 -127 102 27 88 46 -120 -70 -198 154 -53 -47 192 8 -132 85 170
$$ packed form
5696a67Q5m6k5L30k06K2L31m03MJ73j02k49M60l53R2N0k42M24l4k57K78m1j00
5719B4N4j02o7J76l0k72r2J95J32M8N2j5Jj69r4N0J6p9J73k3j42M4M12k12m11
5744c31N34l13o2Q3j83M35j10k6%Oj0j80K78M1j1j86J57j31J28k03r2J4O5J91
5768I4r5k84K48N9J69QPk95N7L9l2Lm4J02o0j05P4K87l70N8RJ31j30J99j42J00
5794H7p3p1j04K18K45m58K43j63m9K63Kj79r0J70l5r8K48m2j44K06k63L4J45k35
5818a43K00J47j42j54j71P4L94k26J25j28M3K5j21j59PL38q1L0j23J55j94J35
5840C1l31Q2K2K33n2p3J01k0J64p9m0p4P6o4Q7j08L88j67P5p36l06j24P55m0J
5865a99J09J06k4j95K07O4J84l79K29p5O1m2j66N0j28L52k07OK39j84j40K17Q5
$$ plain form
5888 170 -195 241 -73 144 -1 77 -22 199 -169 35 -193 -636 74 -600 174 27 27 14 -61 42 25 147
5910 147 98 -52 47 40 -98 -204 -14 -170 46 -21 141 -12 -54 91 -9 58 -33 -56 -163 182 86 41 160 163
5934 163 -71 -136 -250 6 -142 164 -196 3 6 89 37 81 -73 39 -52 -7 6 -82 130 34 -116 -25 37 -175
5958 -175 -107 -90 224 76 33 -44 26 -29 -148 -211 104 -57 -39 54 59 195 11 28 105 73 21 74 -111 138 31
5983 31 -58 202 -126 -215 -74 120 -10 -181 -115 150 -13 177 -182 -87 -75 129 -87 4 165 -56 26 168 -148
6006 -148 96 90 -7 -252 77 -191 -61 101 -38 285 -35 182 -150 88 -28 -6 89 198 225 145 -1 58 -2
6029 -2 55 -214 5 -31 82 109 -149 129 147 94 20 -91 54 -63 -61 86 -80 181 97 112 -19 -16 74 165 192 -80
6055 -80 287 60 -47 -2 -7 69 98 -63 -232 -77 -113 110 43 29 -71 107 -50 -157 241 -65 -21 231 -39
$$ packed form
5888A70l65M36l14K17j45P8r9K21l68K04k28m43P10o74P74j47%j3p5J03j7J22
5910A47m9j50R9pj38j06J90j56K16o7J62j53m2J45j00O7r1k3j07L45r6m5J19L
5934A63k34o5j14K56j48L06l60J99LQ3n2M4j54J12r1M5J3q8K12r6j50R1O2k12
5958a75O8J7L14j48m3p7P0n5j19o3L15j61J8R3NJ36j84J7P7l2n2N3j85K49j07
5983C1q9K60l28q9J41J94j30j71O6K65j63J90l59R5J2K04k16R1J61k21Q2J42l16
6006a48K44or7k45L29k68J30J62j39L23l20K17l32K38j16K2R5J09K7q0j46N9o0
6029bN7k69K19l6J13K7k58K78J8n3p4j11J45j17KJ47j66K61q4J5j31LR0R1K7k72
6055h0L67k27j07M5nP6K9j61j69J55l6K23o7j4j00J78j57j07L98l06M4K52k70
$$ plain form
6078 -39 141 -7 250 -138 -71 -22 -145 -63 -83 205 -144 -2 156 -57 60 -55 -54 60 135 144 -220 -30 -19 254
6102 254 0 140 205 -28 95 -113 101 26 -110 44 -130 -387 137 124 53 -81 -73 -170 -153 88 231 98 -126
6125 -126 -15 -185 71 138 -140 170 70 -48 -312 4 -168 74 -109 -204 -178 1 78 -63 -37 -38 -348 -139
6147 -139 -97 68 26 35 20 -228 -71 -145 -76 129 36 -145 -12 -159 135 -106 -95 79 -117 -97 145 -40 -224
6170 -224 -163 84 290 -19 52 52 -134 139 -38 -145 -164 89 -179 -112 -94 7 -49 34 -93 23 -54 18 -68 -198
6194 -198 46 7 -42 -94 -134 -124 121 65 132 101 7 131 -10 -53 82 -25 -54 70 5 -30 -14 64 77 -163 12
6219 12 19 75 -365 142 25 177 14 -74 -96 -273 -145 -38 13 -141 168 58 -233 -163 -2 84 60 -127 -138 105
6243 105 211 -144 32 31 45 -25 -45 -92 -9 34 -114 -93 385 9 183 -208 44 -520 -114 -413 -51 217 -285
$$ packed form
6078c9J80j48K57l88O7M9j23Q2k0K88l49J42J58k13J17j15JJ14P5Rl64J90J1K73
6102B54k54J40O5k33J23k08K14p5j36J54j74k57N24j3p1j34Qr7J7K41J43j33k24
6125a26J11j70K56O7k78L10j00j18k64L16j72K42j83r5K6J79P7j41K6jl10K09
6147a39M2J65m2Rj5k48J57p4O9K05r3j81J33j47K94k41J1J74j96K0K42j85j84
6170b24O1K47K06l09P1%j86K73j77j07j9K53k68O7J8J01n6Q3j27J16p7P2q6j30
6194a98K44l9m9n2m0J0K45n6O7l1r4J24j41m3J35j07k9J24o5l5J6P8J3k40J75
6219A2PN6m40N07j17J52j63q8k2j77J28J07N1j54L09j10k91P0J61Q6k4j87j1K43
6243A05J06l55J76jJ4p0k0m7Q3M3j48K1M78l76J74l91K52n64M06k99L62K68n02
$$ plain form
6266 -285 309 26 192 -146 -107 -44 108 -212 207 -165 -4 10 -59 -27 3 47 39 211 112 120 253 99 62 -75
6290 -75 233 106 -139 329 -236 124 285 -111 31 -18 -144 -20 -96 13 -84 9 -53 -16 -64 34 -76 8 15 -73
6314 -73 -56 -224 -42 -159 -208 -131 306 332 -214 105 212 -96 200 29 -281 -63 95 190 181 -55 67 19 -55
6337 -55 -119 10 116 22 -64 -153 -138 45 -161 -349 176 44 -53 -157 -33 94 69 89 -146 211 -28 -83 293
6360 293 -22 -28 -149 -98 171 32 -140 -183 -12 -11 -11 62 2 -291 -89 166 122 2 11 100 8 14 -24 50 329 59
6386 59 -17 -134 -232 29 -24 -50 24 231 -76 -140 -9 -120 114 209 49 49 85 -184 -202 -2 -42 102 -27 251
6410 251 86 -5 204 -117 -69 128 0 120 26 -63 -115 -149 52 -123 -175 29 191 -36 89 75 70 14 17 72 88
6435 88 -242 -63 107 -42 -267 77 -42 13 19 -90 -232 -143 -89 91 -70 43 100 -45 -12 -116 38 200 311
$$ packed form
6266b85N94k83J66l38L9O3J52l20M19l72J61J4o9L2L0M4qJ72r9QJ33j54l7j37
6290g5L08j27k45M68n65L60J61l96J42m9j26J24p6J09r7R3o2L7m8R8j10Q4Pq8
6314g3J7j68J82j17m9P7M37K6n46L19J07l08K96j71l10K18J58R5rk36J22m8p4
6337e5o4J29J06r4q6q9J5J83k06j88N25j32r7j04J24J27k5K0k35L57k39n5L76
6360B93l15oj21N1K69j39j72m3J71J%P3o0k93K02K55m4j20RQ9r2Ol8P4K79k70
6386E9p6j17r8K61n3k6P4K07l07o4J31j11K34R5j60%L6k69j8K00m0J44j29K78
6410B51j65r1K09l21M8J97j28J20r4q9n2l4K01j75n2K04J62k27J25j4nn6LN5J6
6435H8l30J79J70j49k25L44j19N5Oj09j42Q9N4J80j61J13N7j45L3j04J54J62J11
$$ plain form
6458 311 70 59 239 -64 -58 -96 14 30 23 -17 177 -119 159 -283 -69 -150 190 192 98 -40 82 186 -148 -227
6482 -227 -143 76 15 112 10 111 -263 -81 98 -130 189 -64 162 23 24 -149 -96 61 -63 -58 28 -49 -141 -73
6506 -73 -233 224 91 105 -35 -123 -138 -34 94 235 15 -19 332 -192 -116 280 155 -127 -64 -38 -3 234 76
6529 76 47 -116 13 -91 17 47 126 -202 -113 1 -92 -212 24 -77 -80 -272 -219 14 124 40 -217 18 90 -237
6553 -237 1 -73 50 191 72 110 -20 161 77 113 16 -339 304 56 -111 -131 -22 82 -8 -33 -29 -129 75
6576 75 -57 -45 -54 -112 91 27 152 -230 -18 -93 -140 100 120 167 -36 9 101 -139 44 167 -24 41 33 0 21 -90
6602 -90 74 113 -136 -93 -215 68 190 103 68 -11 -242 0 70 168 109 -109 -70 129 -19 30 -115 -34 -69 1 -169
6627 -169 -53 72 79 -162 -141 -145 -7 80 64 153 -41 73 83 56 -47 0 -65 187 -62 -371 86 -331 -33 3
$$ packed form
6458C11k41j1J80l03Ol8J10J6pm0J94k96K78m42K14q1L40Kr4j38J22J04l34p9
6482b27Q4K19o1R7j02J01l74J82J79k28L19k53K26j39Jj73N3J57j24NQ6p7r2O8
6506g3j60M57j33J4j40q8j5J04J28J41k20l4L51n24P6L96j25k82O3K6L5K37j58
6529G6k9j63J29j04J08L0P9l28Q9J14r3j20K36j01lj92N3K33J10q4k57K35P2l27
6553b37K38p4J23J41j19L8j30J81q4L6r7l55O43k48j67k0J09J04r0k5Mj00K04
6576G5j32J2rn8K03o4J25l82K12p5m7K40K0M7k03M5R2k40J83J23j91O5ql3K1j11
6602i0J64L9k49M3j22K83J22q7l5p9k31K42P0R8n9k18L9J99j48M9j45Q1l5P0j70
6627a69J16J25Pk41K1mJ38Q7j6Q9j94J14J0k7j03M7o5K52k49l09M57m17K98L6
$$ plain form
6651 3 -130 103 -42 -37 94 34 28 -7 -222 248 -110 145 27 -162 171 203 -112 -110 26 42 45 176 59 62 369
6676 369 215 -54 -115 -132 139 -6 -19 184 -130 75 -19 -241 5 67 20 36 74 59 151 -17 46 316 -77 -2
6700 -2 43 76 -182 -30 57 43 121 -13 28 -39 60 -10 120 -195 -114 259 199 154 -59 -47 -254 25 93 357 167
6725 167 102 212 334 70 -75 88 126 -24 -149 80 70 -130 50 24 -45 -55 104 51 13 3 -98 192 268
6748 268 -172 250 7 27 -31 -5 -21 59 -49 -180 136 40 158 -144 -124 70 -301 -164 22 16 101 -9 -281
6771 -281 91 95 173 -148 66 262 103 158 209 -51 9 212 -129 169 -111 91 39 120 207 194 -3 -78 -71 73
6795 73 -144 -19 53 -165 -305 -122 27 110 180 -368 168 21 -131 -136 134 97 -106 313 110 -129 -82 -153 116
6818 116 -150 -56 -65 -60 29 -169 136 -12 58 92 44 221 127 -219 156 44 -49 -157 206 -210 95 64 -115 -6
$$ packed form
6651Cj33K33j45NJ31o0ol5k15M70l58K55j18j89L33L2l15KJ36J6LJ31j17LL07
6676C69j54k69o1j7K71j45j3K03l14K05r4k22K46O2m7J6L8j5R2j68O3K70l93P5
6700bM5L3k58J52Q7j4P8j34M1o7R9p0J30l15Q1L73o0m5k13J2k07K79O8K64j90
6725A67o5J10J22k64j45J63L8j50j25K29j0k00J80k6o9j0J59n3l8j0j01K90P6
6748B68m40M22k43K0n8K6j6Q0j08j31L16r6J18l02K0J94l71J37J86oQ5j10k72
6771b81L72MP8l21K14J96j59N5N1k60O0K03l41K98k80K02n2Q1Q7j3j97p5PJ44
6795G3k17J25P2k18j40J83J49Q3P0n48N36j47j52nK70l7k03M19k03k39M7p1K69
6818A16k66R4rNQ9j98L05j48P0L4m8J77r4l46L75j12r3j08L63m16L05l1j79J09
$$ plain form
6842 -6 36 -84 -147 7 -8 -57 -93 64 -160 -118 44 229 68 175 102 22 -46 -98 -31 -136 111 21 293 -43 25
6867 25 -92 244 -78 113 -123 63 -24 -185 97 120 2 -256 -199 58 27 -2 150 -266 123 -83 -63 34 40
6890 40 41 -16 243 -49 -7 127 -45 6 -240 -52 142 200 -94 51 -98 110 -85 -27 69 -199 145 74 102 -65
6914 -65 -104 267 -45 48 -57 -158 145 94 20 18 132 128 238 -19 38 38 -131 87 30 49 -53 127 -49 89 -161
6939 -161 35 12 -272 -217 104 139 -130 128 -164 -79 -12 -91 -130 -18 107 357 36 151 76 46 147 -75 -165
6962 -165 147 48 -157 72 -187 67 78 209 -55 -95 -28 -189 -53 -121 47 40 -104 -49 -65 -15 183 24 -13 38
6986 38 66 -127 127 59 94 41 2 -101 -17 -8 -236 -119 -103 -70 204 198 148 -73 84 -40 -150 -137 -118 150 172 -120
7012 -120 63 -77 87 -46 80 61 -114 -123 55 222 -60 -16 41 12 -128 24 -324 -86 59 -128 -91 104
$$ packed form
6842fM2j20o3J54j5m9l6J57k24M2J62J85j61J07p3q0o8n2O7j05K47r0K72l36O8
6867B5j17L36l22J91k36J86q7j61K82K3j18k58N7K57l1k9J52m16L89k06K0R7O
6890D0Jn7K59k92M2J34j72N1k46J88J94N8k94J45j49K08j95N8R6k68L44p1K8j67
6914f5l9L71l12R3j05j01L03n1p4kJ14mJ10k57N7%j69K18n7J9j02J80j76J38k50
6939a61J96k3k84N5L21L5k69K58k92Q5O7p9l9J12J25K50l21J15p5l0J01k22r0
6962a65L12r9k05K29k59K54J1J31k64m0O7j61J36o8J68pj44N5j6N0J98j59l7N1
6986C8K8j93K54o8L5n3l9j03Q4Rk28J17J6L3K74on0k21J57j24j10J3J9K68K2k92
7012a20J83j40J64j33J26j9j75rJ78J67k82M4N7k9j40J52l48K38J45j87L7J95
$$ plain form
7034 104 128 126 152 -70 136 55 79 -80 324 46 -64 137 133 -109 129 193 -10 52 45 97 240 26 144 -244
7058 -244 -84 111 121 -41 112 38 -158 -39 -123 148 -159 133 43 52 -123 -6 105 144 -59 117 109 5 -38
7081 -38 193 -29 -64 147 -114 0 -71 6 -10 91 -136 88 10 -85 142 132 -68 101 -137 -76 346 -115 64
7104 64 -2 -84 106 -63 -57 186 45 84 168 23 -112 41 44 156 99 15 -35 -67 -19 -93 125 -23 -88 -10 -11 75 29
7131 29 15 -171 -121 -4 95 -19 17 10 40 85 116 92 -103 -123 -76 150 144 83 -59 102 25 115 87 158 164 187 -105 84
7159 84 135 -66 -101 -6 -64 29 75 -70 2 -232 -69 -12 36 -69 -295 213 -180 88 195 107 3 47 240 -118
7183 -118 -228 233 253 -30 -284 -15 275 175 93 -125 103 -14 20 175 -93 205 63 -14 43 12 70 82 96
7206 96 -229 34 128 53 2 -70 -12 -32 -96 -73 -265 273 -161 -158 121 -82 47 50 -36 129 33 -97 -14 148 -70
$$ packed form
7034A04K4kK6k22K06q1K4j59M04k78j10K01mk42K38O4k03O2pN2J43k14J18l88
7058b44J60J95J0j62J53p4j96J19q4K71l07K92r0Rj75J17J11L9k03J76qj04m3
7081c8K31k22l5K11k61J14p1P7j6J01k27K24p8r5K27j0k00J69k38O1M22m61J79
7104F4o6q2J90j69OK43j41L9Q4j45j35J53LJ12n7q4n0l2M8p4K18j48o5P8jQ6m6
7131B9j4j86N0J17R9j14L6pL0M5L1k4j95k0M7K26oo1j42J61p7R0k8P1OK3k92J89
7159H4N1k01l5R5n8R3M6j45P2k34J63N7M8j05k26N08l93K68J07q8j04M4J93l58
7183a18j10M61K0k83k54K69K90j00q2k18K28j17L4J55k68K98j42p7N7l1N8J2J4
7206I6l25K63R4p5n1p2N8k0o4K3j92N38m34LK79k03J29Lq6J65r6j30Q3J62k18
$$ plain form
7231 -70 40 83 145 25 -226 -116 112 187 10 39 -107 205 -124 -176 21 -49 -112 166 -12 -31 37 130 -27 46
7255 46 114 -46 -13 -322 208 232 116 90 110 148 97 100 -75 -34 -51 48 -151 -4 127 126 -86 168 -77 -147 35
7280 35 -109 6 -68 228 -68 45 -73 102 -37 -114 16 194 -83 -25 -123 -37 -128 8 -171 44 -60 -153 -61
7303 -61 54 228 -42 -104 10 -46 6 -9 -65 79 22 -268 -153 388 42 13 310 -248 180 135 -98 56 -235
7326 -235 34 -58 62 168 178 135 -63 218 53 -171 120 187 108 -49 127 108 -6 -84 -43 -4 113 -70 -68 61
7350 61 -22 -38 -32 60 29 4 -89 -7 24 29 42 -137 148 -32 35 -109 -162 180 -356 -3 45 151 -66 -176 76 77
7376 77 -82 100 -60 212 0 96 -82 36 -130 66 -83 -49 -158 67 -20 -34 -5 60 -42 -104 147 56 -30
7399 -30 -66 -155 115 138 111 -9 156 -49 -34 -39 103 167 58 3 -9 86 -290 -321 -235 27 -51 91 28 -150 -53 40
$$ packed form
7231g0J10M3O2j20k51J10K28P5j77K9j46L12l29n2J97p0o3K78j78j9O8R3j57P3
7255D6O8j60L3l09N30K4j16k6K0L8n1Lj75M1j7R9j99J47J31jk12K54k45p0J82
7280C5j44J15p4K96k96J13j18J75j39p7J30J78k77N8r8Q6r1J36j79K15j04r3R2
7303f1J15J74k70o2J14n6N2j5n6J44n7k90J15N41l46k9K97n58M28m5k33J54k91
7326b35K69r2J20J06J0m3j98K81j65k24K91O7p9j57J76j9j14p8M1L9J17j83KJ29
7350F1q3j6OR2l1k5r3Q2L1NJ3j79K85j80O7j44n3L42n36L53M8J06k17j10K52J
7376G7j59J82j60K72k12R6j78J18j66J96j49L4j09K25q7j4K9O5j02o2K51r1q6
7399c0l6q9K70K3k7j20J65k05J5nJ42O4j09n5j2R5l76l1Q6K62p8J42o3j78R7R3
$$ plain form
7425 40 -125 -1 38 -82 -149 -102 20 58 61 -76 227 -65 -99 -47 -83 -31 106 -30 264 -238 43 44 122 191 -63
7450 -63 -31 -86 11 -102 90 -213 -100 62 12 -22 73 30 18 -141 -85 -71 -157 -1 20 85 269 -114 -2 34 -123
7475 -123 24 -144 214 12 41 168 -164 347 131 -150 -116 -69 182 -208 -96 132 -47 11 -290 69 42 199
7497 199 -4 32 151 -71 -57 -45 58 7 -18 52 137 -128 92 63 119 83 -132 90 187 172 102 94 101 -339 68 195
7523 195 31 219 214 100 191 -121 22 65 -156 -109 47 -50 -13 33 97 103 9 -23 36 -294 20 -63 182 65 -25
7548 -25 -5 40 207 14 180 132 184 -49 -184 -9 78 -37 -179 205 -127 -375 -4 244 -242 264 203 109 26
7571 26 -85 38 -27 50 -213 15 -199 -144 102 62 -76 -250 -154 -139 77 -152 29 -2 90 17 289 -103 -57 -253
7595 -253 -221 133 -166 -85 -189 86 160 134 146 1 -36 23 222 285 128 154 -191 -72 -2 141 -40 -101 8 -80
$$ packed form
7425D0j65J24L9j20o7M7J22L8Lj37L03k92l4N2l6N2J37j36K94n02K81JP8O9k54
7450f3L2n5R7j13J92l03J13J62n0l4R5m3j2j59N6J4q6J56K1O5J84l83J12L6j57
7475a23J47j68L58k02K9J27l32N11k16k81L4M7K51l90J12K28j79N8l01L59k7J57
7497A99k03L6J19k22J4J2J03n1k5P0Q5k65K20k9N6l6k15K22R7j5p0qPm40M07J27
7523A95j64J88nj14R1l12J43M3k21M7J56r7L7M6O4Or4l2N9l30L14q3K45j17r0
7548b5K0M5J67j93J66m8N2k33j35J75Q7j15j42L84l32k48L71K48m86N06o1r4q3
7571B6j11J23o5P7k63K28k14N5K46m0j38j74R6J5K16k29J81l1R2p3K72l92M6j96
7595b53L2L54k99Q1j04K75P4k6J2j45l7N9J99O3j57K6l45J19P0J43j81o1J09q8
$$ plain form
7619 -80 236 37 37 72 -121 98 -86 306 32 115 -39 12 217 149 126 -155 -48 115 8 17 25 173 78 54 48
7644 48 269 -33 127 -39 -18 120 -100 103 153 16 104 236 17 -56 8 -99 186 224 18 -20 -52 -111 107
7667 107 -18 221 327 -146 -63 -28 -202 64 -31 24 -1 98 -85 46 -41 105 -256 188 50 76 -41 188 108
7690 108 -269 -169 155 23 179 -90 -20 167 44 9 -98 4 -142 -51 103 186 -122 19 1 -171 54 -65
7712 -65 71 5 118 -70 -66 125 20 122 -162 116 253 5 254 74 -31 -238 2 13 -58 -64 -47 -68 116
7735 116 -153 27 -16 88 -39 87 -5 -40 -161 146 -128 -138 54 -36 13 107 28 9 8 318 36 294 -133 -336
7759 -336 66 -45 -50 -348 -113 -48 -203 114 15 90 157 -91 34 -80 50 46 164 -45 -108 8 241 -26 -61
7782 -61 -141 61 -25 20 94 110 -37 -36 244 -18 170 -72 149 46 -15 43 160 -264 88 71 -41 -175 199 -103
$$ packed form
7619h0L16j99%L5j93K19j84L92k74Q3j54N1K05o8k3k81J07J63j07RQJ48r5k4o
7644D8K21l02J60j66K1J38k20K03N0j37Q8J32k19p3O4j07K85L8k06l8l2n9K18
7667A07j25K39J06m73Q3L5j74K66r5N5k5R9j83J31q7J46l61M44j38K6j17K29q0
7690A08l77J00L24j32J56k69P0J87j23l5j07J02j46R1J54Q3l08J41j8j72K25j19
7712f5J36o6J13j88MJ91j05J02k84K78J37k48K49j80j05k07K40J1p1oJ7k1J84
7735A16k69J80m3J04j27J26r2l5j21L07k74j0J92r0M9R4p9j9jL10k82K58m27k03
7759c36M02j11nk98K35O5j55L17r9P5O7k48J25j14J30mJ18k09o3J16K33k67l5
7782f1q0K02q6M5P4J6j47JK80k62J88k42K21j03o1N8J17m24L52j7j12j34L74l02
$$ plain form
7806 -103 -80 -112 -17 -69 -224 61 -248 -23 7 -103 155 5 63 186 19 101 13 13 43 -31 86 -90 -253 -32
7830 -32 -131 175 173 105 -203 17 3 48 -122 6 92 -34 94 -135 140 72 -135 103 -90 84 -13 22 -87 236
7854 236 41 74 9 -48 -103 -163 -73 -73 261 -163 -108 45 75 -193 96 -165 -13 143 -36 268 -95 164 43
7877 43 -62 -162 100 42 176 24 -20 -16 -67 10 35 -173 46 168 116 31 -66 -230 87 -119 202 61 24 74
7901 74 -95 242 -126 78 -77 110 -18 80 223 -14 62 70 -90 -97 2 -23 31 61 54 -24 20 -97 130 81 -203
7926 -203 106 -109 -40 -104 -16 111 -72 41 -128 -37 -62 -267 -224 77 -191 -59 -33 -83 26 121 -115 -54 269
7949 269 -14 16 281 99 -114 -68 31 -145 199 -184 -125 -48 58 -20 -11 95 -80 -64 -63 -248 44 -31 -278 -87
7973 -87 48 59 103 113 -47 139 10 -123 -31 103 70 63 187 37 -251 -35 -38 50 167 -65 -290 185 -38 -69
$$ packed form
7806a03K3l2R5n2j55K85l09K25L0j10K58j50N8J23j67Q2q8%L0p4J17j76j63K21
7830c2r9L06ko8l08K20j4M5j70J28Q6j26J28k29K75o8k07K38j93J74r7L5j09L23
7854B36j95L3o5n7n5o0R0%L34m24N5J53L0k68K89k61J52J56j79L04l63K59j21
7877D3j05j00K62n8J34j52m4Mn1P7K5k08K19J22n2q5r7j64L17k06L21j41l7N0
7901G4j69L37l68K04j55J87j28R8J43k37P6Qj60pR9k5N4L0pp8M4j17K27m9k84
7926b03L09k15O9o4Q8J27j83J13j69R1k5k05M3L01k68J32K6n0J09R5k36O1L23
7949B69k83L0K65j82k13M6R9j76L44l83N9P7J06p8RJ06j75J6Jj85K92p5k47J91
7973h7J35J1M4J0j60J86j29j33R2J34l3pJ24j50k88K16lQ8J17k32k25M75k23l1
$$ plain form
7997 -69 35 84 -201 -111 -104 156 70 -64 106 -136 -146 291 64 -182 -76 200 -20 154 -27 -5 116 200 200 -226
8021 -226 114 46 175 66 124 -110 13 161 -22 -1 67 -29 74 -27 -70 142 94 -156 23 124 68 14 -139
8044 -139 -65 -196 -209 -43 -87 219 137 -148 -36 -83 203 -93 -101 -86 -25 44 101 241 85 -85 -58 2 24 -78 27
8069 27 97 -81 -24 134 208 -152 -32 -78 -56 -156 -11 -114 -120 83 -107 -204 -142 123 61 -157 -141 -21 -46 61
8093 61 140 16 -47 125 90 -113 60 61 -185 -285 87 121 185 144 39 30 -23 -148 68 -47 -40 60 -173 146 -11
8118 -11 -172 104 78 -137 -45 -256 -133 -18 112 -155 2 75 32 -134 -96 -52 -263 -7 116 -192 -128 38 85
8141 85 126 107 -49 134 -79 -109 47 84 42 182 259 -118 -150 108 -125 87 229 28 -90 48 -74 -25 44
8164 44 -63 -207 265 12 -43 -230 -94 19 10 -90 -175 -90 -239 2 261 42 -65 -255 -52 131 -116 -258
$$ packed form
7997f9J04M9k85R0PK60q6j34J70k42j0M37k27k46J06K76k20J74j81K2J21Q4%m26
8021b26L40o8J29j09N8k34J23J48j83K1O8r6J03j01m3K12m8k50J79J01n6n4j53
8044a39P4j31j3J66m4L06q2k85J12m7K86k96qJ5O1O9N7J40j56j70K7O0K2j02J05
8069B7P0j78N7J58P4l60J20m6K2j00J45j03oK03j90r7O2K65o2k18J6J20k5J07
8093F1P9j24o3J72l5k03J73Jk46j00L72L4O4m1j05rn3j25K16j15PJ00k33L19j57
8118a1j61K76k6k15R2k11J23J15J30k67J57P3m3j66L8M4k11K56J23l08O4J66M7
8141H5M1j9j56J83k13l0J56L7m2J40P7l77l2K58k33K12J42k01j18J38j22M9O9
8164D4j07j44M72k53n5j87J36J13rj00q5Q5j49K41K59k19j07j90K03J83k47j42
$$ plain form
8186 -258 -49 176 162 -90 -66
$$ packed form
8186b58K09K25j4k52K4
8191f6
$$ Imaginary data points
##PAGE= N=2
##DATA TABLE= (X++(I..I)), XYDATA
$$ plain form
0 0 0 0 0 0 0 0 0 0 0 0 0 0 0 8 -8 8 -8 8 -16 16 -16 24 -24 32 -36 41 -48 56 -65 75 -86 98 -112 126 -143
35 -143 159 -180 202 -225 251 -281 314 -346 382 -422 468 -516 569 -628 690 -760 839 -923 1019
54 1019 -1128 1246 -1385 1543 -1726 1943 -2202 2523 -2925 3452 -4174 5230 -6922 10086 -18070
69 -18070 86539 108148 -27868 36757 85026 42851 -10689 19480 21734 12305 6265 -6554
81 -6554 -12271 25695 13571 -24771 -662 39969 641 -22899 20885 28887 -14671 -1549 25769
94 25769 1441 -8000 22102 11403 -5153 22894 26397 -3617 16223 41089 10050 710 37827
107 37827 27235 -5373 19380 34003 1188 6800 34123 12027 -1852 29679 27687 -1132
119 -1132 18149 34863 3104 1594 29418 9771 -11647 14358 16600 -14355 -2655 20436 -2713
$$ packed form
0@%%%%%%%%%%%%%Qj6J6j6J6k4L2l2M0m8N6o8P7q9J04j21J40j61J84k10K38k69
35a43L02l39L82m27M76n32N95o60P28q04Q90r84J085j197J318j450J599j762J942
54A019k147K374k631K928l269L669m145M725n448O377p626R404j2152J7008k8156
69a8070J04609K1609j36016O4625M8269m2175n3540L0169K254r429o040j2819
81f554n717L7966j2124l8342K4109M0631l9328k3540M3784Q002m3558J3122K7318
94B5769k4328r441L0102j0699j6556K8047L503l0014J9840K4866l1039r340L7117
107C7827j0592l2608K4753J4623l2815N612K7323k2096j3879L1531j992k8819
119a132J9281J6714l1759j510K7824j9647k1418K6005K242l0955J1700K3091k3149
$$ plain form
132 -2713 -8736 22154 14997 -5306 18890 30151 2747 9140 33610 12725 -4061 21512 17818
145 17818 -10064 4782 19041 -7766 -8605 18745 3831 -12707 14799 19449 -6666 6222 25420
158 25420 1793 -3526 21442 9339 -12575 6791 12601 -14294 -9152 10741 -6768 -17874 5778
171 5778 2940 -18435 -2218 12278 -10635 -10864 13268 2090 -13188 9088 13983 -8131 4319
184 4319 23282 3605 -18 25717 18576 323 19149 26661 3120 7977 24562 6177 -5078
197 -5078 14948 9105 -12663 565 10977 -10079 -9855 9808 -1863 -14311 4924 6745 -13414
210 -13414 -4002 10556 -8081 -13854 5580 -1727 -18275 -2495 3406 -16765 -10558 7558 -6711
223 -6711 -14659 6656 5835 -10689 2402 13540 -3740 -2448 15775 4029 -7191 10556 11733
$$ packed form
132b713o023L0890p157k0303K4196J1261k7404O393K4470k0885j6786K5573l694
145A7818k7882J4846J4259k6807q39K7350j4914j6538K7506M650k6115J2888J9198
158B5420k3627n319K4968j2103k1914J9366N810k6895N142J9893j7509j1106K3652
171E778k838k1375J6217J4496k2913k29K4132j1178j5278K2276M895k2114J2450
184D319J8963j9677l623K5735p141j8253J8826P512k3541M857J6585j8385j1255
197e078K0026n843k1768J3228J0412k1056K24J9663j1671j2448J9235J821k0159
210a3414R412J4558j8637n773J9434p307j6548J5780N901k0171O207J8116j4269
223f711p948K1315q21j6524J3091J1138j7280J292J8223j1746j1220J7747J177
$$ plain form
236 11733 -6971 2091 14969 -1424 -4362 13386 5707 -7722 7407 11667 -6031 -1367 12334
249 12334 -342 -7357 8150 5163 -9178 1921 9733 -6299 -5229 10517 1367 -9242 5325
262 5325 7357 -8450 -1774 9245 -5673 -8622 7632 70 -12558 1266 5504 -10685 -5563
275 -5563 7075 -4972 -9850 5266 1834 -11057 -135 6591 -7006 -5406 6515 -1131 -8355
288 -8355 3584 4022 -8768 -1549 7707 -4685 -7167 6293 1582 -8412 2708 6389 -6120 -1600
302 -1600 9714 -382 -4591 8902 6070 -5403 3405 9467 -2960 -1584 9691 513 -6049 5562
316 5562 4881 -7112 -35 7784 -3411 -4479 6173 438 -6842 3035 4166 -7559 -3201 5153
330 5153 -4037 -7949 2524 37 -8077 -971 3208 -6084 -4541 4996 -1745 -7747 1394 1622 -8941
$$ packed form
236A1733j8704R062J2878j6393k938J7748p679j3429J5129M260j7698M664J3701
249A2334j2676p015J5507k987j4341J1099P812j6032J070J5746r150j0609J4567
262E325K032j5807O676J1019j4918k949J6254p562j2628J3824M238j6189N122
275e563J2638j2047m878J5116l432j2891J0922O726j3597J600J1921p646p224
288h355J1939M38j2790P219R256j2392k482J3460m711r994J1120L681j2509M520
302a600J1314j0096m209J3493k832j1473Q808O062j2427J376J1275r178o562J1611
316E562o81j1993P077P819j1195j068J0652n735p280R877J131j1725M358Q354
330E153r190l912J0473k487q114P106M179r292J543R537o741o002R141K28j0563
$$ plain form
345 -8941 -4009 1976 -7360 -8439 1073 -3846 -10606 -1008 2312 -7023 -2618 6003 -989 -2306 7245
360 7245 3967 -2800 4235 6848 -2557 -1489 5383 -779 -4696 2207 1878 -4830 234 5079 -1578
375 -1578 -1388 6696 3919 -1816 4494 6506 -1312 605 5650 -1709 -4207 2831 -107 -7048 -1826
390 -1826 959 -7210 -6420 -481 -6145 -9351 -3244 -5221 -12222 -7927 -4554 -10879 -10587 -4191 -6627 -9070
406 -9070 -2284 -648 -4677 -592 5290 828 -168 5927 4326 -611 2887 4223 -2359 -1549 2345 -1731
422 -1731 -4776 1096 955 -4019 278 3983 -678 -280 4211 1108 -2934 1182 646 -5839 -4642 -1802
438 -1802 -6736 -8342 -4094 -6429 -8611 -3826 -2140 -5751 -3218 1506 -1183 -2403 1526 811 -2489
453 -2489 -638 643 -3227 -3959 -902 -3054 -5934 -2835 -1848 -5676 -4676 -1466 -4847 -6229 -1998 -4219
$$ packed form
345h941M932N985r336j079R512m919o760R598L320r335M405Q621o992j317R551
360G245l278o767P035K613r405J068O872o162l917O903l29o708N064M845o657
375a578J90Q084k777n735O310K012p818J917N045p359k498P038k938o941N222
390a826K785q169P90N939n664l206O107j977p001M295L373o325K92O396k436k443
406i070O786J636m029M085N882m462r96O095j601m937L498J336o582Q10L894m076
422a731l045N872j41m974M297L705m661L98M491l103m042M116n36o485J197K840
438a802m934j606M248k335k182M785J686l611K533M724k689j220L929p15l300
453b489J851J281l870p32L057k152k880L099R87l828J000L210l381j382M231k221
$$ plain form
469 -4219 -7803 -4540 -3358 -7043 -5987 -2416 -4529 -4592 -353 -1003 -2217 1500 2953 270 301 2459
485 2459 185 -2367 -1068 -2463 -5447 -4934 -3564 -5980 -6124 -2885 -2186 -3548 -416 1959 763 2517
501 2517 5220 3319 2304 4637 2967 -355 390 384 -3188 -3834 -2815 -4650 -6121 -4347 -4595 -6684 -5188
518 -5188 -3743 -6008 -6396 -4810 -6061 -7160 -5783 -5720 -7801 -6526 -4527 -5614 -5263 -2954 -1800 -1967
534 -1967 -196 831 480 1180 2838 2032 1019 2226 2806 1159 1489 2969 2037 2024 3745 3100 1918
551 1918 3586 3763 1260 1104 1842 -604 -2096 -1954 -3814 -5310 -4509 -5098 -5920 -5231 -3839 -3719 -2819 -1038
569 -1038 -111 614 1809 2340 2012 2137 2510 1536 -57 -284 -380 -1987 -2367 -2034 -2821 -2982 -1637 -1782 -2532
588 -2532 -888 -75 -691 -642 688 -2 32 762 -58 -212 597 859 163 223 1035 1310 1068 1338 1085 980
$$ packed form
469d219l584L263J182l685J056L571k113o3M239o50j214L717J453k683L1K158
485B459k274k552J299j395k984N13J370k416j44L239O99j362L132K375j196J754
501B517K703j901j015K333j670l322P45ol572o46J019j835j471J774k48k089J496
518e188J445k265l88J586j251j099J377O3k081J275J999j087L51K309J154j67
534a967J771J027l51P00J658q06j013J207N80j647L30J480r32j3J721o45j182
551A918J668J77k503j56P38k446j492J42j860j496Q01n89q22O89J392J20R00J781
569a038R27P25J195N31l28J25L73r74j593k27r6j607l80L33p87j61J345j45p50
588b532J644Q13o16M9J330o90L4P30q20j54Q09K62o96O0Q12K75k42K70k53j05
$$ plain form
608 980 1121 1130 558 76 260 223 76 -217 486 673 946 1622 1790 1904 2939 2875 2559 2259 2462 1927 1016
629 1016 715 222 -1015 -981 -1191 -2011 -1731 -1534 -1642 -1742 -1341 -1077 -512 -59 -587 -893 -716 -718 -1221 -1456 -1859
650 -1859 -1914 -1567 -1808 -1964 -1857 -1152 -692 -482 -105 416 1353 1585 1404 1730 2470 2255 2417 2381 2250 2617 2684
671 2684 2011 1670 2229 2002 1871 1620 1038 931 1218 401 -210 80 -439 -678 -245 -916 -1144 -870 -794 -960
691 -960 -984 -964 -1052 -801 -941 -1206 -940 -820 -1165 -1493 -1340 -1263 -1258 -1271 -1309 -1448 -761 -1296 -1128 -830 -682 -322 -18
714 -18 -109 43 553 802 775 798 1146 1034 1062 942 718 986 790 672 498 730 437 348 490 255 162 666 962
737 962 429 664 805 564 857 428 66 -70 238 -250 -368 -422 -832 -564 -697 -1050 -1097 -485 -857 -970 -998
758 -998 -1375 -1062 -864 -1503 -1866 -1192 -1320 -1606 -1311 -1128 -913 -273 -203 -264 389 506 419 701 322 -6 -23 -65
$$ packed form
608I80J41Rn72m82J84l7j47k93P03J87K73O76J68J14J035o4l16l00K03n35r11
629A016l01m93j237L4k10q20K80J97j08j00M01K64N65M53n28l06J77kn03k35m03
650a859n5L47k41j56J07P05M60K10L77N21R37K32j81L26P40k15J62l6j31L67O7
671B684o73l41N59k27j31k51n82j07K87q17o11K90n19k39M33o71k28K74P6j66
691i60k4K0q8K51j40k65K66J20l45l28J53P7Nj3l8j39O87n35J68K98J48L60L04
714a8r1J52N10K49k7K3L48j12K8j20k24K68j96j18j74K32k93q9J42k35r3N04K96
737I62n33K35J41k41K93m29l62j36L08m88j18n4m10K68j33l53m7O12l72j13k8
758i98l77L13J98o39l63O74j28k86K95J83K15O40P0o1O53J17q7K82l79l28j7m2
$$ plain form
780 -65 -683 -713 -754 -1091 -915 -620 -690 -165 910 793 800 1830 2031 2067 2261 1927 1587 1840 1691 726 634 690 443
803 443 121 -233 -295 -45 -75 -351 -214 -404 -411 -561 -575 -1047 -1070 -1007 -1176 -1632 -1384 -1394 -982 -628 -1108 -567 -103
826 -103 31 -474 -71 -2 -421 -521 -934 -1378 -1430 -1177 -1385 -1603 -579 -688 -286 420 778 1215 1641 1944 1673
847 1673 1692 1855 1350 1210 770 465 252 538 121 219 464 909 1578 1667 1896 2528 2739 1933 2043 1676 1011
868 1011 504 101 -1116 -1775 -1383 -2357 -2671 -2399 -2905 -2704 -1695 -1737 -1812 -1178 -748 -664 -520 -241 -278 142 290
889 290 96 442 727 981 1297 1058 1109 1945 1321 792 959 495 -156 -80 -701 -1688 -1540 -1424 -1822 -1674 -695
910 -695 -286 -213 993 1338 1737 2258 2913 2396 2176 2641 1814 1274 1046 241 -411 -375 -547 -1137 -1439 -650 -351
931 -351 -327 -344 201 97 62 177 -327 -485 -540 -888 -1528 -1954 -1639 -1899 -1845 -1642 -1119 -1309 -480 -245 -745 -328
$$ packed form
780f5o18l0m1l37J76K95p0N25J075j17PJ030K01L6J94l34l40K53j49r65r2N6k47
803D43l22l54o2K50l0k76J37j90pj50j4m72k3O3j69m56K48j0M12L54m80N41M64
826a03J34n05M03O9m19j00m13m44n2K53k08k18J024j09M02P06L58M37M26L03k71
847A673J9J63n05j40m40l05k13K86m17R8K45M45O69Q9K29O32K11q06J10l67o65
868A011n07m03j217o59L92r74l14K72n06K01J009m2p5O34M30Q4J44K79l7M20J48
889B90j94L46K85K54L16k39N1Q36o24n29J67m64o51P6o21r87J48J16l98J48R79
910f95M09P3J206L45L99N21O55n17k20M65q27n40k28q05o52L6j72n90l02P89K99
931c51K4j7N45j04l5J15n04j58n5l48o40m26L15k60N4K03N23j90Q29K35n00M17
$$ plain form
953 -328 568 357 -111 377 242 -329 178 81 -589 -92 356 -141 -79 220 308 239 264 -36 -153 -220 -122 -721 -812
976 -812 -513 -18 -293 -414 191 710 810 1517 2017 1586 2064 2297 1310 1010 1216 -200 -654 -1199 -1628 -2851
996 -2851 -2308 -2374 -3272 -2923 -2143 -2111 -2361 -1262 -1033 -892 -516 -30 -552 -204 -112 -232 -560 -551 -513 -541 -457 -367 -270
1019 -270 -216 108 270 27 332 635 159 -146 84 84 -80 183 477 -108 282 686 333 293 1095 806 365
1040 365 893 642 80 163 423 -508 -624 -274 -417 -697 -688 -679 -211 -221 -217 -202 -162 186 181 -334 -666 -228 -656 -872
1064 -872 -892 -933 -1540 -1301 -1002 -1588 -1463 -582 -695 -641 224 45 122 526 509 246 457 1074 259 196 569 269
1086 269 177 239 232 7 87 397 243 154 210 587 366 383 279 776 490 577 771 276 689 732 493 327 422 618
1110 618 129 144 231 -389 -335 -358 -671 -639 -455 -647 -696 -539 -479 -679 -685 -182 -586 -328 -216 -207 -435 -381 -156 -306
$$ packed form
953c28Q96k11m68M88j35n71N07r7o70M97M48m97O2K99Q8o9K5l00j17o7R8n99r1
976h12K99M95k75j21O05N19J00P07N00m31M78K33r87l00K06j416m54n45m29j223
996b851N43o6q98L49P80L2k50J099K29J41L76M86n22L48R2j20l28RL8k8Q4R0R7
1019b70N4L24J62k43L05L03m76l05K30%j64K63K94n85L90M04l53m0Q02k89m41
1040C65N28k51n62Q3K60r31j16L50j43k80RRM68j0MJ5M0L48nn15l32M38m28k16
1064h72k0m1o07K39K99n86J25Q81j13N4Q65j79P7M04j7k63K11O17q15o3L73l00
1086B69r2O2pk25Q0L10j54q9N6L77k21J7j04M97k86Q7J94m95M13M3k39j66R5J96
1110F18m89J5Q7o20N4k3l13L2J84j92m9J57O0k00oN03m04K58J12Rk28N4K25j50
$$ plain form
1134 -306 -62 -338 -297 15 -134 -137 -9 -260 201 129 -245 -21 341 217 652 770 645 677 1183 1050 899 1201
1156 1201 990 726 824 652 533 514 466 216 323 255 -74 -37 -140 -261 -127 -125 -151 62 -180 -220 -294 -491 -501
1179 -501 -531 -364 -626 -749 -359 -279 -245 -189 -438 -565 -172 -164 -433 -401 -437 -501 -394 -605 -897 -617 -525 -571 92 -40
1203 -40 328 698 585 545 689 1120 976 781 696 712 686 315 210 -23 39 -3 -305 -524 -244 102 22 305 92
1226 92 195 512 458 366 -154 -35 -282 -166 -401 -490 -251 -23 -371 -258 -394 -201 -46 -222 -229 -282 -100 -619
1248 -619 -635 -615 -814 -526 -761 -863 -839 -408 -435 -72 92 12 445 476 176 324 579 488 131 77 76 -150 268
1271 268 226 75 642 843 1059 985 1233 1168 1315 1265 622 560 391 97 -410 -508 -919 -915 -690 -1116 -989 -333 -335
1294 -335 -182 173 34 420 625 580 740 790 365 171 151 -31 -272 -251 77 -225 -265 -581 -232 -415 -521 -568
$$ packed form
1134c06K44k76M1L12j49lJ28k51M61p2l74K24L62j24M35J18j25L2N06j33j51L02
1156A201k11k64R8j72j19j9m8k50J07o8l29L7j03j21J34Kk6K13k42m0p4j97j0
1179e01l0J67k62j23L90Q0L4N6k49j27L93Qk69L2l6o4J07k11k92K80R2m6O63j32
1203d0L68L70j13m0J44M31j44j95q5J6k6l71j05k33O2m2l02k19K80L46q0K83k13
1226I2J03L17n4r2n20J19k47J16k35q9K39K28l48J13j36J93J55j76pn3J82n19
1248f19j6K0j99K88k35j02K4M31k7L63J64q0M33L1l00J48K55r1l57n4jk26M18
1271B68m2j51N67K01K16p4K48o5J47n0o43o2j69k94n07r8m11MK25m26J27O56k
1294c35J53L55j39L86K05m5J60N0m25j94k0j82k41K1L28l02m0l16L49j83j06m7
$$ plain form
1316 -568 -704 -561 -467 -865 -1074 -785 -609 -587 -197 -128 234 688 680 1037 1456 1465 1427 1191 1367 986 1156 621 459
1339 459 182 174 128 -57 60 4 592 278 384 406 555 368 721 218 -239 144 -119 -465 -598 -669 -833 -531
1361 -531 -335 -687 -295 114 -122 74 311 296 347 766 107 58 -33 100 -280 -415 -705 -367 -330 -717 -458 -204
1383 -204 -229 157 43 312 214 374 503 474 923 779 719 646 1105 817 1129 1587 1291 1087 1296 1149 973 562
1405 562 474 -57 -90 -307 -494 -1102 -749 -596 -920 -802 -650 -143 -38 21 347 563 709 863 466 422 805
1426 805 497 -84 87 -25 -367 -369 -217 -503 -356 7 -244 -424 -38 315 -231 -129 -8 -363 -328 212 33
1447 33 -423 125 -3 -109 172 312 293 474 488 674 513 524 613 509 314 568 621 287 268 777 537 319
1469 319 997 480 205 577 420 17 -157 -55 -636 -674 -154 -833 -1055 -498 -527 -884 -622 -376 -293 -410 -44
$$ packed form
1316e68j36J43R4l98k09K89J76K2L90O9L62M54qL57M19Rl8k36J76l81J70n35j62
1339D59k77qm6j85J17n6N88l14J06K2J49j87L53n03m57L83k63l46j33p1j64L02
1361e31J96l52L92M09k36J96K37j5N1M19o59m9r1J33l80j35k90L38L7l87K59K54
1383b04k5L86j14K69r8J60J29k9M49j44o0p3M59k88L12M58k96k04K09j47j76m11
1405E62q8n31l3k17j87o08L53J53l24J18J52N07J05N9L26K16J46J54l97m4L83
1426H05l08n81J71j12l42kJ52k86J47L63k51j80L86L53n46J02J21l55L5N40j79
1447C3m56N48j28j06K81J40j9J81J4J86j61J1Q9j04j95K54N3l34j9N09k40k18
1469C19O78n17k75L72j57m03j74J02n81l8N20o79k22N57k9l57K62K46Q3j17L66
$$ plain form
1490 -44 120 -268 337 290 -198 6 319 137 -456 14 -21 -553 -10 20 -599 -672 336 397 -255 343 711 310
1512 310 271 978 448 143 782 507 198 376 580 191 299 640 158 -47 629 -135 -414 94 254 -317
1532 -317 -248 384 -130 -470 298 175 -152 -106 407 -27 -244 -11 283 -522 -123 240 -393 -538 368 -572 -919
1553 -919 125 145 -937 -366 -191 -757 -630 274 -107 -617 495 410 -367 352 695 106 -174 547 439 -269
1573 -269 470 658 -102 153 791 317 -148 369 661 -253 331 606 -111 7 1309 134 -373 556 659
1592 659 -534 -87 586 -505 -627 72 -508 -1109 38 206 -832 -615 261 -495 -723 113 -123 -982 -259
1611 -259 252 -592 -622 216 -59 -721 242 641 -485 43 639 179 -52 886 616 -428 353 1074 -258
1630 -258 21 926 -307 -580 553 151 -908 51 743 -301 -3 816 246 -392 400 366 -599 24 713
$$ packed form
1490d4J64l88O05m7m88K04L13j82n93M70l5n32N43L0o19p3J008O1o52N98L68m01
1512C10l9P07n30l05O39k75l09J78K04l89J08L41m82k05O76p64k79N08J60n71
1532c17O9O32n14l40P68j23l27M6N13m34k17K33K94q05L99L63o33j45R06r40l47
1553i19J044K0j082N71J75n66J27R04l81n10J112q5p77P19L43n89k80P21j08p08
1573b69P39J88p60K55O38m74m65N17K92r14N84K75p17J18J302j175n07R29J03
1592F59j193M47O73j091j22O99n80o01J147J68j038K17Q76p56k28Q36k36q59P23
1611b59N11q44l0Q38k75o62R63L99j126N28N96m60k31R38k70j044P81P21j332
1630b58K79R05j233k73J133m02j059R59O92j044K98Q19n70o38P92l4r65O23O89
$$ plain form
1649 713 -191 -293 903 261 -564 431 382 -584 21 724 34 -190 514 312 -318 -270 387 -620 -949 259
1669 259 -397 -1146 -201 61 -1239 -348 662 -768 -529 551 -360 -839 55 363 -923 -323 473 -328
1687 -328 -472 392 483 -346 458 814 -296 82 1305 125 -507 481 672 -470 38 807 -537 -342 813
1706 813 244 -730 408 1015 -82 319 1355 136 24 1031 539 -980 157 392 -894 -1092 352
1723 352 -920 -1242 -342 -188 -1279 -535 121 -1106 -945 44 -318 -879 60 7 -814 -604 802 -303 -458
1742 -458 805 953 -511 844 1260 308 -62 1166 243 -551 756 505 -984 -176 445 -805 -672 609
1760 609 -287 -964 384 572 -995 -160 820 -484 -390 567 343 -780 154 426 -748 -321 773 -96
1778 -96 -353 773 794 -499 443 1141 -265 -289 985 94 -1016 178 141 -1145 -779 314 -919 -1142
$$ packed form
1649G13r04j02J196o42q25R95m9r66O05P03o90k24P04k02o30M8O57j007l29J208
1669B59o56p49R45K62j300Q91J010j430K39J080r11m79Q94L08j286O00P96q01
1687c28j44Q64R1q29Q04L56j110L78J223j180o32R88J91j142N08P69j344J95J155
1706H13n69r74J138O07j097M01J036j219j12J007m92j519J137K35j286j98J444
1723C52j272l22R00J54j091P44O56j227J61R89l62n61R39n3q21K10J406j105j55
1742d58J263J48j464J355M16r52l70J228r23p94J307k51j489Q08O21j250J33J281
1760F09q96o77J348J88j567Q35R80j304R4R57k24j123R34K72j174M27J094q69
1778i6k57J126K1j293R42O98j406k4J274q91j110J194l7j286L66J093j233k23
$$ plain form
1796 -1142 217 -352 -1190 -77 420 -997 -367 836 -46 -755 917 497 -618 190 993 -452 7
1813 7 1030 319 -420 587 725 -127 176 882 -492 -593 798 -17 -914 154 744 -369 -502 874
1831 874 94 -404 996 673 -293 614 1446 -173 -128 960 -5 -872 375 145 -1046 -453 300 -993
1849 -993 -911 212 -250 -982 125 250 -727 -439 702 -404 -864 423 121 -963 130 678 -394 -464
1867 -464 918 265 -389 956 913 -261 395 1037 39 -165 1132 405 -566 513 540 -581 -195 752 -60
1886 -60 -734 573 416 -705 -42 521 -673 -732 370 -164 -886 461 441 -634 -51 702 -487 -384 879
1905 879 365 -631 464 664 -595 -355 583 -84 -743 318 19 -1033 -114 237 -742 -671 619 -81 -822
1924 -822 398 340 -416 171 780 -467 -305 797 173 -417 404 449 -500 33 556 -252 -283 376 285 -721
$$ packed form
1796a142J359n69q38J113M97j417O30J203q82p09J672m20j115Q08Q03j445M59
1813GJ023p11p39J007J38q52L03P06j374j01J391q15q97J068N90j113j33J376
1831H74p80m98J400l23r66R07Q32j619M5J088r65q67J247k30j191N93P53j293
1849i93Q2J123m62p32J107J25r77K88J141j106m60J287l02j084J093N48j072p0
1867d64J382o53o54J345m3j174O56O42r98k04J297p27r71J079K7j121L86R47q12
1886f0o74J307j57j121O63N63j194n9J102n34p22J347k0j075N83P53j189J03J263
1905H79n14r96J095K00j259K40R38o67o59J061k99j052R19L51r79P1J290p00p41
1924h22J220n8p56N87O09j247J62J102o24n90Q21M5r49N33N23q08l1O59r1j006
$$ plain form
1944 -721 275 536 -415 -391 861 135 -641 347 403 -638 116 939 -458 -444 617 -141 -899 189 122 -781
1964 -781 -290 591 -734 -562 399 -251 -898 -50 235 -724 -542 318 -11 -855 167 138 -585 -252 232 -464
1984 -464 -843 392 -137 -817 227 141 -743 -352 369 -584 -686 680 82 -654 171 450 -577 -213 663
2003 663 -66 -540 265 421 -575 70 531 -335 -173 603 83 -465 227 222 -578 -265 444 -394 -759 312
2023 312 1 -897 -69 270 -909 -610 176 -529 -1057 -231 -467 -1214 -346 -6 -690 -607 30 -228 -992 308
2043 308 308 -651 -174 330 -571 -346 683 -1 -518 254 246 -231 215 437 -95 -76 647 204 -427 -87 365
2064 365 -246 -420 432 60 -685 311 312 -719 -285 296 -520 -317 378 -6 -587 52 293 -822 -635 -20
2084 -20 -430 -816 -10 -52 -615 134 185 -159 -296 387 213 -311 200 407 -285 32 441 -126 -364 344 143
$$ packed form
1944g21R96K61r51K4J252p26p76R88N6j041P54Q23j397J4J061p58p58J088o7r03
1964g81M91Q81j325J72R61o50o47Q48K85r59J82Q60l29q44J022k9p23L33M84o96
1984d64l79J235n29o80J044q6q84L91P21r53j02J366n98p36Q25K79j027L64Q76
2003F63p29m74Q05J56r96O45M61q66J62P76n20n48O92nq00L13P09q38l65J071
2023C12l11q98Q28L39j179K99P86p05n28Q26k36p47Q68L40o84Q3O37k58p64J300
2043C08%r59M77N04r01K25J029o84n17P72qm77M46K22n32J9P23m43o31L40M52
2064C65o11j74Q52l72p45R96Jj031M34N81q16K03O95l84n81O39K41j115J87O15
2084b0m10l86Q06m2n63P49N1l44j37O83j74n24N11K07o92L17M09n67k38P08k01
$$ plain form
2105 143 -531 133 291 -490 -392 254 -319 -559 201 -159 -675 -244 181 -545 -327 230 -91 -346 411 304
2125 304 -270 407 604 55 282 528 461 -79 265 175 -232 -251 192 -444 -398 -70 -22 -417 -32 69 -415 -358
2147 -358 141 -283 -386 144 -35 -509 -245 156 -325 -572 124 -2 -502 131 -69 -608 -261 268 -344 -207
2167 -207 37 69 -226 24 -116 -402 -64 132 42 -158 196 309 59 -43 646 282 163 620 186 63 356
2188 356 480 -148 -87 427 66 -228 273 240 -171 63 98 -319 -15 47 -101 -742 -184 -151 -545 -349 -349 -223
2210 -223 -329 -180 -155 -214 -210 246 -8 117 468 458 146 456 392 389 577 218 79 97 266 132 40 125 199 -427
2234 -427 -148 113 -334 -329 325 156 -356 -63 38 -339 42 33 36 150 560 288 303 478 369 332 328 305 429 -16
2258 -16 36 127 66 -34 199 33 -511 197 -32 -103 -106 34 -302 46 242 -99 -394 -137 -115 -147 -199 -5 -229
$$ packed form
2105A43o74O64J58p81R8O46n73k40P60l60n16M31M25p26K18N57l21k55P57j07
2125C04n74O77J97n49K27K46o7n40L44r0m07j9M43o36M6L28M8l95L85J01m84N7
2147c58M99m24j03N30j79m74K64M01m81k47O96j26n00O33k00n39L47N29o12J37
2167b07K44L2k95K50j40k86L38J96r0k00L54J13k50j02O89l64j19M57m34j23K93
2188C56J24o28O1N14l61k94N01l3m11K34L5m17L04O2j48o41N58L3l94J96%J26
2210b23j06J49K5n9MM56k54J25L51j0l12L10o4lJ88l59j39J8J69j34r2Q5P4o26
2234d27K79K61m47NO54j69n12K93J01l77L81rLJ14M10k72J5J75j09l7mk3J24m45
2258a6N2R1o1j00K33j66n44P08k29p1lJ40l36L48J96l41k95K57K2l2n2J94k24
$$ plain form
2281 -229 -112 162 -169 -34 267 97 -54 179 -18 38 273 267 -17 -17 -1 174 -51 -12 15 227 209 223 319 40
2305 40 96 214 69 427 442 465 304 316 318 126 47 320 104 88 310 123 30 -32 132 -172 -200 -108 -144 -3 -70
2330 -70 -178 -258 23 -149 -30 190 17 20 -87 -68 62 84 133 279 -56 -17 -12 429 246 249 375 40 48 105 176
2355 176 -73 118 295 278 332 299 -28 279 211 124 197 214 111 123 79 225 59 250 91 11 8 261 295 276 -127
2380 -127 255 57 248 156 417 -57 236 327 4 70 58 26 -112 225 30 148 49 59 -120 42 358 19
2402 19 9 0 234 24 139 -75 169 -84 -148 -79 81 156 335 333 62 -111 -41 116 -62 296 242 106 19 56
2426 56 307 281 224 17 26 381 228 -1 483 103 44 298 192 224 187 -111 -34 176 55 6 34 219 -93 -31
2450 -31 39 -131 113 -6 -17 -101 -4 -162 -56 -198 -145 -169 73 -279 -228 48 -16 -255 7 54 -11 -123 -59 -272
$$ packed form
2281b29J17K74l31J35L01j70j51K33j97N6K35ok84%J6J75k25L9K7K12j8J4R6k79
2305D0N6J18j45L58J5K3j61J2Kj92p9K73k16j6K22j87r3o2J64l04k8R2l6J41o7
2330g0j08q0K81j72J19K20j73Lj07J9J30K2M9J46l35L9NM41j83LJ26l35QN7P1
2355A76k49J91J77j7N4l3l27L07o8q7P3J7j03J2m4J46j66J91j59q0lK53L4j9m03
2380a27L82j98J91r2K61m74K93R1l23O6j2l2j38L37j95J18r9J0j79J62L16l39
2402A9j0rK34k10J15k14K44k53o4O9J60P5J79kk71j73P0J57j78L58n4j36q7L7
2426E6K51k6n7k07RL55j53k29M84l80n9K54j06L2l7k98P7K10j21m9K8J85l12O2
2450c1P0j70K44j19j1q4R7j58J06j42N3k4K42l52N1K76o4k39K62M7o5j12O4k13
$$ plain form
2474 -272 -67 337 -55 136 145 82 161 153 75 300 211 28 271 82 -80 28 138 -8 110 81 -33 159 -67
2497 -67 18 106 -185 -105 -5 45 108 55 -158 -6 -359 50 -195 -81 314 119 -93 -107 28 91 -117 173 -339
2520 -339 -149 43 92 28 175 55 -103 -23 -72 27 -168 -25 -73 156 74 28 75 -62 162 25 28 178 31 240
2544 240 -30 -153 302 111 -184 -113 -125 -313 216 -93 -175 -6 -185 -15 37 -26 54 174 25 23 99 213 -77
2567 -77 310 -86 123 139 368 115 -60 167 192 27 -117 65 15 -52 -227 -1 53 -49 -126 -454 -248 -55
2589 -55 -88 -421 -198 -131 -17 53 173 22 -2 167 74 353 -57 245 315 280 138 153 112 -62 31 -51 37 226
2613 226 -109 -52 56 188 -63 -202 45 106 -99 -134 -333 25 38 -13 109 31 -32 -263 26 -148 -228 94 -95
2636 -95 -155 -145 50 8 186 -227 -18 30 -176 -157 -163 -38 -177 53 -203 -309 -7 -85 -107 -31 151 -39 -43 16 -148
$$ packed form
2474b72K05M04l92J91Ro3P9qp8K25q9j83K43j89j62J08J10j46J18k9j14J92k26
2497f7Q5Q8k91Q0J00N0O3n3k13J52l53M09k45J14L95j95k12j4J35O3k08K90n12
2520c39J90J92M9o4J47j20j58Q0m9R9j95J43m8K29q2m6M7j37K24j37LJ50j47K09
2544B40k70j23M55j91k95P1j2j88N29l09q2J69j79J70N2o3Q0J20j49kP6J14k90
2567g7L87l96K09J6K29k53j75K27K5j65j44J82n0o7j75K26N4j02p7l28K06J93
2589e5l3l33K23O7J14P0J20j51k4J69r3K79m10L02P0l5j42J5m1j74R3q2Q8J89
2613B26l35N7J08J32k51j39K47O1k05l5j99L58J3n1J22p8o3k31K89j74q0L22j89
2636i5o0J0J95m2J78m13K09M8k06J9oJ25j39K30k56j06L02p8k2P6J82j90mN9j64
$$ plain form
2661 -148 -148 0 26 105 33 136 74 6 10 -229 114 70 -286 -39 45 -143 -15 -195 -128 -273 -44 -103 29 -122
2685 -122 -311 -165 -63 80 -113 -59 116 89 -169 57 -66 -144 73 -16 -43 4 -278 -156 -143 -154 -94 71 -25
2708 -25 -31 -219 68 -68 -68 -114 76 -140 57 -195 -25 -32 -177 -42 -67 -46 205 -66 106 132 58 109 -66 93
2732 93 110 138 66 21 77 23 260 112 33 -7 -125 160 -131 207 -232 -60 -338 -84 -192 -38 -160 -21 -198
2755 -198 115 -108 44 -85 9 -98 -11 74 16 -185 -139 70 -168 81 1 -268 41 -123 203 49 -16 -14 44
2778 44 -127 -40 -29 -58 157 -19 14 55 -4 145 178 -106 274 -109 132 31 133 51 -2 -135 87 -311 -151
2801 -151 -89 -174 -90 23 -43 -205 -81 -49 20 -294 21 36 -47 -17 -128 -291 -120 -19 -3 -133 64 98 -8 -235
2825 -235 -106 -1 -173 20 55 136 -376 -176 -7 267 -77 -23 94 214 5 -56 108 350 66 -89 132
$$ packed form
2661a48%J48K6P9p2J03o2o8Mk39L43m4l56K47Q4j88J28j80O7j45K29n9J32j51
2685a22j89J46J02J43j93N4J75k7k58K26j23p8K17q9k7M7k82J22J3j1O0J65r6
2708b5oj88K87j36%m6J90k16J97k52J70pj45J35k5K1K51k71J72K6p4N1j75J59
2732I3J7K8p2m5N6n4K37j48p9m0j18K85k91L38m39J72k78K54j08J54j22J39j77
2755a98L13k23J52j29R4j07Q7Q5n8k01M6K09k38K49q0k69L09j64L26j54o5KN8
2778D4j71Q7J1k9K15j76L3M1n9J49L3k84L80l83K41j01J02q2n3j33K22l98J60
2801a51O2q5Q4J13o6j62J24L2O9l14L15J5q3L0j11j63J71J01J6j30J97L4j06k27
2825b35J29J05j72J93L5Q1n12K00J69K74l44N4J17J20k09o1J64K42k84j55K21
$$ plain form
2846 132 81 71 33 -51 13 61 51 -5 62 -10 88 -150 -51 -14 -13 54 9 64 285 -227 -104 185 -373 54 -164 113
2872 113 -117 -72 -19 101 79 -173 -1 -13 -66 -249 52 130 107 46 67 10 -207 19 -100 -43 45 75 28 84 14
2897 14 187 172 -38 -34 -101 -34 38 43 81 -48 -206 58 -63 -65 91 -133 -78 46 -111 121 -104 193 120 102 -50
2922 -50 116 249 39 -45 -86 273 -65 93 -8 -137 -135 112 22 -17 -191 -173 134 61 6 66 -7 -34 24 -287 145
2947 145 284 159 -61 -171 169 91 -75 206 -199 8 99 -177 -11 206 -10 235 -70 19 154 242 84
2968 84 -93 91 44 71 76 198 -4 -142 -148 -103 209 62 -33 -35 -280 -258 150 69 123 -80 194 165 -175 -193 -22
2993 -22 127 48 -239 -38 -125 -60 192 -277 47 -67 -70 -217 105 -162 -42 -203 120 192 190 -52 257 94 -221
3016 -221 -34 -205 -31 -205 79 -65 236 -64 -237 92 -80 -96 -17 -9 -124 -116 92 -80 -47 -245 -1 130
$$ packed form
2846A32n1j0l8q4O4M8j0n6O7p2R8k38R9L7JO7m5N5K21n12J23K89n58M27k18K77
2872A13k30M5N3J20k2k52J72j2n3j83L01P8k3o1K1n7k17K26j19N7Q8L0m7N6p0
2897A4J73j5k10Mo7O7P2NL8j29j58K64j21kJ56k24N5J24j57K32k25K97p3j8j52
2922e0J66J33k10q4m1L59l38J58j01j29KK47r0l9j74J8L07p3n5O0p3k7N8l11M32
2947A45J39j25k20j10L40p8j66K81m05K07R1k76J66K17k16K45l05Q9J35Q8j58
2968H4j77J84m7K7NJ22k02j38oM5L12j47r5kk45K2M08q1N4k03K74k9l40j8J71
2993b2J49p9k87K01q7O5K52m69L24j14lj47L22k67J20j61L23P2kk42L09j63l15
3016b21J87j71J74j74K84j44L01l00j73L29j72j6P9Qj15QK08j72L3j98K44J31
$$ plain form
3038 130 105 37 -212 65 170 157 -29 -17 -27 -152 109 -60 -51 54 263 -228 -19 211 142 159 108 -95 -20 36
3062 36 -78 -235 8 -44 87 -18 -22 24 -161 93 143 134 7 -4 -46 -248 -94 263 -79 56 -23 -85 133 93
3086 93 213 -16 -7 -291 -15 65 26 -51 118 -210 124 -10 -234 47 202 148 70 -98 126 175 -96 -21 68 242
3110 242 -5 -95 -198 185 51 -24 156 97 92 -59 -137 -237 -50 -43 -231 -222 75 -83 181 -60 -57 309 153 -71
3134 -71 93 166 313 -70 267 277 130 -71 -7 184 -17 90 -136 -108 77 -13 -71 -89 -77 -131 -134 92 122 150 -165
3159 -165 -92 -24 222 155 -69 30 -48 -138 -74 104 167 -95 191 282 73 125 48 -52 206 287 -170 -34 140 58
3183 58 118 118 -234 144 147 -147 33 -26 -85 132 -231 28 -28 226 113 -113 81 230 -170 136 14 75 -15 33
3207 33 97 -94 25 -191 253 -88 62 -49 68 53 -42 -219 233 1 29 -96 134 -99 -103 36 162 7
$$ packed form
3038A30k5o8k49K77J05j3j86J2j0j25K61j69RJ05K09m91K09K30o9J7n1k03P5N6
3062C6j14j57K43n2J31j05mM6j85K54N0rj27j1m2k02J54L57l42J35p9o2K18m0
3086I3J20k29Rk84K76Q0l9p7J69l28L34j34k24K81J55n4p8j68K24M9k71P5Q9J74
3110B42k47r0j03L83j34p5J80n9nj51p8j00J87Pj88RK97j58K64k41LL66j56k24
3134g1J64P3J47l83L37J0j47k01O4J91k01J07k26K8J85r0n8j8J2n4lK26L0K8l15
3159a65P3O8K46o7k24R9p8r0O4J78O3k62K86R1k09N2p7j00K58Q1m57J36J74q2
3183E8O0%l52L78Lk94J80n9n9K17l63K59n6K54j13k26J94J49m00L06j22O1r0M8
3207C3O4j91J19k16M44l41J50j11J17j5r5j77M52k32K8j25K30k33mJ39J26j55
$$ plain form
3229 7 -134 177 -17 -151 -63 7 -63 69 -35 157 -253 70 -11 27 16 -41 -111 -55 -16 -46 -9 39 -114 -130 29
3254 29 -17 211 -155 -195 -218 -161 96 -173 -116 20 -107 -66 -74 20 -110 -12 -53 239 53 -68 84 72 -10 -152 -38
3279 -38 -1 75 -97 -20 -186 -8 146 130 -120 -105 -65 1 15 -202 -150 -130 64 -114 -172 120 -40 1 -118 8
3303 8 24 134 -133 233 218 -177 -290 11 104 -82 16 165 -135 -24 260 259 -25 -13 -87 41 13 -46 -45 -15 24
3328 24 91 -125 -107 42 -166 -140 -128 -283 103 61 -251 -47 -70 32 66 171 -94 -53 39 101 7 98 62 141 27
3353 27 104 27 52 19 -86 -68 75 -285 63 19 -211 -14 -146 -21 -61 69 -193 -73 -89 -20 -59 -154 87 132
3377 132 -109 -32 344 -36 -42 114 254 -85 -120 -45 -40 69 -90 -200 -241 181 -98 -202 92 28 -105 -2 -72
3400 -72 -86 139 -12 166 -104 -95 108 -5 141 -148 -97 -133 -33 22 -148 -162 -32 13 -140 -43 164 -26 139
$$ packed form
3229Gj41L11j94j34Q8P0p0J32j04J92m10L23q1L8j1n7p0N6L9l0L7M8j53j6J59
3254B9m6K28l66m0k3N7K57k69N7J36j27M1qR4j30R8m1K92j86j21J52j2q2j42J14
3279c8L7P6j72P7j66J78J54j6k50J5M0O6J4k17N2K0J94j78n8K92j60M1j19J26
3303HJ6J10k67L66j5l95j13L01R3j86R8J49l00J11K84jk84J2p4J28k8n9JL0L9
3328B4O7k16J8J49k08K6J2j55L86m2l12K04k3J02L4J05k65M1R2O2r4R1l6P9j14
3353B7P7p7K5l3j05J8J43l60L48m4k30J97j32J25m0J30k62J20j6O9l9r5K41M5
3377A32k41P7L76l80oJ56J40l39l5P5NJ09j59j10m1M22k79j04K94o4j33J03p0
3400g2j4K25j51J78k70RK03j13J46k89N1l6J00N5j70j4J30M5j53R7K07j90J65
$$ plain form
3423 139 -73 9 21 33 41 -56 -22 36 -178 132 112 -74 106 214 -27 -154 141 -77 -148 -114 89 -145 289 34
3447 34 -113 96 29 49 117 140 31 49 5 27 -19 -65 -59 -9 -176 -28 -7 37 112 100 -200 -57 118 121 101 26 -165
3474 -165 -77 56 -104 189 -226 22 5 108 -54 74 -224 -28 88 21 54 55 -17 16 41 155 -106 215 92
3497 92 50 -134 -98 41 -2 1 59 74 -85 41 63 -62 206 77 49 118 -18 130 -19 276 48 43 32 -164 7
3522 7 75 271 395 -49 -49 24 -187 -199 -32 17 -169 -159 56 -1 35 15 33 -216 53 170 62 263 -22 205
3546 205 51 176 -106 117 57 42 -135 87 -9 69 -123 -45 -51 -179 -11 66 120 110 234 96 76 33 -197 -158
3570 -158 81 53 -121 -47 171 -22 57 23 76 -121 -107 200 136 -48 -102 77 -147 -19 -113 -262 22 65 -146
3593 -146 -205 44 12 -212 -62 137 -243 -130 63 -57 -380 -60 -54 11 85 -124 -227 -6 21 -99 128 110 22
$$ packed form
3423A39k12Q2J2J2Qr7L4N8k14L10k0j86J80J08k41j27K95k18p1L4K03k34M34k55
3447C4j47K09o7K0O8K3j09J8m4K2m6m6ON0j67J48K1M4P5j2l00J43J75Lk0p5j91
3474a65Q8J33j60K93m15K48j7J03j62J28k98J96J16o7L3Jp2L3K5J14k61L21j23
3497I2m2j84L6J39m3LN8J5j59J26K2j25K68j29k8O9j36J48j49K95k28nj1j96J71
3522GO8J96J24m44%P3k11j2J67M9j86J0K15n7L6k0J8k49K69J17j08K01k85K27
3546B05j54J25k82K23o0j5j77K22r6P8j92P8oj28J68P7N4j0J24j38k0m3k30L9
3570a58K39k8j74P4K18j93P9l4N3j97J4L07o4j84n4J79k24J28r4j49K84M3k11
3593a46n9K49l2k24J50J99l80J13J93j20l23L20OO5P4k09j03K21K7j20K27j8q8
$$ plain form
3616 22 76 240 -155 -212 -90 -85 108 -135 -68 78 -120 -38 -140 21 -138 208 55 -118 -40 116 134 -25 52
3639 52 -107 -184 -51 -133 79 53 15 -250 73 -145 -10 -242 -6 -115 -249 195 -202 60 -91 189 -32 -44
3661 -44 293 -175 -74 -30 -200 -90 17 130 143 189 2 -202 -67 -69 -160 105 -131 191 50 118 17 79 -45
3684 -45 -4 15 -232 -84 -73 124 -169 -61 216 75 72 201 65 -7 271 -27 -22 -194 19 253 84 151 287
3707 287 -34 -115 157 -53 331 270 -98 101 -65 -58 -83 145 -32 117 -169 70 -36 -19 155 57 31 -146 -73
3730 -73 60 -168 -21 372 -111 -354 121 -7 -142 262 -157 -155 -90 131 -113 -158 -82 -213 133 -43 -76 58
3752 58 9 -173 -117 198 150 -69 -39 56 49 -56 -225 157 -163 71 -14 75 22 79 -87 -89 28 3 -19 54 -36 -112
3778 -112 -146 90 -162 -127 120 -10 43 -203 -298 60 -107 38 88 -94 -46 -232 191 -43 -150 392 -70 -121
$$ packed form
3616B2N4J64l95n7J22NJ93k43O7J46j98Q2j02J61j59L46j53j73P8J56J8j59P7
3639E2j59p7J33q2K12k6l8k65L23k18J35k32K36j09j34M44l97K62j51K80k21j2
3661d4L37m68J01M4j70J10J07J13J3M6j87k04J35kr1K65k36L22j41O8j01O2j24
3684d5M1J9k47J48J1J97k93J08K77j41lJ29j36p2K78k98Nj72K13K34j69O7J36
3707B87l21q1K72k10L84o1l68J99j66Pk5K28j77J49k86K39j06J7J74r8k6j77P3
3730g3J33k28J47L93m83k43M75j28j35M04m19KO5K21k44m5P6j31L46j76l3J34
3752E8m9j82N6L15m8k19L0R5pj05j69L82l20K34q5Q9n3N7j66kJ17k5k2P3r0p6
3778a12l4K36k52L5K47j30N3k46r5L58j67J45N0j82M8j86M23k34j07N42m62n1
$$ plain form
3800 -121 -9 -150 -189 -178 195 47 -134 -237 -139 43 199 27 -122 -85 -37 22 82 128 -5 64 -2 1 128 -141
3824 -141 34 212 116 92 -117 206 107 48 -115 -163 137 -169 -140 -201 168 -47 133 -26 -217 16 -36 45 -13
3847 -13 -1 -59 84 -30 21 107 110 29 -66 232 11 42 -131 27 14 -6 121 -155 -16 -132 80 186 6 -95
3871 -95 -73 61 19 41 -60 157 56 -124 73 -133 134 -7 -148 122 -20 188 -96 54 -271 -81 -188
3892 -188 102 45 52 121 77 125 129 -161 61 -39 73 53 142 -50 154 398 -213 70 82 -136 -89 -4 -128 11
3916 11 106 -20 -48 -115 -56 143 -82 23 4 51 238 87 24 200 -154 69 104 8 34 -82 -302 179 -39 152
$$ packed form
3800a21J12j41l9J1L73j48j81j03R8J82J56j72j49L7M8N9O0M6j33O9o6LJ27k69
3824a41J75J78r6k4k09L23r9n9j63m8L00l06K9o1L69k15J80j59j91K33n2Q1n8
3847a3J2n8J43j14N1Q6Lq1r5K98k21L1j73J58j3k0J27k76J39j16K12J06j80j01
3871i5K2J34m2K2j01K17j01j80J97k06K67j41j41K70j42K08k84J50l25J90j07
3892a88K90n7PO9m4M8Mk90K22j00J12k0Q9j92K04K44o11K83J2k18M7Q5j24J39
3916A1R5j26k8o7N9J99k25J05j9M7J87j51o3J76l54K23L5r6K6j16k20M81k18J91
$$ [...]
8191b24
##END NTUPLES=NMR FID
##END=
