##TITLE=1H_SA_15.184
 DMSO-d6, 8 sc, 
 28.1.2020
##JCAMPDX= 6.0         $$ Bruker NMR JCAMP-DX V2.0
##DATA TYPE= NMR FID
##DATA CLASS= NTUPLES
##ORIGIN= UXNMR, Bruker Analytische Messtechnik GmbH
##OWNER= root
$$ XWIN-NMR		Version 3.5
$$ Tue Jan 28 14:05:49 2020 Russian Standard Time (UT+4h)  she@DPX200
##.OBSERVE FREQUENCY= 200.1315
##.OBSERVE NUCLEUS= ^1H
##.DELAY= (6, 6)
##.ACQUISITION MODE= SIMULTANEOUS
##.ACQUISITION SCHEME= undefined
##.AVERAGES= 8
##.DIGITISER RES= 18
##SPECTROMETER/DATA SYSTEM= spect
##.PULSE SEQUENCE= zg30
##.SOLVENT NAME= CDCl3
##.SHIFT REFERENCE= (INTERNAL, CDCl3, 0, 15.7039)
##AUDIT TRAIL= $$ (NUMBER, WHEN, WHO, WHERE, WHAT)
$$ ##TITLE= Audit trail, XWIN-NMR		Version 3.5
$$ ##JCAMPDX= 5.01
$$ ##ORIGIN= Bruker BioSpin GmbH
$$ ##OWNER= she
$$ F:/spectra/data/she/nmr/H-F/1/audita.txt
$$ ##AUDIT TRAIL=  $$ (NUMBER, WHEN, WHO, WHERE, WHAT)
(   1,<2020-01-28 14:04:26.73 +0400>,<she>,<DPX200>,
      <created by zg, POWCHK disabled, PULCHK disabled
       configuration hash MD5:
       00 E9 B6 7A A2 85 ED C7 34 08 36 98 17 FE 4E 26
       data hash MD5: 16K
       88 C4 A3 4E 97 62 C1 D8 3A 66 7B 2D 01 78 CE 4A>)
$$ ##END=
$$ 
$$ hash MD5
$$ 8E D2 97 52 65 EB 05 04 C6 FA 66 17 22 41 50 36
##$RELAX= 
##$RELAX= 
##$RELAX= 
##$RELAX= 
##$RELAX= 
##$RELAX= 
$$ Bruker specific parameters
$$ --------------------------
##$DU= <F:/spectra>
##$EXPNO= 1
##$NAME= <H-F>
##$PROCNO= 1
##$TYPE= <nmr>
##$USER= <she>
##$AMP= (0..31)
100 100 100 100 100 100 100 100 100 100 100 100 100 100 100 100 100 100 
100 100 100 100 100 100 100 100 100 100 100 100 100 100 
##$AQSEQ= 0
##$AQ_mod= 1
##$AUNM= <au_zg>
##$AUTOPOS= <>
##$BF1= 200.13
##$BF2= 200.13
##$BF3= 200.13
##$BF4= 200.13
##$BF5= 200.13
##$BF6= 200.13
##$BF7= 200.13
##$BF8= 200.13
##$BYTORDA= 1
##$CFDGTYP= 0
##$CFRGTYP= 5
##$CHEMSTR= <none>
##$CNST= (0..31)
1 1 145 1 1 1 1 1 1 1 1 1 1 1 1 1 1 1 1 1 1 1 1 1 1 1 1 1 1 1 1 1 
##$CPDPRG= <>
##$CPDPRG1= <>
##$CPDPRG2= <>
##$CPDPRG3= <>
##$CPDPRG4= <mlev>
##$CPDPRG5= <mlev>
##$CPDPRG6= <mlev>
##$CPDPRG7= <mlev>
##$CPDPRG8= <mlev>
##$CPDPRGB= <>
##$CPDPRGT= <>
##$D= (0..31)
0 1.2 0 0 0 0 0 0 0 0.06 0 0.03 0 0 0 0 0.0002 0 0 0 0 0 0 0 0 0 0 0 0 
0 0 0 
##$DATE= 1580205866
##$DBL= (0..7)
120 120 120 120 120 120 120 120 
##$DBP= (0..7)
150 150 150 150 150 150 150 150 
##$DBP07= 0
##$DBPNAM0= <>
##$DBPNAM1= <>
##$DBPNAM2= <>
##$DBPNAM3= <>
##$DBPNAM4= <>
##$DBPNAM5= <>
##$DBPNAM6= <>
##$DBPNAM7= <>
##$DBPOAL= (0..7)
0.5 0.5 0.5 0.5 0.5 0.5 0.5 0.5 
##$DBPOFFS= (0..7)
0 0 0 0 0 0 0 0 
##$DE= 6
##$DECBNUC= <off>
##$DECIM= 24
##$DECNUC= <off>
##$DECSTAT= 4
##$DIGMOD= 1
##$DIGTYP= 9
##$DL= (0..7)
0 120 120 120 120 120 120 120 
##$DP= (0..7)
150 150 150 150 150 150 150 150 
##$DP07= 0
##$DPNAME0= <>
##$DPNAME1= <>
##$DPNAME2= <>
##$DPNAME3= <>
##$DPNAME4= <>
##$DPNAME5= <>
##$DPNAME6= <>
##$DPNAME7= <>
##$DPOAL= (0..7)
0.5 0.5 0.5 0.5 0.5 0.5 0.5 0.5 
##$DPOFFS= (0..7)
0 0 0 0 0 0 0 0 
##$DQDMODE= 0
##$DR= 18
##$DS= 0
##$DSLIST= <SSSSSSSSSSSSSSS>
$$ [...]
##$SUBNAM2= <"">
##$SUBNAM3= <"">
##$SUBNAM4= <"">
##$SUBNAM5= <"">
##$SUBNAM6= <"">
##$SUBNAM7= <"">
##$SUBNAM8= <"">
##$SUBNAM9= <"">
##$SW= 24.9337058887773
##$SWIBOX= (0..15)
0 0 2 0 0 0 0 0 0 0 0 0 0 0 0 0 
##$SW_h= 4990.01996007984
##$TD= 16384
##$TD0= 1
##$TE= 0
##$TE2= 300
##$TE3= 300
##$TEG= 300
##$TL= (0..7)
0 120 120 120 120 120 120 120 
##$TP= (0..7)
150 150 150 150 150 150 150 150 
##$TP07= 0
##$TPNAME0= <>
##$TPNAME1= <>
##$TPNAME2= <>
##$TPNAME3= <>
##$TPNAME4= <>
##$TPNAME5= <>
##$TPNAME6= <>
##$TPNAME7= <>
##$TPOAL= (0..7)
0.5 0.5 0.5 0.5 0.5 0.5 0.5 0.5 
##$TPOFFS= (0..7)
0 0 0 0 0 0 0 0 
##$TUNHIN= 0
##$TUNHOUT= 0
##$TUNXOUT= 0
##$USERA1= <user>
##$USERA2= <user>
##$USERA3= <user>
##$USERA4= <user>
##$USERA5= <user>
##$V9= 5
##$VALIST= <valist>
##$VCLIST= <CCCCCCCCCCCCCCC>
##$VD= 0
##$VDLIST= <DDDDDDDDDDDDDDD>
##$VPLIST= <PPPPPPPPPPPPPPP>
##$VTLIST= <TTTTTTTTTTTTTTT>
##$WBST= 1024
##$WBSW= 4
##$XGAIN= (0..3)
0 0 0 0 
##$XL= 0
##$YL= 0
##$YMAX_a= 282039
##$YMIN_a= -186515
##$ZGOPTNS= <>
##$ZL1= 120
##$ZL2= 120
##$ZL3= 120
##$ZL4= 120
##$ABSF1= 10
##$ABSF2= 0
##$ABSG= 5
##$ABSL= 3
##$ALPHA= 0
##$AQORDER= 0
##$ASSFAC= 0
##$ASSFACI= 0
##$ASSFACX= 0
##$ASSWID= 0
##$AUNMP= <proc_1d>
##$AZFE= 0.1
##$AZFW= 0.1
##$BCFW= 1
##$BC_mod= 2
##$BYTORDP= 1
##$COROFFS= 0
##$CY= 11.3945322036743
##$DATMOD= 1
##$DC= 2
##$DFILT= <>
##$DTYPP= 0
##$F1P= 16.9975609425685
##$F2P= -3.02152046262296
##$FCOR= 0.5
##$FTSIZE= 0
##$FT_mod= 4
##$GAMMA= 1
##$GB= 0.15
##$INTBC= 1
##$INTSCL= 1
##$ISEN= 128
##$LB= 0.24
##$LEV0= 0
##$LPBIN= 0
##$MAXI= 10000
##$MC2= 0
##$MEAN= 0
##$ME_mod= 0
##$MI= 1.114404
##$NCOEF= 0
##$NC_proc= 0
##$NLEV= 6
##$NOISF1= 3.799351
##$NOISF2= 2.8
##$NSP= 1
##$NTH_PI= 0
##$NZP= 0
##$OFFSET= 15.70392
##$PC= 1
##$PHC0= -9790.828
##$PHC1= 17.60081
##$PH_mod= 1
##$PKNL= yes
##$PPARMOD= 0
##$PSCAL= 0
##$PSIGN= 0
##$REVERSE= no
##$SF= 200.130013532006
##$SI= 16384
##$SIGF1= 3
##$SIGF2= 2
##$SINO= 400
##$SIOLD= 16384
##$SREGLST= <1H.CDCl3>
##$SSB= 0
##$STSI= 0
##$STSR= 0
##$SW_p= 3612.71676300578
##$SYMM= 0
##$S_DEV= 0
##$TDeff= 0
##$TDoff= 0
##$TI= <>
##$TILT= no
##$TM1= 0
##$TM2= 0
##$TOPLEV= 0
##$USERP1= <user>
##$USERP2= <user>
##$USERP3= <user>
##$USERP4= <user>
##$USERP5= <user>
##$WDW= 1
##$XDIM= 8192
##$YMAX_p= 0
##$YMIN_p= 0
$$ End of Bruker specific parameters
$$ ---------------------------------
##NTUPLES= NMR FID
##VAR_NAME=  TIME,          FID/REAL,        FID/IMAG
##SYMBOL=    X,             R,               I
##VAR_TYPE=  INDEPENDENT,   DEPENDENT,       DEPENDENT
##VAR_FORM=  AFFN,          ASDF,            ASDF
##VAR_DIM=   8192,          8192,            8192
##UNITS=     SECONDS,       ARBITRARY UNITS, ARBITRARY UNITS
##FACTOR=    0.0002004,     1,               1
##FIRST=     0,             0,               0
##LAST=      1.6414764,     0,               0
##MIN=       0,             -186515,         0
##MAX=       1.6414764,     282039,          0
$$ Real data points
##PAGE= N=1
##DATA TABLE= (X++(R..R)), XYDATA
$$ [...]
2078a84L91j97k36j67K17j75p1J19J00k45K70k2j02j33M15r1J73j17j33N84l04
$$ -184 207 10 -226 -393 -176 -351 -422 -303 -203 -448 -178 -200 -302 -435 -20 -111 62 -55 -188 396 92
2099I2K36m3L2J97j66K56k01L04j62K01J00L9j03O39k12P9j6q5j4K27r2MK6k37
$$ 92 328 285 317 514 348 604 403 707 545 746 846 885 782 1421 1209 1288 1272 1187 1173 1400 1308 1312 1338 1101
2123A101K60o11n27KR1l40k90l6l55l35L26l50J4k03J27K42j49K60r6L19J88j76
$$ 1101 1361 750 223 225 316 -24 -314 -350 -705 -1040 -714 -1064 -1050 -1253 -1126 -884 -1033 -773 -869 -550 -362 -538
2145e38j28M20p1K70L09m30k00N07K58k85k22J37k23J70j22J9k20K63j42k0j59
$$ -538 -666 -246 -317 -47 262 -168 -368 139 397 112 -110 27 -196 -26 -148 -129 -349 -86 -228 -248 -407
2166d07J77K12J39J41j9j49J76L74k61J7j93O92n6J87k62k64N3L63m9j30j80M2
$$ -407 -230 -18 121 262 243 94 270 644 383 400 207 899 843 1030 768 504 557 920 871 741 561 603
2188F03J41J19j47q9M04j65Kj41m19J93K81l53K9M5Q2K39m01j36L04j06j25L56
$$ 603 744 863 716 627 1031 866 868 727 308 501 782 429 458 503 585 824 423 287 591 485 360 716
2210G16o12j67K48J15N8m01M9k6J83k49Q8k74R2P5j69j30n3Q6J38j6o21JL46K18
$$ 716 104 -63 185 300 358 -43 6 -20 163 -86 2 -272 -180 -105 -274 -404 -457 -371 -233 -249 -870 -869 -523 -305
2234c05l09j78k81L68p9L05l73J12K65K79R0k9q5M13J68J6J79m62N70m6O1k06
$$ -305 -614 -792 -1073 -705 -784 -479 -852 -740 -475 -196 -106 -135 -220 193 361 377 556 94 664 618 679 473
2256D73j8L55j05m1j54RR9R0L25o17R8K54J78j61m40p3J62L85J2o19j09K65L58
$$ 473 455 810 705 664 510 519 618 708 1033 416 514 768 946 785 345 272 434 819 831 212 103 368 726
2279G26k62j86n8j11L64L4n49j12L23r7p9k34j61j13N70m43l81M0O1J51k25j34
$$ 726 464 278 220 109 473 507 -42 -154 169 72 -7 -241 -402 -515 55 -388 -769 -729 -668 -517 -742 -876
2301h76N1J18jj70M55m63K87J03J21j63l09J30K18p9n7l8R8N42m2k78l87K87M19
$$ -876 -825 -707 -708 -878 -423 -886 -599 -496 -375 -538 -847 -717 -499 -578 -635 -673 -575 -33 -75 -353 -740 -453 -34
2324c4J01n29j35N51P1r6j94k72K52M05K22m74k94M93L59j17l77k50O5K18K91
$$ -34 67 -462 -597 -46 25 -71 -265 -537 -285 120 342 -132 -426 67 426 309 -68 -318 -253 -35 256
2345B56k27l18J41K28n9J2k56J38L52L47n09j04J09P61j90l30n21K00J37M05m14
$$ 256 29 -289 -148 80 21 33 -223 -85 267 614 105 1 110 871 681 351 -170 30 167 572 158
2366A58p9k46M88j01o10k43K15L2K11n73j32K86l5L98n33m24M00j5O80m69k21
$$ 158 79 -167 321 220 -390 -633 -418 -386 -175 -748 -880 -594 -629 -231 -764 -1188 -788 -803 -123 -592 -813
2387h13oM14L00m82l05J8K05J75l68m57K35O10K8l82p36N08N60M6l5p00K50O11
$$ -813 -819 -405 -105 -587 -892 -874 -669 -494 -862 -1319 -1084 -474 -446 -828 -1564 -1056 -496 -450 -485 -1185 -935 -324
2409c24J63k97rN9O44J33l29%K1M78L6j15l75K91R6M03j82n27L46M04K55j57q60
$$ -324 -161 -458 -467 -408 236 369 40 40 61 539 575 460 85 376 472 875 693 166 512 916 1171 1014 154
2432A54M00O08m10K97n41q9M49J40j46p20j21K47J08q19j85J06R1j14j98l99j52
$$ 154 554 1162 752 1049 508 419 868 1008 862 142 21 268 376 -443 -628 -522 -431 -545 -743 -1142 -1294
2453a294M37M5k45M1k65N19L11k10l12p2P95j07J64m28K33K08N73m29Jm0O0M23
$$ -1294 -857 -812 -1057 -1016 -1281 -762 -451 -661 -973 -1045 -250 -357 -193 -621 -388 -180 393 -36 -35 -75 -15 408
2475D08m79m11r3N93K89p2n59J71J65M82l09k26q3O84M4m28k13K77QM10l77p22
$$ 408 -71 -482 -575 18 307 235 -324 -153 12 494 185 -41 -124 560 604 176 -37 240 248 658 281 -441
2497d41J37M71K05m38o2j79M14M17k75l07j27N36K32O7o01K65J8R09l03o83J32
$$ -441 -304 167 372 -66 -128 -307 107 524 249 -58 -185 351 583 650 49 314 332 1241 938 255 387
2518C87M76L74o91l83j81L96K2J35k89m04M21OQ4m59j70J92M48j21o24K60k12
$$ 387 863 1237 546 163 -18 378 400 535 246 -158 263 269 353 -106 -276 -84 364 243 -381 -121 -333
2539c33N51J33n95j21M51Q3k48m93k57M51J67l00n08P5L67N88m23J0k13L27M63
$$ -333 218 351 -244 -365 86 169 -79 -572 -829 -378 -211 -511 -1019 -944 -577 11 -412 -402 -615 -288 175
2560A75k73n9j15M70M30L5o12K3M48L51j32n26k38L9N01k45l51l16k52J005l01
$$ 175 -98 -157 -272 198 628 663 51 74 522 873 741 215 -23 16 517 272 -79 -395 -647 358 57
2581E7p15K3L56O43k33l11k3K30N98L31n14qK88J01J76j91k81K12K24P1n34J80
$$ 57 -658 -635 -279 364 131 -180 -203 27 625 956 442 434 722 823 999 808 527 739 963 1034 500 680
2603F80j05K06K1n33k05OM95J04q40J4O0J18j74j88m56K72J34l5m55l22K2K60
$$ 680 575 781 802 269 64 70 565 669 -171 -157 -97 21 -153 -341 -797 -525 -391 -426 -881 -1203 -1181 -921
2625i21N10p26k44M04L38k10r7r5j19Q99j55J01l16M35O18l3m3k48M76o9J59k11
$$ -921 -411 -1137 -1381 -977 -639 -849 -946 -1041 -1160 -261 -416 -315 -631 -196 422 389 346 98 574 505 664 453
2647D53k33J02Q6R4j55l16J02N99j87k44k38k91P66K24m12k54p0P23k09l31q7
$$ 453 220 322 408 502 347 31 133 732 545 301 63 -228 538 762 350 96 26 749 540 209 122
2668A22K63J47k01j7j16k43M21q4m79l83J22N10j03n66pJ87P26K08p12l92J67
$$ 122 385 532 331 314 198 -45 376 292 -187 -570 -448 62 -41 -607 -614 -427 299 507 -205 -597 -430
2689d30N54R8l18R8J00K20q3j87k14L9P20j39o07l07nK90K3N2m91k17R05j85j50
$$ -430 124 222 -96 2 102 322 239 52 -162 -123 597 458 -149 -456 -461 -171 -148 -96 -587 -804 101 -84 -234
2712b34o25J50R4K98l3j63j06O03J44o61K16m55O22J08j17m4o3M56R0m25l76L65
$$ -234 -859 -709 -615 -317 -350 -513 -619 -16 128 -533 -317 -772 -150 -42 -159 -203 -266 190 280 -145 -521 -156
2734a56O56j84k05p1L07L94k09nk13k14M87K26o4k05l38N12m61l38p0K92j81L12
$$ -156 500 316 111 40 347 741 532 527 314 100 587 813 749 544 206 718 257 -81 -151 141 -40 272
2756B72j16o94K17K53L68n10j98L45L59J52m87J9j6J76M46l95j53p2k90O92l17
$$ 272 156 -538 -321 -68 300 -210 -408 -63 296 448 -39 -20 -36 140 586 191 38 -34 -324 368 51
2777E1m64M14k59O82q82K8k16K99L23j78q66L87K09K93n39L0l9O16J51k02m71
$$ 51 -413 1 -258 424 -458 -430 -646 -347 -24 -202 -1068 -681 -472 -179 -718 -688 -727 -111 40 -162 -633
2798f33J82L38j60R1l88q6P58j85M8j99J35J11%J09l28r0P28j79J02o41J21K82
$$ -633 -451 -113 -273 -182 -570 -656 102 -83 -35 -234 -99 12 12 121 -207 -297 431 252 354 -287 -166 116
2820A16L93j82m05J27J40L75k26n77K04N13r1l73k4J32J93K56o08R8k70J21M10
$$ 116 509 327 -78 49 189 564 338 -239 -35 478 387 14 -10 122 315 571 -37 61 -209 -88 322
2841C22m3l92MJ13K42j86m25j10L57K01k32m49j11L10K32l6n49p4N44J12k57l65
$$ 322 279 -113 -109 4 246 60 -365 -475 -118 83 -149 -598 -709 -399 -167 -203 -752 -826 -282 -170 -427 -792
2863g92K99n0j46J29k40OJ66L80r9k11qK5J86R3k74J8k0K27R6k33j95L08O0J27
$$ -792 -493 -543 -689 -560 -800 -794 -628 -248 -347 -558 -566 -541 -355 -262 -536 -518 -538 -311 -215 -448 -643 -335 -275 -148
2887a48l73l18P31J59j99J01l60N53j97k0o5M7J57M61k85m51k0L68N08j96o19
$$ -148 -521 -839 -108 51 -148 -47 -407 146 -51 -71 -136 -89 68 529 244 -207 -227 141 649 453 -166
2908a66N5L88N5m8l44j83L63m9N7j59o54M77L23l1m57Ol6K73J40k17j27k03L38
$$ -166 -111 277 332 284 -60 -243 120 71 128 -31 -685 -208 115 84 -373 -367 -403 -130 10 -207 -334 -537 -199
2931a99j96k21J18J75M11m94K5k85J06K59J93k18m60J56K17L77m90k51J92O95
$$ -199 -395 -616 -498 -323 88 -406 -381 -666 -560 -301 -108 -326 -786 -630 -413 -36 -526 -777 -585 110
2951A10k29o02K46N3N46k91l2Q4l12K57M9j41J77r8J59N4k36j07R7M44n5k55J11
$$ 110 -119 -721 -475 -422 124 -167 -199 -115 -427 -170 -121 -262 -85 -183 -24 30 -206 -313 -216 228 173 -82 29
2974B9j4J15o3J2r5J68j08J20k39k39K96J53j22J22l06K33j5K3l7k38qO8K17k30
$$ 29 15 130 67 79 -16 152 44 164 -75 -314 -18 135 13 135 -171 62 47 70 33 -205 -213 -145 72 -158
2998a58o6J67K36o0m43R2K07J84K5n0om00Q94l70m6j87O5J57j74O6n39J36L0L80
$$ -158 -224 -57 179 119 -324 -232 -25 159 184 134 128 -272 622 252 206 19 84 241 67 133 -406 -270 -240 140
3022A40k76m27J24J08K86o34K98j79M04k82j06m3K33R8j3p9krJ08j52n7pK35J45
$$ 140 -136 -563 -439 -331 -45 -679 -381 -560 -156 -438 -544 -587 -354 -256 -269 -348 -350 -359 -251 -403 -460 -467 -232 -87
3046h7k66L28q0R9k4J30J26m87N17jj55j34R4L13j89K63n35J63N1K10J41k8n88
$$ -87 -353 -25 -105 -6 -30 100 226 -261 256 255 100 -34 60 373 184 447 -88 75 126 336 477 449 -139
3069a39K90n6J1K99l03j6J02o5p8k13K41L62k14j67r4M6K64J18j54j68o0N6k27
$$ -139 151 95 106 405 102 86 188 123 45 -168 73 435 221 54 -40 6 270 388 234 66 6 62 -165
3092a65K01k39J65p1J53n40J22l02K70M44n10k42K02N4M1o7J83j86N9K54o3k23
$$ -165 36 -203 -38 -109 44 -496 -374 -676 -406 38 -472 -714 -512 -458 -417 -484 -301 -487 -428 -174 -237 -460
3114d60j83N02j50j38K10%k04M84J12o7l24M67P3Q1m51j54M69P3j40j45J15N3
$$ -460 -643 -141 -291 -429 -219 -219 -423 61 173 106 -218 249 322 403 -48 -202 267 340 200 55 170 223
3136B23P4K56m03R8oK61l2n50J18K36k63K1J9j73P7J58k47n7j60J28k10k5K26
$$ 223 297 553 150 248 242 503 471 -79 39 275 12 33 52 -121 -44 114 -133 -190 -350 -222 -432 -457 -231
3159b31p0K23j00m1q4L9J14k3J88n00L23J47j93Mq1L49j14O6n1J62j91K77k55
$$ -231 -301 -78 -178 -219 -303 -264 -150 -173 15 -485 -162 -15 -208 -204 -285 64 -50 16 -35 127 -64 213 -42
3182d2k4n7l0K53r6J46j50j18J0j32K40j80j16q2L07j60j17k27L06j81k99K59
$$ -42 -66 -123 -153 100 4 150 0 -118 -108 -240 0 -180 -296 -378 -71 -231 -348 -575 -269 -450 -749 -490
3204d90L86k15k20L27l99J88R9J1r0K97j08J7K52O7k0k43K28N4R2M9j68M8k06
$$ -490 -104 -319 -539 -212 -611 -423 -324 -313 -403 -106 -214 -197 55 122 102 -141 87 141 233 282 114 162 -44
3227d4L69j53M1o8P9j25O3J10j44K79k51J36m10K46r6j96K98m0j74J45l01R3L20
$$ -44 325 172 213 145 224 99 162 272 128 407 156 292 -118 128 32 -164 134 94 -80 65 -236 -143 177
3250A77n06K44l01Ol9J05K04j17m6%K04k9n0J86l37N16m52N9l0j51L89l52K31
$$ 177 -329 -85 -386 -380 -419 -314 -110 -227 -273 -273 -69 -98 -148 38 -299 217 -235 -176 -206 -357 32 -320 -89
3273h9k33k44K26L86m93m7J85J93m0k84L01L7K53j51k74J68k60K70m9R8K2N5l06
$$ -89 -322 -566 -340 46 -447 -494 -309 -116 -156 -440 -139 -102 151 0 -274 -106 -366 -96 -145 -47 -25 30 -276
3296b76M32K8l41L63j05jJ95J74n38K77k6J51k45J70m2J85l68N49m62K91m48K34
$$ -276 156 184 -157 206 101 100 295 469 -69 208 182 333 88 258 216 401 33 582 120 411 -37 197
3318A97J90j48k39O7k18O3K6l81K98k36O4R1l44J79M61p23L82k39J24p7J18j42
$$ 197 387 239 0 67 -151 -88 -62 -443 -145 -381 -317 -226 -570 -391 70 -653 -271 -510 -386 -463 -345 -487
3340d87K59k0q1mn09N74P1j31P8Q6mK20l04M55j91kq4jl8O8O1q6J03J28r8Kj79
$$ -487 -228 -248 -329 -333 -842 -268 -197 -328 -250 -164 -168 52 -252 203 12 10 -74 -75 -113 -45 16 -70 33 161 63 65 -114
3367a14K42j09k23J89r6L32m38O7%J13r4Rk33M23j6n36K83K78l12K88Jm1Q6K31
$$ -114 128 19 -204 -15 -111 221 -217 -150 -150 -37 -131 -122 -355 68 52 -484 -201 77 -235 53 54 13 99 330
3391C30j05j91N27o83R1J36l2J56j49K8k59L13m2o2q9L42m29m7p3J42L5NL6N5
$$ 330 225 34 561 -122 -31 105 73 229 80 108 -151 162 120 58 -31 311 -118 -165 -238 -96 -61 -56 -20 35
3415C5L5n3k56L68j23p8j15K06k02K18n25L70K12l32qm2J65j40J97m9K61m46J21
$$ 35 70 17 -239 129 6 -72 -187 19 -183 35 -490 -120 92 -240 -248 -290 -125 -265 -68 -117 144 -302 -181
3438a81P7q3J43r7k4K1M3L79k85j31o4L32k88K94l85K39k10L60J35j95j47L23
$$ -181 -104 -187 -44 -141 -165 -144 -101 278 -7 -138 -202 130 -158 136 -249 -10 -220 140 275 80 -67 256
3460B56m3K18l21Q7N7j9J05P7k38o9J89j31p2L5J38P6N8l52K29k09j47K67r3k07
$$ 256 213 431 110 197 254 235 340 417 179 110 299 168 96 131 269 345 403 51 280 71 -76 191 98 -109
3484a09L85l75O6L01k08j51K28j14n7j35K82J48m80L78m93R7M94l33l69J86K89
$$ -109 276 -99 -33 268 60 -91 137 23 -34 -169 113 261 -219 159 -334 -237 257 -76 -445 -259 30
3505C0j33J02l22L4M3r0K3M01j54k2q9JK40l58J21j56L09P3P6j47L02l41M65r7
$$ 30 -103 -1 -323 -289 -246 -336 -313 88 -66 -88 -177 -176 64 -294 -173 -329 -20 53 129 -18 284 -57 408 311
3529C11k94L6n8N9J71j26J54p7j28L25l30K24k06L60k70K4l63J75J03J61m49O06
$$ 311 17 53 -5 54 225 99 253 176 48 373 43 267 61 421 151 175 -188 -13 90 251 -198 408
3551D08j44j28J04j83j5J46l43M88M8n12M24m96K69k7j3j2j30m1L60l40P4K08
$$ 408 264 136 240 57 42 188 -155 333 381 -131 293 -203 66 39 26 14 -116 -157 203 -137 -63 145
3573A45o90L85j91J03P4PR3r3r0l0M42k22N2j72L8J33L0j84Q4L95n42M60l72J47
$$ 145 -545 -160 -351 -248 -174 -167 -74 -167 -257 -287 155 -67 -15 -187 -149 -16 14 -170 -86 309 -233 227 -145 2
3597BKl9O0j46M0K74l80J47R0J17o6j34L23k82j83R4J4K95m40K59k61O38m18J23
$$ 2 4 -35 25 -121 -81 193 -187 -40 50 167 101 -33 290 8 -175 -81 -67 228 -212 47 -214 424 6 129
3621A29j07O4J39m06L04j20o7J9Q9k13J87lJ84j33L20n2j33Q5k43K57l73L05k08
$$ 129 22 86 225 -181 123 3 -64 -45 44 -169 18 15 199 66 386 334 201 286 43 300 -73 232 24
3644B4k26R6P4L2j75K41k9n7m50L81M2k38M55k7k58Q2J18j95Kj23J71l71O28m37
$$ 24 -202 -106 -32 0 -175 66 37 -20 -470 -89 -47 -285 170 143 -115 -33 85 -110 -108 -231 -60 -431 197 -240
3668b40P5K0O4K40O4k31m1Kk53J67J18k81n3J23N9O2j12L05j62J1l20L18m07M29
$$ -240 -165 -145 -81 159 223 -8 -49 -47 -300 -133 -15 -296 -349 -226 -167 -105 -217 88 -74 -63 -383 -65 -472 -43
3692d3j10n4k48J89K37K95j36j10J28q6nJ28O0k51J54J43j56j0J52j95O7J72k52
$$ -43 -153 -207 -455 -266 -29 266 130 20 148 62 57 185 245 -6 148 291 135 125 277 82 149 321 69
3715F9k41J73L28o4j56k6j13L04m27k4J69k56J82m6j9o2R1m8j2q3o6N7j67J35
$$ 69 -172 1 329 265 109 83 -30 274 -153 -177 -8 -264 -82 -128 -147 -209 -118 -166 -178 -261 -327 -270 -437 -302
3739c02R6R0n8R7j43J19k83K59o5j15P9K57J41n20K84k52n6L75j05K77r5N00m09
$$ -302 -206 -116 -174 -77 -220 -101 -384 -125 -190 -305 -226 31 172 -348 -64 -316 -372 3 -102 175 80 580 171
3762A71j81L20n37L46k11Q4N5J04r9k75M4L33J08p1k20MJ10j53J26N2J61k23m9
$$ 171 -10 310 -227 119 -92 -8 47 151 52 -223 -179 154 262 191 -29 -25 85 -68 58 110 271 48 -1
3785aj66K58o0j6oR3O1j4j9k62M64l00K32k16P1k60M98o52L39k23j85L40L9L03
$$ -1 -167 91 31 15 9 102 163 149 130 -132 332 32 264 48 119 -141 357 -295 44 -179 -364 -24 15 318
3809C18j86n34M09k44R0N9k1Q0j06R3k2K9j6r5k9K4J56k76J61k46O26k71k49L50
$$ 318 132 -402 7 -237 -147 -88 -109 -29 -135 -42 -64 -35 -51 -146 -175 -151 5 -271 -110 -356 270 -1 -250 100
3833A00l66K83r0J2J49j72J88n3k34L05k70o1L40j45Q7OJ37l31L4J80k47j0l29
$$ 100 -266 17 -73 -61 88 -84 104 51 -183 122 -148 -209 131 -14 73 79 216 -115 -81 99 -148 -158 -487
3856d87K99L1N3P0k6K93l13j18M14k76J08p8J40j3k63l78L75L82q3j7J63k25n5
$$ -487 -188 -157 -104 -34 -60 233 -80 -198 216 -60 48 -30 110 97 -166 -544 -169 213 130 113 276 51 -4
3879dQ8l36J81K9J19J67k77J11J60k84j23Q1R7L01k02k34J64j17j03J49k21P7
$$ -4 84 -252 -71 -42 77 244 -33 78 238 -46 -169 -88 9 310 108 -126 38 -79 -182 -33 -254 -177
3901a77M6r5o3j54L38K9j7k29J48j26J65j05k2L82m18N88l22p2o3M9M3K08r8k17
$$ -177 -131 -226 -289 -443 -105 -76 -93 -322 -174 -300 -135 -240 -262 120 -298 290 -32 -104 -167 -118 -75 133 35 -182
3925a82n9J70J73L1J02l40p4R1j36J52J82l6j17M23k24l33K89Nl01L40R2l2j09
$$ -182 -241 -71 102 133 235 -105 -179 -88 -224 -72 110 74 -43 380 156 -177 112 117 -184 156 248 216 107
3948A07q5N2L65l94kJ12m37P0n1K01J71l2j3Qj82J75k0M9j96J61NNl71K6K05M9
$$ 107 22 74 439 45 43 155 -282 -212 -263 -62 109 77 64 72 -110 65 45 94 -102 59 64 69 -302 -276 -71 -22
3974b2l69M03l90M46M3j12m6k16N05k09N2j67J28m03N76l51o2J24K49j63j53M05
$$ -22 -391 12 -378 68 111 -1 -47 -263 242 33 85 -82 46 -357 219 -132 -194 -70 179 16 -137 268
3996B68l79J01OR0jl60J0R4J09J76k69K37k21J85P7r4J15p6J25L5n3j61M2O0p3
$$ 268 -111 -10 -4 86 85 -275 -265 -171 -62 114 -155 82 -139 46 123 29 144 68 193 228 175 14 56 116 43
4021D3K21m76P03l60j94K27n4j50M40n22Q9K47l24J46lk6M0P3k15J52J64NK5k44
$$ 43 264 -212 491 131 -63 164 110 -40 400 -122 -33 214 -110 36 33 7 47 120 -95 57 221 226 251 7
4045Gl01Q9L3J92l0J06p9q0J26Oo4O5l18L17R7m87M74j90o5J83k82k3M44k82L06
$$ 7 -294 -205 -172 20 -10 96 17 -63 63 69 5 70 -248 69 166 -321 153 -37 -102 81 -201 -224 220 -62 244
4070B44j83n8L20rj09p8k67J01L6j72J96j55J96L9k88J61k73L30p7R8J66j91k2
$$ 244 61 3 323 314 205 127 -140 -39 -3 -175 21 -134 62 101 -187 -26 -299 31 -46 52 218 27 5
4093EJ39N3Rk86L15o8j06k33M72k86m5j59J60K17p2K53n10L09j77J66j83K4l3
$$ 5 144 197 206 -80 235 167 61 -172 300 14 -31 -190 -30 187 115 368 -142 167 -10 156 -27 -3 -36
4116c6L7j73K03J2J1j95oR3R8j11r8J68j65N23k87j89M33l05k38K24J66k06qM8
$$ -36 1 -172 31 43 54 -141 -147 -54 44 -67 -165 3 -162 361 74 -115 318 13 -225 -1 165 -41 -49 -1
4140aR7J74l32k10M15j23k98K07k45J25j42K37r7J10k08J9M32j04l99K19N6j14
$$ -1 96 270 -62 -272 143 20 -278 -71 -316 -191 -333 -96 -193 -83 -291 -272 160 56 -343 -124 -68 -182
4162a82K62J3r2J35j84q3o6K54q9j55K29K73k36j17J91q5J0j59P3j02L70m78L48
$$ -182 80 93 1 136 -48 -131 -197 57 -32 -187 42 315 79 -38 153 68 78 -81 -8 -110 260 -218 130
4185A30J78k84j0R5o5j12K30p0K06j66m59L86L6j84M40j26k41K28n44L77P0k22
$$ 130 308 24 14 109 44 -68 162 92 298 132 -327 59 95 -89 351 225 -16 212 -332 45 115 -107
4207a07L35k51J63j67o3j19K43j26M3o5P6j8j69k2K05m6p9j59N38m44J7J55q1
$$ -107 228 -23 140 -27 -90 -209 34 -92 -49 -114 -38 -56 -225 -247 -42 -88 -167 -326 212 -232 -215 -60 -141
4230a41JJJ88k26K9J52k88L71R6j68J2k11J29J59L2K96l26J79o9m0k44j2K05j68
$$ -141 -140 -139 49 -177 -148 4 -284 87 183 15 27 -184 -55 104 136 432 106 285 216 176 -68 -80 125 -43
4254d3K05j52L01l32j35n8M27l72R3J82m0K19l64j12m6M78l24K01r8P9K23n75
$$ -43 162 10 311 -21 -156 -214 213 -159 -66 116 76 295 -69 -181 -227 251 -73 128 30 109 332 -243
4276b43K64J75j81pk63O15n86N05m17J72J08k93RR7K4K8J69j56m0l23K78r1m3
$$ -243 21 196 15 8 -255 360 -226 279 -138 34 142 -151 -142 -45 -21 7 176 20 -20 -343 -65 -156 -199
4299a99j2J04M4j42O2R0K7Qj62L16m45K55N1j60K64m2j36L70k07j74M0M5n1K48
$$ -199 -211 -107 -63 -205 -143 -53 -26 -18 -180 136 -309 -54 -3 -163 101 59 -77 293 86 -88 -48 -3 -54 194
4323A94k41L72l11J02k36Q5p7K22m77K74K09K7r3k76J62MJ15o2J16q0p3k07L03
$$ 194 -47 325 14 116 -120 -35 -112 110 -367 -93 116 143 50 -226 -64 -60 55 -7 109 29 -44 -251 52
4346E2J3k49L46k88Q7j49J76K6j25J12n1J94j22R2l6J3j22K3j09K46j17M2K0k26
$$ 52 65 -184 162 -126 -39 -188 -12 14 -111 1 -50 144 22 114 78 91 -31 -8 -117 129 12 54 74 -152
4370a52K26k13p2J34K24k73K36q4m2k5J02R3j94j49J54k0j52pJ14m6r4L95K9n69
$$ -152 74 -139 -211 -77 147 -126 110 26 -16 -41 61 154 -40 -189 -35 -55 -207 -214 -100 -146 -240 155 184 -385
4394c85N97l69J61k9O0RK18k81l9K42k5q9n2O3M2j24K08k79j47N55k64q6P1j0
$$ -385 212 -157 4 -25 35 44 262 -19 -58 184 159 70 18 81 123 -1 207 -72 -219 336 72 -14 57 47
4418D7j03J59J35k00L04k97J75q2k43M74l87k65K79J43j1J01j53j63O4l0l6K19
$$ 47 -56 103 238 38 342 45 220 138 -105 369 -18 -283 -4 139 128 229 76 -87 -23 -53 -89 130
4440A30k07j91J73j08J65j29L32L9k93K74j53k04lK61l99L42R3j15j99J36j27
$$ 130 -77 -268 -95 -203 -38 -167 165 204 -89 185 32 -172 -175 86 -313 29 122 7 -192 -56 -183
4461a83M6n4K34k45M8K15k98Q8l7P4q1N5KM16m17P9j72J16k34J86K36m2J0K38
$$ -183 -137 -191 43 -202 -154 61 -237 -149 -186 -112 -193 -138 -136 280 -137 -58 -230 -114 -348 -162 74 32 42 280
4485B80j87k16J31O2J05j25J94m44J95M6P2J29J07k03n6L9Mk87J71QJ24l59K70
$$ 280 93 -123 8 70 175 50 244 -200 -5 41 113 242 349 146 90 129 133 -154 17 25 149 -210 60
4508F0k35M13j46j20R5j64J69j29M19m80N8R7J11mj26j1L16j82j0j30J84l08K49
$$ 60 -175 238 92 -28 67 -97 72 -57 362 -118 -60 37 148 144 18 7 323 141 131 1 185 -123 126
4531A26k90J66L5j79L00k36N5k80L52M1j23K79l61K36k96J96j55J23J77k77L53
$$ 126 -164 2 37 -142 158 -78 -23 -303 49 90 -33 246 -115 121 -175 21 -134 -11 166 -111 242
4552B42l51P6K48m6k72J62l00L52k3P7l02j27L60l70K02R6r8L5j86L47p0K27k42
$$ 242 -109 -33 215 169 -103 59 -241 111 88 165 -137 -264 96 -274 -72 24 -74 -39 -225 122 52 279 37
4575C7J68j25J07k77J9J79j59K59M0K3k58K61l66K86k77K24R3k66L6kJ15m8Q9
$$ 37 205 80 187 -90 -71 108 -51 208 248 271 13 274 -92 194 -83 141 234 -32 4 2 117 69 158
4598A58j37r1Q2K24k30P6j08k0K05j36J67l13K77n3n7m82J94j29K15L90j75j17
$$ 158 21 -70 12 236 6 82 -26 -46 159 23 190 -123 154 101 44 -438 -244 -373 -158 232 57 -60
4620f0Q5k05K40k21LJ62o5L7L6J69m8j68k07m9K44N2K6j6qL02m08K63p2J79k81
$$ -60 25 -180 60 -161 -158 4 -61 -24 12 181 133 -35 -242 -291 -47 5 31 15 7 309 -99 164 92 271 -10
4645a0q6K97j17j49M41l71P6j10K10k58R8k68K47J15j53L0K81n54N13J38l25K34
$$ -10 -96 201 84 -65 376 5 81 -29 181 -77 21 -247 0 115 -38 -8 273 -281 232 370 45 279
4667B79j07p8k48L10O9k22n16L05K17j90r8K12J37j05k58L25J17l68K91J31j7
$$ 279 172 94 -154 156 225 3 -513 -208 9 -181 -279 -67 70 -35 -293 32 149 -219 72 203 186
4688A86l77K03J15k60L9J39l4p5O3K3J5q1J72j02k1q8Q8j97L06k75J62j68L37
$$ 186 -191 12 127 -133 -94 45 11 -64 -1 22 37 -44 128 26 5 -83 5 -192 114 -161 1 -167 170
4711A70j09R2j28M6J27m45K81k3N3n2J0j80L97m72MJ39J02K70k68n7J05N8m65
$$ 170 61 153 25 71 198 -247 34 11 64 12 22 -158 239 -233 -229 -90 12 282 14 -43 62 120 -345
4734c45L46p8j59J60L5j3M87q21L95L6l4J93J93m12k78J31j01M76M3m52L49J67
$$ -345 1 -77 -236 -76 -41 -54 433 -388 7 43 9 202 395 -17 -295 -164 -265 211 254 -198 151 318
4756C18l80J2r4j61K64R4J75l15m2K06J09k89M1K07j47N6k89O0M53l99J11Qo4
$$ 318 -62 -50 -144 -305 -41 53 228 -87 -129 77 186 -103 -62 145 -2 54 -235 -175 278 -121 -10 -2 -66
4779f6K23j01J17m05L11k08K9J0K49l25J32J25q2m5Rk3J18j74J06k61K98j53J90
$$ -66 157 56 173 -232 79 -129 -100 -90 159 -166 -34 91 9 -36 -27 -50 68 -106 0 -261 37 -116 74
4802G4k28P3M4k31K75j73k08J81k1J12K11k28J22p5K50m00K24oj71K80R2N5k44
$$ 74 -154 -81 -37 -268 7 -166 -374 -193 -214 -102 109 -119 3 -72 178 -222 2 -4 -175 105 197 252 8
4825Hj40J62k46L77l56J92J48jM4o9j57J0N35l01m0k61K42o9j80J78k40Q4K0j92
$$ 8 -132 30 -216 161 -195 -3 145 144 188 119 -38 -28 507 206 166 -95 147 78 -102 76 -164 -80 -60 -252
4849b52K79j31j39M4J5J41p7o6M03m45R3M3R0l2k73K31M6j71K00j61J08j32o6
$$ -252 27 -104 -243 -199 -184 -43 -120 -186 217 -228 -135 -92 -2 -34 -307 -76 -30 -201 -1 -162 -54 -186 -252
4872b52K04K7J27n6P5k29L62n07M40k3l99J47P7m8J29j98M0J68k09J59j69L26
$$ -252 -48 -21 106 50 125 -104 258 -249 191 168 -231 -84 -7 -55 74 -124 -84 84 -125 34 -135 191
4894A91j74j5j61N6q0j17J14J13K35k64%n0K87j36q0rJ56m07M05n4j40J39j01
$$ 191 17 2 -159 -103 -183 -300 -186 -73 162 -102 -102 -152 135 -1 -81 -90 66 -341 64 10 -130 9 -92
4917i2M4J2O7l16L95j56j95J90N7q7r0r1L20J13o4j88p8n9k74N05r2K0k49K77
$$ -92 -48 -36 31 -285 110 -46 -241 -51 6 -81 -171 -262 58 171 107 -81 -159 -218 -492 13 -79 -59 -308 -31
4941c1K81R1j55L7J31k09l25R5k22K97q2J62k45J55L20l06l1L22j93j35J08r9
$$ -31 250 341 186 223 354 145 -180 -85 -307 -10 -92 70 -175 -20 300 -6 -37 285 92 -43 65 -34
4963c4p8L91J9k98nK21j86O1j98J57j01j11L45j15m23J75L60l21L03l65K66J81
$$ -34 -112 279 298 0 -5 216 30 91 -107 50 -51 -162 183 68 -355 -180 180 -141 162 -203 63 244
4985B44n45N39k48rK10j88m5L06m4j98j49L05k13K4J2J1j90J19K02r0m4n2Q8q
$$ 244 -301 238 -10 -19 191 3 -42 264 220 22 -127 178 -35 -11 1 12 -178 -59 143 53 9 -43 45 37
5009C7j9J07j43l1o6J76k73K74j41j24K29J90j86M3r0l3m1K14K70l72P2l78J01
$$ 37 18 125 -18 -49 -115 61 -212 62 -79 -203 26 216 30 73 -17 -50 -91 123 393 21 93 -285 -184
5032a84K00p4k73J02K09J0j00K09J8K0p1j74K75m47J91R8J26j87j51K82Rj3l29
$$ -184 16 -58 -331 -229 -20 -10 -110 99 117 137 66 -108 167 -280 -89 9 135 -52 -203 79 88 75 -254
5055b54L78l39n6K78j31P3j25K11j01j5J53k27J64J35n8j47K90k70K83m75K59
$$ -254 124 -215 -271 7 -124 -51 -176 35 -66 -81 72 -155 9 144 86 -61 229 -41 242 -233 26
5076B6Rn3N9k82L10j52L36l26P2J27m6k10p3K88O7k76J92M2j29p6J61k84R8K14
$$ 26 35 -18 41 -241 69 -83 253 -73 -1 126 80 -130 -203 85 152 -124 68 110 -19 -95 66 -218 -120 94
5100I4J44j12k12M83k87K4l21O5K97k56J64l36K43l4o5n1K14J53l53J89l62K08
$$ 94 238 126 -86 397 110 134 -187 -122 175 -81 83 -253 -10 -44 -109 -160 54 207 -146 43 -319 -111
5122a11J08M43o51K90J72n8j99J41nk09j67J98K85m96ML23o1K94r0k89K18l61
$$ -111 -3 440 -211 79 251 193 -6 135 130 -79 -246 -48 237 -259 -255 68 7 301 211 -78 140 -221
5144b21M19l4qO5k09j70K42l29l9K56o37N54K64K6k46K7j43K02j26k57N09l62
$$ -221 198 164 156 221 12 -158 84 -245 -284 -28 -665 -111 153 179 -67 -40 -183 19 -107 -364 145 -217
5166b17K92j98r4j7L78k4j18N5p0r1J03%k98M14k71K34j90l9J04j23M98m43j14
$$ -217 75 -123 -217 -234 144 120 2 57 -13 -104 -1 -1 -299 115 -156 78 -112 -151 -47 -170 328 -115 -229
5189b29L61m93K75J48j29j90K26j23mK29k41M99k83P6l68J82J90j86K13k69K31
$$ -229 132 -361 -86 62 -67 -257 -31 -154 -158 71 -170 329 46 122 -246 -64 126 -60 153 -116 115
5210A15p2J25m6j80o4O8m7J98J73n45K57J97k71k74N98j51O5j39p6L2j51M15r9
$$ 115 43 168 122 -58 -122 -54 -101 97 270 -275 -18 179 -92 -366 232 81 146 7 -69 -37 -188 227 128
5233A28n3R7m19M53O3k26k38N0K04J30n05J75j45M93Jn0k15J18lj44J53k29k52
$$ 128 75 172 -247 206 269 43 -195 -145 59 189 -316 -141 -286 207 208 158 -57 61 58 -86 67 -162 -414
5256d14N02l06lJ20k6j3L92l15o7j21P7Q7oN3k78M09j34j06K77k35P1J85j76j57
$$ -414 88 -218 -221 -101 -127 -140 252 -63 -130 -251 -174 -87 -93 -40 -318 91 -43 -149 128 -107 -36 149 -27 -184
5280a84L14j35N1j99J91k6M22k92j11l39L2R0N2K91j91J98k32L11l03J6L08k57
$$ -184 130 -5 46 -153 38 12 434 142 31 -308 -276 -186 -134 157 -34 164 -68 243 -60 -44 264 7
5302GJ03Nj53L3J49k27J40J89k69o2L22m67K7J07q3J10J12J09k45L44k53J88k21
$$ 7 110 115 -38 -5 144 -83 57 246 -23 -85 237 -230 -203 -96 -179 -69 43 152 -93 251 -2 186 -35
5325c5rj48L42l74q6K92N7q8j4r7K78j07q3K64n67N08j83J03j83mK25k61P5K35
$$ -35 -44 -192 150 -224 -310 -18 39 -49 -63 -160 118 11 -72 192 -375 133 -50 53 -130 -134 91 -170 -95 140
5349A40K1o20N60R0m79M02j12L01m0Ml06J8r0J40k14K08j24J13j34L1K43k69J93
$$ 140 161 -459 101 191 -288 114 2 303 263 267 -39 -21 -111 29 -185 23 -101 12 -122 -91 152 -117 76
5372G6j41r8K22K16k85J13j10J61k8k36J35J15j01K9j80M2K8O0K8j6P8k65J2M11
$$ 76 -65 -163 59 275 -10 103 -7 154 126 -110 25 140 39 68 -112 -70 -42 18 46 30 108 -157 -145 266
5396B66j40K84j72Q8m47j8K75j95K86m25L53j84J03N5j58L35l60J49o8m0k33M84
$$ 266 126 410 238 326 -121 -139 136 -59 227 -198 155 -29 74 129 -29 306 -54 95 27 -13 -246 238
5418B38l58K04j67L28m75K47l11K34R2mj85L83n54K50j5p8L51j48j17j64K83o5
$$ 238 -120 84 -83 245 -230 17 -294 -60 32 28 -157 226 -328 -78 -93 -171 180 32 -85 -249 34 -31
5440c1q8Q7J0r3J18N7k14M79l89r6j20M4L82k45J81l33K03j07J04j94M23N8n6
$$ -31 -119 -32 -22 -115 3 60 -154 325 -64 -160 -280 -236 146 -99 82 -251 -48 -155 -51 -245 178 236 180
5463A80k74J65k35J03J23J45k86J07J57%j21k07K02j66J63k81J85k57O28n10J86
$$ 180 -94 71 -164 -61 62 207 -79 28 185 185 64 -143 59 -107 56 -225 -40 -297 331 -179 7
5484Gk9j63J21J53j74q0M3K59l08J31Qm0j93N72j39n29J94K08n5o2J16l0q9K05
$$ 7 -22 -185 -64 89 -85 -165 -122 137 -171 -40 -32 -72 -265 307 168 -361 -167 41 -14 -76 40 10 -79 126
5508A26l51J13K2O4p5M9K26r9l0M8l24L48j89q0J00M02j66k66L59n1j34j85P4
$$ 126 -225 -112 -90 -26 -101 -52 174 75 45 93 -231 117 -72 -152 -52 350 184 -82 277 226 92 -93 -19
5531a9l3K26l70N17l94L29l26M47l40j12L53l91K34k11J29m9o9k96M52q4K8L1
$$ -19 -52 174 -196 321 -73 256 -70 377 37 -75 278 -113 121 -90 39 -10 -79 -375 77 -7 21 52
5553E2p9M5m5m4k41J56K5N5J5Q8L62l88j41J25P3r7J22k59J19J28O4k07J85j68
$$ 52 -27 18 -27 -71 -312 -156 -131 -76 -61 27 389 1 -140 -15 58 -39 83 -176 -57 71 135 -72 113 -55
5577e5J34k67L28k10K3j68J80R3k26K49R4k23L6K8Qk9l13N8K79P0j44k08J26J35
$$ -55 79 -188 140 -70 -47 -215 -35 58 -168 81 175 -48 -12 16 24 -5 -318 -260 19 89 -55 -263 -137 -2
5601bR5J7k04L08l46J06K3K9M0p5M6j01k3J14J12n8j14K3K8L9k01L32j39M5J10
$$ -2 93 110 -94 214 -132 -26 -3 26 66 -9 37 -64 -87 27 139 81 -33 -10 18 57 -144 188 49 94 204
5626B04l92K04K02k71j10J28j8J2J85k13J87r4j0O4l3j43L8p0j29K65m3j06L13
$$ 204 -188 16 218 -53 -163 -35 -53 -41 144 -69 118 24 14 78 45 -98 -60 -130 -259 6 -37 -143 170
5649A70k70k40M06l8l37L29j61L59m35J88J21l53j43L45J62k34K76j91J46j5k01
$$ 170 -100 -340 66 28 -309 20 -141 218 -217 -29 92 -261 -404 -59 103 -131 145 -46 100 85 -116
5670a16M25l20j30J02j58L84l69K33j05l2N1o1j94J63L02Q9m51J47k79M95N9m65
$$ -116 309 -11 -141 -39 -197 187 -182 51 -54 -86 -35 -96 -290 -127 175 264 -187 -40 -319 176 235 -230
5692b30n3L31j08O8q5K1K37K8p9K5l9j61J83j72j2q6L77n33K50K70j89K15k99
$$ -230 -283 48 -60 8 -77 -56 181 209 130 155 116 -45 138 -34 -46 -132 245 -288 -38 232 43 258 -41
5715d1j14J76P0R8k93J67k00J36k7J13j30L3Oj86J49J38j3j05J07j68o2K3K32
$$ -41 -155 21 91 189 -104 63 -137 -1 -28 85 -45 -12 -6 -192 -43 95 82 -23 84 -84 -146 -123 109
5738A09j77L50k78j54P3J53K80k11P0l16j66L85j92J69Ok16J53k52N65m46n2M50
$$ 109 -68 282 4 -150 -77 76 356 145 215 -101 -267 118 -74 95 101 -115 38 -214 351 -95 -147 303
5760C03l04k4k51L92k90J81N8k99K48j63K38k30K88k5j94N0J0J2J24p4P9j93o1
$$ 303 -1 -25 -276 116 -174 7 65 -234 14 -149 89 -141 147 122 -72 -22 -12 0 124 50 129 -64 -125
5783a25J7K80m9j42K30l19j0j16Q5L58k78k8J57p5L2l45K65O2L8o9O0o3k55K92
$$ -125 -108 172 123 -19 211 -108 -118 -234 -149 209 -69 -97 60 -15 17 -328 -63 -1 37 -32 28 -35 -290 2
5807BJ02k80p5O07m73j28J11RJ28JJ64m74K3P04m63k7K33rj36L09k51J44O5p70
$$ 2 104 -176 -251 356 -117 -245 -134 -125 3 4 168 -306 -283 421 -42 -69 164 155 19 328 77 221 286 -484
5831d84K27J61J32j28O3Q3o1K89m23J95r9j18J40j3j39K09J25O5l56P8J36j98
$$ -484 -257 -96 36 -92 -29 54 -7 282 -141 54 -45 -163 -23 -36 -175 34 159 224 -132 -54 82 -116
5853a16K26j90J00K9p7J76M0k47J8R4l10L18o4N3l0O3n1J1k83J44K44p1k40J28
$$ -116 110 -80 20 49 -28 148 188 -59 -41 53 -257 61 -3 50 20 83 32 43 -240 -96 148 77 -163 -35
5877c5k05L11j4j50K5J32j99K50qk5k04K36k51k8J91R2k44j2L50n20Q4O8J29o0
$$ -35 -240 71 57 -93 -68 64 -135 115 107 82 -122 114 -137 -165 26 118 -126 -138 212 -308 -224 -156 -27 -87
5901h7j64K47j37M0L45k2K4l07J69j84O5j97L34j0l25L30k46K42r4M1k09L28j88
$$ -87 -251 -4 -141 -101 244 222 246 -61 108 -76 -11 -208 126 116 -209 121 -125 117 23 64 -145 183 -5
5924eQj27O1l4J04K62l14J60l65K95l3J20J91j34J26l46Q9j61j20K60J7j24L6
$$ -5 3 -124 -63 -97 7 269 -45 115 -250 45 12 132 323 189 315 -31 58 -103 -223 37 54 -70 -34
5947c4N8m99P91o6k10N9j26l35M51k15L69k64k26L25j98L7p3M07l46J6NR2j65
$$ -34 24 -475 316 250 40 99 -27 -362 89 -126 243 -21 -247 78 -120 -83 -156 251 -95 -79 -74 18 -147
5970a47K32j51K05k32j27K62l22L92l64N5J94j99L59k42K66k16j11K41k97lL08
$$ -147 85 -66 139 -93 -220 42 -280 112 -252 -197 -3 -202 157 -85 181 -35 -146 95 -202 -205 103
5991A03j72J57k12n1j09J22J98j50K71k17n8P1M5k13K36l7Q0MO7j9j1j44m6J45
$$ 103 -69 88 -124 -175 -284 -162 36 -114 157 -60 -118 -47 -2 -215 21 -16 64 68 135 116 105 -39 -85 60
6015F0k46K87j98P1j23K08r0j51o1K75n4j33J52K5j03J19q2N1k36J11N29k30k70
$$ 60 -186 101 -97 -26 -149 59 -31 -182 -243 32 -22 -155 -3 22 -81 38 -44 7 -229 -118 411 181 -89
6038h9K73lo37N29j93k88N85j45M1k81K20M4j5j18J21L8l49N7K62k37m7O3j76
$$ -89 184 181 -456 73 -120 -408 177 32 73 -208 12 56 41 -77 44 82 -267 -210 52 -185 -232 -169 -345
6061c45K16L26j02k07j19M5m4N36o32L27k17K16j3k40M05m05O75n87K43k79M78
$$ -345 -129 197 95 -112 -231 -186 -230 306 -326 1 -216 0 -13 -253 152 -253 422 -165 78 -201 277
6082B77j94l11KK56J31j78K08j72N4j80K9L86m04J23K13k19QJk27K0J16K66q5
$$ 277 83 -228 -226 30 161 -17 191 19 73 -107 -78 308 -96 27 240 21 29 30 -197 -177 -61 205 120
6105A20l25K63J58R1j74o9J12m85M09j65k9j28J08J09k1O3k40M13l42K49m46M44
$$ 120 -205 58 216 307 133 64 176 -309 100 -65 -94 -222 -114 -5 -26 37 -203 210 -132 117 -329 115
6127A15l76J52P9R1J18r4k41L8J45p4r1J73k10p0J3J85K84k59N7j31oJ58Q8k29
$$ 115 -261 -109 -30 61 179 85 -156 -118 27 -47 -138 35 -175 -245 -232 -47 237 -22 35 -96 -102 56 144 -85
6151h5O9j10k4K77l3j38q5RN5J85m9j06J04K22oj08k74L4Pm9J95j28j2K59l92
$$ -85 -16 -126 -150 127 94 -44 -129 -120 -65 120 71 -35 69 291 285 177 -97 -63 -56 -105 90 -38 -50 209 -183
6176a83m2J50N0K1J59j45J83k44K30j75M8K6k2R6k13K16j23k6m1K25l03O3j69
$$ -183 -225 -75 -25 -4 155 10 193 -51 179 4 52 78 56 152 -61 155 32 6 -35 190 -113 -50 -219
6199b19K96l6n8K09j38k37J38q0L79l64L78j53k40J90l00O6N6J16q6N2Q2j36L6
$$ -219 77 41 -17 192 54 -183 -45 -125 254 -110 268 115 -125 65 -235 -169 -113 3 -83 -31 51 -85 -49
6222d9M18o49K99k05K41n5L5p4j10K12o8L5k1K3j02M34m40L3j98K87O1j7j02l7
$$ -49 369 -280 19 -186 55 0 35 -39 -149 63 -5 30 9 32 -70 364 -76 -43 -241 46 107 90 -12 -49
6246d9K60l01O0K2n6K43m93L99J29k27J07k80o0N05r7J50j08l6r6N6Qrr1J0n0
$$ -49 211 -90 -30 -8 -64 179 -314 85 214 -13 94 -186 -246 259 162 312 204 168 72 128 136 127 36 46 -4
6271dj38J43J92k39Nq5K07m8j79m6O4J04j35M02m0j49J04k58LL46j34j11q9k8
$$ -4 -142 1 193 -46 -41 -126 81 33 -146 -192 -128 -24 -159 243 203 54 158 -100 -97 249 115 4 -85 -113
6295a13Q8J55j93N5L11n88J89l6O8M0o6Q8k52L97J60m21J35l8R2K48l24k00J34
$$ -113 -25 130 -63 -8 303 -285 -96 -132 -64 -24 -90 -2 -254 143 303 -118 17 -21 71 319 -5 -205 -71
6318g1L7o8K70J11K07j74j64q4J15j32R4j4k15K99j33pM5m04M41q6k17o0M75j39
$$ -71 -34 -102 168 279 486 312 148 64 179 47 141 127 -88 211 78 71 116 -288 153 67 -150 -210 265 126
6342A26k10J92l11K28J58L27m59J29m35J54J9J94k42K55l10K49R3J04m68K13L45
$$ 126 -84 108 -203 25 183 510 51 180 -255 -101 -82 112 -130 125 -185 64 157 261 -207 6 351
6363C51k27q4L6l73K81j83J03L24l84J3J19j21l07K76R7K30kk29Q5j22J85N7j93
$$ 351 124 40 76 -297 -16 -199 -96 228 -156 -143 -24 -145 -452 -176 -79 151 149 -80 5 -117 68 125 -68
6386f8r3K59k10q6M03l43K68j15rK68n57L01k36L11r5Mj9j78K23j11J45o3j53
$$ -68 -161 98 -112 -198 205 -138 130 15 6 274 -283 18 -218 93 -2 2 -17 -195 28 -83 62 -1 -154
6409a54J87m8k16L03k35J06J20k3J23j82k0J7J8R5l82K10K12k64q9L16o8N8k11
$$ -154 33 -15 -231 72 -163 -57 63 40 163 -19 -39 -22 -4 91 -291 -81 131 -133 -222 94 26 84 -127
6432a27J27j04j9j95J42J75J57l24j3K23L5K42l98j09J52J9R8j98K06k48K99j93
$$ -127 0 -104 -123 -318 -176 -1 156 -168 -181 42 77 319 -79 -188 -36 -17 81 -117 89 -159 140 -53
6454e3K25l94J84j27L0MO7J07J10k67%q8oJ49n8M78j10n38K65NR1o6l5k81K17
$$ -53 172 -222 -38 -165 -135 -131 -64 43 153 -114 -114 -202 -208 -59 -117 361 251 -287 -22 -17 74 8 -27 -308 -91
6479i1L35k36J2M1M6j74m2k04L06k0J43O7m8J3j17N5Nj31L5Mn3j40J37J06k33
$$ -91 244 8 20 61 107 -67 -109 -313 -7 -27 116 183 135 148 31 86 91 -40 -5 -1 -54 -194 -57 49 -184
6504a84Q8L7K48j14J95j47q5L23l47k6j99J28j5Lj1K00j57N1k5R7j36J99j69K09
$$ -184 -96 -59 189 75 270 123 38 361 14 -12 -211 -83 -98 -95 -106 94 -63 -12 -37 60 -76 123 -46 163
6528A63n31P59l88o9J19o3O5j53L07k19J2j00J07m5R2l26L13RL3M0l5j97O2K22
$$ 163 -368 391 3 -66 53 -10 55 -98 209 -10 2 -98 9 -36 56 -270 43 52 85 125 90 -107 -45 177
6552A77k24J09P2j41J70m5p9j82j01K70j00J15j27J37m67L89J88j88P8l2L50k72
$$ 177 -47 62 134 -7 163 118 39 -143 -244 26 -74 41 -86 51 -416 -27 161 -27 51 19 369 97
6574I7j28L55k13k37M04m9l16O6R6l55L26l2k0P1J34j91K22l10k2K62l0L9O8k46
$$ 97 -31 324 111 -126 278 229 -87 -21 75 -280 46 14 -6 65 199 8 230 -80 -102 160 130 169 237 -9
6598in5K43k63KJ19l02K72M8k10J16J88j65l5M4j96J44N41m95l2P0M2j14j03L22
$$ -9 -64 179 -84 -82 37 -265 7 55 -155 -39 149 -16 -51 -7 -203 -59 482 -13 -45 25 67 -47 -150 172
6622A72k09J36K73l00l15L20k4P7k25L84n73l56P61l2O5m43J30N41l19k50L09
$$ 172 -37 99 372 72 -243 77 53 130 -95 289 -284 -640 121 89 154 -289 -159 382 63 -187 122
6643A22l6k02K74q7J54k12k7j68J08k74L72P2J19j81k16K96l22N02l43R3j2mJ7
$$ 122 86 -116 158 71 225 13 -14 -182 -74 -348 24 96 215 34 -182 114 -208 294 -49 44 32 28 45
6666D5j42N9O5J56l41M02l20j32K14r9K81k79J55n9K23Q1l00L0p2qK7J54k2k9
$$ 45 -97 -38 27 183 -158 244 -76 -208 6 -93 188 -91 64 5 228 309 9 39 -33 -41 -14 140 118 89
6690H9j59Q7L1j16K84k94P8L00m87q5Q4K34O4k47L4K87j66J54k58K56j7p2j99
$$ 89 -70 17 48 -68 216 -78 0 300 -187 -272 -188 46 110 -137 -103 184 18 172 -86 170 153 81 -118
6713a18Q6j72M06k84L6j29N9j3L07k97K29j22n5N7k54K07N0J01K9j41q8L52m73
$$ -118 -32 -204 202 -82 -46 -175 -116 -129 178 -119 110 -12 -67 -10 -264 -57 -7 94 123 -18 -106 246 -227
6736b27L44l03J58J0K84l41j54J85M6J36j50K27j08k64J12R5K08j96J9r4J07j89
$$ -227 117 -186 -28 -18 266 -75 -229 -44 2 138 -12 215 107 -157 -45 50 258 62 81 -13 94 -95
6758i5J22q8r1L81l54lJ46J9Q0j30R5Qj71N5K73j10j47l52L02M4r0M9l6L55j26
$$ -95 27 -61 -152 229 -125 -128 18 37 117 -13 82 90 -81 -26 247 137 -10 -362 -60 -16 -106 -57 -93 262 136
6783A36l1j79j47K91o1Q7m2k28L45j70O0R3l14J0L15j68j21J08J79%K2l61L82
$$ 136 105 -74 -221 70 9 96 54 -174 171 1 61 154 -160 -150 165 -3 -124 -16 163 163 185 -176 206
6806B06J40l00Jq7o8L22j32l52K45J71L3k02j72M52l91J61j08J42l68J98J63J4
$$ 206 346 46 47 -40 -108 214 82 -270 -25 146 179 -23 -195 257 -134 27 -81 61 -307 -109 54 68
6828F8j58j73M16k21K47j92k04K78l27J35L46j24M3Q8k40J95j81j43J56k02K60
$$ 68 -90 -263 153 -68 179 -13 -217 61 -266 -131 215 91 134 222 -18 177 -4 -147 9 -193 67
6849F7k02K24o3n8P2j34R5j38J15r3K75o3j34J23j61P5r7J76J4j73J94m9K06j00
$$ 67 -135 89 26 -32 40 -94 1 -137 -22 -115 160 97 -37 86 -75 0 -97 79 93 -80 114 65 271 171
6873A71k42M6K18k23J02m7J40k02j47P6J9J21k6nQ8j55j3k10K24j44K68Q0k29
$$ 171 -71 -25 193 -30 72 25 165 -37 -184 -108 -89 32 6 1 89 -66 -79 -289 -65 -209 59 139 -90
6896i0K8J36J38n25M29o0j54L8N5J22j04M2j12J13j06k00K88NK04k98M8q5M9R9
$$ -90 -62 74 212 -313 116 56 -98 -60 -5 117 13 55 -57 56 -50 -250 38 43 247 -51 -3 -88 -39 60
6920F0J06j25J99j24j43p9J63j04J22l2j89J49r0K21k13o1L03k68K70l89M34k09
$$ 60 166 41 240 116 -27 -106 57 -47 75 43 -146 3 -87 134 -79 -140 163 -105 165 -224 210 1
6942Ak26L75Pj14K49m10J08J71k70J63m00K53L2j81K86p0k7J56m00P6J31q9N0
$$ 1 -225 150 157 43 292 -118 -10 161 -109 54 -346 -93 -61 -242 44 -26 -53 103 -297 -221 -90 -179 -129
6965a29J67Q3j14J14k78M90j41j16R9j5LO2j43K9o4N7k16q9J65o2P8J79k15K97
$$ -129 38 121 7 121 -157 333 192 76 175 160 163 225 82 111 47 104 -112 -201 -36 -98 -20 159 -56 241
6989B41n3l99M67l77N2p3J82P1j91J7K40j11o1m5l6j26J61j17M4K78k26R4J15
$$ 241 188 -211 256 -121 -69 -142 40 111 -80 -63 177 66 5 -40 -76 -202 -41 -158 -114 164 -62 32 147
7012A47l03j16N29k95J94l96K73j18J25k72j15L68J29l96N0J35J61p0j63J16k6
$$ 147 -156 -272 257 -38 156 -240 33 -85 40 -232 -347 21 150 -246 -196 -61 100 30 -133 -17 -43
7033d3N4O6j62K84k08O7q4k71K22L64l29J12k45M35k32K72m55r0L86k75L12l05
$$ -43 11 77 -85 199 -9 58 -26 -297 -75 289 -40 72 -173 262 30 302 -153 -243 143 -132 180 -125
7055a25q2K35k55n5K67O5O4n1j03J9L7r0k74L73k01L70k94JL88j20k86L7N9j23
$$ -125 -207 28 -227 -282 -15 50 114 63 -40 -21 16 -74 -348 25 -176 194 -100 -99 289 169 -117 -80 -21 -144
7079a44J40Ml15K63K52K3k03N9k9L3K17n94L20m0o8K12m8%N6k41R4J15N7j27j56
$$ -144 -4 0 -315 -52 200 223 20 79 50 83 300 -294 26 -14 -82 130 82 82 138 -103 -9 106 163 36 -120
7104a20O0j24K81m10L09k62L44r1j8M14m97K39j41r7K07j53O2L9L5j00j06J26
$$ -120 -60 -184 97 -313 -4 -266 78 -13 -31 383 -114 125 -16 -113 94 -59 3 42 77 -23 -129 -3
7126ck04L81K65n41j23L16j03l04M04l14K56oJ72k80J31l86N89n7j53o7N6j59
$$ -3 -207 174 439 -102 -225 91 -12 -316 88 -226 30 24 196 -84 47 -339 250 193 40 -27 29 -130
7148a30N9L14j15j66J91k01N7m01L41j07J12rJ08L6J43k45j57k9J01M0j88K87
$$ -130 -71 243 128 -38 153 -48 9 -392 -51 -158 -46 -55 53 89 232 -13 -170 -199 -98 -58 -246 41
7170D1k14k17M37r9k3M8J8J52o5o0j29L1j39J86J19j2k14P0J58j7k95K50J09j29
$$ 41 -173 -390 47 -52 -75 -27 -9 143 78 18 -111 -80 -219 -33 86 74 -140 -70 88 71 -224 26 135 6
7194FRj80L85m73L87K29l0j54k69J28k00L22n8j54Kk00j08L63J25j91J67J6m4
$$ 6 15 -165 220 -253 134 363 333 179 -90 38 -162 160 102 -52 -50 -250 -358 5 130 -61 106 122 78
7217G8L15m97J46r5j34J45l4j09J45J22k8j21J59j4k31N2p3K05P9k05R4k0L5q3
$$ 78 393 -104 42 -53 -187 -42 -76 -185 -40 82 54 -67 92 78 -153 -101 -174 31 110 -95 -1 -21 14 -69
7241f9K56j04J98n2j36l8q8P3K5J12K0j18j51Q2q1J75l55J78K3O3J22k21k07K02
$$ -69 187 83 281 229 93 55 -33 40 65 177 197 79 -72 10 -71 104 -251 -73 -50 13 135 -86 -293 -91
7265i1j15L81o0J11l07J84m08J24M09j84M6o0k25J54R1M7J15m84J91J64J6k56
$$ -91 -206 175 115 226 -81 103 -305 -181 228 44 90 30 -195 -41 50 97 212 -272 -81 83 99 -157
7287a57L17j03l48K74M9M4j14n0q2M42k71M1k1j06J65lJ99l00k99K57K9j88R5
$$ -157 160 57 -291 -17 32 76 -38 -88 -170 272 1 42 21 -85 80 77 276 -24 -323 -66 -37 -225 -130
7310a30J47K70k56r6JJ64j38J52N8m4p9J14l38K14j23J85k15n7J46J5L57l51J7
$$ -130 17 287 31 -65 -64 100 -38 114 172 128 49 163 -175 39 -84 101 -114 -171 -25 -10 347 -4 13
7333A3K28l19l6J46M3K9J22k97O3L5J36j02L0j91K9J15L2K57l80J65j27j22K38
$$ 13 241 -78 -114 32 75 104 226 -71 -8 27 163 61 91 -100 -71 44 76 333 -47 118 -9 -131 107
7356A07N9l26J1J35j59J78j17Q3J93N5m10R7J25r2L38m56L75l48K31K18Nj20k20
$$ 107 166 -160 -149 -14 -173 5 -112 -29 164 219 -191 -94 31 -61 277 -179 196 -152 79 297 302 182 -38
7379c8j49K53k04J97R5k25L86j42q9j01o1J25J60k16l4q4R5J41n5m7j78O4L7j22
$$ -38 -187 66 -138 59 154 -71 315 173 84 -17 -78 47 207 -9 -43 -127 -32 109 54 7 -171 -107 -70 -192
7403a92K5L20j33M2J04j97k1K01o7k24RP0j26K02k66K12p1M09j32M1l82K50j98
$$ -192 -167 153 20 62 166 -31 -52 149 82 -142 -133 -63 -189 13 -253 -41 -112 297 165 206 -176 74 -124
7426a24rj4J81j93J47Q0J15k54l4q6j19N47ml6j47j40N3j14K21J10m64L9K36K34
$$ -124 -133 -147 34 -159 -12 68 183 -71 -105 -191 -310 237 233 197 50 -90 -37 -151 70 180 -284 -245 -9 225
7450B25l69J42j3j7J98p5j67KJ92j2K33k70j13k0j02Q8L33k58j5K73l55oJ12j93
$$ 225 -144 -2 -15 -32 166 91 -76 -74 118 106 339 69 -44 -64 -166 -78 255 -3 -18 255 -100 -106 6 -187
7474a87M2J76k40K00R2j05J04j14k06K85R9j14n6R5k7o3KM6R6k45N7K17L4k6j40
$$ -187 -145 31 -209 -9 83 -22 82 -32 -238 47 146 32 -24 71 44 -19 -17 29 125 -120 -63 154 188 162 22
7499B2p6l4Q8j95L81j08K66n73L67k55L4O0rK71m83K1j53M68j12J55l31J55K61
$$ 22 -54 -88 0 -195 186 78 344 -229 138 -117 -83 -23 -32 239 -244 -223 -376 92 -20 135 -196 -41 220
7522B20l57J06j0j26m2J86O0l7Lj16L17k22J26k29K19k13J00J35k18p7M44j96
$$ 220 -137 -31 -41 -167 -209 -23 37 0 3 -113 204 -18 108 -121 98 -115 -15 120 -98 -175 269 73
7544G3l1o0n0J35n0o3J21j34J95k98J64J33l60J91K52l58K38r9R8k94M00q2O5
$$ 73 42 -18 -68 67 17 -46 75 -59 136 -162 2 135 -225 -34 218 -140 98 -1 97 -197 203 121 186
7567A86k47RJ45j99L61k8l50L47k99Nq1j77L45K81n34J40K57q7j81J24K24l26
$$ 186 -61 -52 93 -106 255 227 -123 224 -75 -70 -151 -328 17 298 -236 -96 161 74 -107 17 241 -85
7589h5j37k46L04J51l62K81L80n4l63J45l0Q4K34j61l34J91J87k91M9N5k03J28
$$ -85 -222 -468 -164 -13 -375 -94 286 232 -131 14 -16 68 302 141 -193 -2 185 -106 -57 -2 -205 -77
7611g7m6J36j77L13Q9k69J78j33J83j96J36j59K2o0L23l40l5J32P1l14J59R8J49
$$ -77 -123 13 -164 149 238 -31 147 14 197 1 137 -22 0 -60 263 -77 -112 20 91 -223 -64 34 183
7634A83m16J5K45j51K3r6J24k5m2M3J6L5PK01m37J16K22j01J59k59N38j62j48
$$ 183 -233 -218 27 -124 -101 -197 -73 -98 -140 -97 -81 -46 -39 162 -275 -159 63 -38 121 -138 400 238 90
7657I0k1k94K43j46K98q6J14j39j27j20K99q8k28qM35J14k73j12k14J62J95j39
$$ 90 69 -225 18 -128 170 84 198 59 -68 -188 111 23 -205 -213 222 336 63 -49 -263 -101 94 -45
7679d5N1K2r0J29j85L78k89K04m33M64j46r8j43K76P2p5j18j1l01K26Q2k18L97
$$ -45 6 28 -62 67 -118 260 -29 175 -258 206 60 -38 -181 95 167 92 -26 -37 -338 -112 -30 -248 149
7702A49k24Q3p5K11J83l21j43J06Oq7l4K02O6j76O7o4j30L42l61J55j29L78K8
$$ 149 -75 8 -67 144 327 6 -137 -31 -25 -112 -146 56 122 -54 13 -51 -181 161 -200 -45 -174 204 232
7725B32k98K08k20K83j89P7j00l36K36M31o67L53l8R5j22Jq6J69j05m8J01K75
$$ 232 -66 142 -78 205 16 93 -7 -343 -107 324 -343 10 -28 67 -55 -54 -140 29 -76 -124 -23 252
7747B52n49L02M5k7K21m17L20k45MK14l81L3J96n9K52j68R3L9j54qQ0k13L59k48
$$ 252 -297 5 50 23 244 -173 147 -98 -94 120 -261 -228 -32 -91 161 -7 86 125 -29 -37 43 -170 189 -59
7771e9L88k63o4j25L35l7J1k65r3M44o8K9m07L54o8k5n7j12k13K44k02J61Q1J5
$$ -59 329 66 2 -123 212 175 186 -79 -172 272 204 233 -174 180 112 87 30 -82 -295 -51 -253 -92 -11 4
7795DJ05R4j78r7j81P0P6j61J09J12K35j02p3J97l04K60j2kk80K2O9n5M87o30
$$ 4 109 203 25 -72 -253 -183 -107 -268 -159 -47 188 86 13 210 -94 166 154 152 -128 -106 -37 -92 395 -235
7819b35J72j9L17o07L51r8L8P7j18K8K14n1j11J50o3j62J42j02j85J96J94o4m81
$$ -235 -63 -82 235 -372 -21 -119 -81 -4 -122 -94 120 69 -42 108 45 -117 25 -77 -262 -66 128 64 -417
7842d17L13J90j72M22l13qO4J45R7l73O3j59L61k7p7j9k53O5q0J72j24J27j47
$$ -417 -104 86 -86 336 23 15 79 224 321 -52 11 -148 213 186 109 90 -163 -98 -178 -6 -130 -3 -150
7865a50M73k17Q2J94l74M8Q6j73Q8M3j41k2K11j04J27j38K31k67M6k15J45M8J03
$$ -150 323 106 188 382 8 56 142 -31 57 100 -41 -63 148 44 171 33 264 -3 43 -172 -27 21 124
7888A24j43M1l3j27K28J64l24N5o4Q3L68l37j28L32n0k97m7NN15m1n3m81N43q59
$$ 124 -19 22 -11 -138 90 254 -70 -15 -79 4 372 35 -93 239 189 -108 -155 -150 365 324 271 -210 333 -526
7912e26M54j71L96m07L9K33k21J05K4K61k52K15k00R9r8%m7R6j1J81j47m82J99
$$ -526 -72 -243 153 -254 -215 18 -203 -98 -74 187 -65 150 -50 49 -49 -49 -96 0 -11 170 23 -459 -260
7935b60K54l3l5J58K55l10j8j56R9K59J33n25J29L7j57QK92J9m26N15l73K64l08
$$ -260 -6 -39 -74 84 339 29 11 -145 -46 213 346 -179 -50 -13 -170 -162 130 149 -277 238 -135 129 -179
7958a79l1K37j43K1N6J26j61r3M96m73L07k44J92k3j72J93P4r7j6k18L39l04j3
$$ -179 -210 27 -116 -95 -39 87 -74 -167 329 -144 163 -81 111 88 -84 109 183 86 70 -148 191 -113 -126
7981a26J98k5r6J33l61K44K7J74L6j56j4O4l44L46J13n24J81j1J59o4j23N90l43
$$ -126 72 47 -49 84 -277 -33 -6 168 204 48 34 98 -246 100 213 -311 -130 -141 18 -46 -169 421 78
8004G8j02J14j17n2k12J97K80k40R8j29N5J24k18J40o0M0mj31J12l0J12p7J8J41
$$ 78 -24 90 -27 -79 -291 -94 186 -54 44 -85 -30 94 -124 16 -44 -4 -8 -139 -27 -57 55 -22 -4 137
8028A37l92J91K88l7l45K18K5O0J3l8j99L25m28J55K1J11r4r0m5K12k7k17J22
$$ 137 -255 -64 224 187 -158 60 85 145 158 120 -79 246 -182 -27 -6 105 11 -79 -124 88 61 -156 -34
8051c4J56j72n1J05kK99l97Mj08J45K3K2L5M8k30K13L61n59K86k59J86M9l16o3
$$ -34 122 -50 -101 4 2 301 -96 -92 -200 -55 -32 -10 25 73 -157 56 417 -142 144 -115 71 120 -196 -259
8075b59K96j57J14l6L42k33l19M07k24L35j72J29m62M34j02J77j47j17K17k35
$$ -259 37 -120 -6 -42 300 67 -252 155 -69 266 94 223 -239 195 93 270 123 6 223 -12
8095a2K79j8K3j14P4j38n9k17J83L04j84l31J66pq1L8K57k07L8o5R7K27m21K05
$$ -12 267 249 272 158 232 94 35 -182 1 305 121 -210 -44 -51 -132 -94 163 -44 -6 -71 26 253 -168 37
8119C7L17m70J83j29K68j63k18K91j66J27O0l53M52k25k13L20r4k9j41J10N1O2
$$ 37 354 -116 67 -62 206 43 -175 116 -50 77 137 -216 236 11 -202 118 24 -5 -146 -36 15 77
8141G7O1M0Q8l82L1J70o7O9l52J46Q8p6QL19j31j54K03j1Rj58K53m45J3K28Mj61
$$ 77 138 178 266 -116 -85 85 18 87 -265 -119 -31 -107 -99 220 89 -65 138 127 136 -22 231 -214 -201 27 31 -130
8167a30P8j24J88n7o4j82K26N3j21J34P5j88N5q4J69k51K11K1K91k70N5k78q3
$$ -130 -52 -176 12 -45 -109 -291 -65 -12 -133 1 76 -112 -57 -141 28 -223 -12 9 300 30 85 -193 -276
8190b76J25
$$ -276 -151
8191a51
$$ Imaginary data points
##PAGE= N=2
##DATA TABLE= (X++(I..I)), XYDATA
0@%%%%%%Qj6J6j6K4l2L7m5N6o9Q0r6J16j35J57j84K14k48K85l26L72m25M82n44
$$ 0 0 0 0 0 0 0 8 -8 8 -8 16 -16 21 -24 32 -37 43 -53 63 -72 85 -99 115 -133 152 -174 198 -227 255 -289
30b89O15o93P77q67R69j083J205j339J485j646J826k023K239k478K745l044L381
$$ -289 326 -367 410 -457 512 -571 634 -705 780 -866 960 -1063 1176 -1302 1443 -1601 1780
47A780l762M196m700N292n996O852p923R304j1159J3809j7935K5322m2686J58528
$$ 1780 -1982 2214 -2486 2806 -3190 3662 -4261 5043 -6116 7693 -10242 15080 -27606 130922
61A30922J51117j70302q0873l4511O3509K5529p638n1612j9773r461K555j9003
$$ 130922 282039 111737 30864 -3647 59862 85391 77753 26141 6368 -3093 -538 -19541
73a9541m793P338J9193j0852k3784j3914K5626K9829M479k5716j2692J6241K9267
$$ -19541 -24334 -16996 2197 -8655 -32439 -46353 -20727 9102 13581 -12135 -24827 -8586 20681
86B0681L121k0103j4749J3943K3429K929k2994j5311J3542K6587L982k0665j5105
$$ 20681 23802 3699 -11050 2893 26322 29251 6257 -9054 4488 31075 35057 14392 -713
99g13J4741K6913P064j7926j2337J4256K5502M627j9189j4086J1802K2424K807
$$ -713 14028 40941 48005 30079 17742 31998 57500 62127 42938 28852 40654 63078 65885
112F5885k2752j9072P314K0718K300k2978j9043P009K0604J865k0512j5075R851
$$ 65885 43133 24061 31375 52093 54393 31415 12372 19381 39985 41850 21338 6263 16114
125A6114K1322L918j9103j5332R153K2130N163k0150j9108N725J9100K769k1197
$$ 16114 37436 41354 22251 6919 16072 38202 43365 23215 4107 9832 28932 31701 10504
138A0504j9594M580J6575R98k0048j7297O522K0157N282j5493j4503R213K3337
$$ 10504 -9090 -4510 12065 13063 -6985 -24282 -17760 2397 7679 -7814 -22317 -13104 10233
151A0233J0608j2030j2160R567K2876Q619j3496j3127P246J8533M157j7926j8190
$$ 10233 20841 8811 -3349 6218 29094 37713 24217 11090 18336 36869 41026 23100 4910
164D910K536J4969K614j8859j9976K26J4893M506j5267j6362M064J7726P400j2498
$$ 4910 7446 22415 25029 6170 -13806 -13580 1313 5819 -9448 -25810 -21746 -4020 3380 -9118
178i118j2551P507K0273R196j1288j3316M959J7783Q551j2208j6108R83J4591
$$ -9118 -21669 -14162 6111 15307 4019 -9297 -4338 13445 21996 9788 -6320 -5337 9254
191I254N346j4914j7404M95J4447M975j4643j6279J908J6613Q099j0313j3825
$$ 9254 14600 -314 -17718 -17223 -2776 2199 -12444 -28723 -26815 -10202 -2103 -12416 -26241
204b6241K931J7893J0626p649j2203M297J8333R932q945j2953M015J7574R490
$$ -26241 -23310 -5417 5209 -2440 -14643 -10346 7987 17919 8974 -3979 36 17610 27100
217B7100r359j3721J595J5794R471q500j3379Q47J4136Q877q648j3864L2J4039
$$ 27100 17741 4020 5615 21409 30880 22380 9001 9848 23984 32861 24213 10349 10381 24420
231B4420P109j0844j6347k153J1377N227j1681j8101m989Q950M797j1064j6789
$$ 24420 31529 20685 4338 2185 13562 18789 7108 -10993 -15982 -7032 -2235 -13299 -30088
244c0088m368J0463O426r072j4290q07J3931J0009o125j1134J134J5220J2193
$$ -30088 -34456 -23993 -17567 -26639 -40929 -41736 -27805 -17796 -23921 -35055 -33921 -18701 -6508
257f508l478j0534J166J3733J0889m299j2162m04J2951R686o694j3161k347J1984
$$ -6508 -9986 -20520 -19354 -5621 5268 969 -11193 -11597 1354 11040 4346 -8815 -11162 822
271H22R743n674j2793j848J1967J0180m104j0972o41J2402J0947l990j1019j429
$$ 822 10565 4891 -7902 -9750 2217 12397 8293 -2679 -3320 9082 20029 16039 5020 3591
285C591J2249J0632m873j2445l325J0161Q586n692j3217m574Q234P268n887j3273
$$ 3591 15840 26472 21599 9154 5829 15990 24576 18884 5667 1093 9327 16595 10708 -2565
299b565m191Q391P795n338j2508m120R107Q834l747j1670l819Q836Q460l246j1246
$$ -2565 -6756 1635 9430 4092 -8416 -12536 -3429 5405 1658 -10012 -13831 -4995 3465 219 -11027
314a1027l206Q628Q423l148j1160l564Q563R554l152j0447l968Q707R312k338
$$ -11027 -14233 -5605 2818 -330 -11490 -15054 -6491 3063 -89 -10536 -14504 -5797 3515 1177
328A177r467l440Q128R059j670j0063l019P787R131k137j0829m166P332Q875k174
$$ 1177 -8290 -11730 -3602 5457 3787 -6276 -9295 -1508 7623 5486 -5343 -9509 -2177 6698 4524
343D524j0364m369O916Q460k129r720l732P113Q772j138r086l719P187R567q92
$$ 4524 -5840 -10209 -3293 5167 3038 -6682 -10414 -3301 5471 4333 -4753 -8472 -1285 8282 7390
358G390q612l892P390Q770n92q497l370O389Q431r06q919l804N510Q326p89q877
$$ 7390 -1222 -5114 2276 11046 10454 1957 -1413 4976 13407 12501 3582 -222 5288 13614 12825 3948
374C948m772N193P798n58r193m317M591P608p68q409m617M904P290p24q475m636
$$ 3948 -824 4369 12167 11609 2416 -1901 2690 10298 9530 1121 -3496 1408 8698 7974 -501 -5137
390e137N003P333K73p495n271M322P509k43p412m922M073O903k68p975m982L892
$$ -5137 -134 7199 7472 -23 -5294 -972 6537 6294 -1118 -6040 -1967 4936 4668 -3307 -8289 -4397
406d397O920o15p609n135L740O759N7o738m830L886P572N66o607m576M275P434
$$ -4397 2523 1908 -5701 -10836 -7096 -337 -280 -7018 -11848 -7962 -390 176 -6431 -11007 -6732 702
422G02J490o071m221L808O980J691o129m616L342O994Q81n954m134L018O940J557
$$ 702 2192 -3879 -8100 -4292 2688 4379 -1750 -6366 -3024 3970 4851 -1103 -5237 -2219 4721 6278
438F278n714m241L586P140J560n090l816L250O660J383m855m503K907N963J352
$$ 6278 564 -3677 -91 7049 8609 3519 -297 2953 9613 10996 6141 1638 4545 10508 11860
453A1860n853m802K184N344R99n631n528K581M962J571m469m815K644N744K038
$$ 11860 6007 1205 3389 8733 9732 4101 -1427 1154 6116 7687 3218 -1597 1047 6791 8829
468H829m257m002K713O388J507m069m476J468M981J002n517n108L83L441N6n811
$$ 8829 4572 570 3283 9671 11178 7109 2633 4101 9082 10084 4567 -541 -158 3283 3339 -2472
484b472n977K79L730K36n409m657P07N140K298l587l830K220N915K915k583k467
$$ -2472 -8449 -8170 -4440 -4204 -9613 -14270 -13563 -8423 -6125 -9712 -13542 -11322 -5407 -2492 -5075 -7542
500g542K322N694K686l126l456J459M971J982l685m707K73M630J774l951l729
$$ -7542 -5220 474 3160 34 -3422 -1963 3008 4990 1305 -3402 -3129 1501 3275 -676 -4405
515d405J022M024K305k528l269J404N249K675k130k645J164N117K874k237k968
$$ -4405 -3383 641 2946 418 -2851 -1447 3802 6477 4347 1702 2866 7983 10857 8620 5652
530E652K57M490J796k619l507K44L900J711l390l520J48L983K041k591l737m75
$$ 5652 5909 10399 12195 9576 6069 6313 10213 11924 8534 5014 5162 9145 11186 8595 4858 4383
546D383L608J516k281m485q20K132O59m079m898j852J739r4m518n241j785J614
$$ 4383 7991 9507 7226 2741 1921 4053 4712 633 -4265 -6117 -4378 -4472 -8990 -14231 -16016 -14402
562a4402J564k896l611j47L496L228m99j427K056N453M385op61K033N043L740
$$ -14402 -12838 -15734 -19345 -19492 -15996 -12768 -13267 -14694 -12638 -7185 -2800 -2806 -3567 -1534 3509 7249
578G249l51k081J8K926J708j940l269j510J344P18k882l930j019K156J692j859
$$ 7249 6898 4817 4835 7761 9469 7529 4260 2750 4094 4812 1930 -2000 -3019 -863 829 -1030
594a030l077k88K788K667J16k204K16K777J951m33k688n01K248J333k380l549
$$ -1030 -4107 -4395 -1607 1060 1176 -1028 -812 1965 3916 3483 795 294 2542 3875 1495 -2054
610b054j550J415Q70j845l497j657J595J344q38j645k14K680K315j15j240Q86
$$ -2054 -3604 -2189 -1319 -3164 -6661 -8318 -6723 -5379 -6217 -7862 -8076 -5396 -3081 -3196 -4436 -3550
626c550L241K692j65j620l01K578J490o14k434r92R07P78j229k753p66J302Q78
$$ -3550 -309 2383 2218 598 297 2875 4365 3751 1317 325 1232 2010 781 -1972 -2738 -1436 -558
643e58j114k386j080J864J951j055k154j129J103P34q72k295j578O13J50k088
$$ -558 -1672 -4058 -5138 -3274 -1323 -2378 -4532 -5661 -4558 -3824 -4696 -6991 -8569 -7956 -7806 -9894
659i894k847k025O81J024r54k269p00J655K397Q78k7O48L251K776J797J069J068
$$ -9894 -12741 -14766 -14085 -13061 -14015 -16284 -16984 -15329 -12932 -12054 -12081 -11433 -8182 -5406 -3609 -2540 -1472
676a472L157L175L79j042o2J193J443j070k280j834r97k0j715k485k287k57N03
$$ -1472 1685 4860 5239 4197 4135 5328 6771 5701 3421 1587 590 570 -1145 -3630 -5917 -6174 -5671
693e671j244j242j31J309K562P26k58N01K611K459J424M19J7J525J602k13j487
$$ -5671 -6915 -8157 -8288 -6979 -4417 -3691 -3949 -3448 -837 1622 3046 3465 3482 5007 6609 6396 4909
710D909p53J82Q8j392k905j872r03j67j284k366j802n89k04n19j238q08M25L62
$$ 4909 4156 4338 4426 3034 129 -1743 -2646 -2813 -4097 -6463 -8265 -8854 -9058 -9577 -10815 -11623 -11198 -10836
728a0836l39r24q90J016P24J71j501p51N16J075K78l42k12J185J569O51O37Q74
$$ -10836 -11175 -12099 -12989 -11973 -11249 -11078 -12579 -13330 -12814 -11739 -11461 -11803 -12015 -10830 -9261 -8610 -7973 -7099
746g099J989K558J610N07Q24K191K201J359J90J31M98O24k80q78o90j31n93j182
$$ -7099 -5110 -2552 -942 -435 389 2580 4781 6140 6330 6461 6959 7583 7303 6425 5735 5604 5011 3829
764C829j752j280k20J85p36j027p32m2J131L16J0M13L59R66m0k85j35K14M4k42
$$ 3829 2077 797 577 762 26 -1001 -1733 -1775 -644 -328 -318 95 454 1420 1380 1095 960 1174 1218 976
784I76j537j435n86p17n68j423j523o58j86k76n85l3P17J005N83O93J299J552
$$ 976 -561 -1996 -2582 -3299 -3867 -5290 -6813 -7471 -7657 -7933 -8518 -8551 -7834 -6829 -6246 -5553 -4254 -2702
802b702J832J707J228M08J085J295N29K55l25k7om27j197j292n28n50j258j214
$$ -2702 -870 837 2065 2473 3558 4853 5382 5637 5312 5285 5279 4852 3655 2363 1835 1285 27 -1187
820a187j266q47J60n84k60p48j6M80N12m2K82P68O24L37O9j29J271L07O31Q6j37
$$ -1187 -2453 -3300 -3140 -3724 -3984 -4732 -4748 -4268 -3756 -3798 -3516 -2748 -2124 -1787 -1718 -1847 -576 -269 362 448 311
841C11O88L17Q08L29M23L13Q73O96K64L65L91P07N56N50p74n3J57M7m79n22r46
$$ 311 999 1316 2124 2453 2876 3189 4062 4758 5022 5387 5778 6485 7041 7591 6817 6764 6921 6968 6489 5967 5021
862E021n81n91q40p61m99Q3p81p08k84k44O02N31J40K07Q0N96N98N54L41O5J58
$$ 5021 4440 3849 3009 2248 1749 1832 1051 343 59 -185 417 948 1088 1295 1375 1971 2569 3123 3464 3529 3687
883C687j97o07k02m63m91q44q15r96j192l00p70l68o13n53j70k40K13J87N99P01
$$ 3687 3490 2883 2681 2218 1727 883 68 -928 -2120 -2420 -3190 -3558 -4171 -4724 -4894 -5134 -4921 -4734 -4135 -3434
903c434Q53N65M02R92J005N91J165L00M56N04N97R8N30J2L32J91l62pN1K23M19
$$ -3434 -2581 -2016 -1614 -622 383 974 2139 2439 2895 3399 3996 4094 4624 4636 4968 5159 4797 4790 4841 5064 5483
924E483m20J12j33J5M18O1L9L3Q7k07k39Q0j15k50k28k57j2m30m41r2m61j40n26
$$ 5483 5063 5175 5042 5057 5475 5536 5575 5608 5695 5488 5249 5329 5214 4964 4736 4479 4467 4037 3596 3504 3043 2903 2377
947B377m1m45l71j63p0o8p70M21m73l91M8Nm44k66l46j18r0J08m07J79k83m92
$$ 2377 2336 1891 1520 1357 1287 1219 449 870 397 6 54 59 -385 -651 -997 -1115 -1205 -1097 -1504 -1325 -1608 -2100
969b100p6K4K51j7L01q7L8M67K98J60N48L14M64M9R5N06L71J05L49l0J01KOJ25
$$ -2100 -2176 -2152 -1901 -1918 -1617 -1704 -1666 -1199 -901 -741 -193 121 585 634 729 1235 1606 1711 2060 2030 2131 2133 2139 2264
993B264j97J11P9j30p4r9K07J20j18K5k77K05P6K44J48N6k77K84L61K3j39M75
$$ 2264 2067 2178 2257 2127 2053 1954 2161 2281 2163 2188 1911 2116 2192 2436 2584 2640 2363 2647 3008 3031 2892 3367
1015C367j10J8p0R6p7rp6N7l74j86j83m02k48q8j36m59m59k48m27p5m48O2N5k96
$$ 3367 3257 3275 3205 3301 3224 3215 3139 3196 2822 2636 2453 2051 1803 1715 1579 1120 661 413 -14 -89 -537 -475 -420 -716
1039g16j68m05L50n0j92Q4Q6l26K06J28j72j24k49L7J36J14k96j49L85k08k05
$$ -716 -884 -1289 -939 -989 -1181 -1097 -1011 -1337 -1131 -1003 -1175 -1299 -1548 -1511 -1375 -1261 -1557 -1706 -1321 -1529 -1734
1060a734n3L18q1N73R0K55K1L05M38J39M22J05K63M7%Q0l21M52O8NL6l28J39l87
$$ -1734 -1787 -1469 -1550 -977 -887 -632 -611 -306 132 271 693 798 1061 1108 1108 1188 867 1319 1387 1392 1428 1100 1239 852
1084H52K26J35j15M66K9K55N08m4K12N12M19M2k2K03q3j11j88m11l01l66n02k06
$$ 852 1078 1213 1098 1564 1593 1848 2356 2312 2524 3036 3455 3497 3475 3678 3595 3484 3296 2885 2584 2218 1716 1510
1106A510m08j078m5m45m32j07k78j75k2J38K38j33Q0M69L89K65J95R4K31k85J61
$$ 1510 1102 24 -21 -466 -898 -1005 -1283 -1458 -1480 -1342 -1104 -1237 -1157 -688 -299 -34 161 255 486 201 362
1127C62l28k12m82l84n01n81L7l68o36l78k27k62m5m6K85K57K32N32L03p5O31
$$ 362 34 -178 -660 -1044 -1545 -2126 -2089 -2457 -3093 -3471 -3698 -3960 -4005 -4051 -3766 -3509 -3277 -2745 -2442 -2517 -1886
1148a886N00N45K76N66K12L25M22j17N85j4L0N19R8J80K26K86K08J99K40J2O32
$$ -1886 -1386 -841 -565 1 213 538 960 843 1428 1414 1444 1963 2061 2241 2467 2753 2961 3160 3400 3412 4044
1169D044K77J8k23r9O2m88r0o04j96p23m35q11j020k99n99l19n01l91l21K32q8
$$ 4044 4321 4339 4116 4017 4079 3591 3501 2897 2701 1978 1543 732 -288 -587 -1186 -1505 -2006 -2397 -2718 -2486 -2574
1190b574K22K24P93J02J110M89K9M25M69K91M59m44po7l22o18o54o87m75q04n42
$$ -2574 -2352 -2128 -1335 -1233 -123 366 395 820 1289 1580 2039 1595 1588 1521 1199 581 -73 -760 -1235 -2039 -2581
1211b581p19m18k99j28o9l81L95J34N26O93M79L58J007P30J4O71K07O66L14Q9
$$ -2581 -3300 -3718 -4017 -4145 -4214 -4595 -4200 -4066 -3540 -2847 -2368 -2010 -1003 -273 -259 412 619 1285 1599 1688
1231A688l41K46m28M35k71m73K19j37L93k48n3K28M23L28o8N37J96M33N91P2l67
$$ 1688 1347 1593 1165 1600 1329 856 1075 938 1331 1083 1030 1258 1681 2009 1941 2478 2674 3107 3698 3770 3403
1252C403L61k72j06J59o40o46r6m35p89p5m73l9n37m89j86J78k55N57k22J74J12
$$ 3403 3764 3492 3386 3545 2905 2259 2163 1728 939 864 391 352 -185 -674 -860 -682 -937 -380 -602 -428 -316
1273c16j5J99J12l44m0L42j59l77p27j43n3N1k46r2l01J99L35N66J9L83N83O60
$$ -316 -331 -132 -20 -364 -404 -62 -221 -598 -1325 -1468 -1521 -1470 -1716 -1808 -2109 -1910 -1575 -1009 -990 -607 -24 636
1295F36N35L35P24J87P97k50K8j73k10j43m55q81o72j030l96p77n86o30l57m2
$$ 636 1171 1506 2230 2417 3214 2964 2992 2819 2609 2466 2011 1130 458 -572 -968 -1745 -2331 -2961 -3318 -3360
1315c360l96k45K85M11O79O06N08P89J134J169J019P07M78R81O08N85k22J87K26
$$ -3360 -3756 -4001 -3716 -3305 -2626 -2020 -1512 -723 411 1580 2599 3306 3784 4765 5373 5958 5736 5923 6149
1334F149j60o1q55n61k70r3p45o50k66j66o83m30j89m82J99n21P4j44n15J12m0
$$ 6149 5989 5928 5073 4512 4242 4149 3404 2754 2488 2322 1639 1209 1020 538 737 216 290 146 -369 -257 -297
1355b97n72j07j85l62j01l59N1m55L47j62L53k69K71q0R09J96K33J15M52N02M86
$$ -297 -869 -976 -1161 -1523 -1624 -1983 -1932 -2387 -2040 -2202 -1849 -2118 -1847 -1927 -1018 -822 -589 -474 -22 480 966
1376I66q3n1L30J59j78o4o30K03m64k89k12m82l64L35J53k86L13J32M39J48N10
$$ 966 883 832 1162 1321 1143 1079 449 652 188 -101 -313 -795 -1159 -824 -671 -957 -644 -512 -73 75 585
1397E85L57M84N02M89J62K55L27P94l12j92l39j77J4j05p41o15k27k54j31n89
$$ 585 942 1426 1928 2417 2579 2834 3161 3955 3643 3451 3112 2935 2949 2844 2103 1488 1261 1007 876 287
1417B87K0K76J56M6l55L72N34O50J86K41j19J55K14L5k90l04m7l72k52p39p27
$$ 287 307 583 739 785 430 802 1336 1986 2172 2413 2294 2449 2663 2698 2408 2104 2057 1685 1433 694 -33
1438c3n58J6m94o61j112j16J88k23j73MmM34R5K54J45L55M14Q97l29K54K11K67
$$ -33 -591 -575 -1069 -1730 -2842 -2958 -2770 -2993 -3166 -3162 -3166 -2732 -2637 -2383 -2238 -1883 -1469 -572 -901 -647 -436 -169
1460a69P65q9J66n44P54l5J55K29J47J56Pj54l0N81L65k31k05M3m61L42j57j5
$$ -169 596 507 673 129 883 848 1003 1232 1379 1535 1542 1388 1358 1939 2304 2073 1868 1911 1450 1792 1635 1620
1482A620l83k57k57On16m12J28j09J94n64K09P2K46L40k30O84j12O93L05M34j0
$$ 1620 1237 980 723 729 213 -199 -71 -180 14 -550 -341 -269 -23 317 87 771 659 1352 1657 2091 2081
1503B081J51K17J16l61j27q0j00k34m16o04n41j18m23o51k24k08Q0k62k19j14
$$ 2081 2232 2449 2565 2204 2077 1997 1897 1663 1247 643 102 -16 -439 -1090 -1314 -1522 -1442 -1704 -1923 -2037
1523b037L04J48N8j07N9Q3Q5O40K66k33K61N2R7m6J57j15J23l00m92Q3j46L09
$$ -2037 -1733 -1585 -1527 -1634 -1575 -1492 -1407 -767 -501 -734 -473 -421 -324 -370 -213 -328 -205 -505 -997 -914 -1060 -751
1545g51j03K24l33J43J33M61k03L40L2J81K10n3J76J50k08P41j79J45j87J97L08
$$ -751 -854 -630 -963 -820 -687 -226 -429 -89 -57 124 334 281 457 607 399 1140 961 1106 919 1116 1424
1566A424p1o0k7L09o5j79j67K60N0L2k14n0l6PM35n28p4k9j62k64k04l42J00J4
$$ 1424 1353 1293 1266 1575 1510 1331 1164 1424 1474 1506 1292 1242 1206 1213 1648 1120 1046 1017 855 591 387 45 145 159
1590A59j76m35j70K01k98L7j60K50j34j07N6J1j49R1k76J55l03J27J32K1J30j83
$$ 159 -17 -452 -622 -421 -719 -682 -842 -592 -726 -833 -777 -766 -915 -824 -1100 -945 -1248 -1121 -989 -968 -838 -1021
1612a021K8l19K10k02J36l77K00k27L85k45K33K93jk3k8J41L05M17j7N40k61J90
$$ -1021 -993 -1312 -1102 -1304 -1168 -1545 -1345 -1572 -1187 -1432 -1199 -906 -907 -930 -958 -817 -512 -95 -112 428 167 357
1634C57K18K6K53K37J08j31K93j14l4M41p2l7J9J35k59L7k70J00k74m2Q4l17J55
$$ 357 575 601 854 1091 1199 1068 1361 1247 1213 1654 1582 1545 1564 1699 1440 1477 1207 1307 1033 991 1075 758 913
1657I13j77J09J04r0m35l4JM6O5l27J65J90m79K07p3J93o53J59j7k69P2m54J24
$$ 913 736 845 949 859 424 390 391 437 502 175 340 530 51 258 185 378 -275 -116 -133 -402 -330 -784 -660
1680f60J4N7o88N13m38L8R6J90r2K07o8K94j93J33R9j84K03K6j78J73P6J67j68
$$ -660 -646 -589 -1277 -764 -1202 -1164 -1068 -878 -970 -763 -831 -537 -730 -597 -498 -682 -479 -453 -631 -458 -382 -215 -383
1703c83J0J67O5q6K16j16j20K30K75J16MJ99J47K92R1K29M1j80M26J35j35L6k14
$$ -383 -373 -206 -141 -227 -11 -127 -247 -17 258 374 378 577 724 1016 1107 1336 1377 1197 1623 1758 1623 1659 1445
1726A445J57k3j30r6n25K51q1k38J10k15J88ln9L94o6J31j85M31j98K83M8l20
$$ 1445 1602 1579 1449 1353 828 1079 998 760 870 655 843 840 781 1175 1109 1240 1055 1486 1288 1571 1619 1299
1748A299j27L88l31o1l59k56k33l12p8j59o07J13j07j35m8j1m08K20N88n8j17
$$ 1299 1172 1560 1229 1168 809 553 320 8 -70 -229 -836 -723 -830 -965 -1013 -1024 -1432 -1212 -624 -682 -799
1769g99N5L98j48K90j29J30k20N75k81M62p3j62j86J40J35K76k45P9J13K78k77
$$ -799 -744 -346 -494 -204 -333 -203 -423 152 -129 333 260 98 -88 52 187 463 218 297 410 688 411
1790D11M23q7m6M01K22j6n21L88j07k86J56K5l4j79j11j54l6j80J4R1J26q7R9
$$ 411 834 747 701 1102 1324 1308 787 1175 1068 782 938 963 929 750 639 485 449 269 283 374 500 413 512
1813E12J07M21L27k3L14K05J04L45k11K00qj46p5l88l33l66l35l6n06j79m23k32
$$ 512 619 1040 1367 1344 1658 1863 1967 2312 2101 2301 2293 2147 2072 1684 1351 985 650 614 108 -71 -494 -726
1835g26l77r0m00n3N7l1r0L08o2M56k2J70J27o7K62J67K26mR4m97K41m7J54n9
$$ -726 -1103 -1193 -1593 -1646 -1589 -1620 -1710 -1402 -1464 -1008 -1030 -860 -733 -800 -538 -371 -145 -149 -55 -552 -311 -358 -204 -263
1859b63P5m02j53k49N71j4M6J28J76K50P4K07j4K35K26M1O1k04N0lj91J63l69
$$ -263 -188 -590 -743 -992 -421 -435 -389 -261 -85 165 239 446 432 667 893 934 995 791 841 838 647 810 441
1882D41K21n20j56K72m38J05M9n0K88O6J71J8J29m8L44j70Q5j99J12J7j34J8k0
$$ 441 662 142 -14 258 -180 -75 -26 -76 212 278 449 467 596 548 892 722 807 608 720 737 603 621 601
1905F01l79k88J65q1k00j82K46m94J01qK55k34K07k9j07L24Q4M2l15J0k28k33
$$ 601 222 -66 99 18 -182 -364 -118 -612 -511 -519 -264 -498 -291 -320 -427 -103 -19 23 -292 -282 -510 -743
1927g43P8o05o1m06j23m42l1l76j12K89m02K06J37L3R7P21L78Q2O29J53N40N82
$$ -743 -665 -1270 -1331 -1737 -1860 -2302 -2333 -2709 -2821 -2532 -2934 -2728 -2591 -2558 -2461 -1740 -1362 -1280 -651 -498 42 624
1949F24J20K71M04J79P4Q9n9J88j61j35k48l21j05l15m1m68p0J9k07J79k44k33
$$ 624 744 1015 1419 1598 1672 1761 1702 1890 1729 1594 1346 1025 920 605 564 96 26 45 -162 17 -227 -460
1971d60j27K11rk99R2j86L91j07K35k23L6j12K76l16J45j27R5Nl6J45J22M3j9
$$ -460 -587 -376 -385 -684 -592 -778 -387 -494 -259 -482 -446 -558 -282 -598 -453 -580 -485 -480 -516 -371 -249 -206 -225
1994b25L5K78j18J85M0J23k43l61M9J46m81j60O9j52j80n73lk10k37K54l34J97
$$ -225 -190 88 -30 155 195 318 75 -286 -237 -91 -572 -732 -663 -815 -995 -1568 -1571 -1781 -2018 -1764 -2098 -1901
2016a901N55k82j56L37K24K27J34L36k90L58J13L82l87M66k71o0K64l06m18R3
$$ -1901 -1346 -1628 -1784 -1447 -1223 -996 -862 -526 -816 -458 -345 37 -350 116 -155 -215 49 -257 -675 -582
2036e82K90N6o39K75K43k2K09J96j8J34j30L70L68j57L74N0k48K36K7J7N3m39
$$ -582 -292 -236 -875 -600 -357 -379 -170 26 8 142 12 382 750 593 967 1017 769 1005 1032 1049 1102 663
2058F63j38k96j05k30m2k52k94l08P9M8j87q0Q5o5P8j80P1K76J87k20L5J97L7
$$ 663 525 229 124 -106 -148 -400 -694 -1002 -923 -875 -1062 -1142 -1057 -1122 -1044 -1224 -1153 -877 -690 -910 -875 -678 -641
2081f41k02N04j13j81j46K2k25M7L3l3L68n28J89j97r0L76l7l99M0M20m47K85
$$ -641 -843 -339 -452 -633 -779 -757 -982 -935 -902 -935 -567 -1095 -906 -1103 -1193 -817 -854 -1253 -1213 -793 -1240 -955
2103i55j10q0J59K9K80l71r4j43N76K5p5k13L12N53j4Q5K13K9L71L18o3j72K61
$$ -955 -1065 -1145 -986 -957 -677 -1048 -1142 -1285 -709 -684 -759 -972 -660 -107 -121 -36 177 206 577 895 832 660 921
2126I21L50J89l26K5k01r2j40k92L14o54R2p1m01k79j37Q8Mj64k21j52N54j68
$$ 921 1271 1460 1134 1159 958 866 726 434 748 94 186 115 -286 -565 -702 -614 -610 -774 -995 -1147 -593 -761
2148g61p3lJ7K13K92l7k39K02r1L7J54k76j58K00P8k2j84m35R3K50J74m57k48
$$ -761 -834 -837 -820 -607 -315 -352 -591 -389 -480 -443 -289 -565 -723 -523 -445 -467 -651 -1086 -993 -743 -569 -1026 -1274
2171a274J81J17K11k72J5M07K19o90K80J2M74o3L53m56k18L97M57m87J14L9O4
$$ -1274 -1093 -976 -765 -1037 -1022 -615 -396 -1086 -806 -794 -320 -383 -30 -486 -704 -307 150 -337 -223 -184 -120
2192a20N7j47M5K5K31K86l28J4j67L07MK72m02K13p4L09k35K0j25J78j4j75j32
$$ -120 -63 -210 -165 -140 91 377 49 63 -104 203 207 479 77 290 216 525 290 310 185 363 349 174 42
2215D2L75k07L57q8j18o1LK50J44k76j99M49P4l03k52J9k4R5l26J44m25k7Q0o2
$$ 42 417 210 567 479 361 300 303 553 697 421 222 671 745 442 190 209 185 280 -46 98 -327 -354 -274 -336
2239c36k50k9O3k82M09l18o1k03L54k8m17K58j62M82o9j12M9J06J54op0N0K32
$$ -336 -586 -615 -552 -834 -425 -743 -804 -1007 -653 -681 -1098 -840 -1002 -520 -589 -701 -652 -546 -392 -398 -468 -418 -186
2262a86O3k7j27L18l0K92qk08k58L20L25o7k01Q4J00N50j08m65J32l8N00J54n42
$$ -186 -123 -150 -277 41 11 303 295 87 -171 149 474 407 206 290 390 940 832 367 499 461 961 1115 573
2285E73l1K84j69L11N1m79J62K23j65j23l54L14K62m1m75k61L40M1Q1p62k97J83
$$ 573 542 826 657 968 1019 540 702 925 760 637 283 597 859 818 343 82 422 463 544 -218 -515 -332
2307c32M87l11j86mJ50L38j79l15qK4M59l92k89l08P19pL3k8l86K34K62l23Kl45
$$ -332 155 -156 -342 -346 -196 142 -37 -352 -360 -336 123 -269 -558 -866 -147 -154 -121 -149 -535 -301 -39 -362 -360 -705
2331g05M39K84l85j68J11M44O6n48J56l07L01L36k30J81k16M16n4k13l4k94L39
$$ -705 -266 18 -367 -535 -424 20 86 -462 -306 -613 -312 24 -206 -25 -241 175 121 -92 -126 -420 -81
2352h1L56k89m49J11o3M39K24k45l05J13M66L20l27M0J91N06m68j20j08R7O74
$$ -81 275 -14 -463 -352 -415 24 248 3 -302 -189 277 597 270 310 501 1007 539 419 311 408 1082
2373A082m37n46jJ34K14Kj33l75R1J42J70l57l26M06K43L6k53j25l28K16K97l01
$$ 1082 645 99 98 232 446 448 315 -60 31 173 343 -14 -340 66 309 345 92 -33 -361 -145 152 -149
2395a49q6J03L55l53j29k27J1L38nn96n29q1N76J48m71l16L66Q9m3k18m2K74L60
$$ -149 -235 -132 223 -130 -259 -486 -475 -137 -142 -738 -1267 -1348 -772 -624 -1095 -1411 -1045 -956 -999 -1217 -1259 -985 -625
2418f25j40j66k34K97J76M22n09j72M24Q4K94l80j46L3Q36N9j75k87j00J052L11
$$ -625 -765 -931 -1165 -868 -692 -270 -779 -951 -527 -443 -149 -529 -675 -642 194 253 78 -209 -309 743 1054
2439A054o16l0J36M95J78m2n85M31N2L07l71o27J11j05J47m02p38J93M40k36l25
$$ 1054 438 408 544 1039 1217 1175 590 1021 1073 1380 1009 382 493 388 535 133 -605 -412 28 -208 -533
2460e33m92K34L64p9j77k43l9N33J09n24k22N35K98J20k56k19J21K51J49j40k66
$$ -533 -1025 -791 -427 -506 -683 -926 -965 -432 -323 -847 -1069 -534 -236 -116 -372 -591 -470 -219 -70 -210 -476
2481d76j67M90J47o33k75J97O71M2j65l55J89Q8K50L1p66J77O37o6k44j43M0L51
$$ -476 -643 -153 -6 -639 -914 -717 -46 -4 -169 -524 -335 -247 3 34 -732 -555 82 16 -228 -371 -331 20
2503B0p4j66n33J32L13%jk85j37M75M05k56k81J45M67J55J44l09j09L39J64j18
$$ 20 -54 -220 -753 -621 -308 -308 -309 -594 -731 -256 149 -107 -388 -243 224 379 523 214 105 444 608 490
2525D90o08K48L78J22j93k90n8L96K04k92l71P8L42M16n11j25l3Q3N58o4q09R4
$$ 490 -118 130 508 630 437 147 89 485 689 397 26 104 446 862 351 226 193 276 834 770 -39 55
2547E5M19J43m62m82K16J71N6j53r15K53L17K83n78l75K38J32L42J54l30j01M08
$$ 55 474 617 155 -327 -111 60 116 -37 -952 -699 -382 -99 -677 -1052 -814 -682 -340 -186 -516 -617 -209
2568b09N76l06m80M2R51L7l57l47J55mL68k98m48q5L54J56l50n71K13J69M38l96
$$ -209 367 61 -419 -377 574 611 254 -93 62 58 426 128 -320 -405 -51 105 -245 -816 -603 -434 4 -392
2590c92k89j23J45N16k52L5j68O50M29k30l72J48N42K67m83J81k57L80O53o88
$$ -392 -681 -804 -659 -143 -395 -360 -528 122 551 321 -51 97 639 906 423 604 347 727 1380 692
2610F92j22j21L67O56o59r2j22L53M04k83n28j80O02M6l52p89j15L23J07J5j123
$$ 692 570 449 816 1472 813 721 599 952 1356 1073 545 365 967 1013 661 -128 -243 80 187 202 -921
2631i21J72J45J65j68j33k23K96J50j33n91J01M70K98K1l72k03N01M87L03m48
$$ -921 -749 -604 -439 -607 -740 -963 -667 -517 -650 -1241 -1140 -670 -372 -351 -723 -926 -425 62 365 -83
2651h3k14J73O05l09k32q0M61M4j10m28l55N22K01o2m76M01J93M14l9o56J88J55
$$ -83 -297 -124 481 172 -60 -140 321 365 255 -173 -528 -6 195 133 -343 58 251 665 626 -30 158 313
2673C13K63n8j44k61K54O36o78j88l21L01M70j09o93k05K47K78K01m74j63M11
$$ 313 576 518 374 113 367 1003 325 137 -184 117 587 478 -215 -420 -173 105 306 -168 -331 80
2693H0J72O8l39l19L88O22j91j39k07K83O8J94n21p6N4M69k52k07k51l4L03K7
$$ 80 252 320 -19 -338 50 672 481 342 135 418 486 680 159 83 137 606 354 147 -104 -138 165 192
2715A92k48m34q4N16K29o31l3O37k87J2m47m0K89p2K25m48m98O92J12M84p65k60
$$ 192 -56 -490 -574 -58 171 -460 -493 144 -143 -131 -578 -618 -329 -401 -176 -624 -1122 -430 -318 166 -599 -859
2737h59M36K51Q4j99m6j11P84P4l63k81J18R31l41j25m52K04M18P7l82l20J44
$$ -859 -423 -172 -88 -287 -333 -444 340 414 51 -230 -112 819 478 353 -99 105 523 600 218 -102 42
2758D2K33K1m39N8j07N19Q3o11j3j1L59J47J16n55L04M48Jr2k44L45o7Q3k30l60
$$ 42 275 296 -143 -85 -192 327 410 -201 -214 -225 134 281 397 -158 146 594 595 503 259 604 537 620 390 30
2782C0K86K39l1R4q42J52K22M02m24n70K83R7lj61j73ML74K51o14j15m3O19O7
$$ 30 316 555 524 618 -224 -72 150 552 128 -442 -159 -62 -65 -226 -399 -395 -21 230 -384 -499 -542 77 144
2805A44r2o20M5J80L00n5j90m24O97R1j81n25J83L80M32n11k2l30L95J73k98K8
$$ 144 52 -568 -523 -343 -43 -98 -288 -712 -15 76 -105 -630 -447 -67 365 -146 -168 -498 -103 70 -228 -200
2827b00J21L19J45m74j48J82K78J8J33l34j03M81K62j94n70K01J99N91n41p8M4
$$ -200 -79 240 385 -89 -237 -55 223 241 374 40 -63 418 680 486 -84 117 316 907 366 288 332
2848C32k4L92p4m32J77K63p2m44L56n46K62L07k77k16J38J48j41j62J09k33k5
$$ 332 308 700 626 194 371 634 562 118 474 -72 190 497 220 4 142 290 149 -13 96 -137 -162
2869a62K85k10o7j59L14M8o4l99k6L82P8j90l21L6K10M32l05o37K53L92K56l3
$$ -162 123 -87 -154 -313 1 49 -15 -414 -440 -58 20 -170 -491 -455 -245 187 -118 -755 -502 -110 146 113
2891A13p89QM21J51q3j59l68O13K48o1n95J66R7K08M1l31J63rN84m63k6k06P07
$$ 113 -676 -668 -247 -96 -179 -338 -706 -93 155 94 -501 -335 -238 -30 11 -320 -157 -166 418 -45 -71 -277 430
2914D30k58L86n77J13R4K34J14o79M32k27O17l21k18kJ99j21k09j91J05K95J31
$$ 430 172 558 -19 94 188 422 536 -143 289 62 679 358 140 138 337 216 7 -184 -79 216 347
2935C47k7l72J08N6J09j58k81k04M49J91m53L4pK4K88j50m4l48J44K41Jk89j5
$$ 347 320 -52 56 112 221 63 -218 -422 27 218 -235 -201 -208 -184 104 -46 -90 -438 -294 -53 -52 -341 -356
2958c56Q1K82R4l84M4k33L37R4n46J68K73J61l34j85K70P3J73j3k68p1K64Q9O4
$$ -356 -275 7 101 -283 -239 -472 -135 -41 -587 -419 -146 15 -319 -504 -234 -161 12 -1 -269 -340 -76 13 77
2981G7k46K10k35O54m10l89P3J27L52Q6l83O9J24K47l79Q3o0j13j73K9K03k51
$$ 77 -169 41 -194 460 50 -339 -266 -139 213 299 -84 -15 109 356 -23 60 0 -113 -286 -257 -54 -305
3003c05L39R8L9n00J98m4L30L32k94K4N1k2q1j71K53l7J63n8r2k54Q2J55M9J2
$$ -305 34 132 171 -329 -131 -175 155 487 193 217 268 246 165 -6 247 210 373 315 223 -31 51 206 255 267
3027B67m73K8L24M4l38N0J24K87o05OO3k58L80Q8l4l29K78j51k91P0r7J12j57
$$ 267 -206 -178 146 190 -148 -98 26 313 -292 -286 -223 -481 -101 -13 -47 -376 -98 -249 -540 -470 -567 -455 -612
3050f12K97k12j96N38l78J90L6k42L80K6n8j56r6K55J01K47k98J53j9K26M7k07
$$ -612 -315 -527 -723 -185 -563 -373 -337 -579 -199 -173 -231 -387 -483 -228 -127 120 -178 -25 -44 182 229 22
3072B2k02K80L82j22l76K99j03k01L82l25j5K94R5k04l7j54rJ06L10j40k07J83
$$ 22 -180 100 482 360 -16 283 180 -21 361 36 21 315 410 206 169 15 6 112 422 282 75 258
3094B58J65J12m34Q2rK85k90J1o1j08J40J03k60l36N0J71L5k47R3k4J12m7k51
$$ 258 423 535 101 183 174 459 169 180 119 11 151 254 -6 -342 -292 -121 -86 -333 -240 -264 -152 -199 -450
3117d50k53M15j49K32j84j05N4K2J94j31J98r1K1R5l48Pj45N09M2J8k89J3K81
$$ -450 -703 -288 -437 -205 -389 -494 -440 -418 -224 -355 -157 -248 -227 -132 -480 -473 -618 -109 -67 -49 -338 -325 -44
3140d4K16n4m6k6J50J52l4j11K2r3J97J78l63k30L68M8l72n3J2J83l0K4k16RL3
$$ -44 172 118 72 46 196 348 314 203 225 132 329 507 144 -86 282 330 -42 -95 -83 100 70 94 -122 -113 -80
3165h0K3l09q7M66K43k63j02m59L48K39Mm3j49K47j30k03J67k35J28K24J86j70
$$ -80 -57 -366 -453 13 256 -7 -109 -568 -220 19 23 -20 -169 78 -52 -255 -88 -323 -195 29 215 45
3187D5l51M28N0L03k65M6O7O9l55L15j77o7P5j76n6j30o9K84k1k9l17k8J60l8
$$ 45 -306 122 172 475 210 256 323 392 37 352 175 108 183 7 -49 -179 -248 36 15 -14 -331 -359 -199 -237
3211b37r7j11j60K53K50qk45n7r0J58J72J13k54j41J62L4J85K42j10K57k91j27
$$ -237 -334 -445 -605 -352 -102 -110 -355 -412 -502 -344 -172 -59 -313 -454 -292 -258 -73 169 59 316 25 -102
3233a02J66j19P7o0J10L17k80K52j19j33K35j17K92o4m44K31O6k15J53K46j19
$$ -102 64 -55 22 -38 72 389 109 361 242 109 344 227 519 455 11 242 308 93 246 492 373
3254C73k56q4j40J47j16O7k51L37K50m49J06j7R9j67J22R7K03k67K4j71j2J23
$$ 373 117 33 -107 40 -76 -9 -260 77 327 -122 -16 -33 66 -101 21 118 321 54 78 -93 -105 18
3276A8L6j31p0j72J61k97J20J14m05P83k60n24J83L7r0K59j00Q8K43k35rp9j6
$$ 18 54 -77 -147 -319 -158 -455 -335 -221 -626 157 -103 -627 -444 -407 -497 -238 -338 -250 -7 -242 -251 -330 -346
3299c46J4J07K12m6j50l8J92k3j99M68k25J53J90n09J96K59J9L50k68j03k27K52
$$ -346 -332 -225 -13 -59 -209 -247 -55 -78 -277 191 -34 119 309 -200 -4 255 274 624 356 253 26 278
3321B78Q8k07J56k51K50p0k16L34K4O7m94J52l13M04N7k85q2Q8o3q0K6J47k27
$$ 278 366 159 315 64 314 244 28 362 386 453 -41 111 -202 202 259 -26 -108 -20 -83 -163 -137 10 -217
3344b17R3K5J58l22M3p4qkj53L00K22l76n7K50r3K21j93J48k43M4j33Q2Q7K86
$$ -217 -124 -99 59 -263 -220 -294 -302 -304 -457 -157 65 -311 -368 -118 -211 10 -183 -35 -278 -234 -367 -285 -198 88
3368H8l5p9K07j00k64j98Q2J60K70m38J71j98J52J72j99m6RK13k48k50K30j70
$$ 88 53 -26 181 81 -183 -381 -299 -139 131 -307 -136 -334 -182 -10 -209 -255 -246 -33 -281 -531 -301 -471
3390d71K02R7j14O4j9Q5K00J26l46J78K56M5L8o6l35J07p9L4K19k74JK63j17j12
$$ -471 -269 -172 -286 -222 -241 -156 44 170 -176 2 258 303 341 275 -60 47 -32 2 221 -53 -52 211 94 -18
3414a8L9q9J64j86L90j69j18Nr9O4j18r1O7J61j45J73k27r8K06Q9l29J08N05n65
$$ -18 21 -68 96 -90 300 131 13 18 -81 -17 -135 -226 -159 2 -143 30 -197 -295 -89 0 -329 -221 284 -281
3438b81m3K20K33k40j92k62M12K4m50K09O5J90j25J6K82j29j78o6O0q1j60O5M08
$$ -281 -324 -104 129 -111 -303 -565 -153 -129 -579 -370 -305 -115 -240 -224 58 -71 -249 -315 -255 -336 -496 -431 -23
3461b3j96q2J03J8j01J26j13j72K70K34k31p8K36K77l17J28Lj02J52j23k19K03
$$ -23 -219 -301 -198 -180 -281 -155 -268 -440 -170 64 -167 -245 -9 268 -49 79 82 -20 132 9 -210 -7
3483gP9r8J13r1K07l65K42j23k02K38J43J28m15L12l7Q1j22K76k61J80k88o7J5
$$ -7 72 -26 87 -4 203 -162 80 -43 -245 -7 136 264 -151 161 124 205 83 359 98 278 -10 -77 -62
3506f2N2J0o6J59k61RR6j36r3O3J7m36L74P8L5p2j47K64L5j46j26lJ09o0J54K1
$$ -62 -10 0 -66 93 -168 -159 -63 -199 -292 -229 -212 -648 -274 -196 -161 -233 -380 -116 -81 -227 -353 -356 -247 -307 -153 -132
3532a32J85m14L1m4J34M7l18%N61k99K18j43P6q5j5NK94k75R6J09m3J02o1J13
$$ -132 53 -361 -330 -374 -240 -193 -511 -511 50 -249 -31 -174 -98 -183 -198 -193 101 -174 -78 31 -12 90 29 142
3556A42k36K17J83k89j73K99O1j9o9K23k52Q5l6j3n0j3k73J74K69j42l32L60m7
$$ 142 -94 123 306 17 -156 143 204 185 116 339 87 172 136 123 73 60 -213 -39 230 88 -244 116 69
3579F9j40J59m7k84J36J7J6J30j02j82q6L70k5j90j83L07n3L0r8jK89l17m3O0
$$ 69 -71 88 41 -243 -107 -90 -74 56 -46 -228 -314 56 31 -159 -342 -35 -88 -58 -156 -157 132 -185 -228 -168
3603a68J63k38K79q8k22J45J19p2Rl5J84k63J60k4k93K76j25K01j99K1J03j41
$$ -168 -5 -243 36 -52 -274 -129 -10 -82 -73 -108 76 -187 -27 -51 -344 -68 -193 8 -191 -170 -67 -208
3625b08j30J71J32k71L66n6J73k01L%J25K2j19Q7m5M6r2K23r5q4R7R1k80L38j77
$$ -208 -338 -167 -35 -306 60 4 177 -24 -21 -21 104 126 7 94 49 95 3 226 131 47 144 235 -45 293 116
3650A16m28L91L7k30J20P0Mk64J49l7R3P1k01M3j54J15J87N8j29N9n6m9J05j70
$$ 116 -312 79 116 -114 6 76 80 -184 -35 -72 21 92 -109 -66 -220 -105 82 140 11 70 14 -35 70 -100
3674a00k85Q04j72j87l4J07m23K00J36o9kk27K34j13J95j91k03L49m14J89k22
$$ -100 -385 419 247 60 26 133 -290 -90 46 -23 -25 -252 -18 -131 64 -127 -330 19 -395 -206 -428
3695d28j8J95K10j29J1j77J43J4j64J57R6j13M3K62k08K0j77L88J13j61J82p5
$$ -428 -446 -251 -41 -170 -159 -336 -193 -179 -343 -186 -90 -203 -160 102 -106 -86 -263 125 238 77 259 184
3717A84k57N7KJ80K07j65q5K58j78J00K3k30%J90Q6l0P8r9Lk84J79q8J73k58J14
$$ 184 -73 -16 -14 166 373 208 123 381 203 303 326 96 96 286 372 342 420 321 324 40 219 131 304 46 160
3742A60k71m3N4K3PP8J8l57K38j25K14r5M5k34KK44J89m14K3J68K08o1p1j34J30
$$ 160 -111 -154 -100 -77 -70 8 26 -331 -93 -218 -4 -99 -54 -288 -286 -42 147 -267 -244 -76 132 71 0 -134 -4
3767dp9J34j00J8K16k22M7L2Ol00J89j62M03k0j93K45n74J38J52M26m08R3R5j50
$$ -4 -83 51 -49 -31 185 -37 10 42 48 -252 -63 -225 178 158 -35 210 -364 -226 -74 352 -56 37 132 -18
3791a8J68m2R0j10J9P5lp8m6p5K46j59K82l80L02j73kK94k85K06j88Q3L5N6k89
$$ -18 150 108 198 88 107 182 179 101 55 -20 226 67 349 -31 271 98 96 390 105 311 123 206 241 297 8
3816HL10n14L46k81n3J93O5k59J84o4K01Pk30j23M45n26L32k43J29j06j62K60
$$ 8 318 -196 150 -131 -184 9 74 -185 -1 -65 136 143 -87 -210 235 -291 41 -202 -73 -179 -341 -81
3838h1J16k65L17k49J75j18pJ11j42N6Q8n9J08j59k05N11q8L0l32kL34l29mK15
$$ -81 35 -230 87 -162 13 -105 -112 -1 -143 -87 1 -58 50 -109 -314 197 109 139 -193 -195 139 -190 -194 21
3862B1q7j29l9k96O04l2M2j79j1L20k29j91J27k33K37L51n22K37j14O0m8K46j71
$$ 21 -66 -195 -234 -530 74 42 84 -95 -106 214 -15 -206 -79 -312 -75 276 -246 -9 -123 -63 -111 135 -36
3885c6l1m8L01p5k54L92k14M1Q6k14K37o9P9k46L20k43M8K14m35L22k26j8K41
$$ -36 -67 -115 186 111 -143 249 35 76 162 -52 185 116 195 -51 269 26 74 288 -147 175 -51 -69 172
3908A72m12r2K49Jj24L79o48K87%k6K99l13J14l35M86l04N6k01J68L1J9p6M2O4
$$ 172 -240 -332 -83 -82 -206 173 -475 -188 -188 -214 85 -228 -114 -449 37 -267 -211 -412 -244 -213 -194 -270 -228 -164
3932a64M6Q4k3k2j15k6J49k4Q2rO0J30j7n20N07Kn2j24J42N5N4l14J77k65J17
$$ -164 -118 -34 -57 -79 -194 -220 -71 -95 -13 -22 38 168 151 -369 138 140 88 -36 106 161 215 -99 78 -187 -70
3957g0l1K87l18K48M0j63K55m80M30k50J79Pr2R5k41J79r1k6J11M9o3%m5J27j29
$$ -70 -101 186 -132 116 156 -7 248 -232 198 -52 127 134 42 137 -104 75 -16 -42 69 118 55 55 10 137 8
3982HM5K55n50M16j17q0N9j30R5l5j86M4J0q3L45j15P9n46M99J40l41j18L3J23
$$ 8 53 308 -242 174 57 -23 36 -94 1 -34 -220 -176 -166 -249 96 -19 60 -486 13 153 -188 -306 -273 -150
4006a50k31L01J0j54P1k12L25j8j19j50K8L8L25J3M3l35J88o2K52j12K81q6k45
$$ -150 -381 -80 -70 -224 -153 -365 -40 -58 -177 -327 -299 -261 64 77 120 -215 -27 -89 163 51 332 246 1
4029AO8J78j45K0j74K63l4l45J88N1k62J95j27L63n29K23J16O7J94n9m81L61k0
$$ 1 69 247 102 122 -52 211 177 -168 20 71 -191 4 -123 240 -289 -66 50 117 311 252 -229 132 112
4052A12M35k25o43L58J48j7k15O0j3nJ61J49n17K47j07P9L30l27QJ04n3J71m75
$$ 112 547 322 -321 37 185 168 -47 13 0 -5 156 305 -212 35 -72 7 337 10 18 122 69 240 -235
4075b35K49n1j86J60k44J94j6J26j90J50Q9j15K10l97M09k81J52N9j72J53k41
$$ -235 14 -37 -223 -63 -307 -113 -129 -3 -193 -43 46 -69 141 -256 153 -128 24 83 -89 64 -177
4096a77J25l85M30M9k67K27MK95l53J79K8m02J31J66O2l12J98K56j63J65j45k00
$$ -177 -52 -437 -7 42 -225 2 6 301 -52 127 155 -247 -116 50 112 -200 -2 254 91 256 111 -89
4118h9K16J02j02k21K61k93J39O8Q1j30J89l4j77J33j22N1J03j02j11L61o1k95
$$ -89 127 229 127 -94 167 -126 13 81 162 32 221 187 10 143 21 72 175 73 -38 323 262 -33
4140c3K40j30k42J06J04j11k05L80k75K66N2J40j00m61K87k27Q4j83K04J20J65
$$ -33 207 77 -165 -59 45 -66 -271 109 -166 100 152 292 192 -269 18 -209 -125 -308 -104 16 181
4161A81K58m70j58l0N14m20K7J6j52Q7p0J26j86J45k57L87k52J44r3L30J27l07
$$ 181 439 -31 -189 -219 295 -125 -98 -82 -234 -147 -217 -91 -277 -132 -389 -2 -254 -110 -203 127 254 -53
4183e3j06J56J66k77L04j96N4l1j60K19k40K20m4J58k62M83j19l32L10k77K94
$$ -53 -159 -3 163 -114 190 -6 48 17 -143 76 -164 56 12 170 -92 391 272 -60 250 -27 267
4204B67m5l39L56j1n0j93J12j18K38k1l67M5J61k16J39K8l2K1Q7k03J7J61J32
$$ 267 222 -117 239 228 178 -15 97 -21 217 196 -171 -126 35 -181 -42 -14 -46 -25 62 -141 -124 37 169
4227A69k70OK73l11O8P3J45l7k52o7J69j09N7j12M55l16J58j54Oj28J47J31j38
$$ 169 -101 -95 178 -133 -65 8 153 116 -136 -203 -34 -143 -86 -198 257 -59 99 -55 -49 -177 -30 101 -37
4250c7j25KK32j89J82j46Lk14J53K60k76K18J08k42O8q9p4L22l32M18k96m5J75
$$ -37 -162 -160 72 -117 65 -81 -78 -292 -139 121 -155 63 171 -71 -3 -92 -166 156 -176 242 -54 -99 76
4273G6M2p3j50R9j0J36m91L18m8K6k69N51m00J84L8N4J03J49p60J18L46J4k2k28
$$ 76 118 45 -105 -6 -16 120 -371 -53 -101 -75 -344 207 -193 -9 29 83 186 335 -425 -307 39 53 31 -197
4297a97M6J31j06L73l85L02J11l40j67k30M41kk7K23j07k28K03j32p0k0k50M15
$$ -197 -151 -20 -126 247 -138 164 275 -65 -232 -462 -21 -23 -50 173 66 -162 41 -91 -161 -181 -431 -16
4319a6N3n0j95N30k94j70M65n64M14k41k55K3L50J57l51j86K50K79l33o7j70K99
$$ -16 37 -13 -208 322 28 -142 323 -241 173 -68 -323 -300 50 207 -144 -330 -80 199 -134 -201 -371 -72
4341g2K15k15J97k77N4J89%m16N54j60k50J92J4L4J19n5j60J13j05m1m0K33k54
$$ -72 143 -72 125 -152 -98 91 91 -325 229 69 -181 11 25 59 178 123 -37 76 -29 -70 -110 123 -131
4364a31R3K5O5m1K15m63N56k3j23J86k75r5nK36qj66L6J66k36J57k64J17K30j84
$$ -131 -38 -13 52 11 226 -237 319 296 173 359 84 -11 -16 220 212 46 82 248 12 169 -95 22 252 68
4388F8J26j62J17j38O0OJ74l36K03m7k23N6k05J19J21j40N0p1m5P7J38k09K93
$$ 68 194 32 149 11 71 77 251 -85 118 71 -152 -96 -301 -182 -61 -201 -151 -222 -267 -190 -52 -261 32
4411C2j50q1p5J92n7K03j65j0O9J37o1r1K2P1J47j88J09o7l9k5P7J43R3m46K86
$$ 32 -118 -199 -274 -82 -139 64 -101 -111 -42 95 34 -57 -35 36 183 -5 104 37 -2 -27 50 193 286 -160 126
4436A26J47p2j90j01J24K8l80J95P5J35j69q4K61l17P6K87Q9n40K69K1j95J70
$$ 126 273 201 11 -90 34 62 -318 -123 -48 87 -82 -166 95 -222 -146 141 230 -310 -41 -20 -215 -45
4458d5J2Q6K1p3k39K77m6J37J18m61p9K94m3j18J71j33Jj13K63k42Q8J78k7k9
$$ -45 -33 53 74 1 -238 39 -7 130 248 -213 -292 2 -41 -159 12 -121 -120 -233 30 -212 -124 54 27 -2
4482bp9Q3j27O8q6J36N5j85oj28p3J60Lj35N5J23qJ49m69M74j97J19j79J90J85
$$ -2 -81 2 -125 -57 -143 -7 48 -137 -143 -271 -344 -184 -181 -316 -261 -138 -146 3 -466 8 -189 -70 -249 -59 126
4507A26n21N41j75K19j85P7Rj02j29M75n62K74J37m3j75q7N2L8k19N53k09R2l71
$$ 126 -395 146 -29 190 5 82 91 -11 -140 335 -227 47 184 141 -34 -121 -69 -31 -250 303 94 186 -185
4530a85K52J34j04o5M0q5P4o3J20q4k2j11J87k74N5J49j46J47J75M3N3k4n9o8
$$ -185 67 201 97 32 72 -13 61 -2 118 34 12 -99 88 -186 -131 18 -128 19 194 237 290 266 207 139
4554A39q6j6j26JK03q3n4M70m18j61L03j37N4k10J2qJ29J0J1m6k47K09J14Ln3
$$ 139 53 37 -89 -88 115 32 -22 448 30 -131 172 35 89 -121 -109 -117 12 22 33 -13 -260 -51 63 66 13
4579A3p4J18L8Rn00N39k84j32J54P5l0P0K00l13J20r2L40k51J34k44J39j34O8
$$ 13 -61 57 95 104 -396 143 -141 -273 -119 -44 -74 -4 196 -117 3 -89 251 0 134 -110 29 -105 -37
4602c7N6O9r3K45k8R5l32Q6j54K03q2j99K48j69J18J79k3j54m9j45K49k39O7J56
$$ -37 19 88 -5 240 212 307 -25 61 -93 110 28 -171 77 -92 26 205 182 28 -21 -166 83 -156 -89 67
4626F7K94o29K78K93k04k43K26J88k76K60k98nk38K62J63k57K11k5M5k11J19k31
$$ 67 361 -268 10 303 99 -144 82 270 -6 254 -44 -49 -287 -25 138 -119 92 67 112 -99 20 -211
4648b11M64j82N2q1j33M9p1m2K79j74m0L98l38j43j9K88m6j52k65N92l22J14k92
$$ -211 253 71 123 42 -91 -42 -113 -155 124 -50 -90 308 -30 -173 -192 96 50 -102 -367 225 -97 17 -275
4671b75J37R3j80M91j36l7k47J21K76m41M87l37K42m4k59%k5J78k37J77k98L82
$$ -275 -138 -45 -225 266 130 93 -154 -33 243 -198 289 -48 194 150 -109 -109 -134 44 -193 -16 -314 68
4693F8J77m84L18k29K09j99L75p6K2r9M50m12kj53N0j28p9J64Q8j79K72k62n4
$$ 68 245 -239 79 -150 59 -140 235 159 181 82 532 120 118 -35 15 -113 -192 -28 60 -119 153 -109 -163
4716a63L50j23Jk34N5Q9nl09K89j2q8R3j6J80k24J18n4M8R1j42q4q4K32J15j30
$$ -163 187 64 65 -169 -114 -25 -30 -339 -50 -62 -150 -57 -73 107 -117 1 -53 -5 86 -56 -140 -224 8 123 -7
4741gJ44J94k31n1pj5Qj03r8M46k67k15J74Q9J53k65P7k4j22J04j24J34k49K25
$$ -7 137 331 100 49 42 27 35 -68 -166 280 13 -202 -28 61 214 -51 26 2 -120 -16 -140 -6 -255 -30
4765c0J93j24j00J06J20q4K50k37k5q1Q6k11j0J72J52l44L5L56j35j7l20L20j11
$$ -30 163 39 -61 45 165 81 331 94 69 -12 74 -137 -147 25 177 -167 -132 224 89 72 -248 72 -39
4788c9j98K56l23M34J32l34J67r3j73K85l28J89M3l02L89J40k69j40J31Rj72q2
$$ -39 -237 19 -304 130 262 -72 95 2 -171 114 -214 -25 18 -284 105 245 -24 -164 -33 -24 -196 -278
4810b78J73J55k70L62l74j28L31K57l24j75K48J90J27l52j07J75k18K11K20j51
$$ -278 -105 50 -220 142 -232 -360 -29 228 -96 -271 -23 167 294 -58 -165 10 -208 3 223 72
4830G2j38L75k4m06J48k5K03j81KQ9l03M18j24j73O56p04Q5J85J61k07K7l17L3
$$ 72 -66 309 285 -121 27 2 205 24 26 115 -188 230 106 -67 589 -115 -30 155 316 109 136 -181 -148
4853a48J08j38M20j05j22L40n00P9M4j06K42j8j23N4J28P8l85O3J99J1n1j43R1
$$ -148 -40 -178 242 137 15 355 -145 -66 -22 -128 114 96 -27 27 155 233 -152 -89 110 121 70 -73 18
4876A8Q8k16J34Ok30r5L20j3Mj32O4j65M94j06k48j86qJ95J69J1k73NJ2J18k11
$$ 18 106 -110 24 30 -200 -295 25 12 16 -116 -52 -217 277 171 -77 -263 -271 -76 93 104 -169 -164 -152 -34 -245
4901b45M69j85J14k10j6M5J21L2k19j07M06rj96j14K16K28l16M26l36l8j1M4k3
$$ -245 224 39 153 -57 -73 -28 93 125 -94 -201 205 196 0 -114 102 330 14 440 104 66 55 99 76
4924G6P2j6j20p4j05K0K82p6N6l90J0Q3Q4q5N5M00j72J03l19M13k0l09P6j58l2
$$ 76 148 132 12 -62 -167 -147 135 59 115 -275 -265 -182 -98 -183 -128 272 100 203 -116 297 277 -32 44 -114 -146
4949a46k0K08k84N29m65J20L9N9P7M3l4n75M75o5n5n2J51j05r4K79j35j74M60
$$ -146 -166 42 -242 287 -178 -58 -19 40 117 160 126 -449 26 -39 -94 -146 5 -100 -194 85 -50 -224 236
4972B36l11k7j39M57k71r5N5K03k05q5R6k6k39L85P9j05O5N7q1p1J98k00Q6m70
$$ 236 -75 -102 -241 216 -55 -150 -95 108 -97 -182 -86 -112 -351 34 113 8 73 130 49 -22 176 -24 62 -408
4996d08K59l1M97n04R5K07j75L36j39j20j70O3L34l34J73P3J97l86J76l7K61n97
$$ -408 -149 -180 317 -187 -92 115 -60 276 137 17 -153 -90 244 -90 83 156 353 -33 143 106 367 -230
5018b30K61Ok50j67K38P2K25p4p7j12J62j69r4K64qj91l6L59l12J05kJ88m66L61
$$ -230 31 37 -213 -380 -142 -70 155 81 4 -108 54 -115 -209 55 47 -144 -180 179 -133 -28 -30 158 -308 53
5042E3pj81j75P6J14L50Q6m88L74j51J03J91p12K19p1j3J50m2J13j53k32O33m3
$$ 53 46 -135 -310 -234 -120 230 316 -172 202 51 154 345 -367 -148 -219 -232 -82 -124 -11 -164 -396 237 194
5065A94l11J44j99j72K07L17k53Q0J49r7l83M74j13l94M64k39L04j81j02K36O0
$$ 194 -117 27 -172 -344 -137 180 -73 7 156 59 -324 150 37 -357 107 -132 172 -9 -111 125 185
5086A85k71J40K88l13m2L33j01k04j29J68L0K70l81j28J16o6R8J29j42q6J64M8
$$ 185 -86 54 342 29 -13 320 219 15 -114 54 84 354 -27 -155 -39 -105 -7 122 -20 -106 58 106
5108A06k03L19k29j58m5j58M03l9R4k12k55M80k06k6N3L25m40K39k55k5K39k36
$$ 106 -97 222 -7 -165 -210 -368 35 -4 90 -122 -377 103 -103 -129 -76 249 -191 48 -207 -232 7 -229
5130b29M69l57K35n1n1K42n3p0J09n1j10J82n03K78l8j70J02J11k75L12J10k13
$$ -229 240 -117 118 67 16 258 205 135 244 193 83 265 -238 40 2 -168 -66 45 -230 82 192 -21
5152b1p8J90j22L63l53L8R8k93R3M4J2K80r2M3n57M12l04O9J07j36K66l15K08
$$ -21 -99 91 -31 332 -21 17 115 -178 -85 -41 -29 251 159 202 -355 57 -247 -178 -71 -207 59 -256 -48
5175d8R9k13M20k01J41k50l6M55m96K7p2M36k13k51L7J34J46jl01L76k70K13l60
$$ -48 51 -162 258 57 198 -52 -88 367 -129 -102 -174 262 49 -202 -165 -31 115 114 -187 189 -81 132 -228
5198b28K51J05l02M07k57j03K12j88j3k94K70K22l30K26k11L23r7k32K93j14J23
$$ -228 23 128 -174 233 -24 -127 85 -103 -116 -410 -140 82 -248 -22 -233 90 -7 -239 54 -60 63
5219F3j70L93r9J25m36j27N52j70l17K66q6QJ11k95J42q7K85l43m0M6K27l8Lk7
$$ 63 -107 286 187 312 -124 -251 301 131 -186 80 -6 2 113 -182 -40 -127 158 -185 -225 -179 48 10 13 -14
5243a4j14K59O8j54O9N5l58R5J23j92K77k76N1J57j03J17J13j79K6J5K10J2r2
$$ -14 -128 131 199 45 114 169 -189 -94 29 -163 114 -162 -111 46 -57 60 173 -6 20 35 245 257 165
5266A65j53K16m70K98k08K68j10r4K02j21K10k02n8j06k18L96m7j21J63o7m8j60
$$ 165 12 228 -242 56 -152 116 6 -88 114 -7 203 1 -57 -163 -381 15 -32 -153 10 -57 -105 -265
5288b65R7M16k99o8J7l5Rm5K38k08P4l9q5M85j09k90r4K74o0J29m6l7j60K84j69
$$ -265 -168 248 -51 -119 -102 -137 -128 -173 65 -143 -69 -108 -193 292 183 -107 -201 73 13 142 96 59 -101 183 14
5313A4j19R2j62M79k38j6k45J25K92m55K27J91j66j28K18J07k82j16J49l86M46
$$ 14 -105 -13 -175 304 66 50 -195 -70 222 -233 -6 185 19 -109 109 216 -66 -182 -33 -419 27
5334B7M4l60N6K46J9j55Q5P5J66j35p2l0J97k09Q6J60k04j75J53J02K5K3R6k60
$$ 27 71 -289 -233 13 32 -123 -38 37 203 68 -4 -34 163 -46 40 200 -4 -179 -26 76 101 124 220 -40
5358d0J70k48J40r5R6K6m9o6J57j99J9j93M01q1R0J32k82n4K5N2L75n45N8N0J24
$$ -40 130 -118 22 -73 23 49 0 -66 91 -108 -89 -282 119 38 128 260 -22 -76 -51 1 376 -169 -111 -61 63
5383F3k01m3L19l48K31j7K68l06J1q9j29J06N7l2j57M90p27N59o9K2J76k51j19
$$ 63 -138 -181 138 -210 21 4 272 -34 -23 -112 -241 -135 -78 -110 -267 223 -504 55 -14 8 184 -67 -186
5406a86k3N69l15L0J84l49M36m87J08j75j38K26j4K36k08P3M16m33J09j0n0j25
$$ -186 -209 360 45 75 259 -90 346 -141 -33 -208 -346 -120 -134 102 -106 -33 383 -50 59 49 -1 -126
5428a26r9k00K88P0K27j7l22j1J47q8K64j5r0K21l92J57k16J24J23j87J85k15
$$ -126 -225 -425 -137 -67 160 143 -179 -190 -43 -131 133 118 28 249 -143 14 -202 -78 45 -142 43 -172
5450a72j7M57k53j62J97k34J18J2J68k24j90M17j82q5L24l52j07j9J98j93L07
$$ -172 -189 268 15 -147 50 -184 -66 -54 114 -110 -300 117 -65 -150 174 -178 -285 -304 -106 -299 8
5471HJ87m15L28J02j34k97J73K23J03j32K36n23K48m7k08J95k5M7J29r8j03r9
$$ 8 195 -220 108 210 76 -221 -48 175 278 146 382 -141 107 60 -148 47 22 69 198 100 -3 -102
5493a02N8J08p7k32L7J91j26K83J42l38p1n0K28L3j53n8K83j69J07j30J46j92
$$ -102 -44 64 -13 -245 -208 -17 -143 140 282 -56 -127 -177 51 84 -69 -127 156 -13 94 -36 110 -82
5515h2J11j37P5j55J87K55l10K18j82J39l94M64K9n53l2N14J10m43L78k14R6o3
$$ -82 29 -108 -33 -188 -1 254 -56 162 -20 119 -275 189 218 -335 -367 147 257 -186 192 -22 74 11
5537A1o3J74l31J17k2J41J61l62L52j51r6M5k09L48j20J32mj76j2n1J56k6r6L10
$$ 11 -52 122 -209 -92 -114 27 188 -174 178 27 -69 -24 -233 115 -5 127 123 -53 -65 -116 40 14 -82 228
5561B28j91j12J91J45m57K91l6k79M8L21l39K44j23P0J51M3k90O9N1p2o9K01j84
$$ 228 37 -75 116 261 -196 95 59 -220 -172 149 -190 54 -69 1 152 195 -95 -26 25 -47 -116 85 -99
5584i9O7R2n6o7L25l06K37o5k48K54j49k47P4K58O1k30K29j31j0n7Q8j89J95k91
$$ -99 -32 60 4 -63 262 -44 193 128 -120 134 -15 -262 -188 70 131 -99 130 -1 -11 -68 20 -169 26 -265
5608b65M27k1k10K35k79K80k71m9j59M16J65j94l4L4k39M1K26jq1n0J5N9j79P5
$$ -265 162 141 -69 166 -113 167 -104 -153 -312 104 269 75 41 75 -164 -123 103 102 21 -29 -14 45 -134 -59
5632e9j2R3j9J28j68k34L00r0K8L8J16n5m17M89m33J35K67K2l63K69Qj76J56q
$$ -59 -71 22 3 131 -37 -271 29 -61 -33 5 121 66 -351 138 -295 -160 107 129 -234 35 43 -133 23 15
5656A5k71J07J23k40LJ74l4J19r5J32j15n9q7L13J80l57K30j51j22L16j8k12J46
$$ 15 -256 -149 -26 -266 -263 -89 -123 -4 -99 33 -82 -141 -228 85 265 -92 138 -13 -135 181 163 -49 97
5679I7p7M0J9J41k80M3j24R8j95L3J79j01J58n4M47k91j91J69L0j06k3P1j15l
$$ 97 20 60 79 220 -60 -17 -141 -43 -238 -205 -26 -127 31 -23 424 133 -58 111 141 35 12 83 -32 -35
5703c5j09l3L16j24l56R7K41n1M0kq9N6O7o4o5o7n9J70R6j17J51mk67K51J82l20
$$ -35 -144 -177 139 15 -341 -244 -3 -54 -14 -16 -105 -49 18 -46 -111 -178 -237 -67 29 -88 63 59 -208 43 225 -95
5729i5J15J33o7j19L7r2J10j62J2K23j13rK51l78J56K03n7J5k95J34M14n12j44
$$ -95 20 153 86 -33 4 -88 22 -140 -128 95 -18 -27 224 -154 2 205 148 163 -132 2 416 -96 -240
5752b40J27J01p1K3J42l2l58L0j1L66j84J34Q7q1j47L38l93L10O1n23K10k4K6
$$ -240 -113 -12 -83 -60 82 50 -308 -278 -289 77 -107 27 114 33 -114 224 -169 141 202 -321 -111 -135 -109
5775a09J97j0l01J76J48k93K60k11K59P9m03J58j34Q5R1Q6j6M4k04Q2MM36m76
$$ -109 88 78 -223 -47 101 -192 68 -143 116 195 -208 -50 -184 -99 -8 78 62 106 -98 -16 -12 424 -52
5798e2j12M3L19J04k98J78l35kk7P9L67k71K54j33j20R4J5j8k05J78j85J46k9
$$ -52 -164 -121 198 302 4 182 -153 -155 -182 -103 264 -7 247 114 -6 88 103 85 -120 58 -127 19 -10
5821a0J64j45l10M31J05k62R0J61l35K04p0L49m22P9n7J64j68n8J70O0m72J86
$$ -10 154 9 -301 130 235 -27 63 224 -111 93 23 372 -50 29 -28 136 -32 -90 80 140 -332 -146
5843a46M23n24K96k12L6J06k95M08o2L8J23l57K39n5k43J81m9K12l33J10L13m7
$$ -146 277 -247 49 -163 -127 -21 -316 92 30 68 191 -166 73 18 -225 -44 -93 119 -214 -104 209 162
5865A62J16j68K6J72m40K31J3j50n1K19j7l54N6K86j0qj94J94q1K4L5j35K97l08
$$ 162 278 110 136 308 -132 99 112 -38 -89 130 113 -241 -185 101 91 83 -111 83 2 26 61 -74 223 -85
5889h5J72l29K30j13J31J63p7L6k16J21l6O9k76L23k09j66K60J66m56L07o1m2
$$ -85 87 -242 -12 -125 6 169 92 128 -88 33 -3 66 -210 113 -96 -262 -2 164 -292 15 -46 -88
5911h8n3k09L69l11K92k65K96l40J24J71M8j64K46j60j08K85j05k31J08J00Q5
$$ -88 -141 -350 19 -292 0 -265 31 -309 -185 -14 34 -130 116 -44 -152 133 28 -203 -95 5 90
$$ [...]
8191e2
##END NTUPLES=NMR FID
##END=
