##TITLE=1H_SA_13.205
 CDCl3, 8 sc, 
 11.6.2020
##JCAMPDX= 6.0         $$ Bruker NMR JCAMP-DX V2.0
##DATA TYPE= NMR FID
##DATA CLASS= NTUPLES
##ORIGIN= UXNMR, Bruker Analytische Messtechnik GmbH
##OWNER= root
$$ XWIN-NMR		Version 3.5
$$ Thu Jun 11 10:06:32 2020 Russian Standard Time (UT+4h)  she@DPX200
##.OBSERVE FREQUENCY= 200.1315
##.OBSERVE NUCLEUS= ^1H
##.DELAY= (6, 6)
##.ACQUISITION MODE= SIMULTANEOUS
##.ACQUISITION SCHEME= undefined
##.AVERAGES= 8
##.DIGITISER RES= 18
##SPECTROMETER/DATA SYSTEM= spect
##.PULSE SEQUENCE= zg30
##.SOLVENT NAME= D2O
##.SHIFT REFERENCE= (INTERNAL, D2O, 0, 15.7039)
##AUDIT TRAIL= $$ (NUMBER, WHEN, WHO, WHERE, WHAT)
$$ ##TITLE= Audit trail, XWIN-NMR		Version 3.5
$$ ##JCAMPDX= 5.01
$$ ##ORIGIN= Bruker BioSpin GmbH
$$ ##OWNER= she
$$ F:/spectra/data/she/nmr/H-F/1/audita.txt
$$ ##AUDIT TRAIL=  $$ (NUMBER, WHEN, WHO, WHERE, WHAT)
(   1,<2020-06-11 10:05:24.20 +0400>,<she>,<DPX200>,
      <created by zg, POWCHK disabled, PULCHK disabled
       configuration hash MD5:
       00 E9 B6 7A A2 85 ED C7 34 08 36 98 17 FE 4E 26
       data hash MD5: 16K
       74 2F FD 41 BB EE 6B F1 CB 77 88 54 11 74 42 24>)
$$ ##END=
$$ 
$$ hash MD5
$$ 58 A5 7E DE CA BF 3C 27 D9 36 16 13 AC 5E 07 26
##$RELAX= 
##$RELAX= 
##$RELAX= 
##$RELAX= 
##$RELAX= 
##$RELAX= 
$$ Bruker specific parameters
$$ --------------------------
##$DU= <F:/spectra>
##$EXPNO= 1
##$NAME= <H-F>
##$PROCNO= 1
##$TYPE= <nmr>
##$USER= <she>
##$AMP= (0..31)
100 100 100 100 100 100 100 100 100 100 100 100 100 100 100 100 100 100 
100 100 100 100 100 100 100 100 100 100 100 100 100 100 
##$AQSEQ= 0
##$AQ_mod= 1
##$AUNM= <au_zg>
##$AUTOPOS= <>
##$BF1= 200.13
##$BF2= 200.13
##$BF3= 200.13
##$BF4= 200.13
##$BF5= 200.13
##$BF6= 200.13
##$BF7= 200.13
##$BF8= 200.13
##$BYTORDA= 1
##$CFDGTYP= 0
##$CFRGTYP= 5
##$CHEMSTR= <none>
##$CNST= (0..31)
1 1 145 1 1 1 1 1 1 1 1 1 1 1 1 1 1 1 1 1 1 1 1 1 1 1 1 1 1 1 1 1 
##$CPDPRG= <>
##$CPDPRG1= <>
##$CPDPRG2= <>
##$CPDPRG3= <>
##$CPDPRG4= <mlev>
##$CPDPRG5= <mlev>
##$CPDPRG6= <mlev>
##$CPDPRG7= <mlev>
##$CPDPRG8= <mlev>
##$CPDPRGB= <>
##$CPDPRGT= <>
##$D= (0..31)
0 1.2 0 0 0 0 0 0 0 0.06 0 0.03 0 0 0 0 0.0002 0 0 0 0 0 0 0 0 0 0 0 0 
0 0 0 
##$DATE= 1591855523
##$DBL= (0..7)
120 120 120 120 120 120 120 120 
##$DBP= (0..7)
150 150 150 150 150 150 150 150 
##$DBP07= 0
##$DBPNAM0= <>
##$DBPNAM1= <>
##$DBPNAM2= <>
##$DBPNAM3= <>
##$DBPNAM4= <>
##$DBPNAM5= <>
##$DBPNAM6= <>
##$DBPNAM7= <>
##$DBPOAL= (0..7)
0.5 0.5 0.5 0.5 0.5 0.5 0.5 0.5 
##$DBPOFFS= (0..7)
0 0 0 0 0 0 0 0 
##$DE= 6
##$DECBNUC= <off>
##$DECIM= 24
##$DECNUC= <off>
##$DECSTAT= 4
##$DIGMOD= 1
##$DIGTYP= 9
##$DL= (0..7)
0 120 120 120 120 120 120 120 
##$DP= (0..7)
150 150 150 150 150 150 150 150 
##$DP07= 0
##$DPNAME0= <>
##$DPNAME1= <>
##$DPNAME2= <>
##$DPNAME3= <>
##$DPNAME4= <>
##$DPNAME5= <>
##$DPNAME6= <>
##$DPNAME7= <>
##$DPOAL= (0..7)
0.5 0.5 0.5 0.5 0.5 0.5 0.5 0.5 
##$DPOFFS= (0..7)
0 0 0 0 0 0 0 0 
##$DQDMODE= 0
##$DR= 18
##$DS= 0
##$DSLIST= <SSSSSSSSSSSSSSS>
$$ [...]
##$SUBNAM2= <"">
##$SUBNAM3= <"">
##$SUBNAM4= <"">
##$SUBNAM5= <"">
##$SUBNAM6= <"">
##$SUBNAM7= <"">
##$SUBNAM8= <"">
##$SUBNAM9= <"">
##$SW= 24.9337058887773
##$SWIBOX= (0..15)
0 0 2 0 0 0 0 0 0 0 0 0 0 0 0 0 
##$SW_h= 4990.01996007984
##$TD= 16384
##$TD0= 1
##$TE= 0
##$TE2= 300
##$TE3= 300
##$TEG= 300
##$TL= (0..7)
0 120 120 120 120 120 120 120 
##$TP= (0..7)
150 150 150 150 150 150 150 150 
##$TP07= 0
##$TPNAME0= <>
##$TPNAME1= <>
##$TPNAME2= <>
##$TPNAME3= <>
##$TPNAME4= <>
##$TPNAME5= <>
##$TPNAME6= <>
##$TPNAME7= <>
##$TPOAL= (0..7)
0.5 0.5 0.5 0.5 0.5 0.5 0.5 0.5 
##$TPOFFS= (0..7)
0 0 0 0 0 0 0 0 
##$TUNHIN= 0
##$TUNHOUT= 0
##$TUNXOUT= 0
##$USERA1= <user>
##$USERA2= <user>
##$USERA3= <user>
##$USERA4= <user>
##$USERA5= <user>
##$V9= 5
##$VALIST= <valist>
##$VCLIST= <CCCCCCCCCCCCCCC>
##$VD= 0
##$VDLIST= <DDDDDDDDDDDDDDD>
##$VPLIST= <PPPPPPPPPPPPPPP>
##$VTLIST= <TTTTTTTTTTTTTTT>
##$WBST= 1024
##$WBSW= 4
##$XGAIN= (0..3)
0 0 0 0 
##$XL= 0
##$YL= 0
##$YMAX_a= 99938
##$YMIN_a= -42379
##$ZGOPTNS= <>
##$ZL1= 120
##$ZL2= 120
##$ZL3= 120
##$ZL4= 120
##$ABSF1= 10
##$ABSF2= 0
##$ABSG= 5
##$ABSL= 3
##$ALPHA= 0
##$AQORDER= 0
##$ASSFAC= 0
##$ASSFACI= 0
##$ASSFACX= 0
##$ASSWID= 0
##$AUNMP= <proc_1d>
##$AZFE= 0.1
##$AZFW= 0.1
##$BCFW= 1
##$BC_mod= 2
##$BYTORDP= 1
##$COROFFS= 0
##$CY= 11.3945322036743
##$DATMOD= 1
##$DC= 2
##$DFILT= <>
##$DTYPP= 0
##$F1P= 16.9975609425685
##$F2P= -3.02152046262296
##$FCOR= 0.5
##$FTSIZE= 0
##$FT_mod= 4
##$GAMMA= 1
##$GB= 0.15
##$INTBC= 1
##$INTSCL= 1
##$ISEN= 128
##$LB= 0.24
##$LEV0= 0
##$LPBIN= 0
##$MAXI= 10000
##$MC2= 0
##$MEAN= 0
##$ME_mod= 0
##$MI= 1.114404
##$NCOEF= 0
##$NC_proc= 0
##$NLEV= 6
##$NOISF1= 3.799351
##$NOISF2= 2.8
##$NSP= 1
##$NTH_PI= 0
##$NZP= 0
##$OFFSET= 15.70392
##$PC= 1
##$PHC0= -9790.794
##$PHC1= 12.80088
##$PH_mod= 1
##$PKNL= yes
##$PPARMOD= 0
##$PSCAL= 0
##$PSIGN= 0
##$REVERSE= no
##$SF= 200.130013532006
##$SI= 16384
##$SIGF1= 3
##$SIGF2= 2
##$SINO= 400
##$SIOLD= 16384
##$SREGLST= <1H.CDCl3>
##$SSB= 0
##$STSI= 0
##$STSR= 0
##$SW_p= 3612.71676300578
##$SYMM= 0
##$S_DEV= 0
##$TDeff= 0
##$TDoff= 0
##$TI= <>
##$TILT= no
##$TM1= 0
##$TM2= 0
##$TOPLEV= 0
##$USERP1= <user>
##$USERP2= <user>
##$USERP3= <user>
##$USERP4= <user>
##$USERP5= <user>
##$WDW= 1
##$XDIM= 8192
##$YMAX_p= 0
##$YMIN_p= 0
$$ End of Bruker specific parameters
$$ ---------------------------------
##NTUPLES= NMR FID
##VAR_NAME=  TIME,          FID/REAL,        FID/IMAG
##SYMBOL=    X,             R,               I
##VAR_TYPE=  INDEPENDENT,   DEPENDENT,       DEPENDENT
##VAR_FORM=  AFFN,          ASDF,            ASDF
##VAR_DIM=   8192,          8192,            8192
##UNITS=     SECONDS,       ARBITRARY UNITS, ARBITRARY UNITS
##FACTOR=    0.0002004,     1,               1
##FIRST=     0,             0,               0
##LAST=      1.6414764,     0,               0
##MIN=       0,             -42379,          0
##MAX=       1.6414764,     99938,           0
$$ Real data points
##PAGE= N=1
##DATA TABLE= (X++(R..R)), XYDATA
$$ [...]
$$ plain form
2084 152 1137 943 -29 508 860 107 329 1079 235 -103 1058 368 -38 682 693 -248 0 1371 273
2103 273 -301 655 588 -662 277 762 -175 -270 561 -276 -204 296 -141 -888 -44 327 -707 -282 419 -110
2123 -110 -882 66 142 -676 -321 612 -539 -1104 14 9 -714 156 -38 -846 -372 31 -582 -461 443 -173
2143 -173 -1194 57 436 -928 -328 244 -34 -598 645 345 -535 278 -43 -534 29 222 -336 -421 630
2162 630 168 -824 402 926 -45 -109 920 252 87 1004 872 59 621 699 93 581 1133 542 -166 727
2182 727 381 -126 577 1147 -162 -123 1025 319 -283 262 673 163 265 721 325 645 1026 429 -105 1286
2202 1286 1039 187 909 1176 148 -288 1119 863 -191 260 676 -217 161 643 320 -284 549 -322 -553
2221 -553 610 624 -540 -151 796 -200 -464 778 590 -703 44 639 -56 142 513 -225 -263 161 -92
$$ packed form
2084A52R85j94r72N37L52p53K22P50q44l38J161o90m06P20J1r41K48J371j098
2103B73n74R56o7j250R39M85r37r5Q31q37P2N00m37p47Q44L71j034M25P01n29
2123a10p72R48P6q18L55R33j151n65J118np23Q70j94q08M74M03o13J21R04o16
2143a73j021J251L79j364O00N72k78n64J243l00q80Q13l21m91N63J93n58q5J051
2162F30m62r92J226N24r71o4J029o68j65R17j32q13N62P8o06M88N52n91p08Q93
2182G27l46n07P03N70j309L9J148p06o02N45M11n10J02M56l96L20L81n97n34J391
2202A286k47q52P22K67j028m36J407k56j054M51M16q93L78M82l23o04Q33q71k31
2221e53J163J4j164L89R47r96k64J242j88j293P47N95o95J98L71p38l8M24k53
$$ plain form
2240 -92 -477 605 578 -911 -473 736 -120 -548 485 333 -695 138 822 -234 56 530 39 -320 440
2259 440 304 -319 211 669 -585 -122 974 216 -615 840 519 -20 178 1181 390 113 1030 566 118
2278 118 981 834 84 437 1168 26 201 1130 -56 -399 793 891 -450 364 964 224 -8 963 532
2297 532 292 653 814 24 214 1193 657 342 1116 464 -171 198 1114 115 -222 494 111 -492 152 267
2317 267 -446 -283 46 -336 -379 557 -172 -387 288 -244 -952 -192 366 -699 -571 82 -186 -757 -349 -124
2337 -124 -1461 -753 -305 -941 -947 -129 -817 -1192 -74 -455 -1262 -732 87 -970 -869 -11 -716 -1194 -577 -464
2357 -464 -1428 -1139 -344 -784 -1021 -428 -901 -1379 -443 -212 -1012 -651 211 -669 -947 65 -288 -1174 -182 60
2377 60 -518 -438 113 -469 -780 363 -25 -841 -161 -53 -920 -832 357 -38 -618 280 310 -706 221 470
$$ packed form
2240i2l85J082k7j489M38J209q56m28J033j52j028Q33O84j056K90M74m91l59P60
2259D40j36o23N30M58j254M63J096p58q31J455l21n39J98J003p91k77R17m64m48
2278A18Q63j47p50L53P31j142J75R29j186l43J192R8j341Q14O00p40k32R71m31
2297E32k40L61J61p90J90R79n36l15P74o52o35L69R16r99l37P16l83o03O44J15
2317B67p13J63L29l82m3R36p29k15O75n32p08P60N58j065J28O53k68n71M08K25
2337a24j337P08M48o36oQ18o88l75J118l81q07N30Q19j057J01Q58p05m78O17J13
2357d64r64K89P95m40k37N93m73m78R36K31q00L61Q62q80k78J012l53q86R92K42
2377F0n78Q0N51n82l11J143l88q16O80J08q67Q8J189l95n80Q98L0j016R27K49
$$ plain form
2397 470 -271 80 634 306 -201 637 705 -236 292 816 -140 -146 181 36 -427 326 198 -580 -30 528 -284
2418 -284 -546 340 226 -362 322 632 -278 103 563 -25 -266 675 169 -286 244 351 -402 -394 428 -220 -548
2439 -548 216 -85 -571 -133 232 -566 -372 53 -396 -781 71 -90 -749 -311 189 -865 -767 230 -597 -1069
2459 -1069 1 -402 -903 -329 -291 -852 -742 27 -978 -677 -462 -126 -998 -148 -6 -724 -737 63 -217 -959
2479 -959 -206 -384 -1022 -828 -115 -758 -798 31 -576 -746 -129 -86 -873 -158 205 -466 -645 202 -37 -446 -137
2500 -137 115 -306 -177 252 -150 -666 439 -30 -722 -21 100 -617 -290 217 -115 -489 171 45 -718 259
2520 259 354 -483 -203 581 -201 -188 198 408 -706 256 563 -407 -370 665 -133 -646 486 288 -458 -183
2540 -183 330 -200 -289 503 -349 -359 363 351 -215 -106 384 -230 -206 276 -126 -433 489 347 -112 -150 470 -62
$$ packed form
2397D70p41L51N54l28n07Q38O8r41N28N24r56oL27j45m63P53j28p78N50N58q12
2418b84k62Q86j14n88O84L10r10L81M60n88k41R41n06m55N30J07p53QQ22o48l28
2439e48P64l01m86M38L65p98J94M25m49l85Q52j61o59M38N00j054R8R97q27m72
2459a069J070m03n01N74L8n61J10P69j005L01K15L36q72Q50J42p18j3Q00k80p42
2479i59P53j78o38J94P13o43m0Q29o07j70O17M3p87P15L63o71j79Q47k39m09L09
2500a37K52m21J29M29m02n16J105m69o92P01J21p17L27N07l32l74O60j26p63R77
2520B59R5q37K80P84p82J3L86K10j114R62L07r70L7J035p98n13J132j98p46K75
2540a83N13n30q9P92q52j0P22j2n66J09M90o14K4M82m02l07R22j42m59l8O20n32
$$ plain form
2562 -62 -256 532 109 -653 291 685 -209 124 426 138 -366 657 312 -32 237 472 -335 143 849 66
2582 66 42 402 359 -33 689 481 -57 432 852 308 22 529 534 -169 573 603 155 247 940 266 -106 993
2604 993 702 267 640 1065 -78 319 941 364 -52 875 789 188 465 1091 -52 352 688 530 82 1122
2624 1122 733 127 168 506 227 224 907 216 -19 671 839 20 186 847 391 -221 480 421 -397 304 558
2645 558 -327 167 869 -73 -274 250 331 -362 207 486 -487 119 604 -231 -312 310 408 -562 -134 683 -378
2666 -378 -19 397 245 -353 229 84 -133 425 223 -115 -270 677 -473 -246 86 63 -447 -196 643 19
2686 19 -348 544 -65 -457 458 423 -443 -43 311 -50 97 431 -53 -520 288 669 -302 -17 483 -255 -377
2707 -377 597 267 -273 157 100 -260 -128 331 17 -344 281 -128 -517 206 369 -251 -181 465 -413 -438 259
$$ packed form
2562f2j94P88m23p62R44L94q94L33L02k88n04J023l45l44K69K35q07M78P06p83
2582F6k4L60m3l92P22k08n38M89M20n44k86N07Np03P42L0m48R2O93o74l72J099
2604I93k91m35L73M25j143L97O22n77m16R27q6o01K77O26j143M04L36j58m48J040
2624A122l89o06M1L38k79lO83o91k35O90J68q19J66O61m56o12P01n9q18P01K54
2645E58q85M94P02r42k01N24Q1o93N69K79r73O06M85q35q1O22R8r70M28Q17j061
2666c78L59M16j52n98N82j45k17N58k02l38j55R47j150K27L32k3n10K51Q39o24
2686A9l67Q92o09l92R15l5q66M00L54l61J47L34m84m67Q08L81r71K85N00p38j22
2707c77R74l30n40M30n7l60J32M59l14l61O25m09l89P23J63o20P0O46q78k5O97
$$ plain form
2728 259 64 -583 -212 121 -567 -618 145 -486 -787 -177 -68 -757 -126 151 -697 -616 -259 -185 -731 -170 -102
2749 -102 -868 -547 -80 -733 -776 -283 -831 -1014 -323 -588 -911 -863 -163 -1343 -920 67 -796 -1300 -634 -535 -1158
2770 -1158 -906 -276 -733 -1098 -251 -824 -746 -377 -408 -935 -542 -362 -852 -775 -424 -466 -1149 -282 -9 -629 -654
2791 -654 -248 -340 -752 20 -518 -730 96 -225 -697 66 177 -357 -554 -18 37 -583 -143 645 -232 9 854
2812 854 -6 -250 444 -183 -160 291 868 -133 137 750 42 -177 257 635 -71 23 628 -101 -166 264 285
2833 285 -404 44 552 -304 20 653 6 249 725 161 -603 297 672 -168 45 581 225 -547 269 95
2853 95 -291 -228 -168 -855 -476 -170 -462 -512 -147 -584 -1327 -81 381 -950 -612 32 -318 -497 83 -145 -643
2874 -643 -394 -119 -731 -651 -229 -858 -937 -112 -540 -1198 -625 -222 -1158 -979 -341 -835 -1101 -615 -481 -952 -779
$$ packed form
2728B59j95o47L71L33o88n1P63o31l01O10J09o89O31K77q48Q1L57P4n46N61O8
2749a02p66L21M67o53m3M93n48j83O91k65l23M8P00j180M23R87q63n04O66R9o23
2770a158K52O30m57l65Q47n73P8L69l1n27L93J80m90P7L51m2o83Q67K73o20k5
2791f54M06r2m12P72n38k12Q26l21m72P63J11n34j97N36N5o20M40P88q77K41Q45
2812H54q60k44O94o27K3M51N77j001K70O13p08k19M34L78p06R4O05p29o5M30K1
2833B85o89M48N08q56L24O33o47K43M76n64p64R00L75q40K13N36l56p72Q16j74
2853I5l86O3O0o87L79L06k92n0L65m37p43J246M62j331L38O44l50j79N80k28m98
2874f43K49K75o12Q0M22o29p9Q25m28o58N73M03r36J79O38m94k66M86J34m71J73
$$ plain form
2895 -779 -120 -539 -288 14 -283 -875 -72 -83 -463 -96 191 -547 -567 161 208 -687 107 73 -684 -312 175
2916 175 -220 -408 133 -88 -363 211 701 -485 86 685 -71 -164 701 622 -294 356 347 -61 204 606 -79
2937 -79 -181 596 249 17 318 656 50 -36 742 127 -149 921 693 12 109 688 297 -97 370 223 -351
2958 -351 338 164 -367 -84 219 -396 -238 400 117 -546 18 326 -421 -86 464 -11 -493 169 -410 -519
2978 -519 -67 -161 -997 -447 -329 -1048 -750 -45 -718 -955 -370 -236 -1101 -756 10 -382 -747 56 -172 -495
2998 -495 -258 -110 -509 -435 -47 -546 -181 94 -261 -725 -119 34 -681 -802 -112 -389 -617 -34 218 -529
3018 -529 -31 332 -19 252 505 300 231 979 516 -344 702 775 402 -93 512 395 63 488 782 76
3038 76 254 645 505 539 693 486 442 1213 1269 605 1332 1258 541 425 1443 793 463 874 994 175 387
$$ packed form
2895g79O59m19K51L02k97n92Q03j1l80L67K87p38k0P28M7q95P94l4p57L72M87
2916A75l95j88N41k21k75N74M90j186N71N99p56r3Q65p9r16O50rm08K65M02o85
2937g9j02P77l47k32L01L38o06q6P78o15k76J070k28o81R7N79l91l94M67j47n74
2958c51O89j74n31K83L03o15J58O38k83o63N64L08p47L35N50m75m82O62n79j09
2978e19M52r4q36N50J18p19K98P05o73k37N85J34q65L45P66l92l65Q03k28l23
2998d95K37J48l99P4L88m99L65K75l55m64O06J53p15j21O90k77k28N83K52p47
3018e29M98L63l51K71K53k05o9P48m63q60J046P3l73m95O05j17l32M25K94p06
3038G6J78L91j40L4J54k07m4P71N6o64P27p4p17j16J018o50l30M11J20q19K12
$$ plain form
3059 387 976 317 525 404 394 256 863 613 110 580 861 393 422 1143 748 284 891 863 142 227 765
3080 765 602 -80 567 147 -462 92 205 -633 -22 264 -39 -233 269 13 -378 -39 365 -358 -248 528
3100 528 88 -454 199 -177 -789 -159 -32 -448 -744 51 -414 -832 94 33 -796 -503 -4 -407 -534 94
3120 94 -121 -361 106 -32 -536 -22 61 -330 -166 130 -111 -595 -257 63 -636 -202 230 -236 -488 149 67
3141 67 -440 77 69 -247 88 518 188 4 724 498 -23 507 596 197 53 584 -60 -151 414 434 209 238
3163 238 397 -44 69 938 736 295 638 897 80 430 1316 276 306 853 390 342 826 679 -283 347
3183 347 542 75 318 753 135 -210 532 687 167 466 708 351 569 567 705 4 784 602 19 270 825
3204 825 -13 130 534 206 46 255 141 -125 180 404 -400 -570 107 179 -195 43 403 -173 -321 229
$$ packed form
3059C87N89o59K08j21j0j38O07k50n03M70K81m68K9P21l95m64O07k8p21Q5N38
3080G65j63o82O47m20o09N54J13q38O11K86l03j94N02k56l91L39M04p23J10P76
3100E28m40n42O53l76o12O30J27m16k96P95m65m18R26o1q29K93M99m03j27O28
3120I4k15k40M67j38n04N14Q3l91J64K96k41m84L38L20o99M34M32m66k52O37q2
3141F7n07N17ql16L35M30l30j84P20k26n21N30Q9l99j44N31o44r1N65K0k25K9
3163B38J59m41J13Q69k02m41L43K59q17L50Q86j040L0N47m63m8M84j47r62O30
3183C47J95m67K43M35o18l45P42J55n20K99K42l57K18kJ38p01P80j82n83K51N55
3204H25q38J43M04l28j60K09j14k66L05K24q04j70O77P2l74K38L60n76j48N50
$$ plain form
3224 229 71 -98 374 98 -624 99 293 -422 -408 172 -317 -652 88 -296 -490 -127 159 -554 -448 123
3244 123 -476 -490 -173 99 -622 -512 -62 -494 -292 -157 21 -377 -208 -117 -732 -282 347 -275 -413 -70 -348
3265 -348 -431 -279 -210 -595 -390 48 -580 -509 -217 -74 -429 -393 -4 -537 -224 44 -96 -305 105 -152 -354
3286 -354 -163 49 -168 -120 287 -101 -328 111 120 -493 -44 158 -355 -232 71 -500 -502 -35 -42 -335 -371 256 -221
3309 -221 -526 190 3 -231 220 247 -527 228 597 10 244 455 -39 -157 177 582 -269 181 343 141
3329 141 -24 339 -39 -194 150 158 -213 -94 288 8 -267 404 -28 -220 363 565 -139 -43 461 3 174
3350 174 665 403 -45 416 255 -84 295 143 -96 36 354 520 -334 394 530 -443 84 136 -174 -389
3370 -389 -117 -35 -194 60 241 -434 -333 97 143 -372 324 355 -409 126 447 -171 -235 232 198 -403 120 -141
$$ packed form
3224B29j58j69M72k76p22P23J94p15J4N80m89l35P40l84j94L63K86p13J06N71
3244A23n99j4L17K72p21J10M50m32K02J35J78l98J69R1o15M50O29o22j38L43k78
3265c48q3J52O9l85K05M38o28P1K92J43l55L6L89n33L13K68j40k09M10k57k02
3286c54J91K12k17M8M07l88k27M39Ro13M49K02n13J23L03n71kM67pk93l6O27m77
3309b21l05P16j87k34M51K7p74P55L69n87K34K11m94j18L34M05q51M50J62k02
3329A41j65L63l78j55L44Ql71J19L82k80k75O71m32j92N83K02p04R6N04m58J71
3350A74M91k62m48M61j61l39L79j52k39J32L18J66q54P28J36r73N27N2l10k15
3370c89K72Q2j59K54J81o75J01M30M6n15O96L1p64N35L21o18o4M67l4o01N23k61
$$ plain form
3392 -141 -510 -489 -155 -540 -239 -279 -394 -766 1 -248 -251 -363 230 -318 -223 34 -91 -80 -87 240 -307 -76 330
3415 330 219 27 215 -33 -505 70 144 -168 -354 -81 184 -141 105 157 20 74 297 -239 -172 461 6
3436 6 237 388 239 215 371 297 219 69 876 450 124 575 390 212 567 904 195 -36 464 350 237 684
3458 684 594 287 373 684 368 309 595 467 88 628 755 271 503 665 330 701 906 444 175 814 595
3479 595 84 290 896 261 205 648 601 131 340 655 8 271 302 349 45 339 56 -191 54 772 -15
3500 -15 -21 10 -16 -190 428 231 -432 18 224 -404 -156 271 -38 -475 -51 23 -411 -207 4 -841 -428 -9
3522 -9 -319 -75 -63 -82 -783 -447 335 -205 -153 -3 49 -851 106 87 -31 219 229 -377 125 284 90 -188 346
3545 346 456 -397 63 433 4 -218 -49 58 192 226 500 194 141 317 -24 6 379 205 174 475 408 -157
$$ packed form
3392a41l69K1L34l85L01m0j15l72P67k49lj12N93n48R5K57j25J1pL27n47K31M06
3415C30j11j92J88k48m72N75P4l12j86K73K65l25K46N2j37N4K23n36O7O33m55
3436FK31J51j49k4J56p4p8j50Q07m26l26M51j85j78L55L37p09k31N00j14j13M47
3458F84r0l07Q6L11l16n9K86j28l79N40J27m84K32J62l35L71K05m62k69O39k19
3479E95n11K06O06o35n6M43m7m70K09L15o47K63L1M7l04K94k83k47K45P18p87
3500a5oL1k6j74O18j97o63M50K06o28K48M27l09m37M24P4m34K04K11q45M13M19
3522il10K44J2j9p01L36P82n40N2J50N2r00R57j9j18K50J0o06N02J59j94k78N34
3545C46J10q53M60L70m29k22J69J07J34L4K74l06n3J76l41L0L73j74l1L01o7n65
$$ plain form
3567 -157 242 712 349 -223 228 698 -162 193 584 194 49 533 66 76 489 250 -138 149 458 -86
3587 -86 321 406 45 -219 751 476 104 318 378 496 301 867 357 162 255 342 -101 386 402 -286 -69 360
3609 360 150 -534 -86 176 -381 -89 341 60 196 223 -7 43 -99 44 -466 -289 89 -492 -555 40 -405
3630 -405 -476 -387 -338 -840 -280 -143 -309 -474 -799 -301 -591 -295 152 -670 -104 -98 -314 -255 289 185 -491 -255
3652 -255 -87 -204 -255 160 -430 -276 13 -46 -395 -126 374 -332 225 17 21 -412 244 154 -209 -30 343 246
3674 246 253 340 -39 76 12 186 -335 12 227 -189 -357 224 22 -378 -34 10 -52 -223 332 251 -80 255
3696 255 162 184 256 302 -270 149 609 -69 154 145 79 -446 -55 206 104 -107 549 71 -317 230 186 73 38
3719 38 286 110 -359 307 177 -32 356 185 58 -57 -38 -439 -518 109 -245 -618 -465 -372 -646 -356 -315 -559
$$ packed form
3567a57L99M70l63n72M51M70q60L55L91l90j45M84m67J0M13k39l88K87L09n44
3587h6M07Q5l61k64R70k75l72K14O0J18j95N66n10j95R3Q7m43M87J6o88K17M29
3609C60k10o84M48K62n57K92M30k81J36K7k30N0j42J43n10J77L78n81o3N95m45
3630d05p1Q9M9n02N60J37j66j65l25M98k90K96M47q22N66Ok16N9N44j04o76K36
3652b55J68j17n1M15n90J54K89n9l49K69N00p06N57k08Mm33O56r0l63J79L73r7
3674B46PQ7l79J15o4J74n21L47K15m16j68N81k02m00L44M4o2j71N55q1l31L35
3696B55r3K2P2M6n72M19M60o78K23ro6n25L91K61j02k11O56m78l88N47m4j13l5
3719C8K48j76m69O66j30k09L88j71j27j15J9m01p9O27l54l73J53R3k74K90M1k44
$$ plain form
3741 -559 -200 -436 -408 -486 -130 -336 -379 -586 24 -298 -259 -403 -254 -292 -380 -57 -599 -431 -407 -407 -283 -245 -149 -516
3765 -516 -566 35 -406 -136 -39 -367 -133 182 214 -525 -40 -24 -179 -211 100 -87 -190 -265 -122 -540 202 488
3787 488 -626 -27 111 -170 -103 369 -32 -62 265 329 -44 -36 292 -12 -444 -49 220 -292 -320 297 -262 -312
3809 -312 144 15 -90 27 19 -118 200 600 230 170 488 195 -261 442 286 188 219 344 -157 278 -33 -76
3831 -76 -234 -23 285 50 22 -95 59 18 230 -284 -12 61 360 -129 266 587 267 -98 752 622 -190
3852 -190 -48 286 -119 13 -91 -95 -106 -32 177 -450 -142 -362 -434 -460 -235 -153 -436 -225 -40 -239 -360 134
3874 134 -161 -144 156 156 -304 -184 526 -175 -17 11 -160 -74 16 -300 -436 70 239 -262 -1 245 90 -23
3896 -23 245 -167 -315 23 -351 -526 -294 -164 -66 -370 6 -394 -73 46 258 -71 -145 98 -353 40 286
$$ packed form
3741e59L59k36K8p8L56k06m3k07O10l22L9j44J49l8q8L23n42J68K4%J24L8R6l67
3765e16n0O01m41K70R7l28K34L15L2p39M85J6j55l2L11j87j03p5J43m18P42K86
3787D88j114N99J38k81O7M72m01l0L27O4l73QL28l04m32L95K69n12k8O17n59n0
3809c12M56j29j05J17qj37L18M00l70o0L18k93m56P03j56r8L1J25n01M35l11m3
3831g6j58K11L08k35k8j17J54m1K12n14K72P3K99m89L95L21l20l65Q50j30q12
3852a90J42L34m05J32j04mj1P4K09o27L08k20p2k6K25Q2k83K11J85j99j21M94
3874A34k95J7L00%m60J20P10p01J58K8j71Q6R0l16j36N06J69n01K61K46j55j13
3896b3K68m12j48L38l74j75K32J30R8l04L76m00L21J19K12l29p4K43m51L93K46
$$ plain form
3917 286 -184 -427 246 40 -201 -260 239 -159 -476 -176 411 -462 -105 -149 -337 -28 -203 -201 -286 227 -103 -192
3939 -192 7 451 -260 270 417 258 501 459 291 49 -254 506 101 162 347 -165 -317 433 213 4 79
3960 79 51 -86 -164 -69 48 -320 167 694 125 456 456 27 234 355 207 -6 466 752 -47 329 427 -13
3982 -13 -163 153 394 64 136 103 76 107 359 42 -365 56 48 53 -286 168 -158 -70 261 -169 -552 218 501
4005 501 -83 54 465 -65 -93 469 -324 -160 120 -5 -64 44 98 -232 -254 -67 -268 -242 -337 -115 -453 -251
4027 -251 -19 -158 -476 -43 -254 -459 104 -84 -253 -289 211 -491 -496 -221 -84 -373 -197 37 -591 -499 -49
4048 -49 -414 -542 -50 -130 -380 -248 -323 -614 -421 -275 -182 -429 -157 -63 -305 -110 -90 -3 -227 148 -83 -128 315
4071 315 221 -55 -3 301 138 78 470 -123 -104 543 196 -96 110 414 272 59 236 249 51 481 512 189
$$ packed form
3917B86m70k43O73k06k41n9M99l98l17L00N87q73L57m4j88L09j75Kq5N13l30q9
3939a92J99M44p11N30J47j59K43m2j68k42l03P60m05O1J85n12j52P50k20k09P5
3960G9k8j37p8R5J17l68M87N27n69L31%m29K07J21j48k13M72K86p99L76R8m40
3982a3j50L16K41l30P2l3k7L1K52l17m07M21qNl39M54l26Q8L31m30l83P70K83
4005E01n84J37M11n30k8N62p93J64K80j25n9J08N4l30k2J87k01K6r5K22l38K02
4027b51K32j39l18M33k11k05N63j88j69l6N00p02nK75J37k89J76K34o28R2M50
4048d9l65j28M92q0k50J32p5k91J93J46R3k47K72R4k42J95K0Q7k24L75k31m5M43
4071C15r4k76N2L04j63o0L92n93J9O47l47k92K06L04j42k13J77J3j98M30L1l23
$$ plain form
4093 189 71 100 -164 227 409 9 -25 297 353 33 241 856 167 156 346 196 -28 173 208 103 -19 42
4115 42 212 -86 115 89 -71 -23 -188 -400 54 -173 37 -289 114 -66 -316 55 414 -133 31 333 -207
4136 -207 -148 93 -377 -114 -25 163 -293 -163 -6 -487 -328 85 -77 -499 -393 -305 -173 -462 -238 -277 -710
4157 -710 -175 -432 -596 -418 -230 -500 -579 -371 -75 -573 -398 -172 -515 -404 -236 -576 -375 -15 -416 -755
4177 -755 -229 -414 -373 -238 -272 -94 -494 -78 -233 -182 -32 -25 -330 -475 99 -286 -286 52 -48 -313 37 -19 -209
4200 -209 -24 286 -9 36 -52 272 -51 112 162 266 200 395 -40 -218 262 446 -261 69 294 -107 -172 178
4222 178 -172 190 163 105 77 -51 169 -115 18 210 -145 -216 -34 325 9 59 488 76 72 571 283 -207
4244 -207 345 168 -338 -49 339 248 -210 160 -7 -124 183 135 -103 153 178 -181 -303 129 -77 -225 -256
$$ packed form
4093A89j18K9k64L91J82m00l4L22N6l20K08O15o89j1J90j50k24K01L5j05j22O1
4115D2J70k98K01k6j60M8j65k12M54k27K10l26M03j80k50L71L59n47J64L02n40
4136b07N9K41m70K63Q9J88m56J30J57m81J59M13j62m22J06Q8J32k89K24l9m33
4157g10N35k57j64J78J88k70p9K08K96m98J75K26l43J11J68l40K01L60m01l39
4177g55N26j85M1J35l4J78m00M16j55N1J50Pl05j45N74l85%L38j00k65L50n6j90
4200b09J85L10k95M5q8L24l23J63N0J04o6J95m35j78M80J84p07L30K25m01o5L50
4222A78l50L62k7n8k8j28K20k84J33J92l55p1J82L59l16N0M29m12mM99k88m90
4244b07N52j77n06K89L88r1m58L70j67j17L07m8k38K56K5l59j22M32k06j48l1
$$ plain form
4265 -256 -13 -63 -332 -214 -118 -299 -63 -162 -198 -361 110 -300 -444 -64 -384 -628 -147 -208 -686 -164 -222 -595
4287 -595 -351 -304 -238 -318 -205 62 -412 -238 95 55 -154 -194 11 0 -37 248 -69 206 216 210 -466 332 40
4310 40 28 125 256 287 53 48 -66 39 403 302 266 320 349 195 30 186 -71 -88 253 55 39 53 181 48
4334 48 -210 346 -82 153 72 139 -185 305 172 -246 373 471 40 -42 11 48 -127 56 173 -221 21 278
4356 278 181 -82 138 565 1 247 179 -269 288 441 341 122 322 138 190 253 347 -99 290 438 122 109
4378 109 75 89 6 -78 34 -146 -217 156 -75 -70 -34 140 -341 -47 244 -51 -346 -85 -117 -167 -292 50 -459
4401 -459 -29 85 -257 -236 132 -349 -48 134 -19 -294 -229 306 64 -60 -28 105 -26 -78 299 -29 -30 248
4423 248 173 78 82 53 75 372 -74 -177 -196 -183 147 -158 -3 391 4 -77 328 103 -177 342 -71 59 195
$$ packed form
4265b56K43n0k69J18R6j81K36r9l6j63M71m10j44L80l20k44M81o1m78N22n8l73
4287e95K44M7O6q0J13K67m74J74L33m0k09m0K05j1l7K85l17K75J0oo76P98k92
4310D0j2R7J31L1k34nj14J05L64j01l6N4K9j54j65J56k57j7L41j98j6J4J28j33
4334D8k58N56m28K35q1O7l24M90j33m18O19R8m31q2N3L7j75J83J17l94K42K57
4356B78r7k63K20M27n64K46o8m48N57J53j00k19K00j84N2O3R4m46L89J48l16j3
4378A09l4J4q3q4J12j80p1L73k31NL6J74m81K94K91k95k95K61l2n0j25L42n09
4401d59M30J14l42K1L68m81L01J82j53k75O5N35k42j24L2J33j31n2L77l28jK78
4423B48p5r5Mk9K2K97m46j03j9J3L30l05J55L94l87q1M05k25k80N19m13J30J36
$$ plain form
4446 195 10 -255 228 277 -294 -263 290 144 -124 -187 90 -268 -46 -159 -96 -219 6 -87 -185 -266 68 -113
4468 -113 -9 238 -67 26 235 117 -114 382 -34 32 119 437 45 5 300 164 27 277 22 -62 -297 230
4490 230 -102 -351 196 182 -322 22 109 -149 -145 133 -224 -30 -22 -97 -457 -73 10 -53 -27 12 134 -400 -73 59
4514 59 -305 -118 -132 -230 -376 -162 -177 -73 -97 -168 -320 -163 -56 -98 -174 177 -4 -272 121 68 -217 -390 305
4537 305 -9 40 193 131 -379 -1 408 -240 57 191 -96 -82 149 -89 -464 -42 38 -427 -169 135 -490
4558 -490 -327 152 -49 -25 32 12 -96 -30 -22 316 -27 68 137 -48 -241 24 -360 -163 92 -119 -199 -236 -37
4581 -37 -201 52 318 -168 -172 42 -45 -105 48 136 160 -177 90 174 200 139 297 247 277 7 182 278 256 114 23
4606 23 346 -121 -35 -75 153 -75 77 239 -292 132 67 -20 2 9 126 -157 -246 181 -233 43 -38 259 82
$$ packed form
4446A95j85k65M83M9n71L1N53j46k68o3K77l58K22j13O3j23K25r3r8q1L34j81
4468a13J04K47l05R3K09j18k31M96m16O6Q7L18l92m0K95j36j37K50k55q4k35N27
4490B30l32k49N47j4n04L44Q7k58MK78l57J94Qp5l60L84Q3o3K6L9J22n34L27J32
4514E9l64J87j4r8j46K14j5J04k4p1j52J57J07m2p6L51j81k68L93n3k85j73O95
4537C05l14M9J53o2n10L78M09o48K97J34k87J4K31k38l75M22Q0m65K58L04o25
4558d90J63M79k01K4N7k0j08O6QL38l43R5O9j85j93K65l84J97K55k11q0l7J99
4581c7j64K53K66m86mK14q7o0J53Q8K4l37K67Q4K6o1J58n0L0k70J75R6k2j42r1
4606B3L23m67Q6m0K28k28J52J62n31M24o5q7K2PJ17k83q9M27m14K76q1K97j77
$$ plain form
4629 82 154 298 -94 34 254 115 -323 -1 283 -3 -12 311 49 -25 143 -25 -120 -12 -105 -148 -180 326 -52
4652 -52 -330 182 -3 56 233 4 -420 275 416 9 -5 212 229 -412 157 -171 -186 120 -182 -315 -276 -244
4674 -244 -85 -619 -111 8 -200 -217 -263 -190 -134 -110 -57 -506 -211 -87 -172 -281 83 -181 -452 -226 -204 -182 160
4697 160 140 -101 147 9 163 26 122 227 -277 221 249 -20 -17 103 209 -167 167 123 -138 -183 360 -139
4719 -139 -225 -116 113 -176 -218 117 -58 345 403 213 -16 152 158 100 75 301 315 262 -122 -11 193 454 121
4742 121 174 172 384 -13 121 189 355 -177 276 388 -143 268 533 173 270 150 140 200 234 -37 -82 279 266
4765 266 -200 65 241 -79 -110 -118 -29 -344 87 120 -222 -49 87 -232 -215 -30 -208 -235 58 -116 25 40 205
4788 205 -33 -174 247 -70 -32 -13 61 -199 -158 152 16 -152 -136 149 -169 -283 96 -316 -92 -135 168 -200
$$ packed form
4629H2P2J44l92J28K20j39m38L22K84k86rL23k62p4J68j68r5J08r3m3l2N06l78
4652e2k78N12j85N9J77k29m24O95J41m07j4K17J7o41N69l28j5L06l02j33L9L2
4674b44J59n34N08J19k08j7m6P3N6K4N3m49K95J24q5j09L64k64k71K26K2K2L42
4697A60k0k41K48j38J54j37R6J05n04M98K8k69LJ20J06l76L34m4k61m5N43m99
4719a39q6J09K29k89m2L35j75M03N8j90k29J68On8k5K26J4n3l84J11K04K61l33
4742A21N3kK12l97J34O8J66n32M53J12n31M11K65l60R7j20j0O0L4k71m5L61j3
4765B66m66K65J76l20l1qQ9l15M31L3l42J73J36l19J7J85j78k7K93j74J41J5J65
4788B05k38j41M21l17L8J9P4k60M1L10j36j68J6K85l18j14L79m12K24m3L03l68
$$ plain form
4810 -200 -120 -174 -88 -145 308 -11 -6 254 -104 -180 -47 -76 -77 -282 23 2 -247 -155 96 -113 100 203 203 -66 47
4835 47 198 -204 92 439 -184 351 201 -27 -60 285 69 -91 134 236 80 140 216 -53 373 52 368
4856 368 -22 194 213 -24 366 715 -187 234 573 724 38 380 236 -26 358 181 361 125 380 71
4876 71 2 179 -5 88 166 332 346 -138 185 -3 145 80 320 305 87 45 -135 159 113 15 275 81 35 63
4900 63 155 141 100 -224 190 93 -215 131 161 10 23 245 71 6 106 239 -30 -166 137 -41 445 117 -163
4923 -163 -143 129 -86 -92 50 -174 -154 -144 134 -206 -167 80 -209 -18 -35 -355 -160 -307 108 -228 -152 269 15
4946 15 -186 -372 158 -81 -150 157 238 -171 132 19 161 -148 -37 -43 115 202 193 -196 296 283 -64 242 275
4969 275 23 5 201 196 170 197 -82 226 -46 46 110 51 163 221 15 96 282 193 237 348 24 -100 73 270
$$ packed form
4810b00Q0n4Q6n7M53l19NK60l58p6J33k9jk05L05k1k49R2K51k09K13J03%k69J13
4835D7J51m02K96L47o23N35j50k28l3L45k16j60K25J02j56O0P6k69M26l21L16
4856C68l90K16J9k37L90L49r02M21L39J51o86L42j44k62L84j77J80k36K55l09
4876G1o9J77j84R3P8J66J4m84L23j88J48o5K40j5k18m2j80K94m6r8K60j94m6K8
4900F3R2j4m1l24M14r7l08L46L0j51J3K22j74o5J00J33k69j36L03j78M86l28k80
4923a63K0K72k15oJ42k24K0J0K78l40L9K47k89J91j7l20J95j47M15l36P6M21k54
4946A5k01j86N30k39o9L07Q1m09L03j13J42l09J11oJ58Q7rl89M92j3l47L06L3
4969B75k52j8J96nk6K7k79L08k72R2O4n9J12N8k06Q1J86q9M4J11l24j24J73J97
$$ plain form
4993 270 145 146 240 51 62 -1 -13 -88 -85 123 35 8 0 97 165 306 -22 29 219 182 105 -127 327 65 6 240
5019 240 99 -127 218 -22 -161 89 327 -194 30 -92 -53 -15 155 25 44 -130 5 17 -50 100 21 -305
5041 -305 -145 268 3 163 -73 41 -230 170 -200 -131 -78 -5 -202 211 -57 -265 -111 -232 50 -82 14
5062 14 187 4 -274 16 -97 -94 -48 141 -24 -54 -1 69 -131 14 216 -176 169 16 -107 167 -40 -64 -94
5085 -94 58 -3 -27 118 -38 -198 -28 353 -207 -613 80 187 -220 -91 51 -120 37 -1 -130 -45 80 157
5107 157 15 -64 152 -29 36 217 -62 -15 172 211 -238 69 0 -171 97 -11 -189 -207 410 370 -300 150
5129 150 17 116 -30 190 429 162 -136 -142 -66 124 410 205 60 -27 -76 5 -16 10 199 -78 -200 -27 -32 123
5153 123 -48 -45 -141 192 41 6 -48 -184 -354 116 -195 -197 234 -53 117 99 316 -233 -211 211 -100 -202 -74
$$ packed form
4993B70j25JR4j89J1o3j2p5LK08q8k7qR7O8J41l28N1J90l7p7k32M54k62n9K34
5019B40j41k26L45k40j39K50K38n21K24j22L9L8J70j30J9j74J35J2o7J50p9l26
5041c05J60M13k65J60k36J14k71M00l70O9N3P3j97M13k68k08J54j21K82j32R6
5062A4J73j83k78K90j13LM6J89j65l0N3P0k00J45K02l92L45j53j23K74k07k4l0
5085i4J52o1k4J45j56j60J70L81n60m06O93J07m07J29J42j71J57l8j29Q5J25P7
5107A57j42p9K16j81O5J81k79M7J87L9m49L07o9j71K68j08j78j8O17m0o70M50
5129A50j33R9j46K20K39k67k98oP6J90K86k05j45q7m9Q1k1K6J89k77j22J73nJ55
5153A23j71Lr6L33j51l5n4j36j70M70l11kM31k87J70j8K17n49K2M22l11j02J28
$$ plain form
5176 -74 163 181 -236 77 12 249 218 224 -59 -183 -9 268 44 103 118 -73 276 131 -247 162 355 -3 -303
5199 -303 117 -160 -114 27 229 -306 -128 16 147 -24 56 -55 -193 5 78 -75 -144 156 -75 -39 -55 2
5221 2 -129 -32 -280 -154 -93 -42 -321 -56 -42 12 -167 -14 121 -476 -17 113 158 -65 256 163 -133 159 178
5244 178 -7 298 163 175 -183 20 71 -16 -392 157 254 -277 98 -21 -29 71 138 -160 69 -73 -1 36 186
5267 186 -146 10 -47 50 -79 52 150 58 -172 273 -177 77 308 -65 -212 -183 109 190 59 126 33 -283 267
5290 267 -109 -26 -79 116 -100 119 39 13 -52 -7 25 90 300 130 -79 -304 52 179 -338 100 -220 -87 65
5313 65 42 -113 38 475 75 -72 -55 -206 -98 -135 20 -109 -18 25 -46 -201 243 78 -96 33 -209 -16
5335 -16 -132 -94 54 -24 -203 -26 5 17 62 -167 -93 -104 107 -84 13 -22 -1 221 147 140 10 -101 117 -149 25
$$ packed form
5176g4K37J8m17L13o5K37l1Ok83j24J74K77k24N9J5j91L49j45l78M09J93l58l00
5199c03M20k77M6J41K02n35J78J44J31j71Q0j11j38J98P3j53o9L00k31L6j6N7
5221Bj31R7k48J26O1N1k79K65J4N4j79J53J35n97M59J30M5k23L21r3k96K92J9
5244A78j85L05j35J2l58K03N1q7l76N49R7n31L75j19qJ00O7k98K29j42P2L7J50
5267A86l32J56n7R7j29J31R8r2k30M45m50K54K31l73j47K9K92Q1j31O7r3l16N50
5290B67l76Q3n3J95k16K19q0k6o5M5L2O5K10j70k09k25L56J27n17M38l20J33J52
5313F5k3j55J51M37m00j47J7j51J08l7J55j29R1M3p1j55M44j65j74J29k42J93
5335a6j16L8J48p8j79J77L1J2M5k29P4j1K11j91R7l5K1K22p4pj30j11K18k66J74
$$ plain form
5360 25 273 111 63 35 190 -272 210 10 91 107 398 -318 -23 108 -168 131 228 51 -76 -44 -53 78 -33
5383 -33 77 226 -96 -110 180 296 84 125 -45 -12 127 -37 150 18 164 -21 124 55 -97 48 231 107
5405 107 -86 -231 163 -106 95 5 128 18 20 37 79 50 232 -78 -57 116 -48 113 200 -5 -41 -177 73
5428 73 -95 -169 -38 11 -92 -173 93 -333 -118 -50 -149 -16 -189 43 -199 297 -102 -71 -48 -12 124 -149 218
5451 218 147 -61 -21 -92 157 39 23 -131 -160 -153 103 -146 -215 -91 -124 12 -64 -39 -197 41 -50 -74 77 -131
5475 -131 -162 -105 -83 178 -271 95 -30 -12 -115 -6 -234 -34 -4 -224 -104 71 -131 -150 -221 -195 -117 -183 48
5498 48 121 70 201 322 263 26 168 -74 -4 83 -128 133 2 388 -128 23 271 256 -416 69 -163 -60
5520 -60 197 75 -23 52 236 -21 196 62 -147 111 88 21 120 186 -59 -41 -83 -73 65 -11 78 203 -36 87
$$ packed form
5360B5K48j62m8k8J55m62M82k00Q1J6K91p16K95J31k76K99R7j77j27L2rJ31j11
5383c3J10J49l22j4K90J16k12M1j70L3J39j64J87j32J46j85J45o9j52J45J83j24
5405A07j93j45L94k69K01r0J23j10KJ7M2k9J82l10K1J73j64J61Q7k05l6j36K50
5428G3j68p4J31M9j03q1K66m26K15O8r9J33j73K32k42M96l99L1K3L6J36k73L67
5451B18p1k08M0p1K49j18j6j54k9PK56k49o9J24l3J36p6K5j58K38r1k4J51k08
5475a31l1N7K2K61m49L66j25J8j03J09k28K00L0k20J20J75k02j9p1K6P8o6K31
5498D8P3n1J31J21n9k37J42k42P0Q7k11K61j31L86n16J51K48j5o72M85k32J03
5520f0K57j22r8P5J84k57K17j34k09K58k3o7R9O6k45J8m2J0J38p6Q9J25k39J23
$$ plain form
5544 87 400 11 -174 -62 -35 -41 365 -4 -161 379 -132 -202 -187 54 -286 -38 38 -105 -96 -235 -150 -190 -199 -27
5568 -27 -182 117 4 -147 -51 -246 383 5 0 -128 -240 -211 116 -4 59 -325 -7 -1 -174 -3 -146 -115 -14
5591 -14 -138 -50 -215 155 -66 -56 -247 332 -112 -222 -5 -141 -238 -29 84 -95 85 26 -81 -142 -49 180
5613 180 -42 -431 38 16 -177 -93 -22 103 -174 123 25 143 -100 -223 -159 -22 -29 -148 83 -115 -299 41
5635 41 -200 -245 -54 25 -34 206 -130 13 11 293 139 157 234 407 365 65 -118 90 189 4 102 207 -111 264
5659 264 52 227 99 -140 3 -346 -272 104 70 -38 273 -156 -9 157 -176 -16 12 -21 -224 34 63 -71
5681 -71 170 27 29 31 -81 -55 -181 41 14 -119 20 231 -2 -57 -167 -46 -279 157 -142 50 -244 211 -155
5704 -155 26 153 201 66 -19 -31 -158 139 5 -194 -215 -47 -375 138 299 80 59 -284 -141 127 -216 276
$$ packed form
5544H7L13l89j85J12K7oM06l69j57N40n11p0J5K41l40K48P6j43Rj39Q5m0rJ72
5568b7j55K99j13j51R6j95O29l78nj28j12K9L27j20O3l84L18Oj73J71j43L1J01
5591a4j24Q8j65L70k21J0j91N79m44j10K17j36r7K09J13j79J80n9j07o1R3K29
5613A80k22l89M69k2j93Q4P1J25k77K97r8J18k43j23O4J37pj19K31j98j84L40
5635D1k41m5J91P9n9K40l36J43kK82j54J8P7J73m2l00j83K08R9j85R8J05l18L75
5659B64k12J75j28k39J43l49P4L76l4j08L11m29J47J66l33J60K8l3k03K58K9j34
5681g1K41j43KKj12K6j26K22k7j33J39K11k33n5j10J21k33M36k99J92k94M55l66
5704a55J81J27M8j35q5j2j27K97j34j99k1J68l28N13J61k19k1l43J43K68l43M92
$$ plain form
5726 276 -82 -261 67 -211 29 -130 -70 74 330 -160 88 -28 202 57 88 217 37 -111 -83 185 -8
5747 -8 95 -3 -137 189 -177 65 -124 22 70 -84 -20 -108 -77 -30 143 -102 47 -157 148 -14 -93 224 -121
5770 -121 69 29 299 110 61 468 -20 -106 -227 143 78 265 242 -175 -166 161 -208 -134 283 39 -162 104 306
5793 306 171 -318 299 58 81 315 66 78 107 435 228 -194 36 -164 130 108 -224 -237 -58 -69 -202 140
5815 140 -174 110 -178 -11 143 -140 -151 -57 -7 -177 221 -105 68 185 191 24 -126 88 -266 76 -156 35
5837 35 -144 -55 154 182 -117 114 100 -123 35 -171 -191 -254 129 -40 193 -131 -102 -41 -198 -266 -185 141 144 111
5861 111 -60 -261 -64 96 11 -90 -178 -226 239 -10 -89 390 246 -50 -138 -177 -133 -335 -194 117 -345 -25
5883 -25 128 21 107 -25 -49 57 100 -59 164 111 32 98 -42 -156 -58 169 29 -138 312 258 -150 -327 39
$$ packed form
5726B76l58j79L28k78K40j59O0J44K56m90K48j16K30j45L1J29j80j48K8K68j93
5747hJ03r8j34L26l66K42j89J46M8j54O4q8L1M7J73k45J49k04L05j62p9L17l45
5770a21J90m0K70j89m9M07m88q6j21L70o5J87k3m17RL27l69P4M17k44k01K66K02
5793C06j35m89O17k41K3K34k49J2K9L28k07m22K30k00K94k2l32j3J79j1j33L42
5815A40l14K84k88J67J54k83j1R4N0j70L98l26J73J17Oj67j50K14l54L42k32J91
5837C5j79Q9K09K8k99K31j4k23J58k06k0o3L83j69K33l24K9O1j57o8Q1L26Ll3
5861A11j71k01J97J60q5j01q8m8M65k49p9M79j44k96q8l9M4k02J41L11m62L20
5883b5J53j07Q6j32k4J06M3j59K23n3p9O6j40j14R8K27j40j67M50n4m08j77L66
$$ plain form
5906 39 89 -76 242 73 203 -84 -25 42 27 50 121 -230 16 184 123 114 191 -273 365 -20 -181 -51 -190 -19
5930 -19 16 -171 -188 1 -67 58 178 53 -93 144 -63 231 6 227 222 52 49 88 132 51 -222 15 13 236
5954 236 5 155 159 -128 -29 183 -175 -135 188 -100 -58 -119 179 53 123 157 86 -134 -329 -48 -70 41 196
5977 196 -9 -115 -69 -173 -306 0 -65 -167 -385 261 17 -218 92 100 47 237 215 -95 164 289 293 -17 -89
6000 -89 -324 -282 49 94 -107 -109 -261 92 -258 -228 -253 -17 -5 84 -423 -87 79 -60 42 -8 163 -159 36
6023 36 91 155 -43 -92 -81 -258 -139 -74 271 120 -23 -221 112 361 70 -89 61 -38 -16 282 47 -220 -306
6046 -306 86 -154 -100 41 -84 -245 -23 -95 71 229 -38 -356 11 209 -169 91 -4 -71 250 -69 69
6067 69 38 16 -68 -66 51 -436 105 74 -84 -95 -309 -329 143 34 -22 117 117 95 11 75 134 -9 36 17 -65 -92 36
$$ packed form
5906C9N0j65L18j69J30k87N9O7j5K3P1l51K46J68o1rP7m64O38l85j61J30j39J71
5930a9L5j87j7J89o8J25J20j25j46K37k07K94k25K21nj70lL9M4q1k73K37kK23
5954B36k31J50Mk87R9K12l58M0L23k88M2o1K98j26P0L4p1k20j95K81k2J11J55
5977A96k05j06M6j04j33L06o5j02k18O46k44k35L10Qn3J90k2l10K59J25Ml10p2
6000h9k35M2L31M5k01kj52L53l50L0k5K36J2Q9n07L36J66j39J02n0J71l22J95
6023C6N5O4j98m9J1j77J19O5L45j51j43j98L33K49k91j59J50r9K2K98k35k67q6
6046c06L92k40N4J41j25j61K22p2J66J58k67l18L67J98l78K60r5o7L21l19J38
6067F9l1k2q4KJ17m87N41l1j58j1k14k0M72j09n6J39%k2q4O4N9j43M5j9q2k7J28
$$ plain form
6094 36 -35 -5 12 -251 -82 -7 66 58 18 106 74 -245 284 -89 -243 71 125 188 -50 -147 -72 65 25 -85 -323
6119 -323 -267 -192 -216 288 -6 160 -236 -39 159 -144 -242 61 -86 57 197 87 -138 -116 290 -79 -52 124
6141 124 279 -255 55 12 -257 91 34 -122 106 -137 -158 -360 53 -57 -220 -8 136 -273 117 -170 23
6162 23 175 -43 -195 87 -187 185 -38 42 92 -164 -67 106 105 25 71 145 -29 324 4 74 -96 38 104 -211
6186 -211 -115 -43 109 -26 305 -166 -180 239 -17 255 178 -130 89 77 -197 211 81 255 191 70 274 68
6208 68 99 286 -146 60 184 -258 80 92 339 37 -28 -149 -154 -62 -208 -162 -19 178 -350 44 -112 -265 -186
6231 -186 76 -79 45 -134 3 70 -39 124 -314 59 -91 279 -40 121 54 -106 -101 -198 -74 -268 -10 -57
6253 -57 -70 276 -169 265 -21 -10 213 153 176 -251 -13 108 -12 64 -25 -25 160 -103 104 -295 113 100 -122
$$ packed form
6094C6p1L0J7k63J69P5P3qm0Q8l2l19N29l73j54L14N4O3k38r7P5J37m0j10k38
6119c23N6P5k4N04k94J66l96J97J98l03r8L03j47J43J40j10k25K2M06l69K7J76
6141A24J55n34L10m3k69L48n7j56K28k43k1k02M13j10j63K12J44m09L90k87J93
6162B3J52k18j52K82k74L72k23Q0N0k56R7J73jq0M6P4j74L53l20P0j70J34O6l15
6186b11R6P2J52j35L31m71j4M19k56K72p7l08K19j2k74M08j30J74o4j21K04k06
6208F8L1J87m32K06J24m42L38J2K47l02o5j21nR2j46M6J43J97n28L94j56j53P9
6231a86K62j55J24j79J37O7j09J63m38L73j50L70l19J61o7j60Nr7J24j94K58m7
6253e7j3L46m45M34k86J1K23o0K3m27K38J21j20P6q9%J85k63K07l99M08j3k22
$$ plain form
6276 -122 83 198 247 34 -72 165 24 30 2 -77 -265 197 163 179 -45 -172 56 197 191 53 190 74 315
6299 315 -3 22 -53 93 -22 438 -97 -159 132 63 201 36 196 -114 196 47 -23 78 -54 25 239 352
6321 352 -209 -40 -30 195 147 -163 -104 55 -11 16 61 -162 -29 5 -118 -17 93 214 -92 -60 -3 125 -90
6344 -90 45 -163 -20 -126 -81 -247 -235 25 -209 22 -65 44 167 -295 164 62 218 127 -102 -61 105 199
6366 199 -203 -191 -98 125 81 -183 -154 -34 -104 -79 -201 -75 139 -33 -183 305 49 97 32 314 -124 190 249
6389 249 40 -26 145 -213 58 61 7 52 314 176 -79 5 -229 -200 -148 -18 -102 14 -71 118 18 -28 27 -94
6413 -94 -237 -116 210 -124 274 34 -182 -10 -93 113 76 -77 65 134 299 109 -82 -37 172 99 -81 -159
6435 -159 184 -59 78 29 12 -108 119 148 -257 -81 10 305 -194 61 -138 -2 9 66 -57 -101 158 -169
$$ packed form
6276a22K05J15M9k13j06K37j41Ok8p9j88M62l4J6k24j27K28J41oj38J37j16K41
6299C15l18K5p5J46j15M60n35o2K91o9J38j65J60l10L10j49p0J01j32P9K14J13
6321C52n61J69J0K25m8l10N9J59o6K7M5k23J33L4j23J01J10J21l06L2N7J28k15
6344i0J35k08J43j06M5j66J2K60k34K31q7J09J23m62M59j02J56r1k29M1J66R4
6366A99m02J2R3K23m4k64K9J20p0K5j22J26K14j72j50M88k56M8o5K82m38L14N9
6389B49k09o6J71l58K71Ln4M5K62j38k55Q4k34K9N2J30q4J16q5J89j00m6N5j21
6413i4j43J21L26l34L98k40k16J72q3K06l7j53J42O9J65j90j91M5K09p3j80p8
6435a59L43k43J37m9j7j20K27K9m05J76R1K95m99K55j99J36J1N7j23m4K59l27
$$ plain form
6457 -169 204 114 264 -240 -247 -121 -83 -65 16 -197 111 -66 -178 -376 76 -218 159 170 35 64 -135 -15 142
6480 142 -60 190 177 237 -65 -144 -61 45 -62 -165 -112 -278 -5 -11 -4 -44 -274 47 27 58 283 145 -281 -211
6504 -211 -157 -13 45 -114 74 125 -16 -109 123 44 -296 -34 137 -65 -135 297 94 36 339 -98 323 239 50
6527 50 28 16 147 -168 55 95 -71 -195 -81 15 -102 272 -94 -55 -188 -43 -105 182 -158 -243 178 -90 -113
6550 -113 -287 -168 167 230 -199 43 79 -108 -63 101 -182 -73 79 164 34 126 -296 -20 -32 321 -115 51
6572 51 -296 -38 17 146 76 -205 -10 214 -356 -62 76 -47 28 -2 -147 -95 70 -20 301 -339 -75 -182
6594 -182 118 -117 167 -37 15 -66 -74 -162 151 -47 -118 166 -179 -38 164 200 242 2 -35 -67 63 78 112 -179
6618 -179 -312 -197 50 115 -48 219 -241 -113 5 -155 -502 20 -156 -145 68 14 -46 -52 31 10 -104 -22 45
$$ packed form
6457a69L73r0J50n04pJ26L8J8Q1k13L08j77j12j98M52k94L77J1j35K9j99J20J57
6480A42k02K50j3O0l02p9Q3J06j07j03N3j66K73oPm0k30L21k0L1K25j38m26P0
6504b11N4J44N8j59J88N1j41r3K32p9l40K62J71k02p0M32k03n8L03m37M21q4j89
6527E0k2j2J31l15K23M0j66j24J14R6j17L74l66L9j33J45o2K87l40q5M21k68k3
6550a13j74J19L35O3m29K42L6j87M5J64k83J09J52Q5j30R2m22K76j2L53m36J66
6572E1l47K58N5J29p0k81J95K24n70K94J38j23P5l0j45N2J65r0L21o40K64j07
6594a82L00k35K84k04N2q1qq8L13j98p1K84l45J41K02L6M2k40l7l2J30J5L4k91
6618a79j33J15K47O5j63K67m60J28J18j60l47N22j76J1K13n4o0oQ3k1j14Q2O7
$$ plain form
6641 45 22 9 51 -100 118 92 -78 168 -34 168 153 -159 119 -133 -202 -29 185 32 -176 62 -4 69 168
6664 168 -159 196 77 -45 -201 -251 -250 135 -31 -58 -328 51 -50 -34 -61 -74 37 -156 180 74 271 197 316
6687 316 -244 14 -189 399 -63 321 6 -43 213 42 71 -59 295 30 -28 -113 10 -97 13 376 -41
6708 -41 -56 144 -24 -67 262 66 96 -16 26 -78 109 -210 -102 -120 8 225 112 145 198 159 -263 261 201
6731 201 45 -172 62 -138 192 -82 -39 -14 237 11 -96 -153 42 -17 27 209 -273 20 -342 333 -15 245
6753 245 121 31 87 160 8 -34 -172 -204 126 -94 167 -347 -242 22 186 -57 120 159 -17 18 -30 32 -51
6776 -51 112 139 -189 85 270 328 -84 -53 -27 -152 -286 -52 -5 -1 206 -146 3 -232 -164 -238 41 -4 104 343
6800 343 -25 5 -94 337 35 155 86 -7 -62 107 -13 107 374 -17 134 -118 191 -98 4 -219 -44 -106
$$ packed form
6641D5k3j3M2j51K18k6j70K46k02K02j5l12K78k52o9J73K14j53k08K38o6P3R9
6664A68l27L55j19j22j56n0JL85j66k7k70L79j01J6k7j3J11j93L36j06J97p4J19
6687C16n60K58k03N88m62L84l15m9K56j71K9j30L54k65n8q5J23j07J10L63m17
6708d1j5K00j68m3L29j96L0j12M2j04J87l19J08j8J28K17j13L3N3l9m22N24o0
6731B01j56k17K34k00L30k74M3K5K51k26j07n7J95n9M4J82m82K93l62O75l48K60
6753B45j24r0N6P3j52m2j38l2L30k20K61n14J05K64J64k43J77L9j76L5m8O2q3
6776e1J63K7l28K74J85N8m12L1K6j25j34K34M7MK07l52J49k35O8p4K79m5J08K39
6800C43l68L0r9M31l02J20o9r3n5J69j20J20K67l91J51k52L09k89J02k23J75o2
$$ plain form
6822 -106 -64 -47 -22 160 99 322 -64 -10 28 -177 114 117 95 9 -155 -114 39 -95 224 43 -239 154 -118 105
6846 105 -16 32 -93 41 121 -203 154 -106 -76 -144 166 -57 -383 -12 139 -28 -96 200 -1 -63 -24 67 -54
6869 -54 76 22 210 151 -50 -12 -337 46 168 -87 -154 159 -110 -63 -124 -303 172 -147 -97 -157 -41 52 -234
6892 -234 -377 240 147 -292 -80 -77 94 158 -58 -109 210 -114 155 -61 -171 187 219 -161 248 130 68 143 -66
6915 -66 71 121 -261 -42 -131 134 -336 -36 -295 -154 92 -278 -38 200 -279 -43 148 -13 -64 -72 236 79
6937 79 -114 -80 15 209 -150 -76 -232 -187 -50 -132 92 -59 61 -169 -229 -120 65 165 185 -4 -16 -116 132
6960 132 140 16 -26 265 170 2 144 45 85 -92 22 121 101 -78 -6 -60 -299 140 -162 -103 -92 44 -93 -146
6984 -146 -207 -5 -47 -158 -136 107 118 -190 -96 -61 62 -389 -79 171 20 -268 23 -95 93 43 -351 -100
$$ packed form
6822a06M2J7K5J82o1K23l86N4L8k05K91Lk2q6j64M1J53j34L19j81k82L93k72K23
6846A05j21M8j25J34Q0l24L57k60L0o8L10k23l26L71J51j67o8K96k01o2L9R1j21
6869e4J30n4J88n9k01L8l25L83J22k55o7L13k69M7o1j79M75l19N0o0J16R3k86
6892b34j43O17r3m39K12LJ71O4k16n1L19l24K69k16j10L58L2l80M09j18o2P5k09
6915f6J37N0l82K19q9K65m70L00k59J41K46l70K40K38m79K36J91j61n1qL08j57
6937G9j93L4R5J94l59P4j56M5J37q2K24j51J20k30o0J09J85J00K0j89j2j00K48
6960A32Qj24m2K91r5j68J42r9M0j77J14R9k0j79P2n4k39M39l02N9J1J36j37n3
6984a46o1K02m2j11K2K43J1l08R4L5J23m51L10K50j51k88K91j18J88n0l94K51
$$ plain form
7006 -100 125 -96 310 -162 -68 -140 -73 79 -52 -18 6 -309 151 7 -136 -139 -296 -163 -25 -178 -97 -23 197
7029 197 -151 -10 79 -84 87 48 47 112 54 279 89 -25 16 -105 72 120 255 27 290 111 -70 -440 -40
7052 -40 -167 -137 62 127 5 -129 1 46 347 -121 -157 -175 10 -142 -52 78 -51 -44 33 -176 -176 -251 -84 39
7076 39 -75 -111 37 101 20 -87 110 68 -138 29 69 176 204 48 -95 -358 -5 -241 -141 -131 117 -161 180
7099 180 -215 72 -352 -206 -96 20 272 -109 69 207 27 -36 -44 -230 42 -36 -3 -37 -337 123 72 -43
7121 -43 154 -124 32 12 61 152 326 55 187 -224 -55 -61 146 147 -68 -87 -62 3 -100 239 -192 -194 -405 -78
7145 -78 165 37 32 246 111 138 455 -63 -44 131 320 22 -326 -70 -20 -177 148 261 -32 244 -209 174
7167 174 -104 217 18 -53 274 -138 -233 -92 -223 209 179 170 -96 50 -135 10 -164 -26 50 197 -23 3
$$ packed form
7006a00K25k21M06m72R4p2O7J52j31L4K4l15M60j44j43lj57J33J38j53Q1P4K20
7029A97l48J41Q9j63J71l9jO5n8K25j90j14M1j21J77M8J35k28K63j79j81l70M00
7052d0j27L0J99O5j22j34J30M5L01m68l6j8J85j52R0J30j29PP7k09%p5J67J23
7076C9j14l6J48O4q1j07J97m2k06J67M0J07K8j56j43k63L53k36J00J0K48k78L41
7099A80l95K87m24J46J10J16K52l81J78J38j80o3qj86K72p8L3l4l00M60n1j15
7121d3J97k78J56k0M9R1J74k71J32m11J69oK07Jk15j9K5O5j03L39m31kk11L27
7145g8K43j28nK14j35K7L17n18J9J75J89k98l48K56N0j57L25J13k93K76m53L83
7167A74k78L21j99p1L27m12r5J41j31M32l0rk66J46j85J45j74J38P6J47k20K6
$$ plain form
7189 3 217 145 -14 -138 6 -126 9 -75 104 76 110 -34 79 -39 -392 -50 40 -95 -153 226 59 109 140
7212 140 -191 -121 -111 -48 314 -290 -161 49 59 104 1 -236 135 -155 -34 2 -59 122 85 212 194 -80 191
7235 191 -108 306 -87 -230 -73 -73 168 -167 -8 -63 122 -119 118 -163 -37 87 99 -24 -120 163 101 -119
7257 -119 136 36 -165 -127 147 -7 17 -36 -203 73 -36 415 235 14 324 -3 -50 -382 -228 126 -166
7278 -166 87 -66 129 67 185 -307 -134 -113 30 -92 56 287 126 94 30 -65 -14 -165 -22 238 38 256
7300 256 -78 101 -174 -88 -147 57 -31 35 -54 313 -108 -247 1 93 -268 177 115 178 -207 -40 -13 133 225
7323 225 3 -22 -72 -43 -157 234 14 -57 362 29 -174 -231 -172 33 104 332 13 -4 349 6 40 -46 143
7346 143 -85 -150 -10 266 27 203 149 154 -363 -18 -22 89 233 87 -174 31 187 -115 -377 -284 -86 -41 59
$$ packed form
7189CK14p2j59j24J44j32J35q4J79k8L4j44J13j18l53L42R0j35n8L79j67N0L1
7212A40l31P0J0O3L62o04J29K10J0M5j03k37L71k90J21L6o1J81l7J27j8k74K71
7235A91k99M14l93j43J57%K41l35J59n5J85k41K37k81J26J24J2j23r6K83o2k20
7257a19K55j00k01L8K74j54K4n3j67K76j09M51j80k21L10l27m7l32J54L54k92
7278a66K53j53J95o2J18m92J73K1J43j22J48K31j61l2o4r5N1j51J43K60k00K18
7300B56l34J79k75Q6n9K04q8O6q9L67m21j39K48R2l61M45o2O3l85J67K7J46R2
7323B25k22k5n0K9j14L91k20p1M19l33k03n7N9K05P1K28l19j7L53l43L4q6J89
7346A43k28o5J40K76k39J76n4Nn17L45mJ11J44j46k61K05J56l02k62R3J98M5J00
$$ plain form
7369 59 -117 -31 -275 140 -18 -226 -39 -55 15 -345 5 -39 -54 124 133 313 102 254 -44 -497 -54 326 -116
7392 -116 50 79 -188 -296 74 -74 -131 -89 195 -152 -226 -73 -81 265 269 -373 -62 -15 225 51 34 238 -328
7415 -328 50 179 36 -65 -72 -15 63 265 119 21 -166 206 114 -158 -256 57 -159 -253 -182 -26 1 61 -324 -214
7439 -214 -11 112 200 -218 -103 -119 182 47 167 -45 -210 -445 91 -88 4 -30 -174 63 -314 -22 102
7460 102 80 75 -97 -10 -298 -83 105 -247 280 -10 -217 -16 166 81 -117 126 -39 102 -157 413 -440 -126
7482 -126 -67 -484 -190 175 -29 27 -186 30 186 74 295 141 31 -107 -55 -279 249 -157 28 6 -315
7503 -315 183 -23 263 163 37 191 -37 -64 116 120 115 -188 -40 132 -269 -73 213 -132 135 17 -47 -103
7525 -103 -89 96 77 -126 -23 -142 -194 -171 55 11 -137 86 165 340 233 35 40 -254 80 87 -50 40 99 212
$$ packed form
7369E9j76Q6k44M15j58k08J87j6P0l60L50m4j5J78RJ80k11J52k98m53M43L80m42
7392a16J66K9k67j08L70j48n7M2K84l47p4J53qL46Mo42L11M7K40j74j7K04n66
7415c28L78J29j43j01pN7P8K02j46r8j87L72r2k72r8L13k16r4P1J56K7O0l85J10
7439b14K03J23Q8m18J15j6L01j35J20k12j65k35N36j79R2l4j44K37l77K92J24
7460A02k2nj72Q7k88K15J88l52N27k90k07K01J82q5j98K43j65J41k59N70q53L14
7482a26N9m17K94L65k04N6k13K16J56j12K21j54j10j38N2k24N28m06J85k2l21
7503c15M98k06K86j00j26J54k28k7J80Mnl03J48J72m01J96K86l45K67j18o4n6
7525a03J4J85j9k03J03j19n2K3K26m4j48K23P9J75j07j98Nk94L34Pj37R0N9J13
$$ plain form
7549 212 -4 51 -319 47 46 348 -30 128 202 -41 -52 -127 -99 204 -147 -114 181 239 -16 -196 15 205 -125
7572 -125 -370 -239 -105 -109 -147 -126 182 -29 92 167 -31 138 50 -191 -40 -10 -151 94 174 -79 -255 117 72
7595 72 -78 -155 172 72 0 -50 -106 -138 -71 218 -252 60 11 -10 -96 -1 151 -20 52 -275 -209 151 14 102 92
7620 92 75 -132 28 -227 24 -17 116 111 -63 106 365 142 -214 52 -146 -226 17 35 -238 89 44 -27 219
7643 219 -94 -109 82 -79 151 11 -116 219 -228 36 116 2 1 -78 -69 -6 93 -151 -39 -256 -22 174 -88
7666 -88 20 123 287 -154 95 182 -126 4 106 288 5 48 -20 167 233 84 129 186 72 -117 44 200
7688 200 35 -88 166 58 119 -64 82 200 -71 263 192 -75 122 88 -219 -116 146 -8 214 116 114 61
7710 61 208 232 -98 -95 118 224 8 125 81 -22 -183 -57 95 82 -41 -219 -197 -151 -97 385 -127 -19 -307
$$ packed form
7549B12k16N5l70L66jL02l78J58P4k43j1p5K8L03l51L3K95N8k55j80K11J90l30
7572a25k45J31J34ml8K1L08k11J21P5j98J69q8k41J51L0j41K45Q0k53j76L72m5
7595G2j50p7L27j00p2n0n6l2O7K89m70L12m9k1q6R5J52j71P2l27O6L60j37Q8j0
7620I2j7k07J60k55K51m1J33nj74J69K59k23l56K66j98q0K43J8k73L27m5p1K46
7643B19l13j5J91j61K30j40j27L35m47K64Q0j14jp9RO3R9k44J12k17K34J96k62
7666h8J08J03J64m41K49Q7l08J30J02J82k83M3o8J87O6j49M5N7j14j89J61J56
7688B00j65j23K54j08O1j83J46J18k71L34p1k67J97l4l07J03K62j54K22r8kn3
7710F1J47K4l30LK13J06k16J17m4j03j61J26J52j3j23j78K2M6N4M82n12J08k88
$$ plain form
7733 -307 -264 5 56 68 93 -54 -58 -4 -189 206 -138 52 46 97 180 30 -57 -129 107 -33 15 -137 -24 23 -100
7758 -100 256 -226 -203 -82 -156 23 85 -158 -161 52 -18 305 82 34 65 135 -5 188 83 21 98 178 39 142
7782 142 4 -163 -34 147 44 119 -68 83 7 26 294 98 90 128 38 -115 -48 27 358 137 -324 -96 208
7805 208 18 -186 -8 -92 108 -155 -141 -204 -91 169 -42 145 -340 186 -123 84 -111 231 52 84 131 -83
7827 -83 141 -33 351 94 -44 4 70 -88 -411 -182 -260 127 -71 -126 252 131 -149 -231 -10 160 41 -104
7849 -104 98 -18 -57 169 -3 47 60 49 51 144 138 9 46 -96 105 -141 -207 -225 185 -136 72 -122 148 -10
7873 -10 -283 119 -295 -224 63 -166 -136 60 26 -81 110 -172 23 43 -6 163 -197 12 4 -159 115 133 -3
7896 -3 -143 -109 -55 -57 -160 -350 305 -47 186 -181 -70 -48 27 337 -130 -153 -7 70 260 -235 -96 147 -2
$$ packed form
7733c07M3K69N1J2K5j47mN4j85L95l44J90oN1Q3j50q7p2K36j40M8j52J13M7j23
7758a00L56m82K3J21p4J79O2k43lK13p0L23k23m8L1P0j40J93j05o2P7Q0j39J03
7782A42j38j67J29J81j03P5j87J51p6J9K68j96qL8r0j53O7P5L31k21m61K28L04
7805B08j90k04J78q4K00k63J4o3J13K60k11J87m85N26l09K07j95L42j79L2M7k14
7827h3K24j74L84k57j38M8O6j58l23K29p8L87j98n5L78j21k80q2K21J70j19j45
7849a04K02j16l9K26j72N0J3j1KR3oj29L7j42K01k46o6j8M10l21K08j94K70j58
7873a0k73M02m14P1K87k29L0J96l4j07J91k82J95K0m9J69l60K09qj63K74J8j36
7896cj40L4N4kj03j90O55l52K33l67J11K2P5L10m67k3J46P7J90m95J39K43j49
$$ plain form
7919 -2 -28 -104 -121 153 -116 77 102 118 -64 -20 60 58 48 59 -89 8 93 67 33 254 152 -253 192 226 -90 271
7945 271 62 20 -30 41 92 -122 -133 12 191 17 242 -90 120 2 61 102 -87 58 -13 -32 -28 45 -158 -275
7969 -275 -62 184 -53 -271 65 -70 113 -124 -50 257 -410 291 176 178 -196 -47 -93 -208 15 -3 127 -145
7991 -145 -53 -83 -229 -224 -49 126 -37 -164 10 -161 -11 -116 -33 295 -268 -136 -105 -111 268 61 -78 -69 -173
8014 -173 249 -16 97 58 -113 -203 36 69 69 -81 -47 -243 124 201 -89 6 90 48 57 57 -287 -32 165 77 12
8039 12 57 60 124 -66 -14 123 269 -229 85 1 145 -125 58 111 -62 34 145 46 -158 -145 -226 106 -61 78
8063 78 82 107 103 109 -89 -203 59 331 129 72 -114 19 -155 -197 33 41 307 -225 275 96 -260 -75 -211 104
8087 104 333 4 89 -52 -91 -128 60 -53 34 88 229 -297 168 15 224 249 26 -141 -58 23 119 79 -207
$$ packed form
7919bk6p6j7K74k69J93K5J6j82M4Q0kj0J1j48R7Q5k6l4K21j02m05M45L4l16L61
7945B71k09m2n0P1N1k14j1J45J79j74K25l32K10j18N9M1j89J45p1j9MP3k03j17
7969b75K13K46k37k18L36j35J83k37P4L07o67P01j15Kl74J49m6j15K23j8J30k72
7991a45R2l0j46NJ75J75j63j27J74j71J50j05Q3L28n63J32L1oL79k07j39Rj04
8014a73M22k65J13l9j71r0K39L3%j50L4j96L67P7k90R5Q4m2R%l44K55J97q8o5
8039A2M5LO4j90N2J37J46m98L14q4J44k70J83N3j73R6J11r9k04J3q1L32j67J39
8063G8MK5mOj98j14K62K72k02n7j86J33j74m2K30QK66n32N00j79l56J85j36L15
8087A04K29l29Q5j41l9l7J88j13Q7N4J41n26M65j53K09K5k23j67Q3Q1R6m0k86
$$ plain form
8110 -207 150 -115 75 94 -83 -279 31 -264 19 218 -113 4 -65 121 -194 26 -162 219 -31 109 -156
8131 -156 -244 13 -63 -56 -25 -63 309 -114 359 143 -196 -39 37 29 49 -153 -15 66 227 20 251 22 200 -85
8155 -85 291 81 -75 -34 -64 88 136 -1 153 49 -155 -126 -140 -72 185 176 -108 -63 -280 64 -226 124 -33
8178 -33 281 15 112 23 139 65 -91 149 -43 51 20 -9 130
$$ packed form
8110b07L57k65J90J9j77j96L10k95K83J99l31J17o9J86l15K20j88L81k50J40k65
8131a56q8K57p6PL1l8L72m23M73k16l39J57P6qK0k02J38Q1J61k07K31k29J78k85
8155h5L76k10j56M1l0J52M8j37J54j04k04K9j4O8K57rk84M5k17L44k90L50j57
8178c3L14k66R7q9J16p4j56K40j92R4l1k9J39
8191A30
$$ Imaginary data points
##PAGE= N=2
##DATA TABLE= (X++(I..I)), XYDATA
$$ plain form
0 0 0 0 0 0 0 0 0 0 0 0 8 -8 8 -8 9 -16 16 -17 24 -25 32 -37 41 -49 56 -63 72 -82 94 -104 119 -134 150
33 150 -166 187 -207 230 -257 286 -316 349 -388 429 -475 527 -584 648 -725 809 -907 1025
51 1025 -1166 1338 -1556 1843 -2235 2812 -3744 5512 -10109 50037 99938 60158 73546 77698
65 77698 73168 59633 63664 55003 50304 44008 33483 25362 34250 27473 9457 9127 21094 11839
79 11839 4806 14597 18406 10130 15205 21218 19284 23737 31311 23112 20578 32233 32227 21422 24676
94 24676 29372 19350 14773 19554 14567 9620 12830 6140 -3611 4940 9811 -3935 -7748 3658
108 3658 1015 -8576 -3690 1468 -2924 -3392 -3114 -7387 -2475 4382 -5146 -11620 1250 2763 -10179
123 -10179 -6771 5052 -1528 -9006 -2867 -127 -3723 -1339 -2421 -7927 -4006 -1227 -10534 -11452 -2959
$$ packed form
0@%%%%%%%%%%Qj6J6j6J7k5L2l3M1m9N7o9P8r0J05j19J35j54J76j98K23k53K84
33A50l16L53l94M37m87N43o02O65p37Q17r04J002j111J232j373J534j716J932
51A025k191K504k894L399m078N047o556R256j5621O0146M9901l9780J3388M152
65G7698m530j3535M031q661m699o296j0525q121Q888o777j8016l30J1967r255
79A1839p033R791L809q276N075O013j934M453P574q199k534J1655oj0805L254
94B4676M696j0022m577M781m987m947L210o690r751Q551M871j3746l813J1406
108C658k643r591M886N158m392m68K78m273M912O857r528o474J2870J513j2942
123a0179L408J1823o580p478O139K740l596K384j082n506L921K779r307r18Q493
$$ plain form
138 -2959 -9394 -21230 -14750 -9754 -19076 -20670 -14431 -18655 -20982 -13224 -12910 -16475 -8061 -1950 -7776
153 -7776 -3212 9311 9066 6868 15170 17875 15107 21642 24815 17837 19059 25811 17157 10315 18466
168 18466 17946 5497 4657 9441 3450 185 3768 719 -2243 3664 2519 -1985 6083 11730 3410
183 3410 3989 15523 14451 8034 13498 17590 10994 10550 13737 9080 7651 10427 4264 -2021 4006
198 4006 3995 -6179 -5269 763 -5818 -9947 -3217 -3285 -8502 -3584 -845 -6240 -3550 3196 -738 -4058
214 -4058 3076 3242 -2097 2315 5452 -255 780 5285 660 -1329 5631 4091 -2939 2164 6270
229 6270 -1147 -2065 5379 1956 -3484 398 1460 -3692 -2210 -1087 -7742 -7390 -2521 -8385 -13335 -6801
245 -6801 -6120 -14675 -12288 -6149 -10287 -11965 -6241 -7275 -9828 -3403 -1704 -5952 -1732 3643 -1157
$$ packed form
138b959o435j1836O480M996r322j594O239m224k327P758L14l565Q414O111n826
153g776M564J2523k45k198Q302K705k768O535L173o978J222O752q654o842Q151
168A8466n20j2449q40M784n991l265L583l049k962N907j145m504Q068N647q320
183C410N79J1534j072o417N464M092o596m44L187m657j429K776o163o285O027
198D006j1j0174R10O032o581m129O730o8n217M918K739n395K690O746l934l320
214d058P134J66n339M412L137n707J035M505m625j989O960j540p030N103M106
229F270p417r18P444l423n440L882J062n152J482J123o655L52M869n864m950O534
245f801O81q555K387O139m138j678N724j034k553O425J699m248M220N375m800
$$ plain form
260 -1157 -1305 5793 4201 -1495 3479 5526 -634 564 4557 -641 -3082 1603 -216 -5341 -974
275 -974 990 -5036 -3842 2233 -1221 -3428 2614 2794 -806 4045 6324 1717 3816 9868 5256 1531
291 1531 8325 8307 2076 4072 7083 1837 950 4543 304 -3182 1522 21 -6676 -3482 -287 -6570
307 -6570 -7658 -2108 -5031 -9596 -4597 -3604 -8561 -5851 -2252 -6390 -6678 -846 -3035 -6516 -524 999
323 999 -4278 -1799 3222 -699 -2505 2883 1418 -2421 1661 2361 -3477 -1679 2253 -3251 -6068 -839
339 -839 -2445 -8151 -5232 -3628 -8911 -7666 -4102 -8041 -9529 -3918 -4593 -9339 -4816 -1525 -5733 -4966
355 -4966 342 -1940 -4282 949 582 -3664 -423 2344 -3055 -2826 1508 -2838 -5943 -1954 -2049 -7986
371 -7986 -5648 -3106 -8183 -8933 -4520 -6915 -9554 -4922 -4729 -9060 -5303 -1014 -5015 -5201 589 -229
$$ packed form
260a157j48P098j592n696M974K047o160J198L993n198k441M685j819n125M367
275i74J964o026J194O075l454k207O042J80l600M851K279m607K099O052m612l725
291A531O794j8o231J996L011n246q87L593m239l486M704j501o697L194L195o283
307f570j088N550k923m565M999R93m957K710L599m138k88N832k189l481N992J523
323I99n277K479N021l921j806N388j465l839M082P00n838J798L932n504k817N229
339h39j606n706K919J604n283J245L564l939j488N611o75m746M523L291m208P67
355d966N308k282k342N231l67m246L241K767n399K29M334m346l105L989r5n937
371g986K338K542n077p50M413k395k639M632J93m331L757M289m001j86N790q18
$$ plain form
387 -229 -2680 1700 3225 -342 1885 5929 1165 420 5944 3575 -369 3273 4456 -879 -313 3407
403 3407 -924 -3012 1354 -449 -4054 -978 778 -3562 -2144 2040 -995 -2519 3527 3365 -607
418 -607 3652 7002 2877 4192 8773 6315 5194 9943 9606 4836 9167 11281 6420 6245 10374 7266
434 7266 4550 7975 7624 2832 5198 7821 2699 2863 7063 4610 1765 6082 6533 2447 4967 8661
450 8661 5122 5021 10121 8382 5790 10176 11049 6527 9180 12229 8389 7145 11307 9338 5523 8645
466 8645 9606 4801 5344 7955 3552 2036 5912 3774 -642 2765 4308 -912 -272 3451 248 -1628
482 -1628 2750 1701 -1610 2101 3331 -1024 -158 4040 379 -1529 2632 1517 -2617 -261 1325
497 1325 -3488 -3904 -309 -3509 -6905 -3875 -4473 -9010 -7129 -5760 -10201 -10406 -6792 -9504 -12695 -8773
$$ packed form
387b29k451M380J525l567K227M044m764p45N524k369l944L642J183n335N66L720
403C407m331k088M366j803l605L076J756m340J418M184l035j524O046j62l972
418f07M259L350m125J315M581k458j121M749l37m770M331K114m861j75M129l108
434G266k716L425l51m792K366K623n122J64M200k453k845M317M51m086K520L694
450H661l539j01N100j739k592M386Q73m522K653L049l840j244M162j969l815L122
466H645R61m805N43K611m403j516L876k138m416L407J543n220O40L723l203j876
482a628M378j049l311L711J230m355Q66M198l661j908M161j115m134K356J586
497A325m813m16L595l200l396L030n98m537J881J369m441k05L614k712l191L922
$$ plain form
513 -8773 -8649 -12344 -9555 -6893 -10414 -10018 -4906 -6653 -9009 -4263 -2774 -5820 -3938 -938 -3674 -3574
529 -3574 396 -1483 -4269 -511 399 -4532 -3115 -108 -3763 -5951 -1887 -3435 -6884 -4124 -3064
544 -3064 -7265 -5937 -2567 -5071 -5661 -1177 -1842 -3726 664 2949 -493 1437 6081 4071 2424 7241
560 7241 7280 3947 6372 7714 4080 4233 7017 4103 1382 4453 3284 -476 1750 3517 -809 -448
576 -448 3945 1703 -381 4030 5786 2506 5040 8951 6595 6993 10967 10067 8050 11698 12218 8850
592 8850 10518 12751 8314 7316 10614 7935 4273 6709 6816 1560 1640 4333 856 -797 1392 -524
608 -524 -2931 -171 208 -3423 -1900 752 -2804 -3879 639 -254 -3717 -405 1424 -2189 -1208 2383
624 2383 245 -1612 1510 1254 -1212 965 2256 -1736 -1281 1294 -1827 -3379 59 -965 -5522 -3348
$$ packed form
513h773J24l695K789K662l521L96N112j747k356M746J489l046J882L000k736J00
529c574L970j879k786L758R10m931J417L007l655k188M064j548l449K760J060
544c064m201J328L370k504n90M484o65j884M390K285l442J930M644k010j647M817
560G241L9l333K425J342l634J53K784k914k721L071j169l760K226J767m326L61
576d48M393k242k084M411J756l280K534L911k356L98L974r00k017L648N20l368
592H850J668K233m437r98L298k679l662K436J07n256Q0K693l477j653K189j916
608e24k407K760L79l631J523K652l556j075M518q93l463L312J829l613R81L591
624B383k138j857L122k56k466K177J291l992M55K575l121j552L438j024m557K174
$$ plain form
640 -3348 -1047 -4611 -4570 -933 -2871 -4841 -1112 -105 -1613 947 3551 1351 2681 7163 5725 4455
656 4455 9026 9546 5381 7325 10659 6817 4785 7291 5081 1877 3279 3363 -487 -530 514 -2456
672 -2456 -2591 738 -843 -2614 922 2631 -59 2900 7441 5501 4065 9073 9921 7956 10188 12115
688 12115 9270 9406 11761 9057 8046 10494 7980 4409 6233 6900 3007 3325 6404 3038 600 4298
704 4298 5613 2132 3598 5790 3722 3618 6398 5042 4054 6190 4657 1627 3865 5688 1042 173
720 173 2834 -35 -3580 -443 -414 -4831 -4872 -2689 -5788 -6248 -3860 -5753 -8018 -5759 -6438 -9438 -7322
737 -7322 -5361 -9828 -11051 -7173 -8577 -11825 -8759 -7671 -11673 -10847 -7643 -8941 -9846 -7062 -7541 -8975
753 -8975 -6219 -4769 -6967 -5131 -2563 -6168 -6605 -2222 -3605 -7204 -5625 -4176 -8373 -8805 -5844 -7690
$$ packed form
640c348K301l564M1L637j938j970L729J007j508K560K604k200J330M482j438j270
656D455M571N20m165J944L334l842k032K506k210l204J402Q4l850m3J044k970
672b456j35L329j581j771L536J709k690K959M541j940j436N008Q48j965K232J927
688A2115k845J36K355k704j011K448k514l571J824O67l893L18L079l366k438L698
704D298J315l481J466K192k068j04K780j356r88K136j533l030K238J823m646q69
720A73K661k869l545L137K9m417m1K183l099m60K388j893k265K259o79l000K116
737g322J961m467j223L878j404l248L066J088m002Q26L204j298r05K784m79j434
753h975K756J450k198J836K568l605m37M383j383l599J579J449m197m32K961j846
$$ plain form
769 -7690 -10315 -8467 -9012 -11109 -8841 -7408 -9638 -8689 -5883 -7391 -7998 -3120 -3090 -6360 -3581 -897
785 -897 -3494 -3660 -804 -1553 -4435 -2883 -2846 -4585 -3704 -3005 -6037 -5991 -3035 -4855 -5957 -2411 -1981 -4935
803 -4935 -2517 890 -595 -1014 2674 2864 678 3342 5246 3141 3956 5424 2782 2732 5472 3708
819 3708 1042 3475 3932 -47 1308 4488 1786 220 3082 2890 449 2565 3950 1696 1535 3285
835 3285 1758 816 2988 1222 -1768 -130 967 -3059 -2352 116 -2427 -5374 -2523 -1681 -4193 -2926
851 -2926 -1141 -2792 -2484 -79 -792 -1413 1263 1044 -1562 1007 2678 -424 -890 1815 -716 -3439
867 -3439 -796 -377 -3818 -3649 -2115 -4008 -4626 -2265 -3021 -4866 -2438 -1858 -3856 -1990 798 -1822
883 -1822 -1880 1104 248 -1898 267 1642 -2344 -2269 -56 -2220 -3813 -2068 -3085 -5531 -3692 -3615 -6297
$$ packed form
769g690k625J848n45k097K268J433k230R49K806j508o07M878L0l270K779K684
785h97k597j66K856p49k882J552L7j739Q81O99l032M6K956j820j102L546M30k954
803d935K418L407j485m19L688J90k186K664J904k105Q15J468k642n0K740j764
819C708k666K433M57l979J355L180k702j566K862j92k441K116J385k254j61J750
835C285j527r42K172j766k990J638J097m026P07K468k543k947K851Q42k512J267
851b926J785j651L08K405p13o21K676k19k606K569J671l102m66K705k531k723
867c439K643M19l441J69J534j893o18K361p56j845K428N80j998J866K788k620
883a822n8K984q56k146K165J375l986P5K213k164j593J745j017k446J839P7k682
$$ plain form
900 -6297 -5124 -3408 -5473 -6612 -3328 -3307 -5502 -2909 -1406 -3732 -3552 -475 -1318 -2976 -683 -789
916 -789 -2655 -746 334 -2118 -1601 889 -1403 -2469 818 597 -1768 -374 1597 -477 -669 1783
932 1783 657 -1312 738 1221 -689 -157 1391 -933 -1185 905 -319 -2197 376 1028 -2035 -1160
948 -1160 1329 -564 -1118 1331 1068 -753 1106 2373 245 925 2742 810 -343 2225 1357 -997
964 -997 908 1163 -1795 -1014 792 -1017 -2388 233 6 -2075 -59 1431 -468 232 2562 1467
980 1467 511 3739 3500 1885 3392 4601 2158 2470 4731 2958 818 3365 3027 87 962 2382
996 2382 -14 -578 1496 -294 -1164 697 1109 -1315 135 1783 -603 -533 1925 1124 -702 1525 2099
1013 2099 -487 304 2457 312 -502 1681 366 -971 436 684 -1670 -515 880 -1165 -1971 606
$$ packed form
900f297J173J716k065j139L284K1k195K593J503k326J80L077q43j658K293j06
916g89j866J909J080k452N17K490k292j066L287k21k365J394J971k074j92K452
932A783j126j969K050M83j910N32J548k324k52K090j224j878K573O52l063Q75
948a160K489j893n54K449k63j821J859J267k128O80J817j932j153K568q68k354
964i97J905K55k958P81J806j809j371K621k27k081K016J490j899P00K330j095
980A467r56L228k39j615J507J209k443L12K261j773k140K547l38k940Q75J420
996B382k396n64K074j790q70J861M12k424J450J648k386P0K458q01j826K227N74
1013B099k586P91K153k145q14K183j315j337J407K48k354J155J395k045q06K577
$$ plain form
1029 606 99 -1684 212 850 -1452 -810 1678 -206 -1063 1578 876 -1103 754 1606 -599 80 1943
1046 1943 -42 -946 1610 1257 -1135 593 1918 -427 -466 1729 503 -973 1335 1376 -1151 294
1062 294 1916 -743 -563 1680 332 -1375 1192 1350 -1117 486 2140 -192 -913 1887 1035 -906
1078 -906 1412 1828 -37 574 2175 442 -467 2172 1603 -178 1828 2506 0 893 2719 601 -31
1095 -31 2382 1685 -188 1644 2343 119 749 2301 778 -127 2120 1312 -546 972 1971 -560 83
1112 83 1625 519 -812 1318 854 -1407 394 1499 -729 -810 1242 -88 -1176 868 526 -1558
1128 -1558 -98 1108 -1441 -1592 767 -803 -2316 -342 -506 -2914 -1396 -225 -2461 -2808 -433 -1860
1144 -1860 -3164 -1351 -1123 -3195 -2268 -728 -2573 -2733 -630 -1504 -3313 -1224 -634 -2231 -1509 -274
$$ packed form
1029F06n07j783J896O38k302O42K488j884q57K641p02j979J857Q52k205O79J863
1046A943j985r04K556l53k392J728J325k345l9K195j226j476K308M1k527J445
1062B94J622k659J80K243j348j707K567J58k467J603J654k332p21K800q52j941
1078i06K318M16j865O11J601j733r09K639n69j781K006O78k506Q93J826k118o32
1095c1K413o97j873J832O99k224O30J552j523r05K247q08j858J518R99k531O43
1112H3J542j106j331K130m64k261J801J105k228q1K052j330j088K044l42k084
1128a558J460J206k549j51K359j570j513J974j64k408J518J171k236l47K375j427
1144a860j304J813K28k072R27J540j845j60K103q74j809K089N90j597P22J235
$$ plain form
1160 -274 -1874 -2683 -211 -1395 -3056 -1569 -712 -2855 -2395 -342 -2123 -2727 -689 -1265 -3126 -1293
1176 -1293 -456 -2401 -1949 -74 -1022 -2043 350 -45 -1708 180 1259 -637 -266 1917 616 -941
1192 -941 1285 1510 -569 662 1999 -212 73 1894 362 -977 1050 1333 -612 378 1496 -470
1208 -470 -193 1789 857 -574 1318 2148 21 1026 2722 1044 743 2728 1952 321 2262 2531 655
1225 655 1318 2372 1024 178 2446 1278 -320 1141 1693 -707 3 1688 -180 -968 1270 790 -1060
1242 -1060 299 877 -828 -236 1382 57 -676 1028 628 -1268 146 1062 -1114 -910 953 -711
1258 -711 -2154 -3 -391 -2618 -1697 -749 -2968 -2889 -1234 -2428 -3759 -2137 -1844 -3686 -2795 -1391 -3074
1275 -3074 -2707 -963 -1983 -3408 -1142 -649 -2869 -2474 -670 -2032 -2184 -560 -1597 -2878 -869 -861 -2902
$$ packed form
1160b74j600q09K472j184j661J487Q57k143M60K053j781o04K038n76j861J833
1176a293Q37j945M52J875r48j021K393l95j663J888J079j896L71K183j301j557
1192i41K226K25k079J231J337k211K85J821j532j339K027K83j945R90J118j966
1208d70K77J982r32j431J892Q30k127J005J696j678l01J985p76j631J941K69j876
1225F55O63J054j348q46K268j168j598J461N52k400P10J685j868p88K238m80j850
1242a060J359N78j705N92J618j325p33J704m00j896J414R16k176K04J863j664
1258g11j443K151l88k227R21R48k219P9J655j194j331J622K93j842Q91J404j683
1275c074L67J744j020j425K266M93k220L95J804j362j52J624j037j281K009Qk041
$$ plain form
1292 -2902 -2267 -800 -2385 -3169 -876 -1513 -3305 -1444 -756 -2545 -2213 -18 -1295 -2057 -152 -470 -1742
1309 -1742 -470 95 -1334 -715 744 -1045 -1547 498 62 -1859 -190 209 -1556 -1332 672 -508
1325 -508 -1440 41 95 -1354 -528 962 -876 -488 1171 137 -1031 1195 1194 -995 -100 1405 -296
1342 -296 -494 1423 877 -578 878 909 -650 590 1458 -190 -64 1832 772 -263 1708 1510 -1117
1359 -1117 185 2100 131 -498 1526 247 -1235 -48 345 -980 -128 176 -1349 -1398 454 -73 -1810
1376 -1810 80 243 -1724 -980 1041 -964 -1809 -43 -74 -2121 -832 347 -1391 -1614 -404 -1361 -1862
1393 -1862 -321 -849 -2527 -1420 -268 -2439 -1523 462 -780 -2476 -93 226 -1601 -345 861 -588
1409 -588 -993 421 -342 -897 554 71 -1704 -541 815 -1319 -1463 966 -338 -1976 -69 729 -1173
$$ packed form
1292b902O35J467j585p84K293o37j792J861O88j789L32K195j277p62J905l18j272
1309a742J272N65j429O19J459j789n02K045m36j921J669L99j765K24K004j180
1325e08r32J481N4j449Q26J490j838L88J659j034j168K226jk189Q95J505j701
1342b96j98J917n46j455J456L1j559J240Q68j648J26J896j060j035J971j98k627
1359a117J302J915j969o29K024j279j482J187L93j325Q52L04j525m9J852n27j737
1376a810J890J63j967P44K021k005q45J766l1k047J289J179j738k23J210r57n01
1393a862J541n28j678J107J152k171R16J985j242j696K383L19j827J256J206j449
1409e88m05J414p63n55J451m83j775J163J356k134j44K429j304j638J907P98j902
$$ plain form
1426 -1173 -913 666 -217 -787 792 664 -680 543 959 -979 392 1414 -84 -397 1476 364
1442 364 -1311 649 1058 -803 -612 1365 452 -246 1336 1346 -5 1181 1700 778 1231 2740 1075
1459 1075 318 2553 2236 521 1770 2853 668 289 2350 1673 102 1679 1771 143 857 2101 827
1476 827 969 2233 1284 540 2434 2870 588 1513 2799 763 383 2651 1901 -167 933 1119 -294
1493 -294 354 944 -261 -431 703 -169 -1068 745 906 -1178 -248 1458 220 -752 1559 1087 -353
1510 -353 674 1497 -178 118 938 -344 -697 798 -318 -1541 446 391 -1790 -1257 443 -718 -1467
1527 -1467 -3 289 -1523 -215 800 -331 -812 456 -205 -974 651 128 -1072 -99 345 -1357 -954
1544 -954 632 -654 -2230 -651 -44 -1914 -1114 -250 -979 -1438 -232 -742 -1484 225 -150 -1591 -780
$$ packed form
1426a173K60J579q83n70J579j28j344J223M16j938J371J022j498l13J873j112
1442C64j675J960M09j861J91J977r13o98J582J0j351J186N19r22M53J509j665
1459A075p57K235l17j715J249J083k185l79K061o77j571J577R2j628P14J244j274
1476H27J42J264r49p44J894M36k282R25J286k036l80K268p50k068J100J86j413
1493b94O48N90j205j70J134q72q99J813J61k084R30J706j238r72K311m72j440
1510c53J027Q23j675K96Q20j282l53J495j116j223J987n5k181N33J700j161p49
1527a467J464K92j812J308J015j131m81J268o61p69J625n23j200R73M44j702M03
1544i54J586j286j576J579O07j870Q00Q64p29m59J206n10p42J709l75j441Q11
$$ plain form
1561 -780 419 -931 -962 833 -7 -1549 290 763 -666 -483 1278 -110 -737 930 678 -580 1135
1578 1135 880 -637 393 1746 305 -341 1102 497 -866 551 1517 -458 -306 994 126 -628 1146
1595 1146 1043 -497 404 1305 -250 635 1822 779 192 2072 1522 304 1128 2030 381 -42 1999
1612 1999 828 -285 947 718 -545 -329 377 -551 -112 758 -84 -939 683 763 -791 49 1725 161
1630 161 -9 1792 1187 -123 1441 1521 211 900 1496 295 -221 1026 -169 -984 449 314 -1298
1647 -1298 -878 252 -1099 -1597 68 34 -1689 -508 277 -965 -358 784 -359 -1105 594 348 -685
1664 -685 360 357 -1013 -549 990 -403 -1356 282 26 -1312 -781 460 -1008 -1222 -94 -551 -1630
1681 -1630 -215 28 -1448 -314 379 -945 -679 1017 -80 -1037 463 770 -747 -72 1317 121
$$ packed form
1561g80J199j350l1J795q40j542J839M73j429J83J761j388o27J667k52j258J715
1578A135k55j517J030J353j441o46J443o05j363J417R66j975J52J300q68p54J774
1595A146j03j540R01R01j555Q85J187j043n87J880n50j218Q24R02j649m23K041
1612A999j171j113J232k29j263K16P06r28M39Q70q42q55J622Q0j554Q40J676j564
1630A61j70J801o05j310J564Q0j310O89N96j201n16J247j195q15J433j35j612
1647a298M20J130j351m98J665l4j723J181P85j242O07J142j143p46J699k46j033
1664f85J045lj370M64J539j393r53J638k56j338N31J241j468k14J128m57j079
1681a630J415K43j476J134O93j324K66J696j097r57J500L07j517O75J389j196
$$ plain form
1697 121 -300 1230 379 -298 925 1173 -584 357 1058 -69 -311 1136 354 -754 469 874 -593
1714 -593 -12 984 120 -730 972 687 -692 771 1157 107 448 1685 401 132 1482 1540 -84 1031
1732 1031 2066 530 791 1847 762 -168 1153 986 -513 292 1273 -89 -59 812 144 -593 699
1749 699 493 -512 666 1326 155 20 1349 653 -488 1022 1181 -78 242 1243 32 -214 1114
1766 1114 69 -723 569 399 -1347 -540 625 -908 -1230 413 -336 -1484 -479 -118 -1360 -801 91
1783 91 -1122 -1396 -171 43 -1682 -345 -134 -1344 -795 45 -752 -1644 -156 -401 -1638 -632 -198 -1547
1801 -1547 -1663 -123 -1300 -1735 -454 -775 -2209 -1114 -187 -1567 -1610 -406 -1089 -1739 -137 -593 -1555
1818 -1555 -769 120 -1253 -1368 204 -224 -1246 -181 -69 -1323 -806 342 -1150 -1015 288 -531 -1510
$$ packed form
1697A21m21J530q51o77J223K48j757R41P01j127k42J447p82j108J223M05j467
1714e93N81R96q64q50J702k85j379J463L86j050L41J237j284k69J350N8j624J115
1732A031J035j536K61J056j085r30J321j67j499Q05R81j362L0Q71o68p37J292
1749F99k06j005J178O60j171j35J329o96j141J510J59j259L20J001j211k46J328
1766A114j045p92J292j70j746Q07J165j533l22J643p49j148J005L61j242N59Q92
1783I1j213k74J225K14j725J337K11j210N49Q40p97q92J488k45j237J006M34j349
1801a547j16J540j177m35J281l21j434J095R27j380m3J204o83o50J602m56r62
1818a555P86Q89j373j15J572m28j022J065J12j254N17J148j492J35J303q19r79
$$ plain form
1835 -1510 -446 58 -1358 -750 461 -710 -803 381 51 -676 141 881 -637 -97 947 -342 -436 661
1853 661 534 -560 462 1013 -332 31 1059 180 -255 1227 805 -23 518 1281 -189 251 1363 539
1871 539 32 1384 715 -208 960 1188 -5 221 1378 552 47 1138 970 -265 385 1089 166 141
1889 141 1439 341 -291 938 878 -436 243 1345 -122 -24 1229 701 -775 851 723 -575 -192
1906 -192 872 -266 -417 769 91 -849 165 389 -989 -247 507 -373 -604 242 -233 -1185 74 260
1924 260 -900 -687 94 -351 -879 480 -130 -791 -117 170 -1070 -547 606 -142 -718 160 -18 -1174
1942 -1174 -297 57 -706 -728 320 -602 -975 162 10 -735 -95 299 -847 -642 707 104 -845 587
1960 587 616 -400 199 967 -137 -193 1077 501 -266 1016 977 3 312 831 104 159 1332 475 -55 1020
$$ packed form
1835a510J064N04j416O08J211j171r3J184l30p27Q17P40j518N40J044j289r4J097
1853F61j27j094J022N51j345L63J028q79m35J482m22q28N41P63j470M40J112q24
1871E39n07J352o69r23J168K28j193K26J157q26n05J091j68j235O50P04r23k5
1889A41J298j098o32J229o0j314O79J102j467R8J253n28j476J626j28j298L83
1906a92J064j138j51J186o78r40J014K24j378P42P54q80k31Q46m75r52J259J86
1924B60j160K13P81m45n28J359o10o61O74K87j240N23J153p48n76Q78j78j156
1942a174Q77L54p63k2J048r22l73J137j52p45O40L94j146K05J349o03r49J432
1960E87K9j016N99P68j104n6J270n76p67J282l9r74L09N19p27N5J173q57n30J075
$$ plain form
1980 1020 1271 46 376 1623 420 -444 1135 829 201 815 990 292 664 1960 684 444 1878
1997 1878 1177 284 975 1813 707 692 1664 709 286 1414 1016 86 658 1169 435 423 1647 195 -22
2016 -22 812 958 -263 708 1149 -120 22 895 579 -140 908 974 -276 253 1085 -145 -110 745 -92
2035 -92 -573 730 428 -768 313 945 -567 -1124 426 84 -998 91 -66 -974 -357 345 -637 -894
2053 -894 104 -533 -999 244 -162 -1070 -213 454 -299 -912 463 344 -672 -189 398 -406 -378 389 -189
2072 -189 -524 609 343 -366 154 728 -812 -199 778 -304 -770 627 501 -577 -49 927 231 57
2090 57 990 132 60 1031 710 -162 1027 1113 187 226 1555 906 150 937 1442 -52 457 1562 861 66
2110 66 883 734 153 852 871 235 597 1277 104 469 1426 593 -208 603 1142 311 355 1118 334 249 789
$$ packed form
1980A020K51j225L30J247j203q64J579l06o28O14J75o98L72J296j276k40J434
1997A878p01q93O91Q38j106j5R72r55m23J128l98r30N72N11p34j2J224j452k17
2016b2Q34J46j221R71M41j269J42Q73l16p19J048O6j250N29Q32j230L5Q55q37
2035i2m81J303l02j196J081O32j512n57J550l42j082J089j57r08O17P02r82k57
2053h94R98o37m66J243m06r08Q57O67p53o13J375j19j016M83N87q04K8P67n78
2072a89l35J133k66p09N20N74j540O13R77j082m66J397j26j078N28R76o96j74
2090E7R33q58p2R71l21q72J189Q6r26L9J329o49p56P87N05j494N09J105p01p95
2110F6Q17j49n81O99J9o36L62O80j173L65R57q33q01Q11N39q31M4P63p84q5N40
$$ plain form
2131 789 671 94 790 732 -218 276 915 -16 -480 716 183 -896 42 942 -375 -413 410 -146 -830 47
2151 47 -20 -1047 -199 -300 -482 -469 -84 -559 -1003 13 -337 -1150 -109 139 -907 -1202 50 -337 -1067
2170 -1067 -387 -401 -1113 -864 -309 -1179 -916 -413 -1094 -1658 -620 -608 -1502 -929 264 -1114 -1302 -226 -238
2189 -238 -1554 -849 -370 -853 -579 76 -412 -562 130 -489 -858 112 -69 -901 -543 73 -693 -1233 205
2208 205 -290 -913 -364 231 -1085 -632 211 -217 -522 255 -24 -290 196 408 -532 -142 838 -48 -496 936
2228 936 443 -1130 -59 524 -563 -269 511 -378 -458 385 173 -190 332 486 -492 -255 1064 436 -457
2247 -457 340 481 -768 -223 776 -325 -633 -56 -63 -482 54 71 -311 -49 395 -248 -196 860 63 -670
2267 -670 169 712 -164 -182 717 -230 -917 202 202 -571 157 -99 -638 -36 187 -516 -782 109 -281 -1072 2
$$ packed form
2131G89j18n77O96n8r50M94O39r31m64J196n33j079R38R00j317l8Q23n56o84Q77
2151D7o7j027Q48j01j82J3L85m75m44J016l50q13J041K48j046k95J252l87p30
2170a067O80j4p12K49N55q70K63N03o81n64J038J2q94N73J193j378j88J076j2
2189b38j316P05M79m83K74O55m88j50O92o19l69R70j81q32L58O16p66n40J438
2208B05m95o23N49N95j316M53Q43m28l05P77k79k66M86K12r40L90R80q86m48J432
2228I36m93j573J071N83j087K94P80q89q0Q43k12l63N22J54r78K37J319o28q93
2247d57P97J41j249N45R99j101l08N77pm19N36J7l82K62M44o43N2J056p97p33
2267f70Q39N43q76j8Q99r47o87J119%p73P28k56n39O02K23p03k66Q91l90p91J074
$$ plain form
2288 2 608 -216 -401 475 144 -690 451 762 -295 -179 189 -199 -224 417 -444 -653 192 132 -1161 -214
2308 -214 213 -480 -908 255 -90 -980 -7 146 -316 -304 510 -552 -40 346 -298 -368 307 393 -610 -298
2328 -298 234 -716 -882 -192 -120 -883 -312 -93 -943 -401 -29 -392 -770 307 -364 -922 -112 58 -969 -639
2348 -639 313 -809 -999 -316 -386 -1298 -583 -394 -1060 -840 -177 -944 -1475 -164 -188 -1132 -490 78 -900 -972
2368 -972 64 -743 -683 -6 -252 -1269 -706 -83 -679 -822 -245 -669 -1246 -682 -334 -1209 -504 210 -974
2387 -974 -1020 317 -422 -960 92 61 -693 -178 263 -213 -365 132 107 -575 -48 338 -404 -125 84 -748
2407 -748 -705 402 -139 -659 148 737 -542 -132 467 48 -290 445 440 -379 195 758 -77 -11 778 -117 -107
2428 -107 405 295 -403 63 692 -375 -478 704 43 -294 446 252 -453 155 361 155 -334 268 56
$$ packed form
2288BO06q24j85Q76l31q34J141L11j057J16L68l88k5O41q61k09Q45o0j293R47
2308b14M27o93m28J163l45q90R73J53m62J2Q14j062N12L86o44p0O75Q6j003L12
2328b98N32r50j66O90P2p63N71K19q50N42L72l63l78J077o71n58Q10J70j027L30
2348f39R52j122j90O83p0r12P15J89o66K20O63p67n31J311k4r44O42N68r78p2
2368i72J036q07O0O77k46j017N63O23n96j43N77m24n77N64L48q75P05P14j184
2387i74m6J337p39n38J052l1p54N15M41m76j52M97k5o82N27L86p42K79K09q32
2407g48M3J107n41n20Q07N89j279M10N99m19l38P35nq19N74N63q35O6P89q95J0
2428a07N12j10o98M66O29j067j03J182o61l37P40j94p05O08K06k06m89O02k12
$$ plain form
2447 56 -382 384 388 -558 -190 568 -488 -380 277 -126 -534 -138 486 -652 -273 413 -388 -545 701 -158
2467 -158 -760 529 219 -396 -255 345 -437 -436 231 65 -345 11 492 -407 -327 320 -32 -361 266 216 -495
2488 -495 102 680 -239 201 743 105 164 698 672 38 527 824 132 333 857 613 188 855 370 -48 525
2509 525 945 341 267 1189 457 164 1080 1417 335 734 1095 498 753 1302 1034 519 1280 1216 522 756
2529 756 1194 787 405 1341 733 181 954 1163 502 568 1301 485 444 1056 871 283 1094 1190 -59 567 1223
2550 1223 203 -209 581 753 -285 420 1004 -161 -142 584 249 -397 337 394 -587 -25 331 -451 -330
2569 -330 108 -238 -530 -23 -12 -713 -414 111 -1050 -446 -159 -387 -918 -295 -387 -853 -420 -412 -1094 -1295 -292
2590 -292 -480 -1059 -427 -266 -870 -783 -374 -980 -917 -161 -860 -1161 -316 -282 -825 -254 -195 -639 -980 -222 -493
$$ packed form
2447E6m38P66Mr46L68P58j056J08O57m03m08L96O24j138L79O86q01j57J246q59
2467a58o02J289l10o15J41O00p82JO67j66m10L56M81q99Q0O47l52l29O27n0p11
2488d95N97N78r19M40N42o38N9N34k6o34M89K97o92K01N24k44m25O67m85m18N73
2509E25M20o04p4R22p32k93R16L37j082L99L61n97K55N49k68n15P61o4o94K34
2529G56M38m07l82R36o08n52P73K09o61O6P33q16m1O12j85n88Q11R6j249O26O56
2550A223j020m12P90J72j038P05N84j165J9P26l35o46P34N7r81N62L56p82J21
2569c30M38l46k92N07J1p01K99N25j161O04K87k28n31O23r2m66M33Qo82k01J003
2590b92j88n79O32J61o04Q7M09o06O3P56o99l01Q45L4n43N71N9m44l41P58k71
$$ plain form
2611 -493 -711 -262 -204 -956 -477 82 -616 -806 46 -174 -778 46 344 -313 -300 453 17 -169 397 269 -440
2632 -440 208 627 -261 -98 581 63 -223 370 324 -151 369 392 186 -32 563 332 -42 692 582 -74 145
2653 145 633 -59 78 637 276 -76 672 433 -154 103 827 75 149 328 406 -294 592 163 -584 -84 319
2674 319 -288 -672 404 52 -524 -78 369 -446 -226 391 -8 -703 93 -142 -525 -149 -34 -620 -431 113
2694 113 -647 -908 189 -311 -675 -533 -29 -768 -914 126 -582 -1180 93 -357 -630 -511 -192 -753 -564
2713 -564 -216 -501 -913 4 -258 -1259 -376 189 -659 -743 -6 -295 -872 -47 -69 -620 -759 182 -462 -720
2733 -720 194 -461 -673 170 -285 -670 -139 411 -651 -428 380 -155 -315 -207 395 -726 -291 346 -272
2752 -272 -235 206 -89 -588 -20 325 -519 -250 172 -25 -458 250 194 -387 -58 310 -277 -44 345 -164 -670
$$ packed form
2611d93k18M49N8p52M79N59o98j90Q52k20o04Q24K98o57J3P53m36j86N66j28p09
2632d40O48M19q88J63O79n18k86N93m6m75N20K3k06k18N95k31l74P34j10o56K19
2653A45M88o92J37N59l61l52P48k39n87K57P24p52P4J79P8p00Q86m29p47N00M03
2674C19o07l84J076l52n76M46M47q15K20O17l99o95P96k35l83L76J15n86J89N44
2694A13p60k61J097n00l64J42N04p39j46J040p08n98J273m50k73J19L19n61J89
2713e64L48k85m12R17k62j001Q83N65q48q4P37k89n77Q25k2n51j39R41o44k58
2733g20R14o55k12Q43m55l85N31N50j062K23Q08n35j60J08O02j121M35O37o18
2752b72L7M41k95m99N68L45q44K69M22j97m33P08n6n81L29L68n87K33L89n09n06
$$ plain form
2773 -670 258 442 -763 22 115 -1049 -493 242 -477 -480 -57 -4 -560 -153 357 -373 -553 65 -73 -500 49
2794 49 -318 -511 -116 27 -445 -733 39 -293 -559 300 345 -598 -267 508 145 -708 97 -189 -569 238 239
2815 239 -224 -129 253 -265 -159 435 -75 -500 12 284 -441 -87 537 -129 -505 405 372 -329 376 601 -225
2836 -225 442 665 117 409 836 516 -100 560 638 17 69 663 299 -140 536 649 -115 -38 840 -147 62
2857 62 578 -71 43 462 463 169 718 908 437 119 900 679 55 860 954 424 417 772 -72 348 483 34
2879 34 -377 22 296 -201 18 581 114 -118 463 398 -55 345 802 -359 -29 601 476 67 433 193
2899 193 -81 293 117 -236 -83 578 -83 -756 258 353 -598 331 438 -108 -139 614 105 156 547 316 33
2920 33 586 567 -120 37 603 7 -372 223 234 -244 -309 285 -145 -197 454 242 -308 219 548 117 665 851
$$ packed form
2773f70R28J84j205P85R3j164N56P35p19lM23N3n56M07N10p30j80O18j38m27N49
2794D9l67j93L95J43m72k88P72l32k66Q59M5r43L31P75l63q53Q05k86l80Q07J
2815B39m63R5L82n18J06N94n10m25N12K72p25L54O24o66l76R10l3p01P05K25q26
2836b25O67K23n48K92M27l20o16O60P8o21N2N94l64m39O76J13p64P7Q78r87K09
2857F2N16o49J14M19Jk94N49J90m71l18P81k21o24Q05R4n30pL55q44M20J35m49
2879C4m11L99K74m97K19N63m67k32N81o5m53M00M57j161L30O30j25m09L66k40
2899A93k74L74j76l53J53O61o61o73J014R5r51R29J07n46l1P53n09N1L91k31k83
2920C3N53j9o87J57N66n96l79N95J1m78o5N94m30n2O51k12n50N27L29m31N48J86
$$ plain form
2942 851 -144 58 834 459 -339 528 793 -103 48 974 61 76 393 -13 -282 87 488 97 125 453 134
2963 134 388 993 535 275 606 608 -161 174 888 293 -207 532 14 -154 181 350 -365 -254 69 -258 -198
2984 -198 607 16 -418 443 569 -215 34 748 244 -224 247 622 -611 139 209 -392 -336 89 -245 -534
3004 -534 252 80 -561 -154 37 -32 -164 451 42 -300 424 614 -18 118 608 171 -100 615 380 -339
3024 -339 159 381 -322 56 648 -320 -354 196 312 -401 628 681 185 397 844 383 219 782 737 314 785
3045 785 852 171 531 1021 262 392 616 730 -89 387 610 -41 34 636 437 149 521 593 203 408 1221
3066 1221 255 547 1226 738 369 919 853 326 172 547 183 -79 692 362 -198 320 593 -282 177 567
3086 567 -4 -80 799 281 -140 549 255 -243 32 542 -41 -231 279 -31 -447 -30 -64 -335 -288 95 -444
$$ packed form
2942H51r95K02P76l75p98Q67K65q96J51R26r13J5L17m06k69L69M01l91K8L28l19
2963A34K54O05m58k60L31Kp69L35P14n95n00P39n18j68L35J69p15J11L23l27O0
2984a98Q05n91m34Q61J26p84K49P14n04m68M71L75j233P50P0o01N6M25l34k89
3004e34P86j72o41M07J91o9j32O15m09l42P24J90o32J36M90m37k71P15k35p19
3024c39M98K22p03L78N92r68l4N50J16p13J029N3m96K12M47m61j64N63m5m23M71
3045G85O7o81L60M90p59J30K24J14q19M76K23o51P5O02j99k88L72P2l90K05Q13
3066A221r66K92O79m88l69N50o6n27j54L75l64k62P71l30n60N18K73q75M59L90
3086E67n71p6Q79n18m21O89k94m98K75N10n83j90N10l10m16M17l4k71M7L83n39
$$ plain form
3107 -444 -351 -174 -342 -727 11 -18 -615 -83 72 -267 -562 -120 117 -804 -250 209 -575 -191 63 -406 -590
3128 -590 -366 -179 -840 -224 83 -375 -462 -18 -235 -576 120 -174 -266 -14 -22 -241 -84 377 -259 -142 146
3149 146 11 -395 -209 223 -326 -306 197 40 -713 98 -51 -112 128 458 -34 -64 540 348 -150 352 432
3170 432 -456 256 532 187 -288 373 77 -372 -20 538 -198 -97 512 -44 -242 308 -95 -190 -69 565
3190 565 -140 179 435 86 -178 328 -27 -158 153 -79 -561 -646 364 -104 -385 -148 -343 -383 -337 41 -769
3211 -769 -305 -49 -427 -790 -312 -20 -536 -579 -256 -490 -363 -100 -331 -892 -162 -67 -880 -671 -56 -799 -899
3232 -899 -326 -496 -776 -484 -360 -670 -575 -27 -729 -365 -192 -481 -904 27 171 -631 -391 -60 -503 -328
3252 -328 120 -327 -448 -95 -98 -287 -265 190 51 -559 143 -100 -233 -33 272 -290 -66 527 -101 -135 556
$$ packed form
3107d44R3J77j68l85P38k9n97N32J55l39k95M42K37r21N54M59p84L84K54m69j84
3128e90K24J87o61O16L07m58q7M44k17l41O96k94r2K52qk19J57M61o36J17K88
3149A46j35m06J86M32n49K0N03j57p53Q11j49o1K40L30m92l0O04j92m98N02Q0
3170D32q88P12K76l45m75O61k96m49L52N58p36J01O09n56j98N50m03r5J21O34
3190E65p05L19K56l49k64N06l55j31L11k32m82q5J010m68k81K37j95m0M6L78q10
3211g69M64K56l78l63M78K92n16m3L23k34J27K63k31n61P30R5q13K09O15p43j00
3232h99N73j70k80K92J24l10R5N48p02L64J73k89m23R31J44q02K40L31m43J75
3252c28M48m47j21L53lj89K2M55j39o10P02k43j33K00L05n62K24N93o28l4O91
$$ plain form
3273 556 284 -193 311 427 130 -28 544 372 72 603 663 257 524 451 333 14 800 605 153 560 639
3294 639 72 -9 516 202 329 398 500 -25 435 598 286 398 577 356 199 486 625 200 808 340 69
3315 69 151 739 230 -124 335 300 -326 263 514 -82 46 440 0 -230 221 83 9 290 377 -172 -114 422
3337 422 35 -277 160 281 -178 337 351 13 -310 329 34 -227 157 137 -434 -300 -66 -362 -323 276 23
3358 23 -500 -119 -130 -640 -216 -4 -110 -455 108 -251 -490 294 -53 -274 -76 41 -146 -207 473 -338 -291
3379 -291 -61 17 -216 -163 163 -384 -180 57 64 -467 5 -56 -642 -106 4 -463 -398 140 237 -402 106 -13
3401 -13 -20 117 583 107 85 523 314 -49 136 426 -145 19 275 33 -8 487 -188 -248 -107 507 -184 -17
3423 -17 302 134 -332 442 43 -242 -39 418 284 268 623 294 -65 529 556 204 240 618 132 -174 707
$$ packed form
3273E56k72m77N04J16k97j58N72j72l00N31O0m06K67p3j18l19P86j95m52M07P9
3294F39n67q1N25l14J27O9J02n25M60J63l12J12J79k21j57K87J39m25O08m68k71
3315F9Q2N88n09l54M59l5o26N89K51n96J28L94m40k30M51j38p4K81Q7n49N8N36
3337D22l87l12M37J21m59N15J4l38l23O39k95k61L84k0n71J34K34k96L9N99k53
3358B3n23L81j1n10M24K12j06l45N63l59k39P84l47k21J98J17j87o1O80q11M7
3379b91K30P8k33N3L26n47K04K37Pn31M72o1n86N36J10m67O5N38R7o39N08j19
3401a3pJ37M66m76k2M38k09l63J85K90n71J64K56k42m1M95o75o0J41O14o91J67
3423a7L19j68m66P74l99k85K03M57j34j6L55l29l59N94K7l52L6L78m86l06Q81
$$ plain form
3444 707 169 -49 535 491 -2 400 427 270 -87 809 119 -161 157 136 22 124 357 -15 95 550 488
3465 488 68 258 217 260 149 252 83 -87 357 388 -182 116 366 -72 -71 408 48 -230 203 307 -627 -196
3487 -196 285 -349 -45 -87 -15 -383 106 146 -142 -84 -118 -198 -224 271 51 -402 128 -136 -670 -381 12 -223
3509 -223 -280 -72 -295 -412 -438 28 -451 -493 -16 -360 -567 -117 -122 -615 -280 -81 -794 -629 160 -753 -378 -120
3531 -120 -427 -680 89 -88 -642 -390 -195 -225 -235 148 -144 -488 -33 -38 -500 -248 157 -192 -811 -78 122
3552 122 -462 -281 207 -303 -339 -132 68 -347 284 -66 -338 47 324 -115 25 476 273 -290 159 573
3572 573 -140 29 149 134 74 402 -152 -176 -192 168 -99 141 -45 129 -450 -16 126 -355 75 448 -153
3593 -153 -13 364 193 -18 92 59 -340 30 -28 -353 -15 31 -155 -66 264 92 -597 124 165 -234 -188 276
$$ packed form
3444G07n38k18N84m4m93M02K7j57l57Q96o90k80L18k1j14J02K33l72J10M55o2
3465D88m20J90m1M3j11J03j69j70M44L1n70K98K50m38JM79l60k78M33J04r34M31
3487a96M81o34L04m2P2l68M89M0k88N8l4q0k6M95k20m53N30k64n34K89L93k35
3509b23n7K08k23j17k6M66m79m2M77l44k07M50nm93L35J99p13J65P89r13L75K58
3531a20l07k53P69j77n54K52J95l0j0L83k92l44M55nm62K52M05l49o19P33K00
3552A22n84J81M88n10l6K07K00m15O31l50k72L85K77m39J40M51k03n63M49M14
3572E73p13J69J20j5o0L28n54k4j6L60k67K40j86J74n79M34J42m81M30L73o01
3593a53J40L77j71k11J10l3l99L70n8l25L38M6j86Q9L30j72o89P21M1l99M6M64
$$ plain form
3615 276 106 -137 2 171 -518 -288 137 -318 -413 -122 -485 -684 151 -429 -623 -763 40 -402 -645 8
3635 8 -496 -512 28 126 -224 -348 -244 -370 -471 -211 -611 -889 -100 -151 -844 -661 -426 -564 -730 -445 -696 -676
3657 -676 -424 -277 -335 -243 -338 -584 -333 236 195 117 87 183 -175 -12 185 257 -173 -149 86 -354 -175 177 -281
3680 -281 -45 148 -112 -212 451 174 -32 -90 347 -120 -44 571 402 -115 75 63 -18 -52 276 -20 -32 -21
3702 -21 34 -101 147 -54 -353 -236 85 -193 -137 324 212 -245 209 627 -16 44 800 48 174 303 328 -33
3724 -33 223 329 -641 -39 173 -126 -150 21 -159 -210 220 155 -239 -101 153 35 4 198 -125 -556 77 50
3746 50 2 -228 190 -501 -277 -202 -428 -684 -90 -189 -489 -335 -227 -307 -663 -221 -253 -238 -154 107 -134 -478 183
3769 183 -380 -493 -120 59 -376 -134 -143 -234 -678 102 -176 -295 107 97 -164 230 486 132 178 404 292 17
$$ packed form
3615B76j70k43J39J69o89K30M25m55r5K91l63j99Q35n80j94j40Q03m42k43O53
3635Hn04j6N40R8l50j24J04j26j01K60m00k78P89n1o93J83K35j38j66K85k51K0
3657f76K52J47n8R2r5k46K51N69m1p8l0R6l58J63J97P2m30K4K35m40J79L52m58
3680b81K36J93k60j00O63k77k06n8M37m67P6O15j69n17J90j2q1l4L28k96j2J1
3702b1N5j35K48k01k99J17L21k78N6M61j12m57M54M18o43O0P56p52J26J29K5l61
3724c3K56J06r70O02K12k99k4J71j80n1M30o5l94J38K54j18l1J94l23m31O33k7
3746E0m8k30M18o91K24P5k26k56N94r9l00J54J08q0l56M42l2J5Q4K61k41l44O61
3769A83n63j13L73J79m35K42rr1m44P80k78j19M02j0k61L94K56l54M6K26j12k75
$$ plain form
3791 17 -11 293 -75 49 308 47 -120 213 101 -239 -142 -33 -347 -89 137 303 -34 451 380 -170 151
3812 151 495 -27 -48 614 205 -210 415 344 -207 -14 138 168 -202 88 -11 -146 -69 206 -29 223 303 0
3834 0 220 633 336 -233 494 489 163 301 476 -43 221 425 256 -249 173 240 -233 -279 217 -222 -344 -48
3856 -48 -190 -518 -306 47 -189 -1 50 -167 -294 -214 -191 -369 -29 -113 -204 -259 -107 -70 -336 -288 66 -501 -101
3879 -101 -64 -595 -444 -171 -98 -387 -237 -340 -384 -54 -36 -322 -190 -24 -371 -236 45 -32 -231 62 266 -27
3901 -27 -117 108 303 -66 421 384 -162 59 125 303 32 819 16 -330 -67 142 -160 -156 87 -58 -138 -61 3
3924 3 -319 525 68 -475 308 582 -89 171 204 374 228 503 481 220 130 269 327 93 496 681 -40 407
3946 407 359 -28 -243 265 -230 -113 232 5 -126 -352 203 -210 -136 320 124 -319 2 90 -202 207 618
$$ packed form
3791A7k8L04l68J24K59k61j67L33j12l40R7J09l14K58K26J66l37M85p1n50L21
3812A51L44n22k1O62m09m15O25p1n51J93J52L0l70K90r9j35P7K75k35K52Q0l03
3834@K20M13k97n69P27nl26J38J75n19K64K04j69n05M22O7m73m6M96m39j22K96
3856d8j42l28K12L53k36J88N1k17j27Q0K3j78L40q4r1n5J52L7k66M8L54n67M00
3879a01L7n31J51K73P3k89J50j03m4L30J8k86J32J66l47J35K81p7j99K93K04k93
3901b7r0K25J95l69M87l7n46K21O6J78k71P87q03l46K63K09l02MK43j45q0P7O4
3924Cl22Q44m57n43P83K74o71K60L3J70j46K75k2k61r0J39N8k34M03J85p21M47
3946D07m8l87k15N08m95J17L45k27j31k26N55m13P4M56j96m43L21Q8k92M09M11
$$ plain form
3967 618 178 10 320 136 78 473 524 -141 -57 -12 -251 -147 -163 -14 -615 -222 -139 -566 -50 -32 -265 -449
3989 -449 -63 -266 -207 156 243 -422 34 -83 -238 -508 236 -326 -279 390 89 -114 -251 194 -90 -106 147
4010 147 -291 -749 15 -174 -577 -570 -7 -527 -419 28 19 -487 -130 -65 -248 -23 360 3 -369 -28 -8 -366
4032 -366 -87 29 -21 22 77 -225 -191 124 -211 -225 124 43 65 -463 357 -66 -138 132 84 -204 -36 157 -264
4055 -264 75 -25 -50 -148 332 91 -381 32 287 54 -276 251 163 102 232 220 -76 67 74 220 188 -236 -66
4078 -66 -252 347 41 -338 -185 206 -11 -176 297 162 -100 28 148 -45 -74 71 263 15 488 379 -162
4099 -162 122 44 -135 3 248 -9 -101 200 304 -333 257 114 27 102 -94 -16 -278 -135 -113 -215 -114 144
4121 144 -247 49 169 143 -257 -177 -147 -219 -197 -117 -459 -464 -114 -45 -160 -107 -185 -371 -130 -66 -126 -488 -139 -219 -137
$$ packed form
3967F18m40j68L10j84n8L95N1o65Q4M5k39J04j6J49o01L93Q3m27N16J8k33j84
3989d49L86k03N9L63Q7o65M56j17j55k70P44n62M7O69l01k03j37M45k84j6K53
4010A47m38m58P64j89m03PN63n20J08M47rn06L57O5j83K25L83l57l72L41K0l58
4032c66K79J16n0M3N5l02L4L15l35j4L49q1K2n28Q20m23p2K70m8k88J68J93m21
4055b64L39j00k5r8M80k41m72M13K55k33l30N27q8o1J30j2k96J43PJ46l2m24J70
4078f6j86N99l06l79J53L91k17j65M73j35k62J28J20j93k9J45J92k48M73j09n41
4099a62K84p8j79J38K45k57r2L01J04o37N90j43q7P5j96P8k62J43K2j02J01K58
4121A44l91K96J20k6m00Q0L0p2K2Q0l42nL50O9j15N3p8j86K41O4o0l62L49q0Q2
$$ plain form
4146 -137 68 -244 -451 62 70 -76 -78 10 -89 -473 -275 -120 -314 -75 -41 -256 -223 53 -31 -227 -263 34 -142
4169 -142 -232 -122 -117 -163 -136 -121 29 -105 -78 -265 -230 114 -383 -166 -141 -150 -384 154 134 -90 -204 133 75 -42
4193 -42 -59 294 360 336 389 -151 256 392 73 79 356 461 39 148 404 175 175 873 448 125 544 415 143
4216 143 304 662 63 329 370 224 12 272 384 327 544 313 347 199 317 502 43 48 494 172 50 110
4238 110 212 -142 362 261 -216 71 -28 -122 -45 304 98 -154 177 94 32 -274 -41 -454 -154 -135 -42 -186
4260 -186 242 539 -56 -65 -97 -109 -186 379 -64 -294 61 110 -343 -68 211 -218 -197 198 -149 -89 -131 -104 -478
4283 -478 -238 108 -310 -51 27 -231 -557 -158 -113 -408 -517 -198 -342 -323 -170 139 -454 47 112 -395 112
4304 112 96 -241 -75 205 -20 -75 226 420 -29 51 253 360 109 214 252 -269 367 342 203 216 611 369
$$ packed form
4146a37K05l12k07N13Qj46kQ8r9l84J98J55j94K39L4k15L3K76q4j96l6K97j76
4169a42r0J10Nm6K7J5J50j34K7j87L5L44m97K17K5rk34N38k0k24j14L37n8j17
4193d2j7L53O6k4N3n40M07J36l19OK77J05m22J09K56k29%O98m25l23M19j29k72
4216A43J61L58n99K66M1j46k12K60J12n7K17k31L4j48J18J85m59NM46l22j22O0
4238A10J02l54N04j01m77K87r9r4P7L49k06k52L31q3o2l06K33m13L00J9R3j44
4260a86M28K97n95rl2j2p7N65m43k30L55M9m53K75K79m29K1L95l47O0m2K7l74
4283d78K40L46m18K59P8k58l26L99M5k95j09L19j44J9J53L09n93N01O5n07N07
4304A12j6l37J66K80k25n5L01J94m49Q0K02J07k51J05L8n21O36k5j39J3L95k42
$$ plain form
4326 369 216 384 428 300 281 614 196 8 368 -8 194 541 418 325 274 55 217 359 501 383 27
4347 27 489 220 127 267 224 296 -30 533 279 -34 201 289 -1 167 178 5 195 140 113 -5 -10 330 -138
4370 -138 -12 299 63 -258 239 18 -16 24 583 -85 242 169 129 -147 50 366 -86 128 247 -179 -110 362
4392 362 -337 -325 -51 -95 -403 -108 2 -15 -422 -79 -17 -327 -126 -56 -462 -256 40 -390 -142 -191 -349 -643
4414 -643 -255 -145 -59 -240 -2 -357 -339 -140 -100 -322 -197 -101 -387 -46 -17 -6 -256 330 4 -303 66 274
4436 274 81 203 344 248 -70 430 161 -124 130 140 -38 249 498 72 -123 -120 198 40 138 178 124 16
4458 16 -13 -99 45 221 373 -175 69 271 -67 -235 414 -196 58 148 132 -222 -42 102 -45 42 121 -27
4480 -27 -178 -81 247 -392 73 281 -64 -167 161 -84 74 125 471 -258 -28 208 -96 -434 374 54 -1
$$ packed form
4326C69j53J68M4j28j9L33m18j88L60l76K02L47j23r3n1k19J62J42J42j18l56
4347B7M62k69r3J40m3P2l26N63k54l13K35Q8k90J68J1j73J90n5k7j18nL40m68
4370a38J26L11k36l21M97k21l4M0N59o68L27p3m0k76J97L16m52K14J19m26O9M72
4392C62o99J2K74m4l08K95J10j7m07L43O2l10K01P0m06K06K96m30K48m9j58k94
4414f43L88J10Q6j81K38l55J8J99M0k22J25R6k86L41K9J1k50N86l26l07L69K08
4436B74j93J22J41r6l18N00k69k85K54J0j78K87K49m26j95LL18j58R8M0n4j08
4458A6k9q6J44J76J52n48K44K02l38j68O49o10K54R0j6l54J80J44j47Q7P9j48
4480b7j51R7L28o39M65K08l45j03L28k45J58N1L46p29K30K36l04l38Q08l20n5
$$ plain form
4501 -1 283 -340 -207 -163 111 -237 -55 186 18 -224 262 -68 -129 -269 68 -255 -386 -115 -112 -2 -273 -174
4523 -174 -294 -301 115 -132 -336 117 -99 -304 -133 -213 -237 25 99 -84 -80 42 -163 6 -175 -129 -49 -68 -96 -61
4547 -61 84 -69 25 -174 26 205 -195 -73 289 249 -77 357 107 53 287 225 39 -184 476 334 248 252 252
4570 252 44 -60 -151 135 -129 16 -95 -353 -67 90 -37 -311 209 25 -55 4 39 -133 109 143 93 105
4592 105 341 -90 -33 -37 354 29 -160 429 164 -124 468 -62 -135 76 128 -126 -159 -82 27 -101 367 78
4614 78 -63 211 -100 -90 34 234 159 -282 402 336 104 168 -12 -106 -61 113 -120 -10 77 -296 52 100 151
4637 151 -203 10 306 -91 39 -148 -14 14 -8 -86 -7 43 19 -249 29 0 -219 -294 -142 386 -150 -49 43
4660 43 58 -251 12 -25 -217 9 23 45 -269 61 46 109 339 22 -262 -111 -72 60 -259 302 86 -4 245
$$ packed form
4501aK84o23J33M4K74l48J82K41j68k42M86l30o1j40L37l23j31K71LJ10k71R9
4523a74j20pM16k47k04M53k16k05J71q0k4K62P4j83MJ22k05J69j81M6Q0j9k8L5
4547f1J45j53R4j99K00J79m00J22L62m0l26M34k50n4K34o2j86k23O60j42q6M%
4570B52k08j04r1K86k64J45j11k58K86J57j27k74N20j84q0N9L5j72K42L4n0J2
4592A05K36m31N7mL91l25j89N89k65k88N92n30p3K11N2k54l3P7J09j28M68k89
4614G8j41K74l11J0J24K00p5m41O84o6k32O4j80r4M5J74k33J10Q7l73L48M8N1
4637A51l54K13K96l97J30j87J34K8k2p8P9N0k4k68K78k9k19p5J52N28n36J01R2
4660D3J5l09K63l7j92K26J4K2l14L30j5O3K30l17k84J51L9J32l19N61k16r0K49
$$ plain form
4683 245 180 72 61 44 66 -205 93 7 -409 76 -198 -194 91 91 -155 82 320 48 -176 -99 -175 -53 -85 213
4707 213 20 -1 345 48 101 157 413 -110 176 265 192 25 139 278 143 233 -201 -33 156 164 -5 -45 57
4730 57 -11 -172 -24 332 -267 -55 -126 133 192 134 157 -102 171 392 108 54 -85 134 6 -41 96 -73 260
4753 260 200 291 160 56 27 71 58 121 -178 -87 94 55 -224 15 -133 44 50 -119 73 212 198 -35 -236 101
4777 101 -63 -354 -109 82 76 -478 237 -53 -156 329 -92 -104 3 -29 -32 103 26 -316 -283 183 -80 -215 -152
4800 -152 266 -171 -28 412 86 -62 56 104 -59 159 -70 -347 91 56 -209 -75 -57 441 -134 3 45
4821 45 -149 -76 221 162 -242 358 249 12 -217 338 -83 -85 -109 -7 203 -79 8 -99 61 215 -31 -55 131
4844 131 136 157 67 -12 110 -19 92 84 196 341 8 -36 2 227 -8 -87 404 383 -8 104 -27 105 -47 221
$$ packed form
4683B45o5j08j1j7K2k71K98q6m16M85k74MK85%k46K37K38k72k24P7p6J22l2K98
4707B13j93k1L46k97N3N6K56n23K86Q9p3j67J14J39j35R0m34J68J89Qj69m0J02
4730E7o8j61J48L56n99K12p1K59N9n8K3k59K73K21k84n4j39K19j28m7J37j69L33
4753B60o0R1j31j04k9M4j3O3k99R1J81l9k79K39j48J77Oj69J92J39j4k33k01L37
4777A01j64k91K45J91on54P15k90j03M85m21j2J07l2lJ35p7l42L3M66k63j35O3
4800a52M18m37J43M40l26j48J18M8j63K18k29k77M38l5k65J34J8M98n75J37M2
4821D5j94P3K97n9m04O00j09k37k29N55m21kk4J02K10k82Q7j07J60J54k46k4J86
4844A31NK1r0p9J22j29J11qJ12J45l33m4L8K25k35p9M91k1l91J12j31J32j52K68
$$ plain form
4868 221 24 25 232 13 173 188 305 70 142 22 -50 -3 215 -24 -44 35 135 149 96 -236 0 154 171 -149
4892 -149 -120 -151 183 -200 -270 39 -146 -6 30 -159 -364 85 10 -458 -109 10 -74 75 50 -82 -344 304
4914 304 89 -176 -123 15 66 97 248 -85 191 262 -22 -228 -131 -44 -284 -120 -34 -74 -67 -27 168 -216 -99 34
4938 34 52 -305 -134 -81 -309 -58 -171 -213 -283 4 -95 -16 -222 21 -251 -72 -229 -52 -136 -141 -241 -371 -262
4961 -262 -159 -305 -161 -112 -305 -137 186 -211 84 268 72 -28 -75 144 -154 122 69 -4 -70 128 130 244
4983 244 16 116 -102 129 222 -47 -129 61 137 179 -169 175 189 -124 120 -123 -214 10 -193 -72 -74 171 23
5006 23 -162 -45 -108 -239 -157 -11 -269 -90 -64 -11 22 94 43 -16 -2 66 37 -190 217 -121 -348 138 145 94 104
5031 104 170 0 -252 166 149 -97 -99 -50 140 -125 -96 3 16 -46 -62 -240 -94 7 -366 175 361 -397 -107
$$ packed form
4868B21j97JK07k19J60J5J17k35P2j20p2M7K18k39k0P9J00J4n3l32K36J54J7l20
4892a49K9l1L34l83p0L09j85J40L6j89k05M49p5m68L49J19q4J49k5j32k62O48
4914C04k15k65N3J38N1L1J51l33K76P1k84k06R7Q7k40J64Q6m0PM0J95l84J17J33
4938C4J8l57J71N3k28K51j13m2p0K87r9P9k06K43k72J79j57J77q4nj00j30J09
4961b62J03j46J44M9j93J68L23l97K95J84j96j00m7K19k98K76n3p3o6J98KJ14
4983B44k28J00k18K31R3k69q2J90P6M2l48L44J4l13K44k43r1K24k03J21kK45j48
5006B3j85J17o3j31Q2J46k58J79K6N3L3P2n1n9J4O8k9k27M07l38k27M86Pn1J0
5031A04O6j70k52M18j7k46kM9J90k65K9R9J3o2j6j78J46J01l73N41J86p58K90
$$ plain form
5054 -107 -137 -172 -234 -196 -196 -116 -172 -82 -148 28 -144 -27 -360 34 38 -187 -135 117 -469 -177 -66 -159 -96 309 291
5079 291 89 -35 193 -6 2 235 -11 82 -111 198 51 168 208 178 96 218 11 -41 72 208 2 -90 -34
5102 -34 17 190 289 63 -7 -11 162 129 -4 156 45 -11 5 353 -297 -7 189 -201 -288 -31 -21 -216 -162 98
5126 98 -204 -170 82 -135 -158 348 22 92 -7 336 -311 87 229 -257 -276 -81 102 312 -35 164 67 70 -154
5149 -154 -20 -4 -41 292 -324 -49 -54 138 11 77 -257 -57 202 -3 44 101 -195 -18 -146 -7 -227 -92
5171 -92 -11 296 -174 34 -173 -319 -276 -30 -17 -92 -291 40 -72 -7 -15 -14 -227 261 -5 -238 143 -312 -445
5194 -445 -19 114 -342 -268 -11 294 87 -45 174 -39 -64 44 125 148 -14 156 -310 298 -13 -6 141 399
5216 399 266 133 121 208 107 -12 59 -89 79 165 45 -119 282 -34 119 58 -93 34 -82 144 -121 -4
$$ packed form
5054a07l0l5o2L8%Q0n6R0o6J76j72J17l33L94Mk25N2K52n86K92J11r3O3M05j8
5079B91k02j24K28j99QK33k46R3j93L09j47J17M0l0q2J22k07n2J13J36k06r2N6
5102c4N1J73R9k26p0mJ73l3j33J60j11n6J6L48o50K90J96l90q7K57J0j95N4K60
5126I8l02L4K52k17k3N06l26P0r9L43o47L98J42m86j9J95J83K10l47J99r7Lk24
5149a54J34J6l7L33o16K75nJ92j27O6l34K00K59k05M7N7k96J77j28J39k20J35
5171i2Q1L07m70K08k07j46M3K46J3p5j99L31j12O5qJk13M88k66k33L81m55j33
5194d45M26J33m56P4K57L05k07j32K19k13k5J08Q1K3j62J70m66O08l11PJ47K58
5216C99j33j33j2Q7j01j19P1j48J68Q6j20j64M01l16J53o1j51J27j16K26k65J17
$$ plain form
5238 -4 175 48 -139 69 442 44 -140 107 48 73 -103 161 17 -33 -33 -308 141 -181 106 -35 -65 -156 42
5261 42 15 194 -55 -124 -273 -125 -226 92 -92 -61 -5 300 -187 -153 -80 -53 -350 29 121 -336 -168 -17 35
5284 35 48 -67 -155 -513 -3 94 -257 72 -265 -11 -47 319 -103 -141 -16 -129 -55 -343 -104 -161 -35 60 -43
5307 -43 -52 83 -210 -424 2 -84 -62 -26 126 -54 131 45 20 -212 -187 29 55 159 50 -323 -285 -102 30 266
5331 266 -68 32 101 -507 -178 179 -101 -29 168 -137 42 -73 57 -137 -71 118 -231 54 142 -59 -316
5352 -316 71 137 -214 -125 28 -257 -142 320 215 34 131 185 125 -21 120 149 -191 82 -333 82 65 -4 -164
5375 -164 90 21 198 253 133 -214 84 269 -197 -16 -20 87 331 -185 -199 251 -405 24 -204 -202 -73 -39 -174
5398 -174 -348 -63 -59 154 -119 -138 -303 20 83 -443 -209 53 99 -166 -83 161 -148 -100 175 -150 98 216
$$ packed form
5238dJ79j27j87K08L73l98j84K47n9K5j76K64j44n0%k75M49l22K87j41l0r1J98
5261D2k7J79k49o9j49J48j01L18j84L1N6L05m87L4P3K7k97L79R2m57J68J51N2
5284C5J3j15q8l58N10R7l51L29l37K54l6L66m22l8J25j13P4k88K39n7J26R5j03
5307d3rJ35k93k14M26q6K2L6J52j80J85q6k5k32K5K16K6J04j09l73L8J83J32K36
5331B66l34J00O9o08L29L57k80P2J97l05J79j15J30j94O6J89l49K85Q8k01k57
5352c16L87O6l51Q9J53k85J15M62j05j81R7N4o0j46J41K9l40K73m15M15j7o9j60
5375a64K54o9J77N5j20l47K98J85m66J81mJ07K44n16j4M50o56M29k28KJ29L4j35
5398a74j74K85MK13k73j9j65L23O3n26K34K62M6k65Q3K44l09M8K75l25K48J18
$$ plain form
5420 216 -63 -114 -146 111 -306 -433 -113 -141 -197 4 -164 -367 -24 51 -175 -172 14 19 1 -139 143 -183 -118 141
5444 141 91 -58 -8 42 -49 -87 -485 -58 97 -271 -201 170 -30 -4 -220 -125 -52 -119 92 -11 26 153 -61 -89
5468 -89 97 43 -129 -212 -223 21 221 25 -30 -53 148 81 -71 -6 -335 -72 -30 39 125 -171 -3 -299 -27 131
5492 131 -132 -54 -191 26 171 -158 -56 -5 -140 -304 114 440 162 229 144 191 97 10 170 -75 24 21 7 -198
5516 -198 305 -180 -234 -120 -381 450 24 112 200 -280 86 -103 -208 -6 56 109 -124 -236 -11 -40 272 40
5538 40 52 -59 183 -244 60 -178 -224 27 -407 100 -266 -23 -25 -162 -312 121 -31 -134 -20 183 -260 81
5560 81 115 297 -27 -121 21 -176 -160 176 130 17 153 -149 -7 124 18 -40 186 -39 -111 -40 187 99 -34
5583 -34 42 -154 -54 -193 -260 -53 -101 -105 30 -157 -333 206 -103 -175 1 -439 -258 285 87 147 95 144 -142
$$ packed form
5420B16k79n1l2K57m17j27L20k8n6K01j68k03L43P5k26LJ86Nj8j40K82l26O5K59
5444A41n0j49N0N0r1l8l98M27J55l68P0L71k00K6k16R5P3o7K11j03L7J27k14k8
5468h9J86n4j72q3j1K44K00j96n5k3K01o7j52O5l29K63M2O9Q6k96J68k96K72J58
5492A31k63P8j37K17J45l29J02N1j35j64M18L26k78O7q5M7r4q7J60k45R9lj4k05
5516a98N03m85n4J14k61Q31m26Q8Q8m80L66j89j05K02O2N3k33j12K25k9L12k32
5538D0J2j11K42m27L04k38m6K51m34N07l66K43kj37j50M33j52j03J14K03m43L41
5560H1L4J82l24r4J42j97J6L36m6j13J36l02J42J31j06n8K26k25p2P1K27q8j33
5583c4P6j96J00j39o7K07m8mJ35j87j76N39l09p2J76m40J81N43j98O0n2M9k86
$$ [...]
8191E8
##END NTUPLES=NMR FID
##END=
