##TITLE=1H_SA_13.174
 CDcl3, 8 sc, 
 20.12.2019
##JCAMPDX= 6.0         $$ Bruker NMR JCAMP-DX V2.0
##DATA TYPE= NMR FID
##DATA CLASS= NTUPLES
##ORIGIN= UXNMR, Bruker Analytische Messtechnik GmbH
##OWNER= root
$$ XWIN-NMR		Version 3.5
$$ Fri Dec 20 13:54:58 2019 Russian Standard Time (UT+4h)  she@DPX200
##.OBSERVE FREQUENCY= 200.1315
##.OBSERVE NUCLEUS= ^1H
##.DELAY= (6, 6)
##.ACQUISITION MODE= SIMULTANEOUS
##.ACQUISITION SCHEME= undefined
##.AVERAGES= 8
##.DIGITISER RES= 18
##SPECTROMETER/DATA SYSTEM= spect
##.PULSE SEQUENCE= zg30
##.SOLVENT NAME= CDCl3
##.SHIFT REFERENCE= (INTERNAL, CDCl3, 0, 15.7039)
##AUDIT TRAIL= $$ (NUMBER, WHEN, WHO, WHERE, WHAT)
$$ ##TITLE= Audit trail, XWIN-NMR		Version 3.5
$$ ##JCAMPDX= 5.01
$$ ##ORIGIN= Bruker BioSpin GmbH
$$ ##OWNER= she
$$ F:/spectra/data/she/nmr/H-F/1/audita.txt
$$ ##AUDIT TRAIL=  $$ (NUMBER, WHEN, WHO, WHERE, WHAT)
(   1,<2019-12-20 13:53:44.39 +0400>,<she>,<DPX200>,
      <created by zg, POWCHK disabled, PULCHK disabled
       configuration hash MD5:
       00 E9 B6 7A A2 85 ED C7 34 08 36 98 17 FE 4E 26
       data hash MD5: 16K
       08 A2 63 09 BC 60 B6 40 2D 57 8D 0B 9F F8 48 0C>)
$$ ##END=
$$ 
$$ hash MD5
$$ 15 20 5B F6 75 65 EF C6 7F F4 8D D5 19 68 5E 8B
##$RELAX= 
##$RELAX= 
##$RELAX= 
##$RELAX= 
##$RELAX= 
##$RELAX= 
$$ Bruker specific parameters
$$ --------------------------
##$DU= <F:/spectra>
##$EXPNO= 1
##$NAME= <H-F>
##$PROCNO= 1
##$TYPE= <nmr>
##$USER= <she>
##$AMP= (0..31)
100 100 100 100 100 100 100 100 100 100 100 100 100 100 100 100 100 100 
100 100 100 100 100 100 100 100 100 100 100 100 100 100 
##$AQSEQ= 0
##$AQ_mod= 1
##$AUNM= <au_zg>
##$AUTOPOS= <>
##$BF1= 200.13
##$BF2= 200.13
##$BF3= 200.13
##$BF4= 200.13
##$BF5= 200.13
##$BF6= 200.13
##$BF7= 200.13
##$BF8= 200.13
##$BYTORDA= 1
##$CFDGTYP= 0
##$CFRGTYP= 5
##$CHEMSTR= <none>
##$CNST= (0..31)
1 1 145 1 1 1 1 1 1 1 1 1 1 1 1 1 1 1 1 1 1 1 1 1 1 1 1 1 1 1 1 1 
##$CPDPRG= <>
##$CPDPRG1= <>
##$CPDPRG2= <>
##$CPDPRG3= <>
##$CPDPRG4= <mlev>
##$CPDPRG5= <mlev>
##$CPDPRG6= <mlev>
##$CPDPRG7= <mlev>
##$CPDPRG8= <mlev>
##$CPDPRGB= <>
##$CPDPRGT= <>
##$D= (0..31)
0 1.2 0 0 0 0 0 0 0 0.06 0 0.03 0 0 0 0 0.0002 0 0 0 0 0 0 0 0 0 0 0 0 
0 0 0 
##$DATE= 1576835623
##$DBL= (0..7)
120 120 120 120 120 120 120 120 
##$DBP= (0..7)
150 150 150 150 150 150 150 150 
##$DBP07= 0
##$DBPNAM0= <>
##$DBPNAM1= <>
##$DBPNAM2= <>
##$DBPNAM3= <>
##$DBPNAM4= <>
##$DBPNAM5= <>
##$DBPNAM6= <>
##$DBPNAM7= <>
##$DBPOAL= (0..7)
0.5 0.5 0.5 0.5 0.5 0.5 0.5 0.5 
##$DBPOFFS= (0..7)
0 0 0 0 0 0 0 0 
##$DE= 6
##$DECBNUC= <off>
##$DECIM= 24
##$DECNUC= <off>
##$DECSTAT= 4
##$DIGMOD= 1
##$DIGTYP= 9
##$DL= (0..7)
0 120 120 120 120 120 120 120 
##$DP= (0..7)
150 150 150 150 150 150 150 150 
##$DP07= 0
##$DPNAME0= <>
##$DPNAME1= <>
##$DPNAME2= <>
##$DPNAME3= <>
##$DPNAME4= <>
##$DPNAME5= <>
##$DPNAME6= <>
##$DPNAME7= <>
##$DPOAL= (0..7)
0.5 0.5 0.5 0.5 0.5 0.5 0.5 0.5 
##$DPOFFS= (0..7)
0 0 0 0 0 0 0 0 
##$DQDMODE= 0
##$DR= 18
##$DS= 0
##$DSLIST= <SSSSSSSSSSSSSSS>
$$ [...]
##$SUBNAM2= <"">
##$SUBNAM3= <"">
##$SUBNAM4= <"">
##$SUBNAM5= <"">
##$SUBNAM6= <"">
##$SUBNAM7= <"">
##$SUBNAM8= <"">
##$SUBNAM9= <"">
##$SW= 24.9337058887773
##$SWIBOX= (0..15)
0 0 2 0 0 0 0 0 0 0 0 0 0 0 0 0 
##$SW_h= 4990.01996007984
##$TD= 16384
##$TD0= 1
##$TE= 0
##$TE2= 300
##$TE3= 300
##$TEG= 300
##$TL= (0..7)
0 120 120 120 120 120 120 120 
##$TP= (0..7)
150 150 150 150 150 150 150 150 
##$TP07= 0
##$TPNAME0= <>
##$TPNAME1= <>
##$TPNAME2= <>
##$TPNAME3= <>
##$TPNAME4= <>
##$TPNAME5= <>
##$TPNAME6= <>
##$TPNAME7= <>
##$TPOAL= (0..7)
0.5 0.5 0.5 0.5 0.5 0.5 0.5 0.5 
##$TPOFFS= (0..7)
0 0 0 0 0 0 0 0 
##$TUNHIN= 0
##$TUNHOUT= 0
##$TUNXOUT= 0
##$USERA1= <user>
##$USERA2= <user>
##$USERA3= <user>
##$USERA4= <user>
##$USERA5= <user>
##$V9= 5
##$VALIST= <valist>
##$VCLIST= <CCCCCCCCCCCCCCC>
##$VD= 0
##$VDLIST= <DDDDDDDDDDDDDDD>
##$VPLIST= <PPPPPPPPPPPPPPP>
##$VTLIST= <TTTTTTTTTTTTTTT>
##$WBST= 1024
##$WBSW= 4
##$XGAIN= (0..3)
0 0 0 0 
##$XL= 0
##$YL= 0
##$YMAX_a= 69738
##$YMIN_a= -39391
##$ZGOPTNS= <>
##$ZL1= 120
##$ZL2= 120
##$ZL3= 120
##$ZL4= 120
##$ABSF1= 10
##$ABSF2= 0
##$ABSG= 5
##$ABSL= 3
##$ALPHA= 0
##$AQORDER= 0
##$ASSFAC= 0
##$ASSFACI= 0
##$ASSFACX= 0
##$ASSWID= 0
##$AUNMP= <proc_1d>
##$AZFE= 0.1
##$AZFW= 0.1
##$BCFW= 1
##$BC_mod= 2
##$BYTORDP= 1
##$COROFFS= 0
##$CY= 11.3945322036743
##$DATMOD= 1
##$DC= 2
##$DFILT= <>
##$DTYPP= 0
##$F1P= 16.9975609425685
##$F2P= -3.02152046262296
##$FCOR= 0.5
##$FTSIZE= 0
##$FT_mod= 4
##$GAMMA= 1
##$GB= 0.15
##$INTBC= 1
##$INTSCL= 1
##$ISEN= 128
##$LB= 0.24
##$LEV0= 0
##$LPBIN= 0
##$MAXI= 10000
##$MC2= 0
##$MEAN= 0
##$ME_mod= 0
##$MI= 1.114404
##$NCOEF= 0
##$NC_proc= 0
##$NLEV= 6
##$NOISF1= 3.799351
##$NOISF2= 2.8
##$NSP= 1
##$NTH_PI= 0
##$NZP= 0
##$OFFSET= 15.70392
##$PC= 1
##$PHC0= -10143.65
##$PHC1= 11.8008
##$PH_mod= 1
##$PKNL= yes
##$PPARMOD= 0
##$PSCAL= 0
##$PSIGN= 0
##$REVERSE= no
##$SF= 200.130013532006
##$SI= 16384
##$SIGF1= 3
##$SIGF2= 2
##$SINO= 400
##$SIOLD= 16384
##$SREGLST= <1H.CDCl3>
##$SSB= 0
##$STSI= 0
##$STSR= 0
##$SW_p= 3612.71676300578
##$SYMM= 0
##$S_DEV= 0
##$TDeff= 0
##$TDoff= 0
##$TI= <>
##$TILT= no
##$TM1= 0
##$TM2= 0
##$TOPLEV= 0
##$USERP1= <user>
##$USERP2= <user>
##$USERP3= <user>
##$USERP4= <user>
##$USERP5= <user>
##$WDW= 1
##$XDIM= 8192
##$YMAX_p= 0
##$YMIN_p= 0
$$ End of Bruker specific parameters
$$ ---------------------------------
##NTUPLES= NMR FID
##VAR_NAME=  TIME,          FID/REAL,        FID/IMAG
##SYMBOL=    X,             R,               I
##VAR_TYPE=  INDEPENDENT,   DEPENDENT,       DEPENDENT
##VAR_FORM=  AFFN,          ASDF,            ASDF
##VAR_DIM=   8192,          8192,            8192
##UNITS=     SECONDS,       ARBITRARY UNITS, ARBITRARY UNITS
##FACTOR=    0.0002004,     1,               1
##FIRST=     0,             0,               0
##LAST=      1.6414764,     0,               0
##MIN=       0,             -39391,          0
##MAX=       1.6414764,     69738,           0
$$ Real data points
##PAGE= N=1
##DATA TABLE= (X++(R..R)), XYDATA
$$ [...]
2026E78j31j83J6J84P4r4j05j70L15l48K13L31l67J06J31k35j49K39J08j16K14
$$ 578 447 264 280 464 538 444 339 169 484 136 349 680 313 419 550 315 166 405 513 397 611
2047F11kj04L2O0K1q8K9N3L3k66K17l4j57J02O5j89K93q0k9R7q1k75J38M01k01
$$ 611 609 505 537 597 618 530 559 612 645 379 596 562 405 507 572 383 676 596 567 664 583 308 446 847 646
2072F46k53M28l37Q3M5l2m63N83j19j09l37K15K29l47Q6m0k63K38k2M3j02l7P5
$$ 646 393 821 484 567 612 580 117 700 581 472 135 350 579 232 318 278 15 253 231 274 172 135 210
2095B10J41J28R5k36j21m5O6k11j81M40j22j43P5n9P9o2k85J7o9L09n51L55j93
$$ 210 351 479 574 338 217 172 238 27 -154 286 164 21 96 37 116 54 -231 -214 -283 26 -525 -170 -363
2118c63R0K93m11L12m0j75K49k32L0j21j7J59R1k97r0JK42k58J90k09mM53l87
$$ -363 -273 20 -391 -79 -119 -294 -45 -277 -247 -368 -385 -226 -135 -432 -522 -521 -279 -537 -347 -556 -560 -107 -494
2141d94N3J35J38n1n76L57J8j05J67nj02l6P0M10j62j90j86M91n52L13K18j29
$$ -494 -441 -306 -168 -219 -795 -438 -420 -525 -358 -363 -465 -501 -431 -21 -183 -373 -559 -68 -620 -307 -89 -218
2163b18N9R5l6l8M92k14n6k59L94k8k45M66j69P8k88J03M9Q2j23%q7m6M0O3L69
$$ -218 -159 -64 -100 -138 354 140 84 -175 219 191 -54 412 243 321 33 136 185 267 144 144 57 11 51 114 483
2188D83k01k09J85J98l02j03K44L81j29q3j20k7K51R0k29J49l60L48o22K31J54
$$ 483 282 73 258 456 154 51 295 676 547 464 344 317 568 658 429 578 218 566 -56 175 329
2209C29j14K1Q6j71l6J42j83M6n6K53l25R5J08J0j40q8M70j39p1N6j52j23m3Q4
$$ 329 215 236 322 151 115 257 74 120 64 317 -8 87 195 205 65 -23 447 308 237 293 141 18 -25 59
2233E9J39k40j01Jj01j34J93p4m5J83j47L24k60q2J4p1J63p0k74M65j75J74q6
$$ 59 198 -42 -143 -142 -243 -377 -184 -258 -303 -120 -267 57 -203 -285 -271 -342 -179 -249 -523 -58 -233 -59 -145
2256a45l58J17K40j39k29J75Q8o3m1k00J99J4K47L7j23k68j11M83J47m03L53m08
$$ -145 -503 -386 -146 -285 -514 -339 -251 -314 -355 -555 -356 -342 -95 -58 -181 -449 -560 -77 70 -333 20 -388
2278c88K07n2K01j2N9l16j0J05J99k10L14j42K09k13J65j21J53J78j50j56O2L44
$$ -388 -181 -233 -32 -44 15 -301 -311 -206 -7 -217 97 -45 164 -49 116 -5 148 326 176 20 82 426
2300D26n1j52N2K32l72J74j92j50K62N1l61O7N6M6m7Lr9M06m10L26j59J83k42
$$ 426 375 223 275 507 135 309 117 -33 229 280 -81 -14 42 88 41 44 -55 351 -59 267 108 291 49
2323D9k41J40K14l04J11J79l00O0K9J55j59j16n8o6J17J09j86k24Q8l37M7L65
$$ 49 -192 -52 162 -142 -31 148 -152 -92 -63 92 -67 -183 -241 -307 -190 -81 -267 -491 -403 -740 -693 -328
2345c28j60q6J23K27J20m58J14n2q6L10k07l46J87j66j02k7P0n4pJ41J68K07j80
$$ -328 -488 -574 -451 -224 -104 -562 -448 -500 -586 -276 -483 -829 -642 -808 -910 -937 -867 -921 -928 -787 -619 -412 -592
2368e92l8M0p0j95K95o8J48K01l92K5p2J16o4J06k13K61j48n2J18p8p8K38J33
$$ -592 -630 -590 -660 -855 -560 -628 -480 -279 -671 -646 -718 -602 -666 -560 -773 -512 -660 -712 -594 -672 -750 -512 -379
2391c79j19k90L22L18m6K22rR4l41K72j24J37J4o8N6L10n01J57q9J98j9j75q7
$$ -379 -498 -788 -466 -148 -194 28 19 113 -228 44 -80 57 71 3 59 369 -132 25 -64 134 115 -60 -147
2414a47L48j75j23K10K04J80J10m83j96M02K26j06k7N4J26N7j75j10L29k91k74
$$ -147 201 26 -97 113 317 497 607 124 -72 330 556 450 423 477 603 660 485 375 704 413 139
2435A39K70J28j19l3L31o03O04l27q7N6k05q1K33k15K81L6j23k94J5J68K14J07
$$ 139 409 537 418 385 716 113 717 390 303 359 154 73 306 91 372 408 285 -9 6 174 388 495
2457D95l47R6j60kJ31k46J31k25L3K35l13L22j06l70K65r7K42l96J69O0m13K1
$$ 495 148 244 84 82 213 -33 98 -127 -94 141 -172 150 44 -326 -61 -158 84 -312 -143 -83 -496 -475
2479d75J94J70l20o1J88j1J65m19M60j17k63K38j65J21J30J7k56J45K64j69p1
$$ -475 -281 -111 -431 -492 -304 -315 -150 -569 -109 -226 -489 -251 -416 -295 -165 -148 -404 -259 5 -164 -235
2500b35M19k17j9p2J9R7n58L20J95j17L3l1m5J7K4J82J18r5j09J67j26J68k73
$$ -235 184 -33 -52 -124 -105 -8 -566 -246 -51 -168 -135 -166 -211 -194 -170 12 130 35 -74 93 -33 135 -138
2523a38nK48K31j71j10L80k81K43l27J35n9K52m57J12M91j62j30j45N52m47K07
$$ -138 -143 105 336 165 55 435 154 397 70 205 146 398 -59 53 544 382 252 107 659 212 419
2544D19j30Q0q1j22R2K1J06L7M30m50k58K49L1p4Q0k00J4L9K89l63L90j9l87m6
$$ 419 289 369 288 166 258 279 385 422 852 402 144 393 424 350 430 230 244 283 572 209 599 580 193 147
2568A47K91j17k44K64l40J71J85j83R9M2p6Q8k43P1l15K86l5J30j34N2j31q0M9
$$ 147 438 321 77 341 1 172 357 174 273 315 239 327 84 155 -160 126 91 221 87 139 8 -72 -23
2591b3j91L61O8k75J1l66L0M82j88J06j82J28LPO0L1k76K00m5l0q0m5J86j17n4
$$ -23 -214 147 215 -60 -49 -415 -385 97 -91 15 -167 -39 -36 -29 31 62 -214 -14 -59 -89 -169 -214 -28 -145 -199
2616a99J99l69J37K15j76j90M61k13kM3l7k0m53L58j17K97L4j38k42M65k60j19
$$ -199 0 -369 -232 -17 -193 -383 78 -135 -137 -94 -131 -151 -604 -246 -363 -66 -32 -170 -412 53 -207 -326
2638c26M97k09j61L1L23l19j81M32j78jk1P0N5m3Pk09K54J13qm34M33k14p5r1
$$ -326 171 -38 -199 -168 155 -164 -345 87 -91 -92 -113 -43 12 -31 -24 -233 21 134 126 -308 125 -89 -164 -255
2662b55J90j45K16K8k9K43l59j03J42j8q2N90l45k27J90m33M52P8k57J99q4R4
$$ -255 -65 -210 6 34 5 248 -111 -214 -72 -90 -172 418 73 -154 36 -397 55 133 -124 75 -9 85
2684H5k06M38l28j84K77L13m89M11j74k80K61l62K48L8m8j95l1k0J93j0R1J28
$$ 85 -121 317 -11 -195 82 395 -94 317 143 -137 124 -238 10 48 0 -195 -226 -246 -53 -63 28 156
2706A56k51j12Q5j07K75j77J94J05l06J97l62k2J29k3q6N7p7N9K45jq9K8k1j64
$$ 156 -95 -207 -122 -229 46 -131 63 168 -138 59 -303 -325 -196 -219 -305 -248 -325 -266 -21 -22 -111 -83 -104 -268
2730b68r4R1m0k26L46j19l39K64J38K14n3l05L31j08k90J64j52J23O0k6j54J21
$$ -268 -362 -271 -311 -537 -191 -310 -649 -385 -247 -33 -86 -391 -60 -168 -458 -294 -446 -323 -263 -289 -443 -322
2752c22K4j78K44k36J0k36L95j23K50k05N4k96J18K22j24J80m7J20k43j84M08
$$ -322 -298 -476 -232 -468 -458 -694 -299 -422 -172 -377 -323 -619 -501 -279 -403 -223 -270 -150 -393 -577 -169
2773a69r0K37k06l5Q1k48J44k30K72j34J17o9J75J67k75o9j31K29l4J78j45O0
$$ -169 -259 -22 -228 -263 -182 -430 -286 -516 -244 -378 -261 -330 -155 12 -263 -332 -463 -234 -268 -90 -235 -175
2795a75L40m94o1L23J5l14L53J12J7j59K00K6j16Mp0J10J66L7K9j70K15m1j10
$$ -175 165 -329 -390 -67 -52 -366 -13 99 116 -43 157 183 67 71 1 111 277 314 343 173 388 347 237
2818B37k45M39n6j53M25r3j34o2P6j19n0K21J4l34M65l27K3k94L36J22o5M9K3
$$ 237 -8 431 375 222 647 554 420 358 434 315 265 486 500 166 631 304 327 33 369 491 426 475 498
2841D98j46J29k76k2L04o0N3l58J82j96J85j55J63j92J90J5k15JP0j46k9M41k27
$$ 498 352 481 205 183 487 427 480 122 304 108 293 138 301 109 299 314 99 100 170 24 -5 436 209
2864B09Rj38O4j61J07k4n2J18j55M0M2J07k38n2j1J59k40j85J47J71o0k53K96
$$ 209 218 80 144 -17 90 66 14 132 -23 17 59 166 -72 -124 -135 24 -216 -401 -254 -83 -143 -396 -100
2887a00l80K14k22M08p9k18j3k42L15J8J02n1M5J30l10n1L21j37J98l11L9p6J51
$$ -100 -480 -266 -488 -80 -159 -377 -390 -632 -317 -299 -197 -248 -203 -73 -383 -434 -113 -250 -52 -363 -324 -400 -249
2910b49j69J57J36k52K94n45O13m1k26J69m4j87L39n6L89l91J47K4j67kK82l7
$$ -249 -418 -261 -125 -377 -83 -628 -15 -56 -282 -113 -157 -344 -5 -61 328 -63 84 108 -59 -61 221 184
2932A84l07L18Q3J87l15m1K31o4N2O8n6j1J66p8P8J28m1m46K69O9j10R3J90l84
$$ 184 -123 195 278 465 150 109 340 276 328 396 340 329 495 417 495 623 582 136 405 474 364 457 647 263
2956B63KK37n12K02J24r6K00l2%j00J93l7K6M6o2j31K61n8k63q1J38j65J48j85
$$ 263 265 502 -10 192 316 220 420 388 388 288 481 444 470 516 454 323 584 526 263 182 320 155 303 118
2980A18K61k64K01l63P6L02k72J69k10J5J19j92j01L32k49Q8J39N9k64J86n7q
$$ 118 379 115 316 -47 29 331 59 228 18 33 152 -40 -141 191 -58 30 169 228 -36 150 93 85
3002H5J11l1m10M62k28n3J56l66k4n8K46J0%K27o06L36K58k56J73%m9J02r7J39
$$ 85 196 165 -245 217 -11 -64 92 -274 -298 -356 -110 -100 -100 127 -479 -143 115 -141 32 32 -17 85 -12 127
3026A27j10l54K0L89L8K9j68k5r7K20o5j22J18k83K97r6J00J35L46k56o3o8L45
$$ 127 17 -337 -317 72 110 139 -29 -54 -151 69 4 -118 0 -283 14 -82 18 153 499 243 180 112 457
3049D57k14RJ51j87K2K55n7J42k62M0j57N0Rj30J12R6l01MM16J7J4l24K01N6K82
$$ 457 243 252 403 216 238 493 436 578 316 356 199 249 258 128 240 336 35 39 455 472 486 162 363 419 701
3074G01k09l33M19l12J60k27O3J75k79J08M1k36P6L4J94n4l45R9K28M6q0J42m1
$$ 701 492 159 578 266 426 199 262 437 158 266 307 71 147 181 375 321 -24 75 303 349 269 411 370
3097C70j08P0j42L4J73j81j80j54L2o8M13m49l23O07k11j17K65J92m81J68o6J57
$$ 370 262 332 190 224 397 216 36 -118 -86 -154 259 -190 -513 94 -117 -234 31 223 -258 -90 -156 1
3119An7j21J65l09R0K71Qn08N27j46j50M3j00R1k58J50k85K67J25j57K26J19m11
$$ 1 -56 -177 -12 -321 -231 40 48 -460 67 -79 -229 -186 -286 -195 -453 -303 -588 -321 -196 -353 -127 -8 -419
3142d19J07M5O8J06RM4j41j90L16k59K39j27J50j91J24r7K24j16Q3J9K73k68l39
$$ -419 -312 -267 -199 -93 -84 -40 -181 -371 -55 -314 -75 -202 -52 -243 -119 -216 8 -108 -25 -6 267 -1 -340
3165c40M91n9j01j26M29l99J55O1j95L47q7l7N7j32k60K20J46LO4l50M49l19J93
$$ -340 151 92 -9 -135 294 -105 50 111 -84 263 176 139 196 64 -196 24 170 173 237 -113 336 17 210
3188B10J03l03L16k69K40J25o24M10n0j90J18o7L75m73O53o18R2k68O9L42N1k99
$$ 210 313 10 326 57 297 422 -202 208 158 -32 86 19 394 -79 574 -44 48 -220 -151 191 242 -57
3210e7M2pJ66l25q9N0L11j05L19m89J78J27k25J6K74p2k1j4j21K86k74K00k50
$$ -57 -15 -22 144 -181 -270 -220 91 -14 305 -184 -6 121 -104 -88 186 114 93 79 -42 244 -30 170 -80
3233h0Q8j94L21k29j02J45j77K45k38Q2k0q1L00j97K27j18p5R9k01K59k50Lj30
$$ -80 8 -186 135 -94 -196 -51 -228 17 -221 -139 -159 -240 60 -137 90 -28 -103 -4 -205 54 -196 -193 -323
3256c23J11L07m25PO3l7N66l07l19r0J41L3K00J0j94J46k24J77K69l56QJ3J57
$$ -323 -212 95 -330 -323 -260 -297 269 -38 -357 -447 -306 -273 -73 -63 -257 -111 -335 -158 111 -245 -237 -224 -67
3279f7K16k68Q8L1j37K0L36k20J75l30k1L26j55j27J75K44m33J07J24R3l88M74
$$ -67 149 -119 -31 0 -137 -117 219 -1 174 -156 -177 149 -6 -133 42 286 -147 -40 84 177 -211 263
3301B63j59q6M6j24j72Q8P5N29n33J93M7j21j72L96j78P9r2j31J8J03k19L90m04
$$ 263 104 18 64 -60 -232 -144 -69 460 -73 120 167 46 -126 270 92 171 79 -52 -34 69 -150 240 -164
3324a64L62k00J21k77J92K42k06K10k34K25k20J10m56N74j70J1K25j37k08L56
$$ -164 198 -2 119 -158 34 276 70 280 46 271 51 161 -295 279 109 120 345 208 0 356
3344C56k08n8Np4J58j36q4M4M19j72k18N50n80M6Q5J06k17k6j05K13j63K54O9
$$ 356 148 90 95 21 179 43 -41 3 422 250 32 582 2 48 133 239 22 -4 -109 104 -59 195 264
3367B64k67K07j05j54R0O8q8N1L8K07l12j32L51l28P7K39l85K86j88j7l4J74k59
$$ 264 -3 204 99 -55 35 103 15 66 104 311 -1 -133 218 -110 -33 206 -179 107 -81 -98 -132 42 -217
3390b17R6R4l87J2K46j25n6J49m9J00j80p9P00m28J34O7k44Q5j74J06J0q4K52
$$ -217 -121 -27 -414 -402 -156 -281 -337 -188 -237 -137 -317 -396 304 -124 10 77 -167 -82 -256 -150 -140 -224 28
3413B8j6k14K5Q4K15l13Q2K1p4j58L73k50L32j52QP4k67M33j85K43k93J45o4m1
$$ 28 12 -202 -177 -93 122 -191 -109 -88 -162 -320 53 -197 135 -17 -9 65 -202 231 46 289 -4 141 77 36
3437C6J85k70N9K31n2j78J34OJ41j41L9k02J35m80K08J92j26M16k33J21J18j79
$$ 36 221 -49 10 241 189 11 145 151 292 151 190 -12 123 -357 -149 43 -83 333 100 221 339 160
3459A60M8j52K09j36J32l3j00J78k1k55L24K5l59PJ85J31J66k74o2J11j78P9J59
$$ 160 208 56 265 129 261 228 128 306 285 30 354 379 20 27 212 343 509 235 173 284 106 185 344
3482C44m23J42PK33k04k36J29k5j83K1J10K1J22J58k87Rm6P8Q8k80q4L19O6j46
$$ 344 -79 63 70 303 99 -137 -8 -33 -216 -195 -85 -64 58 216 -71 -62 -108 -30 58 -222 -306 13 79 -67
3506f7n6P7j03L56M6l96J79k26l03J2L75k0o1j01k48K13J63j86J49j80pO4K32
$$ -67 -123 -46 -149 207 253 -143 36 -190 -493 -481 -106 -126 -187 -288 -536 -323 -160 -346 -197 -377 -384 -320 -88
3529h8j64J5j79K27p5j12J72o9K37k32K54j18m7k20O2J87o0j82O8MM73l23j6j39
$$ -88 -252 -237 -416 -189 -264 -376 -204 -273 -36 -268 -14 -132 -179 -399 -337 -150 -210 -392 -324 -320 153 -170 -186 -325
3553c25J27k23J20M44j92o8j44K79l19J71J87j81j6K7J38P3k48K73J7q4m4O4K4
$$ -325 -198 -421 -301 143 -49 -117 -261 18 -301 -130 57 -124 -140 -113 25 98 -150 123 140 56 12 76 100
3576A00j00Q6P1k98N96l89k27L70J84l81J17j86K08j05L17k95L20n2j04K36j22
$$ 100 0 86 157 -141 455 66 -161 209 393 12 129 -57 151 46 363 68 388 336 232 468 346
3597C46j64K34k17k35K28j44jK41m17J82Ko1M4L15m10K29k26L5l2K86j90j60K72
$$ 346 182 416 199 -36 192 48 47 288 -129 53 55 -6 38 353 -57 172 -54 -19 -51 235 45 -115 157
3620A57r2R0j01q3K1O6k3r4P9M8j11NJ19l26j7L45j71ON3r7q0j1mJ85Q0j07p6
$$ 157 65 155 54 -29 -8 58 35 -59 20 68 -43 -38 81 -245 -262 83 -88 -82 -29 -126 -206 -217 -221 -36 44 -63 -139
3647a39Nj00j69K96J51l16J10o5K69l73j0rqO6K89N7m55M7L29k82j61K24J57j73
$$ -139 -134 -234 -403 -107 44 -272 -162 -227 42 -331 -341 -350 -358 -292 -3 54 -401 -354 -25 -307 -468 -244 -87 -260
3671b60J67l8M7j28N03m90J99k36k77M08j99K61j93L46k49J49l18P6K11k1j45
$$ -260 -93 -131 -84 -212 291 -199 0 -236 -513 -105 -304 -43 -236 110 -139 10 -308 -232 -21 -42 -187
3692a87mJ74j12L61n44K99J93j60K33k0M2k19O3j3j49J42j46J8J32k33L85j66
$$ -187 -191 -17 -129 232 -312 -13 180 20 253 233 275 56 119 106 -43 99 -47 -29 103 -130 255 89
3714H9K38l59L20j62J70o5q3K2k4Q0K15j35J81l55j1q6L27n93L03l1J71l02LK60
$$ 89 327 -32 288 126 296 231 148 170 146 226 441 306 487 132 121 35 362 -231 72 41 212 -90 -87 173
3738A73N4k09j08J32N1j13J70m5J21r1k98L08j99K90m57M31l14Q2j41P5J56M8
$$ 173 227 18 -90 42 93 -20 150 105 226 135 -163 145 -54 236 -221 210 -104 -22 -163 -88 68 116
3760A16J11j10r9K58k50K7J36p7K1l25K3j91K39r5O9K29k20o8J52j71L63j98K71
$$ 116 227 117 18 276 26 53 189 112 133 -192 -169 -360 -121 -216 -147 82 -138 -206 -54 -225 138 -60 211
3783B11o32M57k76J26n6J14j2o3J2m0o2J37k2j59K6L2J19l48K8L87l5j34J50Q0
$$ 211 -421 36 -240 -114 -170 -56 -68 -131 -119 -159 -221 -84 -106 -265 -239 -207 -88 -436 -408 -21 -56 -190 -40 40
3807D0l31M50l72J41J43J18k06M00j21k97N1Q2l01N05qj7j51k59J72J6o1l0m0
$$ 40 -291 159 -213 -72 71 189 -17 383 262 -35 16 98 -203 302 294 277 126 -133 39 55 -6 -36 -76
3830g6KK71q9P8j88k12p7Q5J58L18j94j15m2M13j72j17q9J50Q7Jk29J95j55K36
$$ -76 -74 197 108 186 -2 -214 -291 -206 -48 270 76 -39 -81 332 160 43 -46 104 191 192 -37 158 3 239
3854B39o8j81R4o1j18n1L97j99j19P3K4k78L77J61k17JJ09q1j80M1K5p8K35M0
$$ 239 171 -10 84 23 -95 -146 251 52 -67 6 30 -248 129 290 73 74 183 102 -78 -37 -12 -90 145 185
3878A85R7j53N6mj11j45R8K4j13j08J50M3k24q7L49l4r9J97k45J01m9K81l31J47
$$ 185 282 129 185 181 70 -75 23 47 -66 -174 -24 19 -205 -292 57 23 -76 121 -124 -23 -72 209 -122 25
3902B5n9o9K97k58l5J85l47L87J10l85J86J33l1Q5l25J78j59k83K94J88k02j84
$$ 25 -34 -103 194 -64 -99 86 -261 126 236 -149 37 170 139 224 -101 77 -82 -365 -71 117 -85 -269
3924b69L42k01J23O5ll13O0K21K04l42J83j97L0K27k81K97k28J80l40L71Mj19
$$ -269 73 -128 -5 60 57 -256 -196 25 229 -113 70 -127 -97 130 -151 146 -82 98 -242 129 133 14
3946A4J89k42o7l7K11l07J26J08K3M5l44l3M79k34j27K14l1k4J3P8j22J7K22n9
$$ 14 203 -39 -106 -143 68 -239 -113 -5 18 63 -281 -314 165 -69 -196 18 -13 -37 -24 54 -68 -51 171 112
3970A12N0rj25K34p6Rj75M3m7J73q4O4L3m14N08l75J40j42L8K6K76l0k12l12O12
$$ 112 162 153 28 262 186 195 20 63 16 189 105 169 202 -212 296 -79 61 -81 -43 -17 259 229 17 -295 317
3995C17q3Rm9k06n3K18j76K31l05J64J94l90J51k91L71j08j3j93K15l12L09K0
$$ 317 234 243 194 -12 -65 153 -23 208 -97 67 261 -129 22 -269 102 -6 -19 -212 3 -309 0 20
4017B0k42j43J81K68l29NO2k6N05j73q8k32J52j1LL3k46M82m71Q9nJ07r4j38J83
$$ 20 -222 -365 -184 84 -245 -240 -178 -204 301 128 40 -192 -40 -51 -48 -15 -261 221 -250 -161 -166 -59 -153 -291 -108
4042a08J69m04M32l65J44k8J3m1J36j29L48k18p6N1r9J51j3K21k08Pl7k47K90
$$ -108 61 -343 89 -276 -132 -160 -147 -188 -52 -181 167 -51 -127 -76 -175 -24 -37 184 -24 -17 -54 -301 -11
4065a1J2M5m6j03J72m1j46N2qQ6J06j87P9j90K26j11r9O3O5m11M44k6J44j46k45
$$ -11 1 46 0 -103 69 28 -118 -66 -74 12 118 -69 10 -180 46 -65 -164 -101 -36 -447 -3 -29 115 -31 -276
4090b76K94k68K60Q4Rm7K02j94j92K84O3r9Q7k51qK08j20l2j2N1j98L88k90J40
$$ -276 18 -250 10 94 103 56 258 64 -128 156 219 120 207 -44 -52 156 36 4 -8 43 -155 233 -57 83
4114H3l8L84l43o8L37l74J37j40K00P0j62J83j66K25m37L17j55K22j18k26L80
$$ 83 45 429 86 18 355 -19 118 -22 178 248 86 269 103 328 -109 208 53 275 157 -69 311
4135C11n17N12m62N7P8M4Pj91o6L4J34O2m2rJ82r5J06j81L83m98J88L5r8k42J82
$$ 311 -206 306 -156 -99 -21 23 30 -161 -227 -193 -59 3 -39 -48 134 39 145 -36 347 -151 37 72 -26 -268 -86
4160h6L07l08K0k22K64k24K66l22M77k91j04J13K4k31L59j99J81l39L62J9k43
$$ -86 221 -87 -67 -289 -25 -249 17 -305 172 -119 -223 -110 -86 -317 42 -157 24 -315 47 66 -177
4181a77N0J15J63L23m23m0J73k90J88m66K04L47L5l58N8l50N54q5l17J30N20l82
$$ -177 -127 -12 151 474 51 11 184 -106 82 -384 -180 167 202 -156 -98 -448 106 21 -296 -166 354 -28
4203b8k1J10k28K93l93K92n6PJJ67k80Q6j83K06N3k73L34q2n6l6L84k34j24P6
$$ -28 -49 61 -167 126 -267 25 -31 -24 -23 144 -136 -50 -233 -27 26 -247 87 5 -51 -87 297 63 -61 15
4227A5NoJ52l6J43l19K7L76j34M8k43K79j2j00L1l1L7l1L46l56J23j0j02Qnk88
$$ 15 20 14 166 130 273 -46 -19 357 223 271 28 307 295 195 226 195 232 201 547 191 314 304 202 210 205 -83
4253h3R6m4Q7qK7J16l3j85J37M0l55J83K56l52J20J07j57N6K50n37J8M40k21J6
$$ -83 13 -31 56 48 75 191 158 -27 110 150 -205 -22 234 -118 2 109 -48 8 258 -279 -261 179 -42 -26
4277b6P2j72j4NK0J54k76K88k1j66m7J93n6l24P1L80k42K12k03O1k95J59J75J24
$$ -26 46 -126 -140 -135 -115 39 -237 51 30 -136 -183 10 -46 -370 -299 81 -161 51 -152 -91 -386 -227 -52 72
4301G2k47QK16j56J71m8m43L62K04l29j78M87o8k59L17k64K30r4k94L47k16J70
$$ 72 -175 -167 49 -107 64 16 -427 -65 139 -190 -368 119 51 -208 109 -155 75 -19 -313 34 -182 -12
4323a2k49L92m86M00L1q9j90J09KM2m7l8K43j9jJ47o56O06J60l26RO9r7K21K58
$$ -12 -261 131 -355 45 76 -13 -203 -94 -92 -50 -97 -135 108 89 88 235 -421 185 345 19 28 97 0 221 479
4348D79m75O5k94L67J38n6J40k24K24l15j99J86J26nn6p5N01n16j15K2K92J35
$$ 479 4 69 -225 142 280 224 364 140 364 49 -150 36 162 157 101 26 527 11 -104 -82 210 345
4370C45k16m55M90j44j04J68k1lj36M31j15j87J43k59k19O4J02J75m9N2l42J52
$$ 345 129 -326 164 20 -84 84 63 60 -76 355 240 53 196 -63 -282 -218 -116 59 10 62 -280 -128
4392a28p5o2L16j17J58R8k44k4k1J97n0J45l61J84K33l49K8J22j46R6l7N8k39
$$ -128 -203 -265 51 -66 92 190 -54 -78 -99 98 48 193 -168 16 249 -100 -72 50 -96 0 -37 21 -218
4415b18K93k60J53l18lM6M55j90k5N8l56J57l4K39MJ9nj81O9J49o0P9k23R6k6
$$ -218 75 -185 -32 -350 -353 -307 148 -42 -67 -9 -365 -208 -242 -3 1 20 15 -166 -97 52 -8 71 -152 -56 -82
4440h2o3q7q5K39j2k98L45k8M3Q0L22k57l45J30J5K2J4j8K4j45K71l87L96p8m9
$$ -82 -145 -232 -317 -78 -90 -388 -43 -71 -28 52 374 117 -228 -98 -83 -61 -47 -65 -41 -186 85 -302 94 16 -33
4465c3O5K36k96R7J59k75J09J51j02q5l0n4J00j28M9L60n01K32k67K18o6J8j18
$$ -33 32 268 -28 69 228 -47 62 213 111 26 -4 -58 42 -86 -37 323 -178 54 -213 5 -61 -43 -161
4488a61L61r8J58k17j06L52j24j83M92n47K7K0k55K56K02j68j07Q3J59p0j12o2
$$ -161 200 102 260 43 -63 289 165 -18 474 -73 -46 -26 -281 -25 177 9 -98 -15 144 74 -38 -100
4510a00J7q6o5L31j78J5K67l57M01k90J74jO7r5O6r9l58N18k84L04l21K99j33
$$ -100 -83 -169 -234 97 -81 -66 201 -156 245 -45 129 128 195 100 166 67 -291 227 -57 247 -74 225 92
4533I2J72j95j43K72j85p6k70J02L02L4n2j10j43J83j39L88l94K09o9r5J3K41
$$ 92 264 69 -74 198 13 -63 -333 -231 71 105 53 -57 -200 -17 -156 232 -162 47 -22 -117 -104 137
4555A37j39j15J5J63m70K81J17m5J60j79P5r1O1j05K9J80MJ18l01J02k0k56N96
$$ 137 -2 -117 -102 61 -409 -128 -11 -56 104 -75 0 -91 -30 -135 -106 74 78 196 -105 -3 -23 -279 317
4578C17n19L12k59j93L51o3l6j98K26R5M7K0l24j61L72l09L32j08J08J04K91o24
$$ 317 -202 110 -149 -342 9 -54 -90 -288 -62 33 80 100 -224 -385 -13 -322 10 -98 10 114 405 -219
4600b19K87j43o5Q0j15J4Q0l1j02J83Q5J73j81j57M4J17j09J75O5k55j4k3J34
$$ -219 68 -75 -140 -60 -175 -161 -81 -112 -214 -31 54 227 46 -111 -67 50 -59 116 181 -74 -88 -111 23
4623B3J42k75P2J56J19j59L6Nj38m5K09j9m68L91J31j44nK43Q1k08J29m85J2K72
$$ 23 165 -110 -38 118 237 78 114 119 -19 -64 145 126 -342 49 180 36 31 274 355 147 276 -209 -197 75
4647G5K65k88J14j24p3J18J37k74QJ28k6j32K22j4p7n0K80m21j03K74J12k84j6
$$ 75 340 52 166 42 -31 87 224 -50 -42 86 60 -72 150 136 59 9 289 -132 -235 39 151 -133 -149
4670a49K03j65Rq9k38L50p9K21o6K38j10p1J74k83J3P2K61l48J98K69l41k4J21
$$ -149 54 -111 -102 -191 -429 -79 -158 63 -3 235 125 54 228 -55 -42 30 291 -57 141 410 69 45 166
4693A66l84L65j3l15J52l0j22J34R3j29J19k15Q6M1J01k68Q1L11l70n4J00p4K52
$$ 166 -218 147 134 -181 -29 -59 -181 -47 46 -83 36 -179 -93 -52 49 -219 -138 173 -197 -251 -151 -225 27
4716B7k00O30j32l99J38N9j50j42K80j64L8K25j75r2ql7NP0J14l64J53o6M73k87
$$ 27 -173 457 325 -74 64 123 -27 -169 111 -53 -15 210 35 -57 -65 -102 -97 -27 87 -277 -124 -190 283 -4
4740dJ46l27J29M7rJ47j82J86k2q2n2K56j14n4j75K62n9J6j7J5L2k48J79j91K18
$$ -4 142 -185 -56 -9 -18 129 -53 133 111 29 -23 233 119 65 -110 152 93 109 92 107 139 -109 70 -121 97
4765I7L20n01N1L8M6J97p2L5n4r3K11k57j99M72k06j50Q7P6N6N8N5k17L3k79l8
$$ 97 417 -84 -33 5 51 248 176 211 157 64 275 18 -181 291 85 -65 22 98 154 212 267 50 83 -196 -234
4790b34J71J74J5l40L74r4J73m65N20k79N2j10o3J76q4J30J97k31j55J63n05M64
$$ -234 -63 111 126 -214 160 66 239 -226 294 15 67 -43 -106 70 -14 116 313 82 -73 90 -415 49
4812D9n3k63R5J53m07M17j55J40j60K52L61p02M27k23J50k80K2J61K0R7l74P4
$$ 49 -4 -267 -172 -19 -426 -9 -164 -24 -184 68 429 -273 154 -69 81 -199 -177 -16 4 101 -273 -199
4834a99L39k91J84m3R7k19L5K16m21K22J46n4J33J5l5kLo7Q7l24M9J56m65M40
$$ -199 140 -151 33 -10 87 -132 -97 119 -302 -80 66 12 145 160 125 123 126 59 146 -178 -129 27 -438 2
4858Bp3j21k4L1J11l1O2j18Q0M2q7J24O0k97R0k3L0J00K65l78J50j13K74o8J24
$$ 2 -71 -192 -216 -185 -74 -105 -43 -161 -81 -39 -126 -2 58 -239 -149 -172 -142 -42 223 -155 -5 -118 156 88 212
4883B12K9k60P1j39K5L64l3m95L07K23l87j12N00m83L27N0k18K43k43P5j86K73
$$ 212 241 -19 52 -87 -62 302 269 -226 81 304 -83 -195 305 -178 149 199 -19 224 -19 56 -130 143
4905A43j71L7R4Q1M3k10O5j38j89OJ32Q0j84K22o1N2o26P50K4k33J71Mm99J63
$$ 143 -28 9 103 184 227 17 82 -56 -245 -239 -107 -27 -211 11 -50 2 -624 126 150 -83 88 92 -407 -244
4929b44qL94j86K01m9k36J26j2q3K8R2NJ59l23L02j05k1o6j89J52n9Q0J05j59
$$ -244 -252 142 -44 157 108 -128 -2 -14 -97 -69 23 28 187 -136 166 61 40 -26 -215 -63 -122 -42 63 -96
4953i6N8R3J4k41K67N8k60K47k39R0j64J52l08J75o3J75k10M34k92O7q0k77L53
$$ -96 -38 55 69 -172 95 153 -107 140 -99 -9 -173 -21 -329 -154 -217 -42 -252 182 -110 -43 -123 -400 -47
4976d7j0J07n3L5j57P5l02L04q0J10j15J1L16k33K73l26J37J64o9ll9qK28m01
$$ -47 -57 50 -3 32 -125 -50 -352 -48 -128 -18 -133 -122 194 -39 234 -92 45 209 140 137 98 90 318 -83
5000h3m0P4J10j84J68R0O6L37n06n0j58L54l4k68K01j07J41l38K81j95M7J66k41
$$ -83 -123 -49 61 -123 45 135 201 538 32 -18 -176 178 144 -124 77 -30 111 -227 54 -141 -94 72 -169
5023a69J41K76j11j83P6J03R6j36k43M0o0L93q4j04j2mk58M02o5N6j12J99k51
$$ -169 -28 248 137 -46 30 133 229 93 -150 -110 -170 223 139 35 23 19 -239 163 98 154 42 241 -10
5046a0j6j10N39n56n1K23J2J53r2K81m19l2J66k12R6j62K28N3K5k11p5K16j97
$$ -10 -26 -136 403 -153 -204 19 31 184 92 373 -46 -78 88 -124 -28 -190 38 91 116 -95 -170 46 -151
5069a51K2qJ86m7Rj3k69Q8j70K69qK44M9l92k49M86j38J23k6k02J55M5K51n15
$$ -151 -129 -137 49 2 11 -2 -271 -183 -353 -84 -92 152 201 -191 -440 46 -92 31 5 -197 -42 3 254 -261
5093b61J04M61m59O1J04J16k74K30j25j73M18l34L36l4M4k56J9K01J0k0L3l15
$$ -261 -157 304 -155 -94 10 126 -148 82 -43 -216 202 -132 204 170 214 -42 -23 178 188 168 201 -114
5115a14Q9J70k71J38K27j13l9k18N3K47j44k32M01k16PN2Mj02j52k5J82R9O3L8
$$ -114 -25 145 -126 12 239 126 87 -131 -78 169 25 -207 194 -22 -15 37 41 -61 -213 -238 -56 43 106 144
5139A44k0K19l89j84L45K0k64R8J22l43Q7L36j74L12j43j53k23J40M1rJ83Q1L
$$ 144 124 343 -46 -230 115 135 -129 -31 91 -252 -165 171 -3 309 166 13 -210 -70 -29 -38 145 226 229
5162B29k22j89L7q2J34n0J91k54J62L62k95J65m65J28k6M98n01J39J27j37R8j01
$$ 229 7 -182 -145 -227 -93 -143 48 -206 -44 318 23 188 -277 -149 -175 323 -178 -39 88 -49 49 -52
5184e2K7P0j43J56K55n16M67k75m1J60j47o8j14RJ46O6j61J1N8K32l17L17k03
$$ -52 -25 45 -98 58 313 -203 264 -11 -52 108 -39 -107 -221 -212 -66 0 -161 -150 -92 140 -177 140 -63
5207f3J89k07j28K27j25r7KL51j79K1j93M0R6O2K6pK20o8j7j30k30K75k7q8K25
$$ -63 126 -81 -209 18 -107 -204 -202 149 -30 -9 -202 -162 -66 -4 22 15 235 167 150 20 -210 65 38 -50 175
5232A75p4l02J32M6J6J31l06K28q1R5p1Q3Kl1J0j05P5j32J38j30L46j22k44j7
$$ 175 101 -201 -69 -23 -7 124 -182 46 -35 60 -11 72 74 43 53 -52 23 -109 29 -101 245 123 -121 -138
5256a38J47J85r2l70L81J7O7l25K28J0O4n0k44j34L20k21R7LP6m2J53j13J13j86
$$ -138 9 194 102 -268 113 130 197 -128 100 110 174 124 -120 -254 66 -155 -58 -55 21 -21 132 19 132 -54
5280e4R7J57qj34J1j40n8L61lm2j06k28J91K01k80k5K3J53l38M73k8p5Mq7K06
$$ -54 43 200 192 58 69 -71 -129 232 229 187 81 -147 44 245 -35 -60 -37 116 -222 251 223 148 152 65 271
5305B71j10r7M0j54M5k23L61k08Q1k33K71j15P3l6J62K9om18M25k08q8K02k28
$$ 271 161 64 104 -50 -5 -228 133 -75 6 -227 44 -71 2 -34 128 157 151 -267 158 -50 -138 64 -164
5328a64L09m13j35O65k58j54J28j90J82k66K12QL5R2j33J29J49l55O5OK71r3j09
$$ -164 145 -268 -403 262 4 -150 -22 -212 -30 -296 -84 -76 -41 51 -82 47 196 -159 -94 -88 183 90 -19
5351a9J05j87N2N4j23K11k72J20Q0R5j72J2j23J40J07n8Q4P9N3k83J25j92K31
$$ -19 86 -101 -49 5 -118 93 -179 -59 21 116 -56 -44 -167 -27 80 22 106 185 238 -45 80 -112 119
5374A19l33N50k74j75J78n7L63j22l61L19o1k13J14o1N5%L1j76K05k57K78km93
$$ 119 -214 336 62 -113 65 8 371 249 -112 207 146 -67 47 -14 41 41 72 -104 101 -156 122 120 -373
5397c73L76J17o5K41j95k10J85l3j21K5J35R1l75K75Qj43K63o4j78m1j25J8K43
$$ -373 3 120 55 296 101 -109 76 43 -78 -53 82 173 -202 73 81 -62 201 137 -41 -82 -207 -189 54
5420E4o3L6P8k98N53m15J89j48J18R0j78q0O7P0J53l55J00k73N63k15J72l86K98
$$ 54 -9 27 105 -193 360 -55 134 -14 104 194 16 -64 3 73 226 -129 -29 -302 261 46 218 -168 130
5443A30n9l67K59k03P3O4m4J15J9l2J29j04p3j50N27k53M7o0J59l06L94n58N78
$$ 130 71 -296 -37 -240 -167 -103 -147 -32 -13 -45 84 -20 -93 -243 284 31 78 18 177 -129 265 -293 285
5466B85k08m11N50k23J12k02j75L26N2J3j32J67n3m18M40j55J90L7j09l07J77
$$ 285 77 -334 216 -7 105 -97 -272 54 106 119 -13 154 101 -317 123 -32 158 195 86 -221 -44
5487d4J67j16K30k68J06j68j39K53M1j98J31J76k69rQJ26j11J10K30k99J39J61
$$ -44 123 7 237 -31 75 -93 -232 21 62 -136 -5 171 -98 -107 -99 27 -84 26 256 -43 96 257
5509B57l4m19K69J90n25L75j57P0J46m05L68q0n0L8J29m35J71j71M05m3k7l98
$$ 257 223 -196 73 263 -262 113 -44 26 172 -233 135 55 5 43 172 -263 -92 -263 142 99 72 -326
5531c26M06l7l2O2J45j54j68K40l27J67O9q1J55K43n17L37l26J81N8n7J19J53
$$ -326 80 43 11 73 218 64 -104 136 -191 -24 45 -36 119 362 -155 182 -144 37 95 38 157 310
5553C10n33K15j38K38p6L2J38p3j08o0J4j97K44j19r5L37j85K32l6l81L24r6k63
$$ 310 -223 -8 -146 92 16 48 186 113 5 -55 -41 -238 6 -113 -208 129 -56 176 140 -241 83 -13 -276
5576b76K97J62j69NL5j6j6l58L05K84n43J72p9K45M7L8j19j29K70r5j21J28J08
$$ -276 21 183 14 19 54 38 22 -336 -31 253 -290 -118 -197 48 95 133 14 -115 155 60 -61 67 175
5599A75j76K2k4k16J29K91K32l72j51O1l6J61M2J8j79OM2p6J5L7Jm8J29N1k11
$$ 175 -1 21 -3 -219 -90 201 433 61 -90 -29 -65 96 138 156 -23 -17 25 -51 -36 1 2 -46 83 134 -77
5624g7J70k83N52k32L20l01J89m86PK15j55K78k76P8j63J26J93k68J39K39k61
$$ -77 93 -190 362 130 450 149 338 -148 -141 74 -81 197 -79 -1 -164 -38 155 -113 26 265 4
5645DJ02k5L0j11L6r3j23J39l2K21j71R3j17P1Q9j93L8K4O6l2K25k8l65L40j76
$$ 4 106 81 111 0 36 -57 -180 -41 -73 148 -23 70 -47 24 113 -80 -42 -18 48 16 241 213 -152 188 12
5670A2k84P5J54J47j43o8j25k3K61r8j37M04k59J1K3J55q7%K0L1m7L6j84J53k92
$$ 12 -272 -197 -43 104 -39 -107 -232 -255 6 -92 -229 175 -84 -73 -50 105 18 18 38 69 22 58 -126 27 -265
5695b65K94k5N3q9M16j86Nk06Qq3l11K99K80j16j11j61R9j85K21J94j14K1J71
$$ -265 29 4 57 -32 384 198 203 -3 5 -78 -389 -90 190 74 -37 -198 -99 -284 -63 131 17 38 209
5718B09j51j53J19l06L08J76J4j82P5j11j20K84l63M2J38K08m9m55M28j76J42
$$ 209 58 -95 24 -282 26 202 216 34 109 -2 -122 162 -201 -159 -21 187 138 -317 111 -65 77
5739G7J17q4l9QJ2m0o8K41j44L80k85j56j36LR9K09j13j79J28k0m5L6J33m65M71
$$ 77 194 110 71 79 91 51 -17 224 80 460 175 19 -117 -114 -15 194 81 -98 30 10 -35 1 134 -331 140
5764A40P8l16J38k09K6K06r6J21j39j0j22Q5l6K60l23J56j40J26J48j3n7J33l27
$$ 140 218 -98 40 -169 -143 63 -33 88 -51 -61 -183 -98 -134 126 -197 -41 -181 -55 93 80 23 156 -171
5787a71M59k03M5pJ15n91M21r5p7K00l89L02k3J91O2n15L28J05j4k44M1N3K15
$$ -171 288 85 130 123 238 -353 68 -27 -104 96 -293 9 -14 177 239 -276 52 157 143 -101 -60 -7 208
5810B08k95PK18k89K21j27o2J54j38J24m6L16m73L44r9j06j22J40J43k75n0J31
$$ 208 -87 -80 138 -151 70 -57 -119 35 -103 21 -25 291 -182 162 63 -43 -165 -25 118 -157 -207 -76
5832g6mJ98q8j70N9M0j17l8K72qj57R0J59j48M3K17m64K56O6m6j47Q7j52L63m40
$$ -76 -80 118 30 -140 -81 -41 -158 -196 76 68 -89 1 160 12 55 272 -192 64 130 84 -63 24 -128 235 -205
5857b05L7K38j48k3Q7L2N0k55P1K33j61p8J58j25R4K1k86K61j25J34k1M6Q8p2
$$ -205 -168 70 -78 -101 -14 18 68 -187 -116 117 -44 -122 36 -89 5 26 -260 1 -124 10 -11 35 123 51
5881E1J39lk53J2J1q7j84j20N51j06n5J08r7r4J66k2K8k0m5n0K22k69J26k84L31
$$ 51 190 187 -66 -54 -43 -130 -314 -434 117 11 -44 64 -33 -127 39 17 45 25 -20 -70 152 -117 9 -275 56
5906E6N3k6Q2k7j8n0%P6q7j06P1J65l21J81r0J5k33L27J87k38o8J00Q2m6P3J7
$$ 56 109 83 165 138 120 70 70 146 59 -47 24 189 -132 49 -41 -26 -259 68 255 17 -51 49 131 85 158 175
5932A75M9k20N7q0K30k31k88M31J16m86L17j20J7K66l98M28J4j74j82K07j29M5
$$ 175 224 4 61 -19 211 -20 -308 123 239 -247 70 -50 -33 233 -165 263 277 103 -79 128 -1 44
5954D4o6r8J21j81J67K5k59M65k05L45m43K52j9j16K12k70J66j62J84K57j73o72
$$ 44 -22 -120 1 -180 -13 12 -247 218 13 358 -85 167 148 32 244 -26 140 -22 162 419 246 -426
5976d26N16l47L51k98J23k3N0K69J46j97k81L45l31J34l90N22j23K85m23J78j22
$$ -426 90 -257 94 -204 -81 -104 -54 215 361 164 -117 228 -103 31 -359 163 40 325 -98 80 -42
5997d2J02O0j07M1p5K9j84J18k96K93LL99k72n2l18K27J14j64J74m0Q4r7Kp1J69
$$ -42 60 120 13 54 -21 8 -176 -58 -354 -61 -58 341 69 17 -301 -74 40 -124 50 10 94 -3 -1 -72 97
6022I7R1o5q1q7J02%p8m0J55j64j41N1l0J09J37o5J16k93K71N2k16p3k91K44P7
$$ 97 188 123 42 -45 57 57 -21 -61 94 -70 -211 -160 -190 -81 56 -9 107 -186 85 137 -79 -152 -443 -199 -122
6047a22J57l30K22Q7k03M40l87K53J11j95j03k5j16M19m1m79P3L5K50m20L07J01
$$ -122 35 -295 -73 14 -189 251 -136 117 228 33 -70 -95 -211 208 167 -312 -239 -204 46 -374 -67 34
6069C4K94l96J01R2l40L16j31j02J46j79M9RJ71l23K02R7Jj18j9k4j27J8J6J95
$$ 34 328 -68 33 125 -215 101 -30 -132 14 -165 -116 -107 64 -259 -57 40 41 -77 -96 -120 -247 -229 -213 -18
6093a8J48l44K13j23J62L4k58J66m9K66k59K08q7M5J03J1k99K12L6l14K19P8q5
$$ -18 130 -214 -1 -124 38 72 -186 -20 -69 197 -62 146 59 104 207 218 -81 131 167 -147 72 150 65
6116F5K90n49n4K90P8l5k68K09L4J9j59pM63n69j17L47N8j28K5R5j98N3j60L71
$$ 65 355 -194 -248 42 120 85 -183 26 60 79 -80 -87 376 -193 -310 37 95 -33 -8 87 -111 -58 -218 153
6140A53m3j99J64J76k94O9L2j51k6M11r9k46K70q0k53M9K40l00J92l75R2M1l2
$$ 153 110 -89 75 251 -43 26 58 -93 -119 292 193 -53 217 137 -116 -67 173 -127 65 -310 -218 -177 -209
6163b09J10k74M31j6n9J35O7j19j84K2J35J90k49J3P8j03n7k07J42J28P1o9K14
$$ -209 -99 -373 58 42 -17 118 185 66 -118 -96 39 229 -20 -7 71 -32 -89 -296 -154 -26 45 -24 190
6186A90r5j1p6j78j76L43Q5N9l15K74j20j48M43l83K40j37%k57K09K48o63M26
$$ 190 95 84 8 -170 -346 -3 82 141 -174 100 -20 -168 275 -108 132 -5 -5 -262 -53 195 -468 -42
6208d2Q0j90K55k90K88l04J8Q0M1M8J26j58r7J66m53L00L42l28J51m43M54r1q
$$ -42 38 -152 103 -187 101 -203 -185 -105 -64 -16 110 -48 -145 21 -432 -132 210 -118 33 -410 44 -47 -55
6231e5j32K66O9l55n1M29J9n5Q4l68J09j00o0J72J85j23o2L63j79k18K10k26P6
$$ -55 -187 79 148 -207 -258 171 190 135 219 -149 -40 -140 -200 -28 157 34 -28 335 156 -62 148 -78 -2
6254bQ7J04k25J8l52M73k03J88k7K02k35n8L21k23q3P2Q1k27J34j58M0J24q3J03
$$ -2 85 189 -36 -18 -370 103 -100 88 61 263 28 -30 291 68 -15 57 138 -89 45 -113 -73 51 -32 71
6278G1j30K56M5j72l02K96J6L8J38j74m15L04Q1J58j08j75M68o58Q8K23Q4j80
$$ 71 -59 197 242 70 -232 64 80 118 256 82 -333 -29 52 210 102 -73 395 -263 -175 48 132 -48
6300d8j43K91j2J19k85JL44j97J11m0k7j69M2K38l47N8P5j81L45Q6l11J54q5j30
$$ -48 -191 100 88 207 -78 -77 267 70 181 141 114 -55 -13 225 -122 -64 11 -170 175 261 -50 104 19 -111
6324a11K97l24L14j88L37n93L34k38J2K98j30r1P1R5m2o3k5Q2l0j63J5J03L7K25
$$ -111 186 -138 176 -12 325 -268 66 -172 -160 138 8 -83 -12 83 41 -22 -47 35 5 -158 -143 -40 -3 222
6348B22l57K47m5l50l4K73k27K98N9l8J45m50K93J12j86J70n4j20Q2K19l40K12
$$ 222 -135 112 67 -283 -317 -44 -271 27 86 48 193 -257 36 148 -38 132 78 -42 40 259 -81 131
6370A31j1J25k58J05K3j12L1P8L1J31k40k88J99L17k17r6K98j3n25L75M9k08k03
$$ 131 120 245 -13 92 115 3 34 112 143 274 34 -254 -55 262 45 -51 247 234 -291 84 133 -75 -278
6393b78L27J86j40Q7nj22j91L18k33k17J61K17l5k4J05n77K75L04l75K60m64O05
$$ -278 49 235 95 182 177 55 -136 182 -51 -268 -107 110 75 51 156 -421 -146 158 -217 43 -421 184
6415A84k07k2K91k92n7L08l23j30L12n98M14J93N4L7j01k92K57k34K41N7Q1k9
$$ 184 -23 -45 246 -46 -103 205 -118 -248 64 -534 -120 73 127 164 63 -229 28 -206 35 92 173 144
6437A44j46j20L60m52l2K97j47oJ07J93j98j67L81j76P5q9l19K52j1K66k74q8
$$ 144 -2 -122 238 -214 -246 51 -96 -102 5 198 0 -167 214 38 113 24 -295 -43 -54 212 -62 -150
6459a50R2O9j29K6j15L16k75J12j59k17K75L13m4j1r5l16K46k71K9K69p4rk9L28
$$ -150 -58 11 -118 -92 -207 109 -166 -54 -213 -430 -155 158 114 103 8 -308 -62 -333 -304 -35 -109 -118 -147 181
6483A81j24J33m81K09J23q2j35J8M3J22j11K21k11k0j37L27k30O2L40j04J02k67
$$ 181 57 190 -291 -82 41 -41 -176 -158 -115 7 -104 117 -94 -114 -251 76 -154 -92 248 144 246 -21
6505b1K8J1J08j72l9J69O7o0j68K2j99L52k8o2p7J8J89k4j79K44j22k63L26l54
$$ -21 7 18 126 -46 -85 84 151 91 -77 -55 -254 98 70 8 -69 -51 138 114 -65 179 57 -206 120 -234
6529b34K24j28K44q3J10J30m85N3K34Ol60L04q2K8Q9K24l20n9J06m0j28L3J77
$$ -234 -10 -138 106 23 133 263 -222 -169 65 71 -289 15 -67 -39 50 274 -46 -105 1 -39 -167 -134 43
6552D3p2R5j10J36L7p9Ml0O7k51J43J9m7J14o4j00j46M2L58j39J5J16o95Q56l15
$$ 43 -29 66 -44 92 129 50 54 24 91 -160 -17 2 -45 69 5 -95 -241 -199 159 20 35 151 -544 312 -3
6577cQ0M1m5j25l05K79j13K68P2j42J61p1l93M28j3j47J7K26m39M51k99l3M92
$$ -3 77 118 73 -52 -357 -78 -191 77 149 7 168 97 -296 132 119 -28 -11 215 -224 227 -72 -105 387
6600C87k93j73J51j78J49J33j45L78k90j57J01j57K50l9j03M8l3k8L9r0n1K98
$$ 387 94 -79 72 -106 43 176 31 409 119 -38 63 -94 156 117 14 62 29 1 40 -50 -101 197
6622A97m3j51J38l95M22k45n0K55j1l60N11k66l8L8N9j1j46K16p6p2j5R5j03p5
$$ 197 154 3 141 -254 168 -77 -127 128 117 -243 268 2 -36 2 61 50 -96 120 44 -28 -43 52 -51 -126
6646a26J19J17j87J07j97M09j26l27J01J59k1k70j3L89k75J57P6k74l6N78l43
$$ -126 -7 110 -77 30 -167 242 116 -211 -110 49 28 -242 -255 134 -141 16 92 -182 -218 360 17
6667A7J08j57k9M3j05M48j44j32J75k08j01j46J37J90j15J75k82m9M01m39j06
$$ 17 125 -32 -61 -18 -123 325 181 49 224 16 -85 -231 -94 96 -19 156 -126 -175 226 -213 -319
6688c19M10o0P7L9l10J41j27j89M41m5l48L06o5J06k00J44K9k69K23j11R4K45
$$ -319 91 31 108 147 -163 -22 -149 -338 103 58 -290 16 -49 57 -143 1 30 -239 -16 -127 -33 212
6710B12j19q9pK8k72Q5J72K57l84o7J08n4J42j28J75J37o8j10j31J44J18r3M3
$$ 212 93 4 -3 25 -247 -162 10 267 -117 -184 -76 -130 12 -116 59 196 128 18 -113 31 149 56 99
6733I9Jj80j03L10j26J38k14q7K27l5l40L27J11j59j18L76m23J9K15r1K73j8l33
$$ 99 100 -80 -183 127 1 139 -75 -162 65 30 -310 17 128 -31 -149 227 -196 -177 38 -53 220 202 -131
6756a31R0k07M02j16j86j06L66n55P15l26k11K64m7L33k68J15K29j16J47k74N7
$$ -131 -41 -248 154 38 -148 -254 112 -443 272 -54 -265 -1 -48 285 17 132 361 245 392 118 175
6777A75r2j51N3k79J05L77k30K36pl58K23K8k87L79m32L60j73J51nJ8j41J72k73
$$ 175 83 -68 -15 -294 -189 188 -42 194 187 -171 52 80 -207 172 -260 100 -73 78 73 91 -50 122 -151
6800a51j4K30r6J89q2k67L35Rn00J36N5R1J40L1r8m01K68o1K54r3o9j3j9J91k93
$$ -151 -165 65 -31 158 76 -191 144 153 -347 -211 -156 -65 75 106 8 -393 -125 -186 68 -25 -94 -107 -126 65 -228
6825b28O06j99j48P2r3j69K31k01Q3r2K67P2l37qO4R0L23m90J57l7J32j84M8q8
$$ -228 378 179 31 103 10 -159 72 -129 -46 -138 129 201 -136 -144 -80 10 333 -157 0 -37 95 -89 -41 -129
6849a29K87J2j52k1J18k85j42L80MK06l09j30K84j07j67J92J19J70l51j5k03L40
$$ -129 158 170 18 -3 115 -170 -312 68 72 278 -31 -161 123 16 -151 41 160 330 -21 -36 -239 101
6871A01j93L01j40l1Loq4L67l04k07K73N3n59K97L94l76j16Q5P1j34L11j25M3
$$ 101 -92 209 69 38 41 35 -49 318 14 -193 80 133 -426 -129 265 -111 -227 -142 -71 -205 106 -19 24
6894B4J89m9j14J45m22L97j05J08j70j48K46r0p8K3J85J77m92O8L76j50k98L03
$$ 24 213 164 50 195 -227 170 65 173 3 -145 101 11 -67 -44 141 318 -174 -106 270 120 -178 125
6916A25j56l2oj6L7P3p8n5J43p6J21j37k78J60L08k53m1K17K1k35j83L97j70J98
$$ 125 -31 -63 -69 -85 -48 25 -53 -108 35 -41 80 -57 -335 -175 133 -120 -161 56 77 -158 -341 56 -114 84
6940H4k15K13O4l99L04k89K14p8J31k06K23j98N70n51J50q1j31J17o5K30j85J42
$$ 84 -131 82 146 -253 51 -238 -24 -102 29 -177 46 -152 418 -133 17 -64 -195 -78 -143 87 -98 44
6962D4j8n3m0K0L40j97j57L1j18J14j63N20j17k37J58LJ3k83J95m3j10j85K61
$$ 44 26 -27 -67 -47 293 96 -61 -30 -148 -34 -197 323 206 -31 127 130 143 -140 55 12 -98 -283 -22
6985b2j3m1j37K41j4L9O4Jk8j85L20m13K08o6l1j14p2L71k8k81R0K5J02J55k70
$$ -22 -35 -76 -213 28 14 53 117 118 90 -95 225 -188 20 -46 -77 -191 -263 108 80 -201 -111 -86 16 171 -99
7010i9J96j2R1n1l18K87l13L88j79j03K81j46q9k3k8L0K09j48J31Q9k01M5l5j
$$ -99 97 85 176 125 -193 94 -219 169 -10 -113 168 22 -67 -90 -118 -88 121 -27 104 193 -8 37 2 1
7034ARj72J30J27R1j61k5N1N5k01Q4r9K13j84L21l2m87L62n3J20m5m1p3j19J11
$$ 1 10 -162 -32 95 186 25 0 51 106 -95 -11 -110 103 -81 240 208 -279 83 30 150 105 64 -9 -128 -17
7059a7k7pL14n02J60J94j8l6l9r1K09j02k69L02j06K87k11J48Q2k80K10J48m40
$$ -17 -44 -51 263 -239 -79 115 97 61 22 -69 140 38 -231 71 -35 252 41 189 271 -9 201 349 -91
7082i1O6M6J7J52k34j35J72J43l90N10k77J71j63Oo9m0J40l2p7J5q6J11J96n3
$$ -91 -25 21 38 190 -44 -179 -7 136 -254 256 -21 150 -13 -7 -76 -116 24 -8 -85 -70 -156 -45 151 98
7106I8p2k47JK01N7j45K80N8n87J59J89j02L9L0Q0J7J08k32J35J5O0l44O6J71
$$ 98 26 -221 -220 -19 38 -107 173 231 -356 -197 -8 -110 -71 -41 39 56 164 -68 67 82 142 -202 -136 35
7130C5l09L67j35m8J38K04j49K10k89L17k90j20J38j30J00J16q3M9k01K2j49M02
$$ 35 -274 93 -42 -90 48 252 103 313 24 341 51 -69 69 -61 39 155 72 121 -80 -58 -207 195
7152A95O4m40l9K39K5QOq6K52l45J09m5j02K15j81K53l83K22L93k83j46m8L57
$$ 195 259 -181 -220 19 44 52 58 -28 224 -121 -12 -57 -159 56 -125 128 -255 -33 360 77 -69 -117 240
7175B40n16J38K80j42J63J06k67q2K4K49Oj12j76l28L71K12k77k32M84j65K52
$$ 240 -276 -138 142 0 163 269 2 -80 -56 193 199 87 -89 -417 -46 166 -111 -343 141 -24 228
7196B28k09j39K35o7k61L06j82qR3J49l18j3K11Q8n3On3K03j28M2K69o87L23O0
$$ 228 19 -120 115 48 -213 93 -89 -97 -4 145 -173 -186 25 113 60 66 13 216 88 130 399 -288 35 95
7220I5Q6k97J40j21K80k91m9K14qJ83k11K09l04o9mJ01k22J07O0J24Q9k72P6R8
$$ 95 181 -116 24 -97 183 -108 -157 57 49 232 21 230 -74 -143 -147 -46 -268 -161 -101 23 112 -160 -84 14
7244A4Ol8n1P1q3K00j35j41K8j66N37k32p0PO5J60k57k8J97k5k26O5JrJ65q9J01
$$ 14 20 -18 -69 2 -81 119 -16 -157 -129 -295 242 10 -60 -53 12 172 -85 -113 84 59 -167 -102 -101 -110 55 -34 67
7271F7k11K00j86Q5K68k50K3j99L96M0j10k14R9j30K69j90M2n4j7J44k98K66J08
$$ 67 -144 56 -130 -45 223 -27 -4 -203 193 233 123 -91 8 -122 147 -43 -1 -55 -72 72 -226 40 148
7294A48n7k26J22j54K86j12L22m0k67K47k57M10k33j87J27j67l3J27J96l20K43
$$ 148 91 -135 -13 -167 119 7 329 289 22 269 12 422 189 2 129 -38 -71 56 252 -68 175
7315A75q5J11L3O2k63k36k2N29n2j06j33N0n8K76m4j52j2j26J83R2pj49p2J70
$$ 175 90 201 234 296 33 -203 -225 304 252 146 13 63 5 281 237 85 73 -53 130 222 215 66 -6 164
7339A64m01L55j91j30L65pj41m25K51J46K17l58kJ77J6J55n6j7k32L65l72J03
$$ 164 -237 118 -73 -203 162 155 14 -411 -160 -14 203 -155 -157 20 36 191 135 118 -114 251 -121 -18
7361a8J75k79J93J32k04k32K52j18O9K59l89K72k42j40L65n45O35j7q7J7l54P0
$$ -18 157 -122 71 203 -1 -233 19 -99 -30 229 -160 112 -130 -270 95 -450 185 168 81 98 -256 -186
7383a86L58m06j9L28K7k62L44k02KR0PP1l09N40k30l05O5J09j3n7Kr0nJ43K63
$$ -186 172 -234 -253 75 102 -160 184 -18 -16 74 81 152 -157 383 153 -152 -87 22 9 -48 -46 -136 -141 2 265
7408B65l87R9O1k94M92k20K39k69J01j70M95l51L5Pm2K8j62K73q8k40L19m10J30
$$ 265 -122 -23 38 -256 236 16 255 -14 87 -83 412 61 96 103 61 89 -73 200 112 -128 191 -219 -89
7431h9J04K52l17N4k68N16k14M2k73K59k8J2j26J90j20lL65k48j72j04J00K88
$$ -89 15 267 -50 4 -264 252 38 80 -193 66 38 50 -76 114 -6 -9 356 108 -64 -168 -68 220
7453B20n00J16L62k75P7J22p8m43N43l51J32j17J85l13N20KK1rk11J67k36NN2
$$ 220 -280 -164 198 -77 0 122 44 -399 144 -207 -75 -192 -7 -320 200 202 223 214 3 170 -66 -61 -9
7476ij34L14q0k59M32m06Q5L75l54j41J20j9K12M2J45m15M03o88M07J87l9j58
$$ -9 -143 171 91 -168 264 -142 -57 318 -36 -177 -57 -76 136 178 323 -92 311 -377 30 217 178 20
7498B0L76k50J53r7j70J67k18p4R2p0J6K32N6j64l37M68k62J20o6q6J26k5J00
$$ 20 396 146 299 202 32 199 -19 -93 -1 -71 -55 177 233 69 -268 200 -62 58 -8 -94 32 7 107
7521A07N3k85J50Q1K1Qj27L47n17L99l86J65M3k50J64l2o9K15j22o1q1j6J22j48
$$ 107 160 -125 25 106 127 135 8 355 -162 237 -149 16 59 -191 -27 -59 -128 87 -35 -96 -177 -193 -71 -219
7545b19M8JM74m05L88l27n8N8J30p9Q6K81m66k3J63q1J10j17om8j41N2M61m31
$$ -219 -171 -170 304 -101 287 -40 -98 -40 90 11 97 378 -88 -111 52 -29 81 -36 -42 -90 -231 -179 282 -149
7569a49J50M3k3n7k95O14m32Q2J73l21J68l09J16K16R6k21j39J00K61j21j6J16
$$ -149 1 44 21 -36 -331 283 -149 -67 106 -215 -47 -356 -240 -24 72 -149 -288 -188 73 -48 -64 52
7591E2L03j2m53j06J13k6J55j6p2J00l52L01n8J07j92J26J97k90L7J26Q3j63J6
$$ 52 355 343 -110 -216 -103 -129 26 10 -62 38 -314 -13 -71 36 -156 -30 167 -123 -86 40 123 -40 -24
7614b4k21M27m3o3Kj10K33k55K44k70K22j24J71k83K18l09K70N0k14k6K85k05
$$ -24 -245 182 139 76 78 -32 201 -54 190 -80 142 18 189 -94 124 -185 85 135 -79 -105 180 -25
7636b5j36L25k35J09j35J76k35J44K76r7l40J73n7J14k2J34j39J04k1K22l24O6
$$ -25 -161 164 -71 38 -97 79 -156 -12 264 167 -173 0 -57 57 35 169 30 134 113 335 11 77
7658G7j78j80L69J2k7j21K34j72N1j41o4M39l05j62NJ42P1L2j56J81m7J69m69
$$ 77 -101 -281 88 100 73 -48 186 14 65 -76 -140 299 -6 -168 -163 -21 50 82 -74 107 60 229 -240
7681b40K18n2L44m0q6j71oJ66j25Q6n2K16l6j30n5J35m9k12KP1Q5k4L5L4j56n4
$$ -240 -22 -74 270 230 144 -27 -33 133 8 94 42 258 222 92 37 172 123 -89 -87 -16 69 45 80 114 -42 -96
7707i6K08K09J6n43K25j57j8q8J64K52l50L43l64M21n49J19L83k63J67j01j39
$$ -96 112 321 337 -206 19 -138 -156 -244 -80 172 -178 165 -199 222 -327 -208 175 -88 79 -22 -161
7728a61J88J28j13j35j98L63k06K00l88L58n1J39m00L51l08j6K64l02R8J32M9
$$ -161 27 155 42 -93 -291 72 -134 66 -322 36 -15 124 -276 75 -233 -249 15 -287 -189 -57 -8
7749hn4J53j61r0K37l2j23J11k51J17l9R1k85O7L66K0R6l06K32J22k88o6M1K24
$$ -8 -62 91 -70 -160 77 45 -78 33 -218 -101 -140 -49 -334 -267 99 119 215 -91 141 263 -25 -91 -50 174
7773A74n39J54M15ok93J08k03N6K66n0l2p6R6k7K93m18K00q2j72N2Q4j96M02l52
$$ 174 -365 -211 204 198 -95 13 -190 -134 132 82 50 -26 70 43 336 -82 118 36 -136 -84 0 -196 206 -146
7797a46L18J37m52P8p7K27mJ9j23q6L9k79J63R1L98j89j18R1l52M02J42l85J22
$$ -146 172 309 -143 -65 -142 85 81 100 -23 -109 -70 -349 -186 -95 303 114 -4 87 -265 137 279 -106 16
7820A6j16M3K21O8k33J98j05m04K89j08L39l05J83o3k9n0j19M6L6J15j14m5J15
$$ 16 -100 -57 164 232 -1 197 92 -312 -23 -131 208 -97 86 23 -6 -56 -175 -129 -93 22 -92 -137 -22
7843b2J45r4j72L2L51p1l39kQ3r5K72r5k12R2M4M9J5J81k60J25r0K46J0j9k38
$$ -22 123 29 -143 -111 240 169 -170 -172 -89 -184 88 -7 -219 -127 -83 -34 -19 162 -98 27 -63 183 193 174 -64
7868f4MJ52k16J75j43M6j56J33J95j79o2L27j87p1L68j88j48J09j97J51P3j09
$$ -64 -60 92 -124 51 -92 -46 -202 -69 126 -53 -115 212 25 -46 322 134 -14 95 -102 49 122 13
7890A3j13k2K37k03R8K4J00k98P9L62k85K27k75pK99k97J08J58j85K13m15j07
$$ 13 -100 -122 115 -88 10 34 134 -164 -85 277 -8 219 -56 -63 236 -61 47 205 20 233 -182 -289
7912b89K16K99j71j63j95q5M22J54k26J37J80k92K47k13K7Lj79M72k79J59l83
$$ -289 -73 226 55 -108 -303 -388 34 188 -38 99 279 -13 234 21 48 51 -128 344 65 224 -159
7933a59P6l5K24k39r4K74op4L8p8p3q2Q7K22J33m14J39J83l17K71m8J75l34N39
$$ -159 -83 -118 106 -133 -227 47 41 -33 5 -73 -146 -228 -141 81 214 -200 -61 122 -195 76 28 203 -131 408
7957D08j90N8j84n8j79J05J45r7j16J97k66J00J96j82J82JQ5m15pQ9k14L08p3
$$ 408 218 276 92 34 -145 -40 105 8 -108 89 -177 -77 119 -63 119 120 205 -210 -217 -128 -342 -34 -107
7980a07M0k20N91j58N7k82q6K29k42O5j78M80j81J85j10k59j51N07j69K36L5l91
$$ -107 -67 -287 304 146 203 -79 -165 64 -178 -113 -291 189 8 193 83 -176 -327 180 11 247 282 -109
8002a09K60j93m7J51Oj44J67l19K38j61J74K5L6K9k14J61j20L85k05j36j15J24
$$ -109 151 -42 -89 62 68 -76 91 -228 10 -151 23 48 84 113 -101 60 -60 325 120 -16 -131 -7
8024gJ17l45K3K59k01qo7O5K61j48m3K13j85P2M5k01J67k18L18j52o4K23OK6m18
$$ -7 110 -235 -212 47 -154 -162 -229 -164 97 -51 -94 119 -66 6 51 -150 17 -201 117 -35 -99 124 130 156 -262
8049b62L36k57K29j96J65J39l34L64n5k30q2O0J72k36J73L62l17r0J4j19q7K22
$$ -262 74 -183 46 -150 15 154 -180 184 129 -101 -183 -123 49 -187 -14 348 31 -59 -45 -164 -251 -29
8071b9j7L84j81k87L53j36p3j40R8j30Q1J92j29j83L40j78L56p87P57m12K5O9
$$ -29 -46 338 157 -130 223 87 14 -126 -28 -158 -77 115 -14 -197 143 -35 321 -466 291 -121 -96 -27
8093b7J07K6l64K21J83j94j36L06k62J33k70M65k2l22K16M1K88l54L9m9J42l64
$$ -27 80 106 -258 -37 146 -48 -184 122 -140 -7 -277 188 166 -156 60 101 389 35 74 25 167 -197
8115a97J08j36M16j91j10P3j36P6q5L21n50J79L72l42L07l9j08L29l83O9M1M0
$$ -197 -89 -225 191 0 -110 -37 -173 -97 -182 139 -411 -232 140 -202 105 66 -42 287 -96 -27 14 54
8137E4N5j94K23J16j3J8n9l16J01L1J21j30j25L20k95J70j41K89j90p8K47j98
$$ 54 109 -85 138 254 241 259 200 -116 -15 16 137 7 -118 202 -93 77 -64 225 35 -43 204 6
8159Fk4R1q5J22j65JJ16j75l30P99l95O5n8J41R1j54j1J23m02K34J90k35m5K98
$$ 6 -18 73 -12 110 -55 -54 62 -113 -443 356 -39 26 -32 109 200 46 35 158 -244 -10 180 -55 -100 198
8183A98l93L32j75q9K75l36K86p5
$$ 198 -195 137 -38 -127 148 -188 98 23
8191B3
$$ Imaginary data points
##PAGE= N=2
##DATA TABLE= (X++(I..I)), XYDATA
0@%%%%%%%%%%%lJ1j6J6j6J6k1K9l2L7m5N1n9O9q0R0j01J15j30J49j69J87k08K34
$$ 0 0 0 0 0 0 0 0 0 0 0 0 -3 8 -8 8 -8 8 -13 16 -16 21 -24 27 -32 37 -43 47 -54 61 -69 80 -89 98 -110 124
35A24k63K93l24L60l98M39m89N41n97O61p34Q15r08J015j135J276j447J654j912
$$ 124 -139 154 -170 190 -208 231 -258 283 -314 347 -387 428 -480 535 -600 676 -771 883 -1029
54a029K245k690L324m310O078j0235L7806L8549k0627M093M94L284j0441l919
$$ -1029 1216 -1474 1850 -2460 3618 -6617 31189 69738 49111 53204 53698 56982 46541 42622
68D2622j461P10j0242p614k454J899o472p791k162M458j741m929n73O154K012
$$ 42622 41161 41871 31629 24015 21561 23460 16988 9197 7035 11493 9752 4823 4250 10404 12416
83A2416k521j055O132N092j584k773L471M917j193n043M6L770j739o171k565K096
$$ 12416 9895 8840 14972 20064 18480 15707 19178 24095 22902 17859 17905 21675 19936 13765 11200 13296
99A3296j21n965l993J257J617l730m564J444K689j946m360N47L905k74l375j099
$$ 13296 13175 7210 3217 4474 6091 2361 -2203 -759 1930 -16 -4376 -3829 76 -198 -3573 -4672
115d672L601J212l217k609K663K954k292l627J806L680j038l396J64L958M62l805
$$ -4672 -1071 141 -3076 -5685 -3022 -68 -2360 -5987 -4181 -501 -1539 -4935 -4771 -813 -351 -4156
131d156j529L274J067l755l295J799K124l462m530N22K436k138l653N1L342P55
$$ -4156 -5685 -2411 -1344 -5099 -8394 -6595 -4471 -7933 -12463 -11941 -9505 -11643 -15296 -15245 -11903 -11148
147a1148k062L35M450L465l39K14N375M832P51M4L706M743J230j896J120L328
$$ -11148 -13210 -12875 -8425 -4960 -5299 -5085 290 5122 5873 5917 9623 14366 15596 13700 14820 18148
163A8148m73l021k182J466k12m068l941O79K55l450k764k29K126j132j673L72
$$ 18148 17675 14654 12472 13938 13726 9658 5717 6396 6651 3201 437 208 2334 1202 -471 -99
179i9L575J309r87M24L214K552j012r84K305K028j346k300R3J044r85l507j606
$$ -99 3476 4785 3798 4222 7436 9988 8976 7992 10297 12325 10979 8679 8772 9816 8831 5324 3718
196C718P78q21l578k173Q00J034k363k066J398J714p35j547J466K435L17j286
$$ 3718 4496 3675 97 -2076 -1276 -242 -2605 -4671 -3273 -1559 -2294 -3841 -2375 60 377 -909
212i09M19K616Q81j566n14J998J053j528j440J376J493j160j828N30J551n33j757
$$ -909 -490 2126 3007 1441 927 2925 3978 2450 1010 2386 3879 2719 891 1421 2972 2439 682
229F82o13J582L92k530r86J193K06j603k306M03K63j401k289k63R05o28k197m60
$$ 682 69 1651 2043 -487 -1473 -280 -74 -1677 -3983 -3580 -3317 -4718 -7007 -7270 -6365 -6993 -9190 -9650
247i650J492P14j322k98K133J353J41m36J917K293P0j64R12K320K09j132k63J683
$$ -9650 -8158 -7444 -8766 -9064 -6931 -5578 -5437 -5873 -3956 -1663 -1593 -1757 -845 1475 1684 552 289 1972
265A972L21j860j227Q95K58j309j686N61N24m32j575K55J251J017j040j11K234
$$ 1972 2293 433 -794 101 359 -950 -2636 -2075 -1551 -1983 -3558 -3303 -2052 -1035 -2075 -2186 48
282D8J158p32J2J928J525o31p89R25J353m08j441k5Q74m52j924r11M90j23j901
$$ 48 1206 474 486 2414 3939 3308 2519 3444 4797 4389 2948 2923 3797 3345 1421 510 1000 877 -1024
301a024r60K19J75j357j313R7P18k21j073j84J008P37j189P1J531O30m58j19J060
$$ -1024 -1984 -1765 -1590 -2947 -4260 -4163 -3445 -3666 -4739 -4923 -3915 -3178 -4367 -4296 -2765 -2135 -2593 -2712 -1652
320a652J179J26o66N55J612J43o98l48J481J18j312k37P96l7j447p36K41L8j275
$$ -1652 -473 -347 -1013 -458 1154 1297 599 251 1732 1850 538 301 1097 1060 -387 -1123 -882 -844 -2119
339b119j072l19M75m64j752j18R81K73r31J25R78J016l06j63J015R93M0l93O06
$$ -2119 -3191 -3510 -3035 -3499 -5251 -5369 -4388 -4115 -5046 -4921 -3943 -2927 -3233 -3396 -2381 -1388 -1348 -1741 -1135
358a135J457l27r27J1Q50m6j597m72M06l11j102j046K01L4p95r17l1P68J00j036
$$ -1135 322 -5 -932 -921 -71 -117 -1714 -2186 -1780 -2091 -3193 -4239 -4038 -4004 -4799 -5716 -5747 -4979 -4879 -5915
378e915L20J058L64K59K54J000J206K45l05J105J247J12k30O15M30K48o41J3L94
$$ -5915 -5595 -4537 -4173 -3914 -3660 -2660 -1454 -1209 -1514 -409 838 950 720 1335 1765 2013 1372 1385 1779
397A779o55n55l59m41J34n41j088N13j42j07q25r7J013n0k15N86Q24O92J38J10
$$ 1779 1124 569 210 -231 -97 -638 -1726 -1213 -1355 -1462 -2287 -2384 -1371 -1421 -1636 -1050 -226 466 604 714
417G14J151J256J75j18R30J204p9n42J151N01j38n15j96N26P0p34o41j12N06r22
$$ 714 1865 3121 3296 3178 4108 5312 5233 4691 5842 6343 6205 5690 5494 6020 6090 5356 4715 4603 5109 4187
437D187o76L6O81o87o05J61O78K35m79J95Q12O16k58L32P63P64j56p5R39L14q5
$$ 4187 3511 3547 4228 3541 2936 3097 3775 4010 3531 3726 4538 5154 4896 5228 5991 6755 6599 6524 7463 7777 7692
458G692o8K1L44J05r25k43j73q7r28m87l84n9q74o99l03L11o74p29l75L84J94
$$ 7692 7624 7645 7989 8094 7169 6926 6753 6666 5738 5251 4867 4808 3934 3235 2932 3243 2569 1840 1465 1849 2043
479B043l58m92K96M35l65n34Q60K93q15p4m6J8k64m12m75L05n54n71q92l05k56
$$ 2043 1685 1193 1489 1924 1559 1025 1885 2178 1363 1289 1243 1261 997 585 110 415 -139 -710 -1602 -1907 -2163
500b163j198p20j41l32o93j063n4r9k38p39k81Q8K15j79J71K64Q28k75L92N56
$$ -2163 -3361 -4081 -4222 -4554 -5247 -6310 -6364 -6463 -6701 -7440 -7721 -7633 -7418 -7597 -7426 -7162 -6334 -6609 -6217 -5661
520e661Q40K91P0O74M17K51L14K66J77O58o90j22N54k44p00k52n2j00p38m74O9
$$ -5661 -4821 -4530 -4460 -3786 -3369 -3118 -2804 -2538 -2361 -1703 -2393 -2515 -1961 -2205 -2905 -3157 -3209 -3309 -4047 -4521 -4452
541d452J17k46m82R7O43L87K40L34R34M89O81O27M75J180L73P09Q72M04N34n9
$$ -4452 -4335 -4581 -5063 -4966 -4323 -3936 -3696 -3362 -2428 -1939 -1258 -631 -156 1024 1397 2106 2978 3382 3916 3857
561C857J2l4r4k75n19j10J68j033k44k76l50K10m47K42O10j24R9Q12N70R91M38
$$ 3857 3869 3835 3741 3466 2947 2837 3005 1972 1728 1452 1102 1312 865 1107 1717 1593 1692 2504 3074 4065 4503
582D503Q33J166L66N67N57N60O69k38j59n4L18r10p14m36j70j085j083q71n58
$$ 4503 5336 6502 6868 7435 7992 8552 9221 8983 8824 8770 9088 8178 7464 7028 6858 5773 4690 3819 3261
601C261o30n76o63l72l62l32o98j8j33J78n18J71K56L12j54QK26L61r2j94M30
$$ 3261 2631 2055 1392 1020 658 326 -372 -390 -523 -345 -863 -692 -436 -124 -278 -270 -44 317 225 31 461
622D61j59K34l33K61m2K61n68l06k06O3o68k57j20l22m08j92n65J12k4k10L02
$$ 461 302 536 203 464 422 683 115 -191 -397 -334 -1002 -1259 -1379 -1701 -2109 -2301 -2866 -2754 -2778 -2988 -2686
643b686LN07k73O59N97R53L09P20O03Q46O56O5L06Q19j03k19K05k10m02q99n06
$$ -2686 -2683 -2176 -2449 -1790 -1193 -240 69 789 1392 2238 2894 2959 3265 4084 3981 3762 3967 3757 3355 2456 1950
664A950l99r27p84o32n07p84k82J37l49J07N12M65O44R10Q65P60J255P65J096
$$ 1950 1551 624 -160 -792 -1299 -2083 -2365 -2228 -2577 -2470 -1958 -1493 -849 61 926 1686 2941 3706 4802
683D802P50N97O37K48N21n52M7J3j004Km24o25m11r72m21n23l66m89K16k08J56
$$ 4802 5552 6149 6786 7034 7555 7003 7050 7063 6059 6061 5637 5012 4601 3629 3208 2685 2319 1830 2046 1838 1994
704A994P2m1P11kK83K03N63l11K11j13k98k77l63l90p58m93m98j053m47l24r91
$$ 1994 2066 2025 2736 2734 3017 3220 3783 3472 3683 3570 3272 2995 2632 2242 1484 991 493 -560 -1007 -1331 -2322
725b322p37o08l08j38j91n17L7j7k91l07ll35O4k46m19n5k06K25l51L53l97J56
$$ -2322 -3059 -3667 -3975 -4113 -4304 -4821 -4784 -4801 -5092 -5399 -5402 -5737 -5673 -5919 -6338 -6393 -6599 -6374 -6725 -6372 -6769 -6613
747f613K11L60OP13p6J53M32O8N68j27K77j78M46m66m98J57p28m38j74q06n5m08
$$ -6613 -6402 -6042 -6036 -5323 -5399 -5246 -4814 -4746 -4178 -4305 -4028 -4206 -3760 -4226 -4724 -4567 -5295 -5733 -5907 -6713 -6768 -7176
769g176n39j93j9K40k83L67L94O14L92N14O81M86M72L79O59M32O2M8L48l53k98
$$ -7176 -7715 -7908 -7927 -7687 -7970 -7603 -7209 -6595 -6203 -5689 -5008 -4522 -4050 -3671 -3012 -2580 -2518 -2470 -2122 -2475 -2773
790b773P5j16n20j74Q7l16K67j94M05M5M41M37N18O63P36N42O64P60M88L90O63
$$ -2773 -2698 -2814 -3334 -3508 -3421 -3737 -3470 -3664 -3259 -3214 -2773 -2336 -1818 -1155 -419 123 787 1547 2035 2425 3088
811C088L62j15L89qj16j22k73J33k41q30Q6l38J92k91q8k94J59O3j89L41l7m0
$$ 3088 3450 3335 3724 3716 3600 3478 3205 3338 3097 2267 2353 2015 2207 1916 1828 1534 1693 1756 1567 1908 1871 1831
833A831k7K87m64J8l63j16k19l87j31o42j91l04j82M5l9Lk04L12L83J52R6N35
$$ 1831 1804 2091 1627 1645 1282 1166 947 560 429 -213 -404 -708 -890 -845 -884 -881 -1085 -773 -390 -238 -142 393
855C93K11K31J55K15Q3L14j63k46l07m43l16l69k91m87o12r8k14j62j25K2k95
$$ 393 604 835 990 1205 1288 1602 1439 1193 886 443 127 -242 -533 -1020 -1632 -1730 -1944 -2106 -2231 -2209 -2504
876b504L74L78m9M86J32O42qM0J92J02k41o2j53o52j43j64o46m37j68j83m49l05
$$ -2504 -2130 -1752 -1801 -1315 -1183 -541 -549 -509 -317 -215 -456 -518 -671 -1323 -1466 -1630 -2276 -2713 -2881 -3064 -3513 -3818
898c818j05k74J92j46J17K00K50K33N50M50L04K00K13N96o2J30M40L36K1j01j12
$$ -3818 -3923 -4197 -4005 -4151 -4034 -3834 -3584 -3351 -2801 -2351 -2047 -1847 -1634 -1038 -1100 -970 -530 -194 -173 -274 -386
919c86r7L60l82J57L2J57j21l02L50j58L57l27L55M61o91L83k23K61j86N7k68
$$ -386 -483 -123 -505 -348 -316 -159 -280 -582 -232 -390 -33 -360 -5 456 -235 148 -75 186 0 57 -211
940b11J77q3O6J11j05L6l8L00R4l03J38J28M52o6L80M3k47K00N25p40Q6J95l87
$$ -211 -34 -117 -51 60 -45 -9 -47 253 347 44 182 310 762 696 1076 1119 872 1072 1597 857 943 1138 751
963G51K26k17n58J92j48l4j95j23J73o0M32K69J59L93J24K32M68J99L86j15Q8
$$ 751 977 760 202 394 246 212 17 -106 67 7 439 708 867 1260 1384 1616 2084 2283 2669 2554 2642
984B642J03k81J95K18k86m51j68l05J58q76k60m06j87J18k71k7p7J3R5N3j0N10
$$ 2642 2745 2464 2659 2877 2591 2140 1972 1667 1825 949 689 283 96 214 -57 -84 -161 -148 -53 0 -10 500
1006E00k72N73jm5J83K55k51J9%k14k4k29jl91k54q8M1j19m12L45k13q3j49K49
$$ 500 228 801 800 755 938 1193 942 961 961 747 723 494 493 102 -152 -240 -199 -318 -730 -385 -598 -681 -830 -581
1030e81j48J05L9L21K05jk93L71K19M5R4k90N7K9J33j56l01K92k54L12l33R1k66
$$ -581 -729 -624 -585 -264 -59 -60 -353 18 237 282 376 86 143 172 305 149 -152 140 -114 198 -135 -44 -310
1053c10J87mj04P3m7p5l9J17k74R5p6K05J5j13J52N2J91j25o5K43j37M69j50j34
$$ -310 -123 -127 -231 -158 -205 -280 -319 -202 -476 -381 -457 -252 -237 -350 -198 -146 45 -80 -145 98 -39 430 280 146
1077A46M32M1K08k15qK57j87L6K45l38K42k95M12k99K71J58k27j07J71J15j27
$$ 146 578 619 827 612 604 861 674 710 955 617 859 564 976 677 948 1106 879 772 943 1058 931
1098I31j5N11j88l76k05K97K16o7q8k37L09l54R5J21k47k03K4P5L7j27Mo8P5J13
$$ 931 916 1427 1239 863 658 955 1171 1104 1016 779 1088 734 829 950 703 500 524 599 636 509 513 445 520 633
1122F33j75m50K15K02l04N6p0j45k99r8K05O8l49k30n7o5M2L2m59J7P8q4r2K70
$$ 633 458 8 223 425 121 177 107 -38 -337 -435 -230 -162 -511 -741 -798 -863 -821 -789 -1248 -1231 -1153 -1237 -1329 -1059
1146a059j65j08Q0k7k50J07R4l21L48r8L18n18K80j04k5k23Q7j07L2L50p19L80
$$ -1059 -1224 -1332 -1252 -1279 -1529 -1422 -1328 -1649 -1301 -1399 -1081 -1599 -1319 -1423 -1448 -1671 -1584 -1691 -1659 -1309 -2028 -1648
1168a648j48j31L06m36K41j2L00q5Q5K25jM37k95K41J96P7j23L41Oj39M22m65
$$ -1648 -1796 -1927 -1621 -2057 -1816 -1828 -1528 -1613 -1528 -1303 -1304 -867 -1162 -921 -725 -648 -771 -430 -424 -563 -141 -606
1190f06J92R8q8R6o9l5K60j15J19l2l86N94l94J74K04J81R2j82K35K0Q5J9J44
$$ -606 -414 -316 -404 -308 -377 -412 -152 -267 -148 -180 -566 28 -366 -192 12 193 285 103 338 358 443 462 606
1213F06K05j83K39J15L74l86M87L7Ol16P9k27J52J55j13p4l35O4K40n47K18Q2
$$ 606 811 628 867 982 1356 970 1457 1494 1500 1184 1263 1036 1188 1343 1230 1156 821 885 1125 578 796 878
1235H78j44j87j73K66K7k17K96m2jJ03j00NM60m32j07j72J44l15J01l79P6j89
$$ 878 734 547 374 640 667 450 746 704 703 806 706 711 1171 739 632 460 604 289 390 11 87 -102
1257a02j48pl29k16l49K02l32K35l04j93J90o6j67j6K3Q9J25J36P9K1J02m75P11
$$ -102 -250 -257 -586 -802 -1151 -949 -1281 -1046 -1350 -1543 -1353 -1419 -1586 -1602 -1579 -1490 -1365 -1229 -1150 -1129 -1027 -1502 -791
1280g91n2q5pj71L5Kk80K8L4Qj75n0p3qk8J11j29j0l3J59l6J5J26J77n0N47k32
$$ -791 -843 -928 -935 -1106 -1071 -1069 -1349 -1321 -1287 -1279 -1454 -1504 -1577 -1585 -1613 -1502 -1631 -1641 -1674 -1515 -1551 -1536 -1410 -1233 -1283 -736 -968
1307i68l6M28l0j54n2j7L34l04j55K12R5j42j99K42l11P1R4P8M66l70J12J83L77
$$ -968 -1004 -576 -606 -760 -812 -829 -495 -799 -954 -742 -647 -789 -988 -746 -1057 -986 -892 -814 -348 -718 -606 -423 -46
1330d6k86O5L07N8m0j7N06K6j52J18M57l53j58N80j40p0l40k0K90J00k24J19J79
$$ -46 -332 -267 40 98 58 41 547 573 421 539 996 643 485 1065 925 855 515 495 785 885 661 780 959
1353I59j28k5j4J00K69j86r5O7k31K55j24q7k08l4j24j48J27P4j93r0J1J55L0
$$ 959 831 806 792 892 1161 975 880 947 716 971 847 760 552 518 394 246 373 447 254 164 175 330 360
1376C60K12k08M1%J66r6j13J3k87J74j81R3j25Ll84l4K58j74j22J18L07Q0j47
$$ 360 572 364 405 405 571 475 362 375 88 262 81 174 49 52 -332 -366 -108 -282 -404 -286 21 101 -46
1399d6j71J46K1K27K8j71J5J21m1l8jJ01l3l44R2lL58n3n11M6j9j12j43o1M85
$$ -46 -217 -71 -50 177 205 34 49 170 129 91 90 191 158 -186 -94 -97 261 208 -303 -257 -276 -388 -531 -592 -107
1424a07l61J02k0J92l1L19K8j40l4oJ95j24J68J59j82O2n8l70L08o2M5n5m3k4
$$ -107 -468 -366 -386 -194 -225 94 122 -18 -52 -58 137 13 181 340 158 220 162 -208 100 38 83 28 -15 -39
1448c9J52K10K41J86k71J56J64KL04K5j31K42m30L53m3j11L36m23L8l36K43q3
$$ -39 113 323 564 750 479 635 799 801 1105 1130 999 1241 811 1164 1121 1010 1346 923 961 625 868 785
1470G85q9RK33j0j36P1o1K30l6K07l4k6J38j18N3p4l57R5q1r8mN7l40N9m50rL26
$$ 785 696 705 938 928 792 863 802 1032 996 1203 1169 1143 1281 1163 1216 1142 785 880 799 701 697 754 414 473 23 14 340
1497C40j15R4O9k1j09K7O3M50j60P6K85k80J50P8j81Q1p7j74l23j50P6k71L4k25
$$ 340 225 319 388 367 258 285 348 798 638 714 999 719 869 947 766 847 770 596 273 123 199 -72 -38 -263
1521b63j29J34k0K08l08l3M04k20L45O8k44j00J51K02k74l7L6k84j3J60j34k06
$$ -263 -392 -258 -278 -70 -378 -411 -7 -227 118 186 -58 -158 -7 195 -79 -116 -80 -364 -377 -217 -351 -557
1543e57J8k25K61k64j35n7J41J18K2k52J21J83N1k4NK06q2J08n4q6M68n9Lk03
$$ -557 -539 -764 -503 -767 -902 -959 -818 -700 -678 -930 -809 -626 -575 -599 -594 -388 -470 -362 -416 -502 -34 -93 -90 -293
1567b93l55K78o7K99j21j2k17L85j6Q6K18k41o0p5J04j83k4J85J20k88r5L73j95
$$ -293 -648 -370 -437 -138 -259 -271 -488 -103 -119 -33 185 -56 -116 -191 -87 -270 -294 -109 11 -277 -372 1 -194
1590a94J19P5p0J31M2ol1p0J16K31k03K41L28l29J78K94m09O42p00J18M0k1m8
$$ -194 -75 0 -70 61 103 97 66 -4 112 343 140 381 709 380 558 852 443 1085 385 503 543 522 474
1613D74J38l11k72J65l03J95M26m47J02K37k1K58j71J92L85l11J14L7j49N06l21
$$ 474 612 301 29 194 -109 86 512 65 167 404 383 641 470 662 1047 736 850 887 738 1244 923
1634I23j33M53j67o82J83K03n18j86K79o3J5n33J39J64k00J08k02J74J03j54J97
$$ 923 790 1243 1076 394 577 780 262 76 355 292 307 -226 -87 77 -123 -15 -217 -43 60 -94 103
1655A03K64l38R5Q5K64j13k34M91l94m60L80k69R2J22m34J13j82K04k64L30o82
$$ 103 367 29 124 209 473 360 126 617 223 -237 143 -126 -34 88 -346 -233 -415 -211 -475 -145 -827
1676h27K57Jq2J44K8k27J94K12k88L79LK8j37N6K01J0J78j82o8K28q9j98M5l7
$$ -827 -570 -569 -651 -507 -479 -706 -512 -300 -588 -209 -206 -178 -315 -259 -58 -48 130 -52 -120 108 19 -179 -134 -171
1700a71j41L8L4J42j67j54m0k4q6P5l0K38n8k37M42o7oK5L20K3j89L20l7m2K29
$$ -171 -312 -274 -240 -98 -265 -419 -459 -483 -569 -494 -524 -286 -344 -581 -139 -206 -212 -187 133 156 -33 287 250 208 437
1725D37j49J43J48l30J55J91m8j01Pj42k51m0J73k7j41M6j6o4J09Q4K04Kl48M22
$$ 437 288 431 579 249 404 595 547 446 453 311 60 20 193 166 25 71 55 -9 100 184 388 390 42 464
1749D64l68K83j12K57l5p2J38m3K50j48Q6n8k90j28j02J74QQr1k59o2J10j08J68
$$ 464 96 379 267 524 489 417 555 512 762 614 700 642 352 224 122 296 304 312 221 -38 -100 10 -98 70
1773G0o33M72P0p3k55N59j81j86K3J50n8k97J34M53j03Q1k93k58K38j19l6j51
$$ 70 -563 -91 -21 -94 -349 210 29 -157 -134 16 -42 -339 -205 248 145 226 -67 -325 -87 -206 -242 -393
1795c93j97P1J24j5j23m8k42P4K61m21M26l65J77k66K83l13L63j66J25j15J64
$$ -393 -590 -519 -395 -410 -533 -581 -823 -749 -488 -909 -483 -848 -671 -937 -654 -967 -604 -770 -645 -760 -596
1816e96Q4J79K1j75j97J78o3P2o4J19j09j02k07l0J64O0J94k92L50k6j73q6K52
$$ -596 -512 -333 -312 -487 -684 -506 -569 -497 -561 -442 -551 -653 -860 -890 -726 -666 -472 -764 -414 -440 -613 -699 -447
1839d47j77k21L21K13k12K11k14J53K27r3K37P5k46M40m17OJ53j7K66l05K63j06
$$ -447 -624 -845 -524 -311 -523 -312 -526 -373 -146 -239 -2 73 -173 267 -150 -144 9 -8 258 -47 216 110
1861A10L12J15n85N25k38L75k80j4k65J11K01R1J61k02K82k69J0K14l1K29j57
$$ 110 422 537 -48 477 239 614 334 320 55 166 367 458 619 417 699 430 440 654 623 852 695
1882F95j3k1J67j09J39L8k50R2j3J12j05j02M17k65O0P0l25R5J8L26j37r7J01
$$ 695 682 661 828 719 858 896 646 738 725 837 732 630 1047 782 842 912 587 682 700 1026 889 792 893
1905H93K34n46K24j11j03M4p8Q8n1o7o2k59M12l37L3L1j68l0K05Q3k38J50j48
$$ 893 1127 581 805 694 591 635 557 645 594 527 465 206 618 281 314 345 177 147 352 435 197 347 199
1928A99J47l87J05n0J67J1n3l62K16Q2m2j75j03j08K38k16L60k66l1n9R3k43J07
$$ 199 346 -41 64 14 181 192 139 -223 -7 75 33 -142 -245 -353 -115 -331 29 -237 -268 -327 -234 -477 -370
1951c70J36n9p5k21Q9J71k43R6L33L3K32m62k4qL9m1j44K19q3K80l46J91J23j45
$$ -370 -234 -293 -368 -589 -500 -329 -572 -476 -143 -110 122 -340 -364 -372 -333 -374 -518 -299 -382 -102 -448 -257 -134 -279
1975b79k04M65l32J8J92K1J18M6P2o8N8Nk73L73K64j32j29L55k48m7M18J7J08
$$ -279 -483 -18 -350 -332 -140 -119 -1 45 117 49 107 112 -161 212 476 344 215 570 322 275 693 710 818
1998H18l35J1J54m01K05j6J62j48O9N0n2K93n18J96j5J45p1J24O3q7P7k7j06k58
$$ 818 483 494 648 247 452 436 598 450 519 569 517 810 292 488 473 618 547 671 734 647 724 697 591 333
2022C33K23P2k30K72r7P2j19Mr3O8N8j05J75j71J01k13j61J6r5k54J01J26L3l13
$$ 333 556 628 398 670 573 645 526 530 437 505 563 458 633 462 563 350 189 205 110 -144 -43 83 116 -197
2046a97P0m4j85K00J74q8J7p3j02L0O3j22r0P0j64J78j45J14j93J20j01Pj07k06
$$ -197 -127 -171 -356 -156 18 -70 -53 -126 -228 -198 -135 -257 -347 -277 -441 -263 -408 -294 -487 -367 -468 -461 -568 -774
2070g74M13k98K05j75j05J1M3P6m5j15K42m8J15k17O3J7l9N6K45l06OK64k07K28
$$ -774 -361 -659 -454 -629 -734 -723 -680 -604 -649 -764 -522 -570 -455 -672 -609 -592 -631 -575 -330 -636 -630 -366 -573 -345
2094c45K58j69Q5k82K85r3j88K75m86M21N3j3j29M46m78J28M7K9k05K95J47J57
$$ -345 -87 -256 -171 -453 -168 -261 -449 -174 -660 -239 -186 -199 -328 118 -360 -232 -185 -156 -361 -66 81 238
2116B38P3k84P5K73k71P3K00j72j54J67O5J06L7k7k40J42j5j22K98l60K63J53
$$ 238 311 27 102 375 104 177 377 205 51 218 283 389 426 399 159 301 286 164 462 102 365 518
2138E18n26K33j89L04m7j7j97J7K12l77M18o7l53L00J90j63k26j20K20l38M46
$$ 518 -8 225 36 340 293 276 79 96 308 -69 349 282 -71 229 419 256 30 -90 130 -208 238
2159B38j72q4j6l6J76q9l01M40k98j60J18k23L81K9l17r9J85m41K81K15n49K95
$$ 238 66 -18 -34 -70 106 17 -284 156 -142 -302 -184 -407 -26 3 -314 -413 -228 -669 -388 -173 -722 -427
2181d27k29J16p8K59m30L7R5J06j66M3nK29J6k59M97o55K22L4r5J55M0j77J16
$$ -427 -656 -540 -618 -359 -789 -752 -657 -551 -717 -674 -679 -450 -434 -693 -196 -851 -629 -595 -690 -535 -495 -672 -556
2204e56j27p2K63j78l11J40L12l52K74Q5j11L36l38K25r1L82j01m11K85r3J33
$$ -556 -683 -755 -492 -670 -981 -841 -529 -881 -607 -522 -633 -297 -635 -410 -501 -119 -220 -631 -346 -439 -306
2225c06M2k34K32j72K37j12r9P1J5j11K61k19PP3J23K28l10J94K06n8K25l78J68
$$ -306 -264 -498 -266 -438 -201 -313 -412 -341 -326 -437 -176 -395 -388 -315 -192 36 -274 -80 126 68 293 -85 83
2248H3O7Ok72J74K52m0r9J47j51k58L51j70R4r3L25j27n8n5q2K58j14l7L09j59
$$ 83 150 156 -116 58 310 270 171 318 167 -91 260 90 184 91 416 289 231 176 94 352 238 201 510 351
2272C51k30p4M18m05R1r4R2J60m81L70j77J03j14L0J25j3L45j2j75l6p5j73P36
$$ 351 121 47 465 60 151 57 149 309 -172 198 21 124 10 40 165 152 497 485 310 274 199 26 762
2295G62m98r0n7j28K57q5k5k02K17j31m34J84P8J5J14k13K60k19k2J81m1n5M56
$$ 762 264 174 117 -11 246 161 136 -66 151 20 -414 -230 -152 -137 -23 -236 24 -195 -217 -36 -77 -132 324
2318C24j13p6k35k49K93j61L81l28j0K41l86J11k79N05m11N4k3O9J81j47J8m4
$$ 324 211 135 -100 -349 -56 -217 164 -164 -174 67 -319 -208 -487 18 -393 -339 -362 -293 -112 -259 -241 -285
2340b85K11pj56J1j49j42M17k19K24j05mJ05n0r1k13K84j42l5K69l20L2L46k45
$$ -285 -74 -81 -237 -226 -375 -517 -100 -319 -95 -200 -204 -99 -149 -240 -453 -169 -311 -346 -77 -397 -365 -19 -264
2363b64L87m34M50r5j80R6k43J70Q0O3k45K83m72j19K01K42k13J16K12j27J24
$$ -264 123 -311 139 44 -136 -40 -283 -113 -33 30 -215 68 -404 -523 -322 -80 -293 -177 35 -92 32
2384C2j77M21n07J75j28M03j58J08k41K70q6m8K64Q0l33j60P9K26k35N4J0j40
$$ 32 -145 276 -231 -56 -184 219 61 169 -72 198 112 64 328 408 75 -85 -6 220 -15 39 49 -91
2406i1O9M7J01M3j6k65M14j76k4K88j51J19j32M6L46k26K20j81Q9l63q6K13J82
$$ -91 -22 25 126 169 153 -112 302 126 102 390 239 358 226 272 618 392 612 431 520 157 71 284 466
2429D66k93j16K35n5J6J11q9Nl0J04J4k10K99k32j9J80m7p3J60J60k13m8j14Q4
$$ 466 173 57 292 237 253 364 275 280 250 354 368 158 457 225 206 386 339 266 426 586 373 325 211 295
2453B95J66M9k01l33q5K12N7J34o1j96K13j52l9P5j16j2N5M9j0q8k01M88r8r5
$$ 295 461 510 309 -24 -109 103 160 294 233 37 250 98 59 134 18 6 61 110 100 12 -189 299 201 106
2477A06n26L68j70L6J77J12l6o2q2J10K1J58k35J62P8l57L13n5KP8q5Mj5m8j93
$$ 106 -420 -52 -222 -186 -9 103 67 5 -77 33 54 212 -23 139 217 -140 173 118 120 198 113 117 102 54 -139
2502a39J75q1K94J03l1m05m2L36j09K76k79j25L13J18r5k31M64l13J98l57%J00
$$ -139 36 -45 249 352 321 -84 -126 210 101 377 98 -27 286 404 309 78 542 229 427 70 70 170
2524A70k1L22J3j85J84j27J48k04l5J63k13K73j2p0p8KJ60q1k78M11k03k4m21
$$ 170 149 471 484 299 483 356 504 300 265 428 215 488 476 406 328 330 490 409 131 542 339 315 -106
2547a06J81J54J43l0k19Q9qJ79k08j85K64J7m0NO1n95N36k97K11l31n0K10J61
$$ -106 75 229 372 342 123 212 204 383 175 -10 254 271 231 236 297 -298 238 -59 152 -179 -229 -19 142
2570A42l23pJ59m17J50J48j26l11L46Kk05r6j58qL04k22M16j99n74M10o0M1n1
$$ 142 -181 -188 -29 -446 -296 -148 -274 -585 -239 -237 -442 -538 -696 -704 -400 -622 -206 -405 -979 -569 -629 -588 -639
2593f39OK3M9o2l0k94J8K50n2Q9p1K51j27K64k95J75q4M9j39K50k68L8K06p9j5
$$ -639 -633 -610 -561 -623 -653 -947 -929 -679 -731 -642 -713 -462 -589 -325 -620 -445 -529 -480 -619 -369 -637 -599 -393 -472 -487
2618d87j96K74K37k86l42O48m87L69K4k8R8k95K90L7L5P7k04J12J1m3L09k92n8
$$ -487 -683 -409 -172 -458 -800 -152 -639 -270 -246 -274 -176 -471 -181 -144 -109 -32 -236 -124 -113 -156 153 -139 -197
2641a97L06k43K11O4N5j24Q5P2J66q1k8J96p1q6N1j5m7p2J67K75j47l60J13K12
$$ -197 109 -134 77 141 196 72 157 229 395 314 286 482 411 325 376 361 314 242 409 684 537 177 290 502
2665E02Q8m76M73p1j05J72l85J06r6L36l52J31O9N7j94J84j8j22J72k22R3k12
$$ 502 590 114 587 516 411 583 198 304 208 544 192 323 392 449 255 439 421 299 471 249 342 130
2687A30j90j00M56l36L39l89K57j78K51m13M7l2m7L03k16J56j48o5K21k11L66
$$ 130 -60 -160 296 -40 299 -90 167 -11 240 -173 -126 -158 -205 98 -118 38 -110 -175 46 -165 201
2708B01r6j67J9O9j63k04J60K4J53k0j5l98R9R0q8r2k74M58j1m42J89j88L98J53
$$ 201 105 -62 -43 26 -137 -341 -181 -157 -4 -24 -39 -437 -338 -248 -336 -428 -702 -244 -255 -697 -508 -696 -298 -145
2732a45k08K02M2l62J95l9m2O8J4K03J02m3J6j01J39j1m12K24J29r7k4J73j38
$$ -145 -353 -151 -109 -471 -276 -315 -357 -289 -275 -72 30 -13 3 -98 41 30 -382 -158 -29 -126 -150 23 -115
2755a15J14M15l21L30l67M5K80l27J07j39P5o9J78R2N3J55j31J07l3J04j38j91
$$ -115 -1 414 93 423 56 101 381 54 161 22 97 28 206 298 351 506 375 482 449 553 415 224
2777B24K08j8k67K67j55oJ86J51k01K1o5J18n4p1R3kJ54j21j17J26k53J53k7p2
$$ 224 432 414 147 414 259 253 439 590 389 410 345 463 409 338 431 429 583 462 345 471 218 371 344 272
2801B72p0J12k88J59K14k32P1K73j37j4m36N27k23r3K12n7l66J43m6k4%j41L05
$$ 272 202 314 26 185 399 167 238 511 374 360 -76 451 228 135 347 290 -76 67 21 -3 -3 -144 161
2824A61j88m9P6J43k88J88k29J19J33n1r1R0j18k2Q1M3lO8l11K56r9ll92L53K8
$$ 161 -27 -76 0 143 -145 43 -186 -67 66 15 -76 14 -104 -126 -45 -2 -5 63 -248 8 -91 -94 -486 -133 -105
2849a05k02J37o4kJ73J86j79j20J53n4L6J85J02k30j8K65o1O0O4P4j3l05J62K44
$$ -105 -307 -170 -234 -236 -63 123 -56 -176 -23 -77 -41 144 246 16 -2 263 202 262 326 400 387 82 244 488
2873D88j88k02l08M24k1q2M21l81J18k55J24J04j13K20K9N5l6p2Oj3P7k4J58Q2
$$ 488 300 98 -210 214 193 111 532 151 269 14 138 242 129 349 378 433 397 325 331 318 395 371 529 611
2897F11k07j45J29j37l12J97J64M0l21J88J45r1n4J88j96j12J1k56K62K63k29
$$ 611 404 259 388 251 -61 136 300 340 19 207 352 261 207 395 199 87 98 -158 104 367 138
2918A38J34P5l6j47L22j31r7l7j74j36K51j56K90m53KL57l43K44J29k33l7j86
$$ 138 272 347 311 164 486 355 258 221 47 -89 162 6 296 -157 -155 202 -141 103 232 -1 -38 -224
2940b24O26m76PP9j42K0L93j91j75j74N56l46k58LL03o4r5J87m6j3J1J95j8l02
$$ -224 402 -74 -67 12 -130 -110 283 92 -83 -257 299 -47 -305 -302 1 -63 -158 29 -17 -30 -19 176 158 -144
2964a44J85q9K25o1J71r2m36K43j26M1K24k21j15j7j7r4J60J34j80j2p0J85K49
$$ -144 41 -48 177 116 287 195 -241 2 -124 -83 141 -80 -195 -212 -229 -323 -163 -29 -209 -221 -291 -106 143
2987A43J17m99P6M45l46j6Q9r4J49M6j94l9p6Q0J70j51j27n6L50l51k04L47K45
$$ 143 260 -239 -163 282 -64 -80 9 -85 64 110 -84 -123 -199 -119 51 -100 -227 -283 67 -284 -488 -141 104
3010A04j97m3J10K11j87N3j33J23J06k32M4K96k37o8p3k70N00j12n3N6k1j04J02
$$ 104 -93 -136 -26 185 -2 51 -82 41 147 -85 -41 255 18 -50 -123 -393 107 -5 -58 -2 -23 -127 -25
3033b5j00K03j97r2M39j1k52L23k17p4j19J98k1m8r1k12L53O3k24Lr8o5oK44J2
$$ -25 -125 78 -119 -211 228 217 -35 288 71 -3 -122 76 55 7 -84 -296 57 120 -104 -101 -199 -264 -270 -26 -14
3058a4j26j01J72K7K45r9K27l49J5J36k64l6J54J79J11k5k63P5k61K00j62K66
$$ -14 -140 -241 -69 -42 203 104 331 -18 -3 133 -131 -167 -13 166 277 252 -11 64 -197 3 -159 107
3080A07j44l41N21j82K77k99J07N4j79J42j45K45o3L02l58j25Q4M7l44R9J42l4
$$ 107 -37 -378 143 -39 238 -61 46 100 -79 63 -82 163 100 402 44 -81 3 50 -294 -195 -53 -87
3102h7l6k3J56k85J0l0qk98M65J8K67k87K70P8N0j30q0pK15k80p5J38p4Q2Nk16
$$ -87 -123 -146 10 -275 -265 -295 -303 -601 -136 -118 149 -138 132 210 260 130 50 43 258 -22 -97 41 -33 49 54 -162
3128a62l1J10k0j82j20O6M36k10n7q9J06R8pk77L10k21J05l02M42j25R9Om63J57
$$ -162 -193 -83 -103 -285 -405 -339 97 -113 -170 -259 -153 -55 -62 -339 -29 -250 -145 -447 -5 -130 -31 -25 -488 -331
3152c31n7J10j15R6P4J96j84k17O1M55k90Q1l6j57J73J66p2J3L43k82k25J71o9
$$ -331 -388 -278 -393 -297 -223 -27 -211 -428 -367 88 -202 -121 -157 -314 -141 25 -47 -34 309 27 -198 -27 -96
3175i6K54k56k13J26j44L35m11L05r2J41L01l12K15m5j20P1J02Q1j64P0n3K41
$$ -96 158 -98 -311 -185 -329 6 -405 -100 -192 -51 250 -62 153 108 -12 59 161 242 78 148 95 336
3197C36l14J47l39J92k38L94l13%J27M6k01M16n51L48j7Q0j35J28k1j91L22k22
$$ 336 22 169 -170 22 -216 178 -135 -135 -8 38 -163 253 -298 50 33 113 -22 106 85 -106 216 -6
3219fN2o8K84j89j64J49O3J3J27l89J19j41J39j33j27K37k70L71j37K45k51j01
$$ -6 46 -22 262 73 -91 58 121 134 261 -128 -9 -150 -11 -144 -271 -34 -304 67 -70 175 -76 -177
3241a77K58k5l22K34P2q7J25l9m4k32O27n51J81n7O4o4j10J70p8pJ09N9j64J14
$$ -177 81 56 -266 -32 40 -47 78 39 -5 -237 390 -161 20 -37 27 -37 -147 23 -55 -62 47 106 -58 56
3265E6J5l46M42L14m72J12J56k13l48K85Mn0M5J01k15J51OK38k44K3j32K05p8
$$ 56 71 -275 167 481 9 121 277 64 -284 1 5 -45 0 101 -114 37 43 281 37 60 -72 133 55
3288E5j89J70K71j22j75M5l30K26J18K2L42k22m73N87p5k51J68J3O5J2j54j01
$$ 55 -134 36 307 185 10 55 -275 -49 69 91 433 211 -262 325 250 -1 167 180 245 257 103 2
3310BJ11J21RLK45o5k16J14j89K19n02K99m4j27j42J3L37m03J81R8j83J92K88
$$ 2 113 234 243 246 491 426 210 324 135 354 -148 151 107 -20 -162 -149 188 -215 -34 64 -119 73 361
3333C61m17L6L6o0J23m30K26L32m65M48k78r1j0jm0OJ57k83K5J17LL40l78K60
$$ 361 -56 -20 16 -44 79 -351 -125 207 -258 190 -88 -179 -189 -190 -230 -224 -67 -350 -325 -208 -205 135 -243 17
3357A7j32k03j81N32N1l20l1K26m14K66j35P0j28K13o8N8J55J75k74P5j46M9R1
$$ 17 -115 -318 -499 33 84 -236 -267 -41 -455 -189 -324 -254 -382 -169 -237 -179 -24 151 -123 -48 -194 -145 -54
3380e4k33M83l23J0k24L27k07N9r4J31p2Q9j84K05R7J06k93K65n4J94ok00p4N3
$$ -54 -287 196 -127 -117 -341 -14 -221 -162 -256 -125 -197 -108 -292 -87 10 116 -177 88 34 228 222 22 -52 1
3404AmJ58j19M72m10L0o0n1p6Qno7L11m2p3J1K27l09J4m4K15n19N40q0K0j13P4
$$ 1 -3 155 36 508 98 128 68 17 -59 -51 -56 -123 188 146 73 84 311 2 16 -28 187 -332 208 128 148 35 109
3431A09p6K64j38Q9n7J4o6j95R8j48J04R6k50J33j12K15l34K41j36J50JK76k40
$$ 109 33 297 159 248 191 205 139 -56 42 -106 -2 94 -156 -23 -135 80 -254 -13 -149 1 2 278 38
3454C8j45k16K17M16l03j33J56p8J5r4J22Pj36Q2j16J33j88K26j67k4j69K53k08
$$ 38 -107 -323 -106 310 7 -126 30 -48 -33 -127 -5 2 -134 -52 -168 -35 -223 3 -164 -188 -357 -104 -312
3477c12k88N68o4P8k19k9J36J6j77J47j76J38K43j57M8j2n5l3k73M27k90PK54
$$ -312 -600 -32 -96 -18 -237 -266 -130 -114 -291 -144 -320 -182 61 -96 -48 -60 -115 -148 -421 6 -284 -277 -23
3500b3Qp8Qo1o8M7j82K05J6j71J02K68k19K5N5p7J42m52k2L95l9L6L37Q0k73m09
$$ -23 -15 -93 -85 -146 -214 -167 -349 -144 -128 -299 -197 71 -148 -123 -68 -145 -3 -455 -477 -82 -121 -85 252 332 59 -350
3526c50K36n4J04R4Q3l45K01O2J3J17J23j3m84J7K10K33q3kl8j1Q7l69J67L15
$$ -350 -114 -168 -64 30 113 -232 -31 31 44 161 284 271 -213 -196 14 247 164 162 124 113 200 -169 -2 313
3550C13j89l99J17K37N4J73m6J24j00l1L5J4m38k38M99l99K25K23j20R2l03K05
$$ 313 124 -275 -158 79 133 306 260 384 284 253 288 302 -136 -374 125 -274 -49 174 54 146 -157 48
3572D8j25nj92L74j15L0J7j84J10p0K53k83K48N9k08J2k58K71k98M64k65j64L2
$$ 48 -77 -82 -274 100 -15 15 32 -152 -42 -112 141 -142 106 165 -43 -31 -289 -18 -316 148 -117 -281 -249
3595b49J41J82K8n07K29K86l94J30L9n3L11l4k51K06J3O3k33o5J77l0l82K16J36
$$ -249 -108 74 102 -405 -176 110 -284 -154 -115 -168 143 109 -142 64 77 140 -93 -158 19 -11 -393 -177 -41
3618d1k9j6k1M9j46K16qK15m38k2J22j40K19K30j38j6k9m5l09N83l30R5j35K93
$$ -41 -70 -86 -107 -58 -204 12 4 219 -219 -241 -119 -259 -40 190 52 36 7 -38 -347 236 -94 1 -134 159
3642A59j57Op7k9L25k46J63m5r4j30j15L03j38J93j40P4J72P3k60K49j59O9P8
$$ 159 2 8 -69 -98 227 -19 144 99 5 -125 -240 63 -75 118 -22 52 224 297 37 286 127 196 274
3665B74Q2k49K03k95J98j82K44l10rR2j08J34n61K60K24O3l46L02j47L70O5j32
$$ 274 356 107 310 15 213 31 275 -35 -44 48 -60 74 -487 -227 -3 60 -286 16 -131 239 304 172
3687A72J45l30m45M04K92l83L1K05j43K61p5q8J65m34O4jJ52j18N38k5l23N9l18
$$ 172 317 -13 -458 -54 238 -145 -114 91 -52 209 134 46 211 -223 -159 -160 -8 -126 412 387 64 123 -195
3710a95J28l3L92j73L4k70L35k07L99n78J53o9J41k76K95j26l6K09l21L9K51O1
$$ -195 -67 -100 292 119 153 -117 218 11 410 -168 -15 -84 57 -219 76 -50 -86 123 -198 -159 92 153
3732A53K8k82mK16j05m6K58l03J49J52l36L28k46k91M55k70J15p1j13K41j03J82
$$ 153 181 -101 -105 111 6 -40 218 -85 64 216 -120 208 -38 -329 126 -144 -29 -100 -213 28 -75 107
3754A07j4k14J05J03K27k82K09k93l1J62q2j79M42j78k44J16k43L19q4k6J57j78
$$ 107 93 -121 -16 87 314 32 241 -52 -83 79 -3 -182 260 82 -162 -46 -289 30 -54 -80 77 -101
3776a01J06m15K04M42k03k87J85Lm4O6J56j91m2J2M53l92pk29J29J02j54o4J32
$$ -101 5 -410 -206 236 33 -254 -69 -66 -110 -44 112 -79 -121 -109 344 -48 -55 -284 -155 -53 -207 -271 -139
3799a39K83k14j10j21L23r6J16j09O7m2k26J26m3J72J7K13j45r8J27m1M8n8l7
$$ -139 144 -70 -180 -301 22 -74 42 -67 0 -42 -268 -142 -185 -13 4 217 72 -26 101 60 108 50 13
3822A3J39j49mJ51k4j33K06k69L57j61R7k63J88o2J7J23j36k5o4K63q7p6l7Q3
$$ 13 152 3 -1 150 126 -7 199 -70 287 126 223 -40 148 86 103 226 90 65 1 264 177 101 64 147
3846A47k15J77j40p8K20k04qL84r7j27k65R5J01l40M15R4r7J87m01K44p6L68m63
$$ 147 -68 109 -31 -109 111 -93 -101 283 186 59 -206 -111 -10 -350 65 159 62 249 -152 92 16 384 -79
3869g9J13r7O0j85J76J4J05P6l70n3K7J37M2o9L1M22m24J94k31J17N1j57N1L9
$$ -79 34 -63 -3 -188 -12 2 107 183 -187 -240 -213 -76 -34 -103 -72 350 -74 120 -111 6 57 -100 -49 -10
3893a0qJ37P3k96l1p5K82K67m16q8%J3K37j87K57m06K8K17K6L8j76m0J75k69M18
$$ -10 -18 119 192 -104 -135 -210 72 339 -77 -165 -165 -152 85 -102 155 -251 -223 -6 20 58 -118 -158 17 -252 166
3918A66m29J43j24J44mK25l03J27M6L5Kp8J69P1J8j00k01J30K49l36K04K31n21
$$ 166 -263 -120 -244 -100 -104 121 -182 -55 -9 26 28 -50 119 190 208 108 -93 37 286 -50 154 385 -136
3941a36M58m81J73K85l72k50K01O06k96j61k75K33J17j93J29k4m02L46J57k99
$$ -136 322 -159 14 299 -73 -323 -122 484 188 27 -248 -15 102 -91 38 14 -388 -42 115 -184
3961a84L34j68J37P7j27j66L29M4k41J2j71n8rL9J58j81K04j2O1M6k44l2J48p4
$$ -184 150 -18 119 196 69 -97 232 276 35 47 -124 -182 -191 -152 6 -175 29 17 78 124 -120 -152 -4 -78
3985g8P4o4J98j42M1j4P2M7j62m3J36k07J74j99O6Q2J36m63K40L83j44j65k44
$$ -78 -4 -68 130 -12 29 15 87 134 -28 -71 65 -142 32 -167 -101 -19 117 -346 -106 277 133 -32 -276
4008b76M30k10J18m3k28L2K33l11K52J47M0m77M04j09j78J79O9qL8j63l61M54
$$ -276 154 -56 62 19 -209 -177 56 -255 -3 144 184 -293 111 2 -176 3 72 64 102 -61 -422 32
4030C2N2k5l02N37o26K53J95j96O0k3n7K25J85m76K9K25K54k82O7j17JK40l00
$$ 32 84 59 -243 294 -332 -79 116 -80 -20 -43 -100 125 310 -166 -137 88 342 60 127 10 11 251 -49
4053d9J58J55j70P3j43p4K80k02l9OK53q7j86M4O6l0J88l01j3QJ76j35j20K92
$$ -49 109 264 94 167 24 -50 230 28 -11 -5 248 161 -25 19 85 55 243 -58 -71 -63 113 -22 -142 150
4077A50k9k5N7j6o1P3k3j22J12J2j50J96J9j43J3P7m42L80p8j55M66m73rK44m16
$$ 150 121 96 153 137 76 149 126 4 116 128 -22 174 193 50 63 140 -302 78 0 -155 311 -162 -171 73 -343
4102c43J67K32J0j50J42j44R6j03P1K25l15K22m36M73l22K50l85L63O0k8k21K52
$$ -343 -176 56 66 -84 58 -86 10 -93 -22 203 -112 110 -326 147 -175 75 -310 53 113 85 -136 116
4124A16j91L5j38J67m3JJ99M8k20j0J29j77K41o2k26P3o9j88J90K55j63M20k97
$$ 116 -75 -40 -178 -11 -54 -53 146 194 -26 -36 93 -84 157 95 -131 -58 -127 -315 -125 130 -33 387 90
4147I0j55K99j90K8J35q9Nj53m4J91K2J8j70N7J38k24pK08R7M6k11j91K44l7o4
$$ 90 -65 234 44 72 207 118 123 -30 -74 117 139 157 -13 44 182 -42 -49 159 256 302 91 -100 144 107 43
4172D3j11Q6J12j65J74J07j76J22p5j93L22k12P8j39L2J02P6J45k12Q1j55o9J91
$$ 43 -68 18 130 -35 139 246 70 192 117 -76 246 34 112 -27 5 107 183 328 116 197 42 -27 164
4195A64o2o2k3J33l6L3M1J20K2k52j24J26k54K87j47J00J68p4j94o3j8J3P8nm4
$$ 164 102 40 17 150 114 147 188 308 330 78 -46 80 -174 113 -34 66 234 160 -34 -97 -115 -102 -24 -29 -73
4220g3k0M12l71p8jO4r5K99j76Nj3j97L48k54J04m5L1Ro1J76l2K46m16mL49j53
$$ -73 -93 319 -52 -130 -131 -67 -162 137 -39 -34 -47 -244 104 -150 -46 -91 -60 -51 -112 64 32 278 -138 -142 207 54
4246E4K77k58J73l04L48m51J95K43m30L04k5n8q3j15L24l16N17l85k77K87K89
$$ 54 331 73 246 -58 290 -161 34 277 -153 151 126 68 -15 -130 194 -122 395 10 -267 20 309
4267C09k63p0q7J18O6Q1k90j2K68l93K41o8K74j07m1j69K68k06M4j87K56o1j09
$$ 309 46 -24 -111 7 73 154 -136 -148 120 -273 -32 -100 174 67 26 -143 125 -81 -37 -224 32 -29 -138
4290a38j61M95kl42J50k57R6P9J11L4o0J1j46M50n54j4J38M32k24J50k04j34P8
$$ -138 -299 196 194 -148 2 -255 -159 -80 31 65 5 16 -130 320 -234 -248 -110 322 98 248 44 -90 -12
4313a2l2k38K79J31j86K74k18M06l01K09m05jK55O2j14r3J3p7J5r5J73k64K70
$$ -12 -44 -282 -3 128 -58 216 -2 404 103 312 -93 -94 161 223 109 16 29 -48 -33 -128 45 -219 51
4336E1k20J01K59j57n05L28J55k01M65l12j12O9O7l17K32K92k82k0M13m31J82
$$ 51 -169 -68 191 34 -471 -143 12 -189 276 -36 -148 -79 -12 -329 -97 195 -87 -107 306 -125 57
4357E7j92K65N6l03J82N2j92q4J06l0J77M4j28o9J75k33K91j2j29j04j23K90k87
$$ 57 -135 130 186 -117 65 117 -75 -159 -53 -83 94 138 10 -59 116 -117 174 162 33 -71 -194 96 -191
4380a91o6K83p3m3j07K34j20K7l8M6K0K0Q9n6N4k04K53o2j36j29P4j32L6O2K40
$$ -191 -257 26 -47 -90 -197 37 -83 -56 -94 -48 -28 -8 81 25 79 -125 128 66 -70 -199 -125 -257 -221 -159 81
4405H1l46J08K85k18j68L6l4N74k84j64N1JO5k11n6L23j03K11l14J51J25j08j03
$$ 81 -265 -157 128 -90 -258 -222 -256 318 34 -130 -79 -78 -13 -224 -280 43 -60 151 -163 -12 113 5 -98
4428i8Q6j12K51j78J95O7m21L2M44m00M03j3l01O2j03K92n97R2j5K54Q5r3r8J21
$$ -98 -12 -124 127 -51 144 211 -210 -178 266 -134 269 256 -45 17 -86 206 -391 -299 -314 -60 25 -68 -166 -45
4452d5l0JM0r1J83O9r5J40r5Jj74J48L2J44m45R1J41k06K72k1j1k32K77m4O4R9
$$ -45 -75 -74 -34 -125 58 127 32 172 77 78 -96 52 84 228 -217 -126 15 -191 81 60 49 -183 94 50 114 213
4478B13j59j05K54k02J63m47N37n44N53k94p3P3J71j98Q0J00N2m11L08n2L4j27
$$ 213 54 -51 203 1 164 -283 254 -290 263 -31 -104 -31 140 -58 22 122 174 -237 71 19 53 -74
4500g4J4M44l07l06J02L00l64J79k64L15J84j18n4k08J67rk4K16m36K18k9J6p
$$ -74 -60 384 77 -229 -127 173 -191 -12 -276 39 223 105 51 -157 10 1 -23 193 -243 -25 -54 -38 -45
4523d5N2p8Q4k1l8J19j76L05k1j75k13J22J35j69l5MQ7j01l9R4nJ83o1j74Q9L11
$$ -45 7 -71 13 -8 -46 73 -103 202 181 6 -207 -85 50 -119 -154 -150 -63 -164 -203 -109 -114 69 8 -166 -77 234
4549B34n65J44M29j68oJ1QL06m46N6J78n9m08L33J18l54Q1M3l37L08j07K62j78
$$ 234 -331 -187 242 74 68 79 87 393 -53 3 181 122 -286 47 165 -189 -108 -65 -402 -94 -201 61 -117
4572a17J21k59J12J57k60n1L30J88l75J58J8m2J71j89K83m54J3M75j2m2k58M51
$$ -117 4 -255 -143 14 -246 -297 33 221 -154 4 22 -20 151 -38 245 -209 -196 279 267 225 -33 418
4594D18m85J51l31L29l7j09j09J44R2j30N76l84Rk8l52K93j01J45n7j0l3k5K21
$$ 418 -67 84 -247 82 45 -64 -173 -29 63 -67 509 125 134 106 -246 47 -54 91 34 24 -9 -34 187
4617A87M1l96M71n81R4K66j73J31r6j01RK3K35m34l1N66j06k63j48L86j43J83
$$ 187 228 -168 303 -278 -184 82 -91 40 -56 -157 -148 -125 110 -324 -355 211 105 -158 -306 80 -63 120
4639A20j82m1K65j75k02M38m05O7K16J47p2k05J22k43K15Pl07K87j22j4J80j1
$$ 120 -62 -103 162 -13 -215 223 -182 -115 101 248 176 -29 93 -150 65 72 -235 52 -70 -84 96 85
4661H5J27j71oN9j85LM7k4L28l33J78l90K49r6j60K17l61N60p5l54J67M09j44
$$ 85 212 41 35 94 -91 -88 -41 -65 263 -70 108 -282 -33 -129 -289 -72 -433 127 52 -302 -135 274 130
4684A30j47J33j08j82J15k11L58j5J45j51j72J12m21M16k22K44M1k4j52n0L20
$$ 130 -17 116 8 -174 -59 -270 88 73 218 67 -105 7 -414 2 -220 24 65 41 -111 -161 159
4705A59j34j03J48j08M5k4q2J92k45L88j14J18p5j51K70k85p4J30J80j94j15J60
$$ 159 25 -78 70 -38 7 -17 -99 93 -152 236 122 240 165 14 284 -1 -75 55 235 41 -74 86
4727H6kk20n6K81k4J77l29K28k59K81j96j02j11K12J03n3J47l7q2O8J01l70J17
$$ 86 84 -136 -192 89 65 242 -87 141 -118 163 -33 -135 -246 -34 69 16 163 126 44 112 213 -157 -40
4750d0K21k08L4J61k20j34L89k52o5L12j92j27K14j50P8m0j1p2J20j70L3J2J97
$$ -40 181 -27 7 168 -52 -186 203 -49 -114 198 6 -121 93 -57 21 -19 -30 -102 18 -152 -119 -107 90
4773I0K0j82q4M12j06j89J99j04K8k26j77M15j12J04k7k43L05l0m0m0J36k64N4
$$ 90 110 -72 -156 256 150 -39 160 56 84 -142 -319 96 -16 88 61 -182 123 93 53 13 149 -115 -61
4796f1L1N4j07J12p3L48l13L5J55k22J72p3O4J97l84P8j37J11j36J0Q9J23L5j65
$$ -61 -30 24 -83 29 -44 304 -9 26 181 -41 131 58 122 319 -65 13 -124 -13 -149 -139 -50 73 108 -57
4820e7J37j83no9L67m74L20q9m4l29L16K06nQ9j57Q4J13j49n4O3j40J50j2j70
$$ -57 80 -103 -108 -177 190 -284 36 -53 -97 -426 -110 96 91 180 23 107 220 71 17 80 -60 90 78 -92
4844i2J94q3J21l11L30r5j04K93j9k47R8j01k3N5l42M41k58K23r0j01N4J21k5
$$ -92 102 19 140 -171 159 64 -40 253 234 -13 85 -16 -39 16 -326 115 -143 80 -10 -111 -57 64 39
4867C9N0l03R2M1k16L28rk07r3m9P4L45Lj24l4P0K77l42P5k26M66j82o1k7Q8r1
$$ 39 89 -214 -122 -81 -297 31 22 -185 -278 -327 -253 92 95 -29 -63 7 284 -58 17 -209 257 75 14 -13 75 -16
4893a6J57J10k66K22n11j54O14q5k2j71J57r8k19M88p2j90O5K23j04k59P0K54
$$ -16 141 251 -15 207 -304 -458 156 71 49 -122 35 -63 -282 206 134 -56 9 232 128 -131 -61 193
4915A93k10J02o6J06m21L79k8p9lj95J35K32k43K77l12O3O6k23J02K46k22L0j17
$$ 193 -17 85 19 125 -296 83 55 -24 -27 -222 -87 145 -98 179 -133 -70 -4 -227 -125 121 -101 -71 -188
4938a88l7J91rk17L06N3k74K72k83J32l9r0J90m1J56J69m21K80O0R8l63O7n0L36
$$ -188 -225 -34 -43 -260 46 99 -175 97 -186 -54 -93 -183 7 -34 122 291 -130 150 210 308 -55 12 -38 298
4962B98m87M1R0J13J59l36N18l23l3J44k32n0J65J4j3M19k8j92k48j03J00j08
$$ 298 -189 -148 -58 55 214 -122 396 73 40 184 -48 -98 67 81 68 487 459 267 19 -84 16 -92
4984i2k03K90j88K39J49k83l8K47J03k08R5j31N2P4k12j62K91m15L45L7N0q5J37
$$ -92 -295 -5 -193 46 195 -88 -126 121 224 16 111 -20 32 106 -106 -268 23 -392 -47 -10 40 -45 92
5007I2j40Q2Rn0L70l50J94m12K37J20k1j28P9j53K11j55J73K52m42j39K74j01
$$ 92 -48 34 43 -7 363 13 207 -205 32 152 131 3 82 -71 140 -15 158 410 -32 -171 103 2
5029BK75k97L84k05k74m1J06p3j46K25Oj19M04j94j00O7j60L56k51K61lm29J59
$$ 2 277 -20 364 159 -115 -156 -50 -123 -269 -44 -38 -157 247 53 -47 20 -140 216 -35 226 223 -206 -47
5052d7M3q0L68o48K50p3J00K6J04J51q9k33J50j71K31l68K64J50k76L79k15n2
$$ -47 -4 -84 284 -364 -114 -187 -87 -61 43 194 105 -128 22 -149 82 -286 -22 128 -148 231 16 -36
5074c6n3J03j20j51M28j07k06Q9l4K04M3q0k52K94L0j51J93j13j55o3K73J24k32
$$ -36 -89 14 -106 -257 171 64 -142 -53 -87 117 160 80 -172 122 152 1 194 81 -74 -137 136 260 28
5097B8n7L71l67M3n3j77L53k17J96j37P2j12M3K10n9j50r2k26J48K02J93j80R8
$$ 28 -29 342 -25 18 -35 -212 141 -76 120 -17 55 -57 -14 196 137 -13 -105 -331 -183 19 212 32 130
5120A30J23pO9l44L18k33r5J10k40L5K30k3o0l39K62N7j58J53M7k00L48j2j06
$$ 130 253 246 315 -29 289 56 -39 71 -169 -134 96 73 13 -326 -64 -7 -165 -12 35 -165 183 171 65
5143F5n5Q0o6j3r3l0L61l83J81j69R7k14K73j31J3J7q2J90Q6k18J06P9j96M45
$$ 65 10 90 24 11 -82 -112 249 -134 47 -122 -25 -239 34 -97 -84 -67 -149 41 127 -91 15 94 -102 343
5167C43n97K40r8r7L1%J32J10j64J09L3n0J25l40K34J33R1l76J23K71M8k44L25
$$ 343 -254 -14 -112 -209 -178 -178 -46 64 -100 9 42 -8 117 -223 11 144 235 -141 -18 253 301 57 382
5190C82m30j03kJ63k7L6l07O19m27J53p4l23M32j25L2O5j35J91n7j35K37r3k86
$$ 382 -48 -151 -153 10 -17 19 -288 331 -96 57 -17 -340 92 -33 -1 64 -71 120 63 -72 165 72 -214
5213b14L7K76j6k50Q2J6P2j3m5K75l59P5J96k57J51o9K22J13k67j80M5J0m1O0
$$ -214 -177 99 83 -167 -85 -69 3 -10 -55 220 -139 -64 132 -125 26 -43 179 292 25 -155 -110 -100 -141 -81
5237h1j0K59j92N6p1j16L58R9l31N6ppL57l78K69l87o6J62J73n9k12P0k2O2j11
$$ -81 -91 168 -24 32 -39 -155 203 302 -29 27 20 13 370 -8 261 -126 -192 -30 143 84 -128 -58 -80 -18 -129
5262a29K15kn5O6k83J92M3Mj4J85r4k84K04O6l59J92n1l2J19K31n07M49j47J94
$$ -129 86 84 29 95 -188 4 47 51 37 222 128 -156 48 114 -245 -53 -104 -136 -17 214 -293 156 9 203
5286B03k58l0K95j88o4j21mOJ89j25L6P3K4j03K7R4r6J81j58K03Ml50J20N9K09
$$ 203 -55 -85 210 22 -42 -163 -167 -161 28 -97 -61 12 36 -67 -40 54 -42 139 -19 184 188 -162 -42 17 226
5311B26l32L10j37J29ok10K92l12j12J93K1j51K10j28o2N5K88k72k24L8O9K02
$$ 226 -106 204 67 196 190 -20 272 -40 -152 41 62 -89 121 -7 -69 -14 274 2 -222 -184 -115 87
5333H7m3k53j44L11R8m04K92J69k8r0R6k97J92O4K09l41K63o2j86P5Q6P3q2J04
$$ 87 44 -209 -353 -42 56 -348 -56 113 85 -5 91 -206 -14 50 259 -82 181 119 -67 8 94 167 85 189
5357A89l30L14q5k66p4J50j47K89J22k58R9Oj22p5J43l3L44k01q4N1J06l59J3
$$ 189 -141 173 88 -178 -252 -102 -249 40 162 -96 3 9 -113 -188 -45 -78 266 65 -19 32 138 -221 -208
5380b08J52o8j3J87j47J92n8k24J75j22J77j6R7j32pJ39j81j87J67l94M33K11
$$ -208 -56 -124 -137 50 -97 95 37 -187 -12 -134 43 27 124 -8 -15 124 -57 -244 -77 -471 -38 173
5402A73l11K0J10q6J76j22O1j4L4M4j37J68j26Q8m0j93j01J78J50J6k23J33j72
$$ 173 -138 -118 -8 -94 82 -40 21 7 41 85 -52 116 -10 78 38 -155 -256 -78 72 88 -135 -2 -174
5425a74L87k10L3q6K40m3k27NL18k51K9j01QJ24j36R6J09k9j5p0j40J32o6o9K00
$$ -174 213 3 36 -50 190 147 -80 -75 243 -8 21 -80 -72 52 -84 12 121 92 77 7 -133 -1 -67 -136 64
5450F4J55k12j08j5o6L91j16j28j8k54M07l6K4K8k87L08k68K46l8j74j3j24J56
$$ 64 219 7 -101 -116 -182 209 93 -35 -53 -307 100 64 88 116 -171 137 -131 115 77 -97 -110 -234 -78
5473g8K7J50J51l66J95k14K12j89RN1L0k21K67J3J85k1k08k25J95L61l61m4J23
$$ -78 -51 99 250 -116 79 -135 77 -112 -103 -52 -22 -243 24 37 222 201 -7 -232 -37 324 -37 -81 42
5496D2J27l04P8J00j1J57l97m5lM40O8m11M80n19J40J70k40K45l22M04k55J53
$$ 42 169 -135 -57 43 32 189 -208 -253 -256 184 252 -159 321 -198 -58 112 -128 117 -205 199 -56 97
5518I7j00M5j8N9q2j22N48l63j58J35O6l38LJ53J4l0r9J77P3L4j25J93k97J9k66
$$ 97 -3 42 24 83 1 -121 427 64 -94 41 107 -231 -228 -75 -61 -91 -190 -13 60 94 -31 162 -135 -116 -382
5543c82M02K36n9j30q8n2J46k59j05K54J51m87K59k61M72j84L62k13J4p6J1j7
$$ -382 20 256 197 67 -21 -73 73 -186 -291 -37 114 -373 -114 -375 97 -87 275 62 76 0 11 -6
5565fp1J10j61K50j30J7j50M44m65J81L5k4j38K95k72q3K47R3j76l2j43K25N0
$$ -6 -77 33 -128 122 -8 9 -141 303 -162 19 54 30 -108 187 -85 -168 79 172 -4 -36 -179 46 96
5588I6r1j1L81m18J98j43J23j92K21l11J8Q3j47L20j26o2K7R7l50K75J68n1o5
$$ 96 5 -6 375 -43 155 12 135 -57 164 -147 -129 -46 -193 127 1 -61 -34 63 -287 -12 156 105 40
5611D0j03J15K87l01k50J02k18L01J2o8L91j69j71K24k13J00k34J62NM9r7K3j87
$$ 40 -63 52 339 38 -212 -110 -328 -27 -15 -83 308 139 -32 192 -21 79 -155 7 12 61 -36 -13 -200
5634b00K10n1J48N4k2k30Q7N7j99J92j48J17J29p7j50J07K96m62L47m3o2l92P6
$$ -200 10 -41 107 161 139 -91 -4 53 -146 46 -102 15 144 67 -83 24 320 -142 205 162 100 -292 -216
5657b16L31j84L13m03NJ50K28j14k86L06j96Q2P1j07k62K02L17j83j68J1K69M2
$$ -216 115 -69 244 -159 -154 -4 224 110 -176 130 -66 16 87 -20 -282 -80 237 54 -114 -103 166 208
5679B08k49r1K19P1k75K10k36K89j22n3M0J5o5J3j20J63j45L03m79Q7J97r7j64
$$ 208 -41 -132 87 158 -117 93 -143 146 24 -29 11 26 -39 -26 -146 17 -128 175 -304 -217 -20 -117 -281
5702b81j31M15O8j35j89N35m92J41m6L79j05m34K94K5J07j36j13K56m1M0l12%
$$ -281 -412 3 71 -64 -253 282 -210 -69 -115 264 159 -275 19 44 151 15 -98 158 117 157 -155 -155
5724a55J20k22oJ89K90j72N9k0j89L6J46r3K15p7K7o1J56j40r3P3p2k15J46Q3
$$ -155 -35 -257 -263 -74 216 44 103 83 -106 -70 76 -17 198 121 148 87 243 103 10 83 11 -204 -58 25
5748B5J6r2m5jQ5J00r2K27j84K7j41K27k36k9K40j27M31m53l80K52L39j91n7J54
$$ 25 41 -51 -96 -97 -12 88 -4 223 39 66 -75 152 -84 -113 127 0 431 -22 -402 -150 189 -2 -59 95
5772I5q5k3R4J8J04j06l03P5J81p2j27M1K20j26j2n7M1j18L75P2m25M00l73K27
$$ 95 10 -13 81 99 203 97 -206 -131 50 -22 -149 -108 112 -14 -26 -83 -42 -160 215 287 -138 262 -111 116
5796A16o4R1L9p1j63l8K66k07J4J0L37l42L3Qk64L74p4M3j44j57J21L52m98K97
$$ 116 52 143 182 111 -52 -90 176 -31 -17 -7 330 -12 21 29 -235 139 65 108 -36 -193 -72 280 -218 79
5820G9J08l63K37J05l04m1N62l62j04N5N3J28o3n0l3K7k04J52M05n97M14j75j80
$$ 79 187 -176 61 166 -138 -179 383 21 -83 -28 25 153 90 40 7 34 -170 -18 387 -210 204 29 -151
5843a51J44k62N91m40J64J1k87L11l10J57J66K2K8P5j14j38p8K10k56L05k14K0
$$ -151 -7 -269 322 -118 46 57 -230 81 -229 -72 94 116 144 219 105 -33 -111 99 -157 148 -66 -46
5865d6q7J17j1J97n3j30j5k4K04k13J09j44J75J7N4k1k80J98J04j7j65J54m9p1
$$ -46 -133 -16 -27 170 117 -13 -28 -52 152 -61 48 -96 79 96 150 129 -151 47 151 134 -31 123 74 3
5889CL2r0l24L33J25N0J34M3j05k24K15k83O0J96l87R9J75n1j4N5j10m86N86k20
$$ 3 35 -55 -379 -46 79 129 263 306 201 -23 192 -91 -31 165 -222 -123 52 1 -13 42 -68 -554 32 -188
5913a88J00M80l34j54J71k9j92J35L5O0j70K75m35J03J23J02k9p0j19N11l88N3
$$ -188 -88 392 58 -96 75 46 -146 -11 24 84 -86 189 -246 -143 -20 82 53 -17 -136 375 -13 40
5935D0j03J00J60l18L1L26l43K74k29K85K64o17K18j49L07L4l95O4M3J1O3J54
$$ 40 -63 37 197 -121 -90 236 -107 167 -62 223 487 -130 88 -61 246 280 -115 -51 -8 3 66 220
5957B20j90Oq2N9L1K0l21M38k13J48k3L27p45J60J02Op0R5j81K1J98j4K8J7l53
$$ 220 30 36 -46 13 44 64 -257 181 -32 116 93 420 -325 -165 -63 -57 -127 -32 -213 -192 6 -8 20 37 -316
5982c16J64J51J90J42m16k54L84q6L29N7j36m2k45J53j27K4J52Jj20r5Q6l2K05
$$ -316 -152 -1 189 331 -85 -339 45 -41 288 345 209 167 -78 75 -52 -28 124 125 5 -90 -4 -36 169
6005A69k22j0J82j1j64J34n5jkj87L96k21J18P4j87l7L2j28P6P7p4K29J3k97J07
$$ 169 -53 -63 119 108 -56 78 23 22 20 -167 229 8 126 200 13 -24 8 -120 -44 33 -41 188 201 -96 11
6030A1M3j67L29m17M7N3k4L77l30j4N1r3k7K63M2k67O0K78m7j63J56m83M62k01
$$ 11 54 -113 216 -201 -154 -101 -125 252 -78 -92 -41 -134 -161 102 144 -123 -63 215 168 5 161 -322 140 -61
6054f1J53j53J6j88N22k76L6K05K39n01q0K47l45j19M64j79N6q5K30k78L6L6l33
$$ -61 92 -61 -45 -233 289 13 49 254 493 -8 -88 159 -186 -305 159 -20 36 -49 181 -97 -61 -25 -358
6077c58L23k5J50j99J56L0l4m6J43k64J61q5m7L0m4O7p6Q7j50L0O7p3J42p2J32
$$ -358 -35 -60 90 -109 47 77 43 -3 140 -124 37 -48 -95 -65 -109 -42 -118 -31 -181 -151 -84 -157 -15 -87 45
6102D5N9k7j45J57l51K02M6J65l33O2j4K01j86R5O0l8P8l65O92m47l8L78j68k56
$$ 45 104 77 -68 89 -262 -60 -14 151 -182 -120 -134 67 -119 -24 36 -2 76 -289 403 -44 -82 296 128 -128
6126a28O0R9k43M14k10p4J12j67m0R9O3K0mJ13P3J13l52k2Q7N4j98QJ46P6l27
$$ -128 -68 31 -212 202 -8 -82 30 -137 -177 -78 -15 5 1 114 187 300 -52 -74 13 67 -131 -123 23 99 -228
6151b28L29l04k1J75L29l88q7K14j33L74l97J40K31n5j74J67k22Lq6o0J56r4K24
$$ -228 101 -203 -224 -49 280 -108 -195 19 -114 260 -137 3 234 179 5 172 -50 -47 -133 -193 -37 -131 93
6174I3o5m3kj05N9k53L44N4k23N46m06O1l67K41J91M8k57K99m56L99j82k01j3
$$ 93 28 -15 -17 -122 -63 -316 28 82 -141 405 -1 60 -307 -66 125 173 -84 215 -241 158 -24 -225 -238
6197b38L13O3m7l82N68m74M5o9K56M9p3l2l13L27L3r1j2p8J20L69n68K41K24k73
$$ -238 75 138 91 -291 277 -197 -152 -221 35 84 11 -21 -334 -7 26 -65 -77 -155 -35 334 -234 7 231 -42
6221d2PJ6J7lJ7pJ21l46J89M7k12L61m26Q3J40J86l44L90k77l1J96k78O3K70j3
$$ -42 -35 -19 -2 -5 12 5 126 -220 -31 16 -196 165 -261 -178 -38 148 -196 194 -83 -114 82 -196 -133 137 124
6246A24n33L07K22k30K13k03j4K26K7p3l8K3J87j87J17k11%k54K93n12O16j35
$$ 124 -409 -102 120 -110 103 -100 -114 112 139 66 28 51 238 51 168 -43 -43 -297 -4 -516 100 -35
6268c5n5l3J7K9J93M3n9j8j30J68k23O5n3m7M11l03J36J0j15J03K47m64K64k13
$$ -35 -90 -123 -106 -77 116 159 100 82 -48 120 -103 -38 -91 -138 273 -30 106 116 1 104 351 -113 151 -62
6292f2K65j01m5O0k05m7L63l23k3Ml20L18L31q9k77L90l13m0J00M9J6K00l25J31
$$ -62 203 102 57 117 -88 -135 228 -95 -118 -114 -434 -116 215 126 -151 239 -74 -114 -14 35 51 251 -74 57
$$ [...]
8191i5
##END NTUPLES=NMR FID
##END=
