##TITLE=1H_SA_10.246
 DMF, 8 sc, 
 31.8.2021
##JCAMPDX= 6.0         $$ Bruker NMR JCAMP-DX V2.0
##DATA TYPE= NMR FID
##DATA CLASS= NTUPLES
##ORIGIN= UXNMR, Bruker Analytische Messtechnik GmbH
##OWNER= root
$$ XWIN-NMR		Version 3.5
$$ Tue Aug 31 08:46:31 2021 Russian Standard Time (UT+4h)  she@DPX200
##.OBSERVE FREQUENCY= 200.131506
##.OBSERVE NUCLEUS= ^1H
##.DELAY= (6, 6)
##.ACQUISITION MODE= SIMULTANEOUS
##.ACQUISITION SCHEME= undefined
##.AVERAGES= 108
##.DIGITISER RES= 18
##SPECTROMETER/DATA SYSTEM= spect
##.PULSE SEQUENCE= zg30
##.SOLVENT NAME= D2O
##.SHIFT REFERENCE= (INTERNAL, D2O, 0, 15.7039)
##AUDIT TRAIL= $$ (NUMBER, WHEN, WHO, WHERE, WHAT)
$$ ##TITLE= Audit trail, XWIN-NMR		Version 3.5
$$ ##JCAMPDX= 5.01
$$ ##ORIGIN= Bruker BioSpin GmbH
$$ ##OWNER= she
$$ F:/spectra/data/she/nmr/H-F/1/audita.txt
$$ ##AUDIT TRAIL=  $$ (NUMBER, WHEN, WHO, WHERE, WHAT)
(   1,<2021-08-31 08:44:50.29 +0400>,<she>,<DPX200>,
      <created by zg, POWCHK disabled, PULCHK disabled
       configuration hash MD5:
       00 E9 B6 7A A2 85 ED C7 34 08 36 98 17 FE 4E 26
       data hash MD5: 16K
       67 17 59 C7 37 21 1E F7 9A 86 F5 4A 40 B0 57 CF>)
$$ ##END=
$$ 
$$ hash MD5
$$ A8 56 EA 81 D6 7E 7A CD 48 D9 A8 F6 5B C7 C0 65
##$RELAX= 
##$RELAX= 
##$RELAX= 
##$RELAX= 
##$RELAX= 
##$RELAX= 
$$ Bruker specific parameters
$$ --------------------------
##$DU= <F:/spectra>
##$EXPNO= 1
##$NAME= <H-F>
##$PROCNO= 1
##$TYPE= <nmr>
##$USER= <she>
##$AMP= (0..31)
100 100 100 100 100 100 100 100 100 100 100 100 100 100 100 100 100 100 
100 100 100 100 100 100 100 100 100 100 100 100 100 100 
##$AQSEQ= 0
##$AQ_mod= 1
##$AUNM= <au_zg>
##$AUTOPOS= <>
##$BF1= 200.13
##$BF2= 200.13
##$BF3= 200.13
##$BF4= 200.13
##$BF5= 200.13
##$BF6= 200.13
##$BF7= 200.13
##$BF8= 200.13
##$BYTORDA= 1
##$CFDGTYP= 0
##$CFRGTYP= 5
##$CHEMSTR= <none>
##$CNST= (0..31)
1 1 145 1 1 1 1 1 1 1 1 1 1 1 1 1 1 1 1 1 1 1 1 1 1 1 1 1 1 1 1 1 
##$CPDPRG= <>
##$CPDPRG1= <>
##$CPDPRG2= <>
##$CPDPRG3= <>
##$CPDPRG4= <mlev>
##$CPDPRG5= <mlev>
##$CPDPRG6= <mlev>
##$CPDPRG7= <mlev>
##$CPDPRG8= <mlev>
##$CPDPRGB= <>
##$CPDPRGT= <>
##$D= (0..31)
0 1.2 0 0 0 0 0 0 0 0.06 0 0.03 0 0 0 0 0.0002 0 0 0 0 0 0 0 0 0 0 0 0 
0 0 0 
##$DATE= 1630385089
##$DBL= (0..7)
120 120 120 120 120 120 120 120 
##$DBP= (0..7)
150 150 150 150 150 150 150 150 
##$DBP07= 0
##$DBPNAM0= <>
##$DBPNAM1= <>
##$DBPNAM2= <>
##$DBPNAM3= <>
##$DBPNAM4= <>
##$DBPNAM5= <>
##$DBPNAM6= <>
##$DBPNAM7= <>
##$DBPOAL= (0..7)
0.5 0.5 0.5 0.5 0.5 0.5 0.5 0.5 
##$DBPOFFS= (0..7)
0 0 0 0 0 0 0 0 
##$DE= 6
##$DECBNUC= <off>
##$DECIM= 32
##$DECNUC= <off>
##$DECSTAT= 4
##$DIGMOD= 1
##$DIGTYP= 9
##$DL= (0..7)
0 120 120 120 120 120 120 120 
##$DP= (0..7)
150 150 150 150 150 150 150 150 
##$DP07= 0
##$DPNAME0= <>
##$DPNAME1= <>
##$DPNAME2= <>
##$DPNAME3= <>
##$DPNAME4= <>
##$DPNAME5= <>
##$DPNAME6= <>
##$DPNAME7= <>
##$DPOAL= (0..7)
0.5 0.5 0.5 0.5 0.5 0.5 0.5 0.5 
##$DPOFFS= (0..7)
0 0 0 0 0 0 0 0 
##$DQDMODE= 0
##$DR= 18
##$DS= 0
##$DSLIST= <SSSSSSSSSSSSSSS>
$$ [...]
##$SUBNAM2= <"">
##$SUBNAM3= <"">
##$SUBNAM4= <"">
##$SUBNAM5= <"">
##$SUBNAM6= <"">
##$SUBNAM7= <"">
##$SUBNAM8= <"">
##$SUBNAM9= <"">
##$SW= 20.0188882624521
##$SWIBOX= (0..15)
0 0 2 0 0 0 0 0 0 0 0 0 0 0 0 0 
##$SW_h= 4006.41025641026
##$TD= 16384
##$TD0= 1
##$TE= 0
##$TE2= 300
##$TE3= 300
##$TEG= 300
##$TL= (0..7)
0 120 120 120 120 120 120 120 
##$TP= (0..7)
150 150 150 150 150 150 150 150 
##$TP07= 0
##$TPNAME0= <>
##$TPNAME1= <>
##$TPNAME2= <>
##$TPNAME3= <>
##$TPNAME4= <>
##$TPNAME5= <>
##$TPNAME6= <>
##$TPNAME7= <>
##$TPOAL= (0..7)
0.5 0.5 0.5 0.5 0.5 0.5 0.5 0.5 
##$TPOFFS= (0..7)
0 0 0 0 0 0 0 0 
##$TUNHIN= 0
##$TUNHOUT= 0
##$TUNXOUT= 0
##$USERA1= <user>
##$USERA2= <user>
##$USERA3= <user>
##$USERA4= <user>
##$USERA5= <user>
##$V9= 5
##$VALIST= <valist>
##$VCLIST= <CCCCCCCCCCCCCCC>
##$VD= 0
##$VDLIST= <DDDDDDDDDDDDDDD>
##$VPLIST= <PPPPPPPPPPPPPPP>
##$VTLIST= <TTTTTTTTTTTTTTT>
##$WBST= 1024
##$WBSW= 4
##$XGAIN= (0..3)
0 0 0 0 
##$XL= 0
##$YL= 0
##$YMAX_a= 1756671
##$YMIN_a= -2403758
##$ZGOPTNS= <>
##$ZL1= 120
##$ZL2= 120
##$ZL3= 120
##$ZL4= 120
##$ABSF1= 10
##$ABSF2= 0
##$ABSG= 5
##$ABSL= 3
##$ALPHA= 0
##$AQORDER= 0
##$ASSFAC= 0
##$ASSFACI= 0
##$ASSFACX= 0
##$ASSWID= 0
##$AUNMP= <proc_1d>
##$AZFE= 0.1
##$AZFW= 0.1
##$BCFW= 1
##$BC_mod= 2
##$BYTORDP= 1
##$COROFFS= 0
##$CY= 11.3945322036743
##$DATMOD= 1
##$DC= 2
##$DFILT= <>
##$DTYPP= 0
##$F1P= 2.36226072786647
##$F2P= -0.459571619588291
##$FCOR= 0.5
##$FTSIZE= 0
##$FT_mod= 4
##$GAMMA= 1
##$GB= 0.15
##$INTBC= 1
##$INTSCL= 1
##$ISEN= 128
##$LB= 0.24
##$LEV0= 0
##$LPBIN= 0
##$MAXI= 10000
##$MC2= 0
##$MEAN= 0
##$ME_mod= 0
##$MI= 1.114404
##$NCOEF= 0
##$NC_proc= 0
##$NLEV= 6
##$NOISF1= 3.799351
##$NOISF2= 2.8
##$NSP= 1
##$NTH_PI= 0
##$NZP= 0
##$OFFSET= 15.70392
##$PC= 1
##$PHC0= -13366.52
##$PHC1= 17.60099
##$PH_mod= 1
##$PKNL= yes
##$PPARMOD= 0
##$PSCAL= 0
##$PSIGN= 0
##$REVERSE= no
##$SF= 200.130013532006
##$SI= 16384
##$SIGF1= 3
##$SIGF2= 2
##$SINO= 400
##$SIOLD= 16384
##$SREGLST= <1H.CDCl3>
##$SSB= 0
##$STSI= 0
##$STSR= 0
##$SW_p= 3612.71676300578
##$SYMM= 0
##$S_DEV= 0
##$TDeff= 0
##$TDoff= 0
##$TI= <>
##$TILT= no
##$TM1= 0
##$TM2= 0
##$TOPLEV= 0
##$USERP1= <user>
##$USERP2= <user>
##$USERP3= <user>
##$USERP4= <user>
##$USERP5= <user>
##$WDW= 1
##$XDIM= 8192
##$YMAX_p= 0
##$YMIN_p= 0
$$ End of Bruker specific parameters
$$ ---------------------------------
##NTUPLES= NMR FID
##VAR_NAME=  TIME,          FID/REAL,        FID/IMAG
##SYMBOL=    X,             R,               I
##VAR_TYPE=  INDEPENDENT,   DEPENDENT,       DEPENDENT
##VAR_FORM=  AFFN,          ASDF,            ASDF
##VAR_DIM=   8192,          8192,            8192
##UNITS=     SECONDS,       ARBITRARY UNITS, ARBITRARY UNITS
##FACTOR=    0.0002496,     1,               1
##FIRST=     0,             0,               0
##LAST=      2.0444736,     0,               0
##MIN=       0,             -2403758,        0
##MAX=       2.0444736,     1756671,         0
$$ Real data points
##PAGE= N=1
##DATA TABLE= (X++(R..R)), XYDATA
$$ plain form
0 0 0 0 0 0 0 0 0 0 0 0 0 0 -107 108 -108 108 -108 216 -216 217 -324 325 -432 540 -617 696 -831 971
28 971 -1081 1268 -1414 1622 -1846 2113 -2377 2675 -3005 3373 -3775 4209 -4688 5207 -5785
43 -5785 6408 -7092 7831 -8642 9535 -10509 11578 -12746 14042 -15482 17077 -18861
55 -18861 20876 -23159 25783 -28823 32390 -36662 41869 -48414 56889 -68348 84808 -110583
67 -110583 157062 -267691 1156437 117757 -920321 1756671 1449026 471851 630972
76 630972 409058 11377 974727 159548 -1054035 396296 1175769 -1190314 -1355507 898626
86 898626 606405 -1006580 -394620 152123 -101435 405621 155615 -920665 173328 1208324
96 1208324 -465830 -973588 930938 707843 -818846 -79060 706570 -57977 114012
$$ packed form
0@%%%%%%%%%%%%j07K15k16K16k16L24m32M33n41O49p57R72j157J313j527J802
28I71k052K349k682L036l468L959m490N052n680O378p148P984q897R895j0992
43e785J2193j3500J4923j6473J8177k0044K2087k4324K6788k9524L2559l5938
55a8861L9737m4035M8942n4606O1213o9052P8531r0283J05303j25237J53156j95391
67a10583K67645m24753J424128j038680j038078K676992l07645r77175J59121
76F30972k21914l97681R63350q15179j213583J450331P79473k366083j65193K254133
86H98626k92221j612985O11960N46743k53558N07056k50006j076280J093993J034996
96A208324j674154n07758J904526k23095j526689P39786P85630p64547J71989
$$ plain form
105 114012 434682 -384243 62359 1057476 -148380 -829502 679903 623399 -830787 -241459
115 -241459 499687 -470733 -483074 237998 -486349 -663428 349347 -146016 -922188 128308
125 128308 383002 -697342 -198164 566107 -380577 -428501 631909 -4893 -717695 332995
135 332995 432028 -572169 -102963 393839 -347373 -109997 481276 -392673 -451803 742063
145 742063 177972 -863212 165213 730870 -363879 -370812 350605 -26999 -96028 295738
155 295738 -322989 -371707 723887 255468 -901628 65604 959647 -178352 -559172 396526
165 396526 343664 -60079 176930 -120649 -201116 680331 306235 -868690 -7656 1044153
175 1044153 -140798 -797684 335575 518607 -181721 -59898 -21115 -113580 513697 284500
$$ packed form
105A14012L20670q18925M46602R95117j205856o81122J509405n6504j454186N89328
115b41459P41146r70420j2341P21072p24347j77079J012775m95363p76172J050496
125A28308K54694j080344M99178P64271r46684m7924J060410o36802p12802J050690
135C32995R9033j004197M69206M96802p41212K37376N91273q73949n9130J193866
145G42063n64091j041184J028425N65657j094749o933P21417l77604o9029L91766
155B95738o18727m8718J095594m68419j157096R67232Q94043j137999l80820R55698
165C96526n2862m03743K37009k97579q0467Q81447l74096j174925Q61034J051809
175A044153j184951o56886J133259J83032p00328J21823L8783r2465O27277k29197
$$ plain form
185 284500 -748508 -37347 1043637 -41718 -824170 350042 682134 -213506 -176538
194 -176538 140545 -35553 269147 221838 -616609 -202814 759747 -132754 -974395 94870
204 94870 486661 -508628 -498146 57714 -189269 -140665 75941 -460358 -298765 564711
214 564711 25732 -713320 201352 650223 -276139 -273281 396119 81510 -108539 245004
224 245004 -96387 -256856 389480 138815 -568909 32845 477395 -310688 -352061 328153
234 328153 -10077 -333592 186173 44932 -386732 124308 235264 -414634 -140688 337582
244 337582 -218002 -307377 298233 -25868 -386631 253127 256293 -379251 28390 467224
254 467224 -106111 -146238 355636 59403 -110902 336974 61496 -311412 304199 366693
$$ packed form
185B84500j033008P11161J080984j085355p82452J174212L32092q95640L6968
194a76538L17083j76098L04700m7309q38447M13795R62561q92501q41641J069265
204I4870L91791r95289J0482N55860k46983M8604K16606n36299J61593Q63476
214E64711n38979p39052R14672M48871r26362K858O69400l14609j90049L53543
224B45004l41391j60469O46336k50665p07724O01754M44550p88083m1373O80214
234C28153l38230l23515N19765j41241m31664N11040J10956o49898K73946M78270
244C37582n55584q9375O05610l24101l60763O39758L166o35544M07641M38834
254D67224n73335m0127N01874k96233j70305M47876k75478l72908O15611O2494
$$ plain form
264 366693 -410998 -142406 496314 -23127 -353568 169195 136582 -144759 135865 14460
274 14460 -299147 223604 343211 -436503 -263117 504190 46189 -505724 30754 227167
284 227167 -167702 -66785 -15731 -236726 141821 292451 -392038 -271504 550472 181845
294 181845 -489198 53528 442132 -30381 -88751 115520 -40653 135749 291831 -266371
304 -266371 -267649 473347 190976 -547480 -76025 409787 -123217 -298831 47986 -59496
314 -59496 -82063 127145 -224516 -333461 292228 166920 -510571 -115644 421095 -90134
324 -90134 -309143 158319 101367 -86560 165863 31265 -175365 281286 308647 -273974
334 -273974 -27412 488131 35776 -247407 227852 194051 -148739 81361 100617 -219473
$$ packed form
264C66693p77691K68592O38720n19441l30441N22763l2613k81341K80624j21405
274A4460l13607N22751J19607p79714J73386P67307m58001n51913N36478J96413
284B27167l94869J00917N1054k20995L78547J50630o84489J20534Q21976l68627
294A81845o71043N42726L88604m72513n8370K04271j56173J76402J56082n58202
304b66371j278P40996k82371p38456M71455M85812n33004j75614L46817j07482
314e9496k2567K09208l51661j08945O25689j25308o77491L94927N36739n11229
324i0134k19009M67462n6952j87927K52423j34598k06630M56651K7361n82621
334b73974K46562N15543m52355k83183M75259l3801l42790K30100J9256l20090
$$ plain form
344 -219473 33222 196411 -283121 -229923 238513 -76930 -379937 59960 83638 -294459
354 -294459 -44088 137674 -225575 -103823 232214 -95096 -208766 212288 82689 -210863
364 -210863 129969 185376 -196138 30709 293436 -122198 -153500 281148 68057 -226856
374 -226856 106406 137871 -170996 25507 123109 -224125 -64210 237225 -166540 -303585
384 -303585 188059 94010 -313974 -36981 165349 -129124 -57607 125014 -117697 -36824
394 -36824 272023 -49656 -238675 253729 248150 -236571 -35160 294447 1075 -87721 138441
405 138441 221 -28820 221347 -5800 -227435 200569 266305 -241668 -124517 288038
415 288038 29550 -189836 65150 37670 -88855 103550 433 -233745 98832 241199
$$ packed form
344b19473K52695J63189m79532N3198M68436l15443l03007M39897K3678l78097
354b94459K50371J81762l63249J21752L36037l27310j13670M21054j29599k93552
364b10863L40832N5407l81514K26847K62727m15634l1302M34648k13091k94913
374b26856L33262L1465l08867J96503R7602l47234J59915L01435m03765j37045
384c03585M91644r4049m07984K76993K02330k94473P1517J82621k42711Q0873
394c6824L08847l21679j89019M92404n579m84721K01411L29607k93372q8796K26162
405A38441j38220k9041K50167k27147k21635M28004O5736n07973J17151M12555
415B88038k58488k19386K54986k7480j26525J92405j03117k34178L32577J42367
$$ plain form
425 241199 -219567 -178655 271983 68214 -222724 55314 114610 -102093 36019 61867
435 61867 -182713 9376 206191 -167552 -209840 219561 83933 -241490 37658 179999
445 179999 -88956 -1505 149796 -77368 -23677 209321 -62602 -203073 154834 79019
455 79019 -281319 -68197 116962 -185420 -169311 65156 -122189 -175381 101589 -23295
465 -23295 -213258 92842 148870 -169074 -18438 213320 -54375 -95496 175813 16776
475 16776 -150699 119159 93281 -172324 23710 168908 -104187 -50652 193048 -10628
485 -10628 -90412 196836 91305 -136608 118500 192579 -118412 -26323 189873 -38286 -96900
496 -96900 137613 2708 -127657 134742 98461 -161004 61106 226995 -82217 -69370
$$ packed form
425B41199m60766M0912M50638k03769k90938K78038N9296k16703J38112K5848
435F1867k44580J92089J96815l73743m2288M29401j35628l25423K79148J42341
445A79999k68955Q7451J51301k27164N3691K32998k71923j40471L57907p5815
455G9019l60338K13122J85159l02382J6109K34467j87345n3192K76970j24884
465b3295j89963L06100N6028l17944J50636K31758k67695m1121K71309j59037
475A6776j67475K69858k5878k65605J96034J45198k73095N3535K43700k03676
485a0628p9784K87248j05531k27913K55108P4079l10991R2089K16196k28159n8614
496i6900K34513j34905j30365K62399l6281k59465K22110J65889l09212J2847
$$ plain form
506 -69370 215152 44901 -111844 109749 57473 -132558 59948 76605 -196036 -41171
516 -41171 172521 -115742 -174599 158409 71241 -141385 77223 140486 -57609 74973 166718
527 166718 -77773 -4782 223124 -36658 -187933 116012 74698 -218707 -64337 62196
537 62196 -157731 -108216 47320 -144622 -141262 113437 -45978 -223711 66707 112647 -179932
548 -179932 -62924 131799 -80356 -107968 94035 -46165 -132983 103085 29491 -183975
558 -183975 48155 159314 -123084 -61502 184907 -1088 -97747 134716 55976 -111246
568 -111246 94257 100058 -151190 -5325 154544 -116115 -136358 125591 -22384 -183615
578 -183615 48017 36928 -175183 2114 101765 -142095 -64386 160857 -37017 -108215 163106
$$ packed form
506f9370K84522j70251j56745K21593n2276j90031J92506J6657k72641J54865
516d1171K13692k88263n8857L33008q7168k12626K18608O3263j98095J32582R1745
527A66718k44491P2991K27906k59782j51275L03945m1314k93405J54370J26533
537F2196k19927M9515J55536j91942L360K54699j59415j77733K90418M5940k92579
548a79932J17008J94723k12155k7612K02003j40200q6818K36068p3594k13466
558a83975K32130J11159k82398O1582K46409j85995r6659K32463p8740j67222
568a11246K05503N801k51248J45865J59869k70659k0243K61949j47975j61231
578a83615K31632j1089k12111J77297R9651k43860P7709K25243j97874p1198K71321
$$ plain form
589 163106 92145 -92439 129197 188875 -48304 72188 241151 6877 -19014 215753
599 215753 64504 -99175 116524 85923 -151920 -4051 92552 -165970 -125045 88607
609 88607 -102974 -201202 51949 -6811 -195049 9268 80739 -140985 -27097 144738 -68079
620 -68079 -77456 169234 31872 -121386 118940 122882 -113347 29471 154788 -75274 -49084
631 -49084 144790 -43458 -134838 102325 13828 -202840 -2078 69910 -190034 -113393 73253
642 73253 -120930 -155691 72924 -42322 -171157 75888 79354 -150658 20922 172019 -66722
653 -66722 -52273 167206 6422 -98126 120813 50643 -143344 49985 106526 -141398 -46279
664 -46279 142690 -62770 -106962 134202 34146 -112535 102744 113145 -102914 38369
$$ packed form
589A63106p0961j84584K21636N9678k37179J20492J68963k34274k5891K34767
599B15753j51249j63679K15699l0601k37843J47869R6603k58522M0925K13652
609H8607j91581r8228K53151n8760j88238K04317P1471k21724J13888J71835k12817
620f8079r377K46690j37362j53258K40326L942k36229J42818J25317k30062K6190
631d9084J93874j88248r1380K37163q8497k16668K00762P1988k59944P6641J86646
642G3253j94183l4761K28615j15246j28835K47045L466k30012J71580J51097k38741
653f6722J4449K19479j60784j04548K18939p0170j93987J93329N6541k47924R5119
664d6279J88969k05460m4192K41164j00056j46681K15279J0401k16059J41283
$$ plain form
674 38369 162221 -72376 -54260 156499 -14372 -128137 100997 55066 -142038 37300
684 37300 116318 -104613 -16812 163021 -35484 -71855 166643 53688 -114061 96669 110504
695 110504 -122414 -1419 120474 -107991 -94326 111387 -54809 -158980 83698 42585
705 42585 -155255 33317 127095 -93320 -11421 172463 -18697 -62629 165707 53718 -113927
716 -113927 91701 103206 -130454 -13477 115049 -112203 -104871 102860 -55310 -164848
726 -164848 62989 25901 -171326 3793 89631 -133476 -57627 123626 -66429 -114631 114617
737 114617 20823 -140438 66252 97789 -116979 4424 143417 -62043 -51918 154100
747 154100 7637 -102444 118528 79406 -124105 38989 120949 -107906 -53011 122601
$$ packed form
674C8369J23852k34597J8116K10759j70871j13765K29134m5931j97104J79338
684C7300P9018k20931Q7801J79833j98505l6371K38498j12955j67749K10730J3835
695A10504k32918J20995J21893k28465J3665K05713j66196j04171K42678m1113
705D2585j97840J88572R3778k20415Q1899J83884j91160m3932K28336j11989j67645
716a13927K05628J1505k33660J16977J28526k27252P332K07731j58170j09538
726a64848K27837l7088j97227J75119Q5838k23107P5849J81253j90055m8202K29248
737A14617r3794j61261K06690L1537k14768J21403J38993k05460J0125K06018
747A54100j46463j10081K20972l9122k03511J63094Q1960k28855N4895J75612
$$ plain form
757 122601 -64117 -122909 92626 -2008 -157691 46654 74790 -144591 -16055 133706
767 133706 -73914 -71132 145637 14248 -96689 117693 85063 -104660 60540 138999 -90190
778 -90190 -28824 153226 -33858 -105939 109120 27921 -132776 51140 75514 -130861 -14477
789 -14477 119557 -89352 -84915 125285 -10521 -128461 82246 61972 -127491 21122 106031
800 106031 -102049 -44774 124474 -48998 -107401 106227 24315 -135184 50958 88243 -117442
811 -117442 -17071 120152 -69983 -73219 121933 -5299 -113493 91257 66183 -120716
821 -120716 30554 122374 -85184 -34854 138448 -25446 -85023 120592 38394 -115655 65463
832 65463 94305 -112216 -13329 115272 -78321 -86081 102977 -24095 -133806 63510 39419
$$ packed form
757A22601j86718n8792K15535r4634j55683K04345K8136k19381J28536J49761
767A33706k07620K782K16769j31389j10937K14382l2630j89723J65200P8459k29189
778i0190O1366J82050j87084p2081K15059q1199j60697J83916K4374k06375J16384
789a4477J34034k08909M437K10200j35806j17940K10707k0274j89463J48613Q4909
800A06031k08080N7275J69248j73472n8403K13628q1912j59499J86142L7285k05685
811a17442J00371J37223j90135l236J95152j27232j08194K04750k5074j86899
821a20716J51270R1820k07558N0330J73302j63894n9577K05615q2198j54049J81118
832F5463K8842k06521R8887J28601j93593p760J89058j27072j09711J97316k4091
$$ plain form
843 39419 -140387 4789 94566 -101682 -49694 118166 -34400 -88594 111795 39220 -104866
854 -104866 69802 104447 -88132 6923 135401 -44852 -53311 127828 9321 -98782 82185
865 82185 57945 -121023 10411 86238 -109704 -70021 86737 -66126 -126443 62589 -3323
876 -3323 -142018 23394 61167 -114654 -15629 112237 -55044 -55907 126531 18008 -83698
887 -83698 95584 77674 -90865 36104 109206 -76152 -36128 114596 -33515 -92851 89248
898 89248 24904 -114740 43469 75281 -103967 -13180 103816 -65976 -75598 94894 -11740
909 -11740 -114264 54444 40903 -115242 9868 87392 -79609 -31340 122738 -11567 -61529
920 -61529 118986 64437 -66986 77491 108971 -61318 12843 119487 -45387 -61090 94666
$$ packed form
843C9419j79806J45176Q9777j96248N1988J67860j52566n4194K00389p2575j44086
854a04866J74668L4645j92579R5055J28478j80253q459J81139j18507j08103J80967
865H2185k4240j78968J31434P5827j95942L9683J56758j52863o0317J89032o5912
876c323j38695J65412L7773j75821R9025J27866j67281q63J82438j08523j01706
887h3698J79282j7910j68539J26969P3102j85358M0024J50724j48111n9336J82099
898H9248o4344j39644J58209L1812j79248R0787J16996j69792r622J70492j06634
909a1740j02524J68708j3541j56145J25110P7524j67001M8269J54078j34305m9962
920f1529J80515n4549j31423J44477L1480j70289P4161J06644j64874j5703J55756
$$ plain form
931 94666 -12400 -113022 49766 33875 -122756 -4263 76781 -85665 -47043 98901 -26286
942 -26286 -76328 89877 31050 -93675 50633 76599 -91802 -15199 96675 -59278 -75144
953 -75144 80037 -12899 -103872 48019 33251 -111111 3726 73518 -90368 -52859 86198
964 86198 -41997 -96488 64557 13897 -109649 25674 61283 -90235 -15284 91022 -48681
975 -48681 -51210 99591 4824 -84172 70145 59231 -90526 7987 80440 -69368 -47456
986 -47456 72180 -40480 -84465 61816 4493 -108085 31794 66753 -86478 -17021 94813
997 94813 -29930 -45942 88859 14196 -62293 72481 55293 -75632 30441 96470 -56440
1008 -56440 -29517 102420 -4746 -63465 74042 35314 -71806 41471 62033 -73900 -4028
$$ packed form
931I4666j07066j00622J62788j5891j56631J18493Q1044j62446L8622J45944j25187
942b6286n0042J66205n8827j24725J44308K5966j68401P6603J11874j55953j5866
953g5144J55181r2936r0973J51891j4768j44362J14837O9792j63886L7509J39057
964H6198j28195n4491J61045n0660j23546J35323L5609j51518P4951J06306j39703
975d8681k529J50801r4767q8996J54317j0914j49757R8513P2453j49808K1912
986d7456J19636j12660m3985J46281n7323j12578J39879L4959j53231O9457J11834
997I4813j24743j6012J34801p4663p6489J34774j7188j30925J06073O6029j52910
1008e6440K6923J31937j07166n8719J37507l8728j07120J13277K0562j35933O9872
$$ plain form
1019 -4028 86707 -50872 -59954 83964 4575 -85164 50130 52440 -68946 15188 77146 -48526
1031 -48526 -16652 94381 -19643 -65754 75154 27230 -91875 18181 55238 -76918 -27680
1042 -27680 62940 -47041 -52306 71885 -2351 -73533 57982 52927 -71780 12674 78220
1053 78220 -51683 -40162 64372 -32041 -84518 33865 -8526 -107906 -2681 27260 -94925
1064 -94925 -35745 60701 -47583 -56752 73143 12507 -64224 53461 56363 -58676 14390
1075 14390 72568 -47009 -30717 70988 -21694 -65028 59316 24873 -74627 30527 71464
1086 71464 -47328 -1519 89416 -10696 -28146 79670 14703 -55751 52204 40269 -77535
1097 -77535 17 62296 -57656 -50635 57925 -13753 -61005 46601 23641 -55789 36905
$$ packed form
1019d028R0735j37579r082J43918p9389q9739J35294K310j21386Q4134O1958j25672
1031d8526L1874J11033j14024m6111J40908m7924j19105J10056L7057j32156M9238
1042b7680R0620j09981n265J24191p4236p1182J31515n055j24707Q4454O5546
1053G8220j29903J1521J04534r6413n2477J18383m2391r9380J05225K9941j22185
1064i4925N9180R6446j08284r169J29895o0636p6731J17685K902j15039P3066
1075A4390N8178j19577J6292J01705r2682m3334J24344l4443r9500J05154M0937
1086G1464j18792M5809R0935j00112j7450J07816o4967p0454J07955j1935j17804
1097g7535P7552O2279j19952P021J08560p1678m7252J07606k2960p9430R2694
$$ plain form
1108 36905 61580 -52073 1044 88886 -20319 -45493 69543 24443 -54400 36885 44607
1119 44607 -47549 19412 68649 -35645 -12644 87401 1862 -51848 60777 40179 -62704
1130 -62704 6127 37357 -62229 -34778 30286 -61880 -70587 33275 -23598 -90908 19145 36995
1142 36995 -62623 -2003 69040 -15481 -7929 78813 10919 -28661 68449 35540 -59330 20895
1154 20895 52055 -60147 -37100 39662 -41828 -68012 23085 -18434 -77414 13036 19470 -71009
1166 -71009 -10004 51497 -37847 -32697 57915 1396 -44527 46144 33266 -45729 21509 55224
1178 55224 -36286 -9368 63782 -10206 -35266 53127 15736 -50678 28988 39916 -50538 -5570
1190 -5570 52846 -31267 -35308 49590 -3422 -50478 34895 23681 -51923 12275 46580 -42135
$$ packed form
1108C6905K4675j13653N3117Q7842j09205k5174J15036m5100p8843R1285P722
1119D4607r2156O6961M9237j04294K3001J00045q5539n3710J12625k0598j02883
1130f2704O8831L1230r9586K7451O5064r2166q707J03862n6873o7310J10053J7850
1142C6995r9618O0620P1043q4521P552Q6742o7894l9580R7110l2909r4870Q0225
1154B0895L1160j12202K3047P6762q1490k6184R1097m1519n8980R0450O434r0479
1166g1009O1005O1501q9344N150R0612n6519m5923R0671j2878p8995O7238L3715
1178E5224r1510K6918P3150p3988k5060Q8393l7391o6414P9666J0928r0454M4968
1190e570N8416q4113m041Q4898n3012m7056Q5373j1214p5604O4198L4305q8715
$$ plain form
1202 -42135 -15626 59534 -12181 -41318 47081 18918 -47076 22502 37392 -42184 -429 49566
1214 49566 -34195 -32337 50974 -4619 -58701 25293 21860 -55263 -2963 33785 -43443 -23029
1226 -23029 45147 -22472 -42999 48104 16898 -49556 23574 47942 -32824 -1023 55484 -14940
1238 -14940 -21136 50914 606 -45073 32799 25009 -53455 -30 40291 -39602 -29919 38792
1250 38792 -16009 -45270 30135 7910 -51862 15088 34197 -44915 -10094 49511 -21486 -32480
1262 -32480 47174 10575 -38079 32199 33059 -36828 13487 51700 -24661 -15928 53778 -3741
1274 -3741 -39863 34292 15061 -49816 7756 27864 -48345 -20337 37787 -29436 -43995 33659
1286 33659 877 -48337 21688 27861 -40454 5306 49931 -23189 -17334 53365 1107 -35929
$$ packed form
1202d2135K6509P5160p1715k9137Q8399k8163o5994O9578J4890p9576M1755M9995
1214D9566q3761J858Q3311n5593n4082Q3994l433p7123N2300L6748p7228K0414
1226b3029O8176o7619k0527R1103l1206o6454P3130K4368q0766L1801N6507p0424
1238a4940o196P2050n0308m5679P7872p790p8464N3425M0321p9893R683O8711
1250C8792n4801k9261P5405k2225n9772O6950J9109p9112L4821N9605p0997j0994
1262c2480P9654l6599m8654P0278Q60o9887N0315L8213p6361Q733O9706n7519
1274c741l6122P4155j9231o4877N7572K0108p6209K8008N8124o7223j4559P7654
1286C3659l2782m9214P0025O173o8315M5760M4625p3120N855P0699n2258l7036
$$ plain form
1298 -35929 36330 23739 -42649 11248 33417 -37802 -15119 40107 -23303 -40359 33416 3028
1310 3028 -49563 15648 25914 -43393 -5958 39631 -25601 -25509 42335 -4211 -40065 31403 20560
1323 20560 -44723 7537 38954 -33658 -17537 43251 -12798 -34262 36739 10965 -39858 22968
1335 22968 32753 -38599 -714 47466 -19379 -23602 44065 3821 -37542 31061 24874 -37074
1347 -37074 12596 43707 -24858 -8740 51661 -3179 -26749 44602 20293 -35966 21651 36641
1359 36641 -34907 -9511 36420 -27932 -36857 25432 -14816 -55775 10688 8312 -55713 -7740
1371 -7740 31045 -34152 -22161 41157 -4350 -28656 39324 20774 -31874 23998 40173 -31224
1383 -31224 -4555 42626 -19928 -32592 31969 -3370 -48744 12921 12784 -50533 -7773 25421
$$ packed form
1298c5929P2259j2591o6388N3897K2169p1219K2683N5226o3410j7056P3775l0388
1310C028n2591O5211J0266o9307L7435M5589o5232R2O7844m6546l5854P1468j0843
1323B0560o5283N2260L1417p2612J6121O0788n6049k1464P1001k5774n0823O2826
1335B2968R785p1352L7885M8180o6845m223O7667m0244m1363O8603o187o1948
1347c7074M9670L1111o8565J6118O0401n4840k3570P1351k4309n6259N7617J4990
1359C6641p1548K5396M5931o4352q925O2289m0248m0959O6463k376o4025M7973
1371g740L8785o5197J1991O3318m5507k4306O7980j8550n2648N5872J6175p1397
1383c1224K6669M7181o2554j2664O4561l5339m5374O1665j37o3317M2760L3194
$$ plain form
1395 25421 -41675 -31512 30730 -18510 -47772 21594 7497 -48612 6191 28867 -35680 -7008
1407 -7008 43328 -12702 -20429 49796 17221 -27712 36293 38864 -26634 11246 46234 -20390
1419 -20390 -17829 40235 -8178 -40910 24887 8509 -49706 3526 27092 -38017 -14894 39155
1431 39155 -16590 -28979 40343 11219 -33421 27871 35451 -27502 10711 51055 -11200 -7745
1443 -7745 53495 9829 -22279 44383 31364 -28084 21001 43744 -24944 -8989 40840 -18007
1455 -18007 -35854 27774 -2952 -52681 8047 14026 -51072 -12922 30150 -29476 -28241 38036
1467 38036 -2081 -34119 31919 21681 -36788 14132 38894 -30541 -13200 41483 -14640 -36183
1479 -36183 28277 2052 -45646 12573 18685 -47125 -9511 33145 -33537 -33342 31457 -9754
$$ packed form
1395B5421o7096J0163O2242m9240k9262O9366j4097n6109N4803K2676o4547K8672
1407g008N0336n6030p727P0225l2575m4933O4005K571o5498L7880L4988o6624
1419b0390K561N8064m8413l2732O5797j6378n8215N3232K3566o5109K3123N4049
1431C9155n5745j2389O9322k9124m4640O1292P580o2953L8213M0344o2255L455
1443g745O1240m3666l2108O6662j3019n9448M9085K2743o8688J5955M9829n8847
1455a8007j7847O3628l0726m9729O0728N979o5098L8150M3072n9626J235O6277
1467C8036m0117l2038O6038j0238n8469N0920K4762o9435J7341N4683n6123k1543
1479c6183O4460k6225m7698N8219O112o5810L7614M2656o6682J95O4799m1211
$$ plain form
1491 -9754 -46407 17803 10621 -45526 3758 29824 -32033 -11789 45893 -5932 -22705 46098
1503 46098 23604 -24848 30063 40764 -25544 5018 43014 -21888 -25378 33832 -11725 -48325
1515 -48325 16084 8358 -50247 -2825 29788 -30124 -11126 45352 -2761 -16973 49266 24822
1527 24822 -25066 34879 45003 -25447 3707 45900 -15888 -21764 37682 -2367 -37218 25589
1539 25589 18786 -40863 7733 36874 -26724 -12274 42669 -8024 -30525 33066 8533 -41006
1551 -41006 12767 22457 -42335 -11516 31225 -29125 -30279 34263 -4780 -39265 26038 22064
1563 22064 -36656 7765 36335 -25891 -13330 37633 -12174 -33397 29720 3854 -47493 9476
1575 9476 23529 -42329 -14629 31820 -24644 -28773 30216 -6876 -39631 22682 14719 -45349
$$ packed form
1491i754l6653O4210p182n6147M9284K6066o1857K0244N7682n1825j6773O8803
1503D6098k2494m8452N4911J0701o6308L0562L7996o4902l490N9210m5557l6600
1515d8325O4409p726n8605M7422L2613n9912J8998N6478m8113j4212O6239k4444
1527B4822m9888N9945J0124p0450K9154M2193o1788n876N9446m0049l4851O2807
1539B5589o803n9649M8596K9141o3598J4450N4943n0693k2501O3591k4533m9539
1551d1006N3773R690o4792L0819M2741o0350j154O4542l9043l4485O5303l974
1563B2064n8720M4421K8570o2226J2561N0963m9807k1223O3117k5866n1347N6969
1575I476J4053o5858K7700M6449n6464m129N8989l7092l2755O2313p963o0068
$$ plain form
1587 -45349 2813 32365 -35372 -22528 35808 -12514 -34242 28885 10413 -34890 20077 30649
1599 30649 -29979 5188 47209 -16450 -20043 45712 8260 -33977 25078 22220 -33590 4437
1611 4437 29914 -31137 -15429 37531 -16574 -36155 32252 12464 -39970 14169 30833 -27306
1623 -27306 -2227 38124 -15506 -17959 41195 1115 -33697 29742 22563 -38033 3519 35002
1635 35002 -27038 -17915 33771 -11849 -31187 26885 6613 -38824 15403 27738 -33637 -3352
1647 -3352 41947 -15447 -21408 40025 4834 -33507 22742 18111 -38057 -383 25501 -34679
1659 -34679 -23072 27106 -21134 -41320 23711 3870 -44767 9421 29626 -28590 -3736 40164
1671 40164 -8915 -12589 41482 6095 -25629 33420 24513 -37314 3077 37077 -26664 -24268
$$ packed form
1587d5349M8162K9552o7737J2844N8336m8322k1728O3127j8472m5303N4967J0572
1599C0649o0628L5167M2021o3659l593O5755l7452m2237N9055k858n5810L8027
1611D437K5477o1051J5708N2960n4105j9581O8407j9788n2434N4139J6664n8139
1623b7306K5079M0351n3630k453N9154m0080l4812O3439p179o0596M1552L1483
1635C5002o2040R123N1686m5620j9338N8072k0272m5437N4227J2335o1375L0285
1647c352M5299n7394n961O1433l5191l8341N6249m631n6168L7674K5884o0180
1659c4679J1607N0178m8240k0186O5031j9841m8637N4188K0205n8216K4854M3900
1671D0164m9079l674N4071l5387l1724N9049q907o1827M0391L4000o3741K396
$$ plain form
1683 -24268 29061 -7752 -31467 19904 2549 -36240 16421 22551 -39937 -5852 42388 -17488
1695 -17488 -31379 31426 8457 -29516 15195 15335 -27165 11601 30225 -28463 -7367 47825
1707 47825 -4538 -31613 33379 23882 -29556 6607 24353 -23756 -2203 25020 -27238 -23022
1719 -23022 33645 -8344 -47647 17634 21506 -37038 -6995 27839 -16293 -11435 29761 -9886
1731 -9886 -19024 35414 7952 -37894 17507 32555 -31696 -12629 32712 -12639 -23359 23107
1743 23107 -1931 -27176 20372 11865 -35161 6405 31392 -26451 -17285 35262 -4462 -29287
1755 -29287 22736 11045 -28946 10779 22062 -26144 -1421 32573 -15125 -16270 36341 4608
1767 4608 -27427 24766 26414 -26310 4610 34160 -15833 -13258 27929 -7689 -23120 22370
$$ packed form
1683b4268N3329l6813k3715N1371j7355l8789N2661O130o2488L4085M8240n9876
1695a7488j3891O2805k2969l7973M4711J40m2500L8766J8624n8688K1096N5192
1707D7825n2363k7075O4992r497n3438L6163J7746m8109K1553K7223n2258M216
1719b3022N6667m1989l9303O5281L872n8544L0043L4834m4132M858M1196l9647
1731i886r138N4438k7462m5846N5401J5048o4251J9067M5341m5351j0720M6466
1743B3107k5038k5245M7548q507m7026M1566K4987n7843R166N2547l9724k4825
1755b9287N2023j1691l9991L9725J1283m8206K4723L3994m7698j145N2611l1733
1767D608l2035N2193J648n2724L0920K9550m9993K575M1187l5618j5431M5490
$$ plain form
1779 22370 854 -35136 13519 22175 -35907 -11585 35025 -10157 -25957 23357 8708 -18671
1791 -18671 17415 10360 -24945 16132 29462 -31069 -16569 38669 -4649 -38428 11913 13716
1803 13716 -26244 -2576 6007 -25266 2825 22092 -29955 -20786 38653 2295 -43217 10562
1815 10562 28177 -21223 -10375 13953 -11645 -3666 18702 -22613 -21339 34150 5750 -45393
1827 -45393 7956 37081 -18790 -18640 22306 3455 -7844 15287 -7287 -15942 31327 11226
1839 11226 -39819 6541 41337 -16789 -25837 25735 10622 -14413 11518 5465 -12249 22855
1851 22855 17078 -30444 2858 41029 -12258 -26862 27324 14821 -22793 6867 16363 -12762
1863 -12762 8966 20045 -16730 275 36125 -5454 -21842 29380 20812 -23774 5951 25465
$$ packed form
1779B2370k1516l5990M8655Q656n8082K4322M6610m5182j5800M9314j4649k7379
1791a8671L6086p055l5305M1077J3330o0531J4500N5238m3318l3779N0341J803
1803A3716l9960K3668Q583l1273K8091J9267n2047R169N9439l6358m5512N3779
1815A0562J7615m9400J0848K4328k5598P979K2368m1315J274N5489k8400n1143
1827d5393N3349K9125n5871J50M0946j8851j1299K3131k2574q655M7269k0101
1839A1226n1045M6360L4796n8126r048N1572j5113k5035K5931o053j7714L5104
1851B2855n777m7522L3302L8171n3287j4604N4186j2503l7614K9660R496k9125
1863a2762K1728J1079l6775J7005L5850m1579j6388N1222q568m4586K9725J9514
$$ plain form
1875 25465 -13301 -6291 20481 -9070 -13413 20302 -4645 -24950 17069 10026 -32605 -2401
1887 -2401 24090 -21774 -22727 18873 -2787 -26077 6140 2348 -20020 5699 7862 -25736 2331
1900 2331 29741 -18138 -23367 30982 14468 -27788 2151 19864 -8821 -4641 2561 -20171 -1794
1913 -1794 19065 -27449 -34685 23125 9572 -45423 -14512 23650 -8229 -19333 767 -6168
1925 -6168 3493 18541 -17039 -21853 36111 25694 -34972 -3780 45423 9385 -19358 11808
1937 11808 17488 9940 14963 -7494 -13245 32800 22739 -38564 -11910 42295 -85 -38213 533
1950 533 16834 -6985 -6358 -9978 -12732 20577 17626 -32041 -7205 48205 9848 -32916 11751
1963 11751 33197 -455 -5095 7023 -1822 12334 13979 -23560 -12390 34250 1941 -39724
$$ packed form
1875B5465l8766P010K6772k9551m343L3715k4947k0305M2019p043m2631L0204
1887b401K6491m5864r53M1600k1660k3290L2217l792k2368K5719K163l3598K8067
1900B331K7410m7879n229N4349j6514m2256K9939J7713k8685M180P202k2732J8377
1913a794K0859m6514p236N7810j3553n4995L0911L8162l1879j1104K0100o935
1925f168R661J5048l5580m814N7964j0417o0666L1192M9203l6038k8743L1166
1937A1808N680p548N023k2457n751M6045j0061o1303K6654N4205m2380l8128L8746
1950E33J6301k3819O27l620k754L3309k951m9667K4836N5410l8357m2764M4667
1963A1751K1446l3652m640J2118q845J4156J645l7539J1170M6640l2309m1665
$$ plain form
1975 -39724 3221 25912 -16079 -20085 7957 -4678 -8651 4692 -17290 -18728 16223 -2387
1987 -2387 -35710 1728 21452 -20689 -18364 17512 1537 -14207 11470 7295 -10094 12414
1999 12414 10912 -16759 4655 20246 -17740 -15859 18561 -5166 -32146 1847 8005 -26248
2011 -26248 -14705 4812 -12555 -9913 4554 -15307 -9796 22893 -2348 -27439 17060 32524
2023 32524 -15772 -13057 26932 14795 -2779 6548 3606 6286 24238 -1875 -25880 19645 32486
2036 32486 -24428 -28448 24345 15554 -24605 -14682 3134 4588 9161 -11147 -24056 20524 35323
2049 35323 -22664 -24159 39943 32482 -19962 -6364 26301 17903 4633 -6995 -12357 19279 26983
2062 26983 -28143 -31323 30652 21270 -39970 -23848 21895 6866 -16184 -13828 -8347 9850 14639
$$ packed form
1975c9724M2945K2691m1991m006K8042j2635l973J3343k1982j438L4951j8610
1987b387l3323L7438J9724m2141K325L5876j5975j5744K5677m175j7389K2508
1999A2414j502k7671K1414J5591l7986J881L4420k3727k6980L3993O158l4253
2011b6248J1543J9517j7367K642J4467j9861N511L2689k5241k5091M4499J5464
2023C2524m8296K715L9989j2137j7574R327k942K680J7952k6113k4005M5525J2841
2036C2486n6914m020N2793q791m0159R923J7816J454M573k0308j2909M4580J4799
2049C5323n7987j495O4102p461n2444J3598L2665q398j3270j1628n362L1636P704
2062B6983n5126l180O1975r382o1240J6122M5743j5029k3050K356N481J8197M789
$$ plain form
2075 14639 -25875 -26801 29552 21993 -33921 -17180 31122 11263 -17943 -4182 6625 8776 11674
2088 11674 -10810 -15933 23397 20856 -29638 -15766 27775 2371 -27192 -2880 7085 -6486
2100 -6486 -2242 -5041 -14465 9427 13691 -19817 -11228 25303 3179 -21193 7283 14646 -10398
2113 -10398 -1781 10384 -8252 -2989 11674 -8189 -9078 13861 1062 -15317 12323 14776 -14798
2126 -14798 -66 25552 -2775 -13678 13627 8850 -8907 1309 -589 -8343 8971 5435 -23673
2139 -23673 -2298 28138 -5322 -25994 12293 23735 -7446 -7551 6033 5744 11989 3262 -20287
2152 -20287 2405 31975 -7948 -36949 10277 28302 -17934 -24721 5881 9328 963 -6204 -17770
2165 -17770 4197 30000 -8785 -34954 15685 36451 -16537 -27772 14093 17853 -5111 -10964
$$ packed form
2075A4639m0514r26N6353p559n5914J6741M8302j9859k9206J3761J0807K151K898
2088A1674k2484n123L9330k541n0494J3872M3541k5404k9563K4312R965j3571
2100f486M244k799r424K3892M264l3508Q589L6531k2124k4372K8476P363k5044
2113a0398Q617J2165j8636N263J4663j9863q89K2939j2799j6379K7640K453k9574
2126a4798J4732K5618k8327j0903K7305m777j7757J0216j898p754J7314l536k9108
2139b3673K1375L0436l3460k0672L8287J1442l1181j05J3584k89O245q727k3549
2152b0287K2692K9570l9923k9001M7226J8025m6236o787L0602L447q365p167j1566
2165a7770K1967K5803l8785k6169N0639K0766n2988j1235M1865L760k2964n853
$$ plain form
2177 -10964 -9777 6172 21813 -11490 -34175 13737 34334 -20127 -31431 17100 20315 -12744
2189 -12744 -13012 -731 7272 15371 -5877 -25347 13166 33137 -15191 -27093 21974 24402 -13027
2202 -13027 -9397 9167 7389 6404 -1045 -16440 5630 24875 -12385 -26477 15611 15947 -22108
2215 -22108 -11774 9568 -2990 -6323 1813 -8936 -3384 16172 -4027 -16854 14014 16081 -13674
2228 -13674 -2062 18567 -1637 -7483 13445 1741 -10262 8634 4615 -14151 1115 8329
2240 8329 -13587 -4840 11816 -11680 -13091 15060 2389 -20152 2807 16176 -7673 -6344 7473
2253 7473 -1933 2052 11073 -10405 -10085 23354 8046 -24580 871 26695 -1915 -15082 6359
2266 6359 8700 2467 4891 -9813 -8737 20799 6152 -29600 -3430 29252 -5346 -26818 3324
$$ packed form
2177a0964J187J5949J5641l3303k2685M7912K0597n4461j1304M8531L215l3059
2189a2744k68J2281Q003Q099k1248j9470L8513J9971m8328j1902M9067K428l7429
2202a3027L630J8564j778r85p449j5395K2070J9245l7260j4092M2088L36l8055
2215b2108J0334K1342j2558l333Q136j0749N552J9556k0199j2827L0868K067k9755
2228a3674J1612K0629k0204n846K0928j1704j2003J8896m019j8766J5266P214
2240H329k1916Q747J6656k3496j411K8151j2671k2541K2959J3369k3849J329J3817
2253G473r406L985R021k1478L20L3439j5308l2626K5451K5824k8610j3167K1441
2266F359K341o233K424j4704J076K9536j4647l5752K6170L2682l4598k1472L0142
$$ plain form
2279 3324 12576 -2004 -3675 -7490 -3118 19816 8601 -25676 1116 36863 181 -25817 10155
2292 10155 24464 -1744 -6369 117 1199 13106 4033 -24305 -4096 29123 -4322 -32162 4640
2305 4640 21313 -10116 -14883 1679 -12 6338 2852 -17012 -4499 25995 1024 -26856 6191
2318 6191 24846 -9411 -13610 7856 2327 -2248 4096 -9542 -9061 16179 1227 -23672 319
2331 319 17660 -12435 -15409 8630 -93 -9988 5222 -2318 -11115 8651 7579 -15435 -662
2344 -662 16750 -6081 -10590 13523 2370 -11150 8948 7934 -12258 2274 13867 -7334 -5549
2357 -5549 14009 -784 -6511 11768 1648 -12845 9450 11202 -16581 -4641 16578 -2759
2369 -2759 -12730 7392 4001 -5799 6387 109 -12047 11491 15540 -16814 -7792 22333 3327
$$ packed form
2279C324R252j4580j671l815M372K2934j1215l4277K6792L5747l6682k5998L5972
2292A0155J4309k6208m625O486J082J1907r073k8338K0209L3219l3445k7840L6802
2305D640J6673l1429m767J6562j691O350l486j9864J2513L0494k4971k7880L3047
2318F191J8655l4257m199K1466n529m575O344j3638M81K5240j4952k4899K3991
2331C19J7341l0095k974K4039q723r895J5210p540q797J9766j072k3014J4773
2344f62J7412k2831m509K4113j1153j3520K0098j014k0192J4532J1593k1201J785
2357e549J9558j4793n727J8279j0120j4493K2295J752k7783J1940K1219j9337
2369b759r971K0122l391r800J2186o278j2156K3538M049l2354R022L0125j9006
$$ plain form
2382 3327 -16435 4363 10188 -4724 750 -543 -9691 8874 13622 -17228 -10927 22285 5938
2395 5938 -22179 1352 15266 -3799 -4598 726 -6347 3331 10149 -15782 -13648 19949 6051
2408 6051 -24510 -1246 17866 -4501 -9392 2720 -1198 669 8600 -10786 -12448 15428 7068
2421 7068 -23418 -3087 16835 -4556 -13940 4587 1102 -4271 5995 -4755 -11102 12045 9939
2434 9939 -18531 -5041 17909 -3712 -14386 5954 2900 -8161 3217 172 -11974 4746
2446 4746 10308 -13306 -4972 16531 -435 -10502 10639 8371 -6926 6587 10644 -7244 2652
2459 2652 14508 -4396 -7337 14123 1959 -10131 6586 6712 -11373 2765 10802 -8757 -5801
2472 -5801 12593 -1439 -10337 7677 3608 -10907 3278 5709 -10363 1318 14010 -7010 -8916
$$ packed form
2382C327j9762K0798N825j4912N474j293r148J8565M748l0850O301L3212j6347
2395E938k8117K3531J3914j9065p99N324p073R678O818k5931K134L3597j3898
2408F051l0561K3264J9112k2367m891J2112l918J867P931j9386j662K7876q360
2421G068l0486K0331J9922k1391r384J8527l485n373J0266j0750o347K3147k106
2434I939k8470J3490K2950k1621j0674K0340l054j1061J1378l045j2146J6720
2446D746N562k3614Q334K1503j6966j0067K1141k268j5297J3513M057j7888R896
2459B652J1856j8904k941K1460j2164j2090J6717J26j8085J4138Q037j9559K956
2472e801J8394j4032q898J8014m069j4515J4185K431j6072J1681J2692k1020j906
$$ plain form
2485 -8916 15459 4870 -11389 5026 8105 -5820 2082 7052 -8333 -1081 12526 -8722 -13161
2498 -13161 10673 4554 -16337 -1662 8692 -7275 -3736 4764 -6628 -2856 11758 -5872 -13359
2511 -13359 10220 8594 -14975 -3537 12107 -3859 -7288 5758 -1886 -3623 9205 -886 -11726
2524 -11726 8760 10384 -12785 -4455 13905 -1811 -10151 4620 -963 -7870 4012 -674 -13613
2537 -13613 3457 8862 -12803 -6993 13432 890 -10901 6564 5788 -5326 6400 6826 -6549
2550 -6549 4616 14175 -5136 -5960 13782 2376 -10973 5609 6609 -8691 -350 5847 -9077
2563 -9077 -3572 9212 -5908 -9758 7761 2046 -11432 2986 7957 -8675 -1865 9734 -4644
2576 -4644 -4625 10865 1820 -7637 8545 7160 -7337 2922 10207 -6616 -3882 9425 -4101 -10933
$$ packed form
2485h916K4375j0589j6259J6415L079j3925P902M970j5385P252J3607k1248m439
2498a3161K3834o119k0891J4675J0354j5967L539Q500j1392L772J4614j7630p487
2511a3359K3579j626k3569J1438J5644j5966l429J3046p644j737J2828j0091j0840
2524a1726K0486J624k3169Q330J8360j5716q340J4771n583o907J1882m686j2939
2537a3613J7070N405k1665N810K0425j2542j1791J7465p76j1114J1726M26j3375
2550f549J1165R559j9311q24J9742j1406j3349J6582J000j5300Q341O197j4924
2563i077N505J2784j5120l850J7519n715j3478J4418M971j6632O810J1599j4378
2576d644J9J5490r045r457J6182j385j4497J0259P285j6823K734J3307j3526o832
$$ plain form
2590 -10933 6236 -59 -12674 -665 3630 -10286 -4646 6303 -6636 -6358 9343 -342 -8620
2603 -8620 7752 6924 -7964 1539 10225 -4527 -3072 8296 -3740 -6097 8571 696 -11710
2616 -11710 4193 7819 -9844 -4606 8818 -5065 -7223 5443 -1337 -8096 5630 2627 -9480
2629 -9480 2134 9562 -7675 -4321 9718 798 -7487 5396 2428 -5463 5107 5510 -7586 -147
2643 -147 10154 -4617 -6442 10182 1276 -8444 3813 5886 -7870 1408 5900 -6621 -3260 8820
2657 8820 -3316 -8154 7995 3134 -9112 1441 6245 -5584 -651 7262 -3558 -4146 8347
2670 8347 -13 -7370 6024 6266 -8221 259 7619 -3544 -2830 7354 -2059 -6167 6641 1585
2684 1585 -9885 2831 6271 -7570 -3356 6869 -2917 -5420 7611 1321 -6198 5152 4494 -7255
$$ packed form
2590a0933J7169o295j2615J2009M295j3916N640J0949j2939K78J5701r685q278
2603h620J6372q28j4888R503Q686j4752J455J1368j2036k357J4668p875j2406
2616a1710J5903L626j7663N238J3424j3883k158J2666o780o759J3726l003j2107
2629i480J1614P428j7237L354J4039q920q285J2883k968p891J0570M03j3096P439
2643a47J0301j4771j825J6624q906r720J2257K073j3756R278M492j2521L361J2080
2657H820j2136m838J6149m861j2246J0553M804j1829M933P913j0820n88J2493
2670H347q360p357J3394K42j4487Q480P360j1163P14J0184r413m108J2808n056
2684A585j1470J2716L440j3841M214J0225r786k503J3031o290p519J1350o58j1749
$$ plain form
2698 -7255 1396 7690 -4935 -3522 6495 -1267 -5776 5956 1802 -7412 2678 5185 -6348 -1749
2712 -1749 6817 -4319 -6910 6985 232 -7181 4258 4515 -6660 1100 7573 -4289 -1799 8217
2726 8217 -39 -5098 6410 3555 -5896 2856 5289 -6232 -2119 7220 -4939 -6279 5370 -273
2740 -273 -8425 2799 3398 -8100 -1254 6120 -5526 -3416 6785 -1359 -5768 5160 3617 -6658
2754 -6658 2944 6004 -5007 -1466 6877 -2398 -4314 5647 251 -7658 2321 3497 -6773 -1061
2768 -1061 5306 -3913 -4269 6179 -1482 -5818 5131 2479 -7232 1442 5860 -4635 -1490 7606
2782 7606 -1020 -4256 6611 1153 -6311 4340 5133 -5699 -1015 6656 -2763 -3308 5828 -1320 -5496
2797 -5496 3370 2229 -7581 660 3997 -6610 -3270 6389 -3175 -4263 5155 1406 -4053 4251 4208
$$ packed form
2698g255Q651O294j2625J413J0017p762m509J1732m154r214J0090K507j1533M599
2712a749Q566j1136k591J3895o753p413J1439K57j1175P760O473j1862K490J0016
2726H217q256n059J1508k855r451Q752K433j1521M113R339j2159j340J1649n643
2740b73q152J1224N99j1498O846P374j1646K110J0201q144m409J0928j543j0275
2754f658R602L060j1011L541Q343r275j916R961n396p909R979J176j0270N712
2768a061O367r219l56J0448p661m336J0949k652r711Q674M418j0495L145R096
2782G606q626l236J0867n458p464J0651P93j0832M684P671r419n45R136p148m176
2797e496Q866j141r810Q241L337j0607L340R659r564j088R418l749n459Q304m3
$$ plain form
2812 4208 -3589 1059 8151 -1343 -1749 6875 549 -4950 4902 2793 -5231 658 3489 -6103 -2601
2827 -2601 4919 -4049 -5925 4282 -390 -6818 1641 3842 -5277 -1514 5467 -3663 -3346 5870 -44
2842 -44 -5378 4323 3413 -5679 826 5560 -3199 -2558 4894 -2400 -5165 4316 -68 -6301 731 2907
2858 2907 -6351 -1593 4281 -4553 -4620 3939 -206 -5379 3929 4116 -5252 1741 5934 -2580 -875 6988
2874 6988 -1053 -3330 5654 2346 -5684 2880 3337 -5187 -357 5691 -2550 -3309 4388 103 -5602
2889 -5602 2324 3094 -5522 867 5018 -3470 -2492 5148 -112 -5007 4877 1026 -4296 1055 3963
2904 3963 -2869 682 5585 -2128 -4044 4676 1888 -4608 3050 2297 -5312 -379 4495 -4450 -3087
2919 -3087 4930 -1399 -5062 2667 1270 -5268 1776 3111 -4774 -2023 5028 -2371 -3722 5937 1240
$$ packed form
2812D208p797M648P092r494m06Q624o326n499R852k109q024N889K831r592L502
2827b601P520q968j876J0207m672o428Q459K201r119L763O981r130L17R216n914
2842d4n334R701r10r092O505M734q759O41P452p294k765R481m384o233P032K176
2858B907r258M758N874q834o7Q559m145n173R308J87r368O993M193q514J705P863
2874F988q041k277Q984l308q030Q564M57q524M830O048q241p59P697m285n705
2889e602P926P70q616O389M151q488R78P640n260m895R884l851n322N351K908
2904C963o832L551M903p713j916Q720k788o496P658p53p609M933M874q945J363
2919c087Q017o329l663P729j397o538P044J335p885K751P051p399j351R659m697
$$ plain form
2934 1240 -4895 1320 3512 -4418 -273 5531 -4266 -2285 5027 -1684 -5448 2940 2473 -5386 383
2949 383 3407 -4584 -2342 4117 -1912 -3750 4973 545 -4441 3255 3792 -4400 -349 5405 -2411
2964 -2411 -2045 4293 -198 -3729 3309 1944 -5210 48 3770 -3709 -1938 4824 -1783 -3995 3827
2979 3827 1622 -4471 3239 4178 -3716 450 6250 -1692 -2847 5194 288 -4675 1993 3268 -5026
2994 -5026 502 3530 -4348 -1468 4422 -1695 -4555 3932 893 -5539 1483 3041 -3639 -1085 4645
3009 4645 -2172 -3127 5343 -390 -4700 3436 2947 -4897 784 4517 -3498 -2142 4742 -1436 -4485
3024 -4485 3443 95 -5038 33 2684 -5668 -1460 5040 -3747 -3627 4396 -468 -4882 2292 2413
3039 2413 -4944 20 4868 -4025 -2343 4443 -1405 -4423 3996 2049 -5722 1848 5003 -3039 -240
$$ packed form
2934A240o135O215K192p930M145N804r797J981P312o711l764Q388m67p859N769
2949C83L024p991K242O459o029j838Q723m428m986P696N37q192M051N754p816
2964b411L66O338m491l531P038j365p154N258L722p479J771O762o607k212P822
2979C827k205o093P710R39p894M166N800p942j155Q041m906m963O668J275q294
2994e026N528L028p878K880N890o117k860Q487l039o432P022J558o680K554N730
3009D645o817r55Q470n733m310Q136m89p844N681L733q015J356O884o178l049
3024d485P928l348n133N071K651q352M208O500q787J20Q023m864m414P174J21
3039B413p357M964M848q893J682O786n848l018Q419j947p771P570L155q042K799
$$ plain form
3054 -240 4924 -1734 -2585 4375 180 -4324 1789 3233 -6035 676 4258 -4005 -2806 4174 -753
3069 -753 -4174 3164 2899 -3751 1128 4091 -3564 -248 5824 -724 -2961 4682 1306 -4159 3585
3084 3585 2482 -3929 -316 3911 -4369 -3296 4743 -1554 -5400 2271 1205 -6113 621 3479 -4506
3099 -4506 -747 5653 -803 -1929 5607 747 -3513 4823 3855 -4103 943 5474 -2144 -1768 4892
3114 4892 -771 -4164 3202 381 -6826 982 3023 -4344 -2071 4414 -2064 -4611 5109 1373 -3490
3129 -3490 3188 4198 -3009 1515 4790 -2030 -950 5826 289 -5044 4785 2820 -4224 1177 3220
3144 3220 -3689 -2033 4139 -3003 -4910 4252 736 -5330 2104 3617 -4406 -216 4401 -2951 -2504
3159 -2504 4813 -374 -4405 4738 2046 -3815 1314 3914 -3082 -1767 5293 -2117 -3055 3819 172
$$ packed form
3054b40N164o658q51O960m195m504O113J444r268O711L582q263J199O980m927
3069g53l421P338k65o650M879K963p655L316O072o548k237P643l376n465P744
3084C585j103o411L613M227q280J073Q039o297l846P671j066p318O734K858p985
3099d506L759O400o456j126P536m860m260Q336r68p958N046M531p618L76O660
3114D892n663l393P366k821p207P808K041p367K273O485o478k547R720l736m863
3129c490O678J010p207M524L275o820J080O776n537n333R829j965p044N401K043
3144C220o909J656O172p142j907R162l516o066P434J513q023M190M617p352M47
3159b504P317n187m031R143k692n861N129K600o996J315P060p410r38O874l647
$$ plain form
3174 172 -4464 2111 1881 -5330 -561 4346 -4132 -2028 3775 -1462 -4738 3060 2588 -4875 736 4775
3190 4775 -3470 -1371 4652 -1840 -2320 4553 -399 -4984 3054 3059 -3914 -159 6040 -2595 -2089 3761
3206 3761 -546 -3671 4008 2156 -5348 1564 5038 -3285 -734 4320 -2202 -2690 4200 624 -4334
3221 -4334 3588 3242 -4137 1605 4874 -3567 -2024 5493 372 -3966 2071 2569 -3921 465 3266
3236 3266 -4052 -1356 4599 -2356 -3773 3751 850 -4538 1425 4099 -3370 856 4349 -2774 -1191
3251 -1191 4781 -409 -5064 3352 1223 -5498 752 3957 -4216 -2972 3355 -2460 -3458 3588 555
3266 555 -5298 2516 2611 -4446 -144 4032 -2515 -2617 4859 228 -3576 3326 1753 -5025 1997 3676
3282 3676 -3481 -1276 4011 -2229 -3526 3399 138 -5073 2449 2771 -5083 -565 3444 -3027 -2003
$$ packed form
3174A72m636O575k30p211M769M907q478K104N803n237l276P798m72p463N611M039
3190D775q245K099O023o492m80O873m952m585Q038No973L755O199q635N06N850
3206C761m307l125P679j852p504O912L474q323K551N054o522m88O890l576m958
3221d334P922l46p379N742L269q441J543P517n121m338O037M98o490M386K801
3236C266p318K696N955o955j417P524k901n388N963K674p469M226L493p123J583
3251a191N972n190m655Q416k129o721O250L205q173J244O327n815r98P046l033
3266E55n853P814R5p057M302M176o547j02P476m631l804O902j573o778P022J679
3282C676p157K205N287o240j297O925l261n211P522L22p854M518M009o471J024
$$ plain form
3297 -2003 4002 -921 -3915 3273 2094 -4130 1993 3926 -2203 -533 5610 64 -2006 5046 1755
3312 1755 -3284 3112 3085 -4415 1116 4112 -3117 -2307 4116 -459 -3838 2566 1737 -4879 528 3127
3328 3127 -4251 -133 4483 -2750 -3330 3968 -47 -4380 2075 3239 -3595 -861 4244 -2807 -1367
3343 -1367 4522 -549 -3856 3954 2561 -4352 501 3384 -3465 -2397 2735 -2870 -3300 3066 24
3358 24 -4448 1834 3266 -4465 -443 4252 -1525 -1771 4838 237 -3527 4307 2120 -3308 544 4536
3374 4536 -3341 -2230 3796 -1827 -3448 2690 281 -5339 1689 2107 -3966 -1254 3686 -2548 -2333
3389 -2333 3041 -1463 -2958 3036 1629 -3078 1676 3909 -2410 494 5308 -778 -3048 4284 1262
3404 1262 -2994 1996 2067 -3308 -225 3658 -2815 -1878 2841 -816 -4039 1617 1295 -3548 672 2129
$$ packed form
3297b003O005m923k994P188j179o224O123J933o129J670O143n546k070P052l291
3312A755n039O396k7p500N531K996p229Q10O423m575l379O404q29o616N407K599
3328C127p378M118M616p233n80P298m015m333O455J164o834K734N105p051J440
3343a367N889n071l307P810j393o913M853K883o849J068N132n605m30O366l042
3358B4m472O282J432p731M022M695n777k46O609m601l764P834k187n428L852L992
3374D536p877J111O026n623j621O138k409n620P028M18o073K712M940o234K15
3389b333N374m504j495N994j407m707M754K233o319K904M814o086k270P332l022
3404A262m256M990P1n375L083L883o473R37M719l657l223N656l22m843M220J457
$$ plain form
3420 2129 -3785 -458 3840 -1428 -3279 4039 1028 -3602 1988 2557 -3328 -223 3456 -2404 -2700
3435 -2700 3876 -964 -2397 1848 1176 -4532 286 2355 -3168 -1182 3176 -1826 -2315 2635 -340
3450 -340 -2911 1844 2468 -2144 233 4393 -849 -756 2896 1349 -3026 3104 2144 -3171 2014 3178
3466 3178 -2590 7 3356 -1643 -2946 3259 21 -3966 1471 1745 -3521 -393 3182 -1804 -1691
3481 -1691 2319 963 -2641 2989 1886 -2650 576 3139 -2219 -573 3560 -283 -1224 3298 617
3496 617 -3686 1347 1746 -3131 -556 1809 -2356 -2273 3103 -988 -2821 3347 1511 -2759 844 3808
3512 3808 -1010 -610 2720 -818 -2135 2971 -86 -3375 2011 659 -3159 -494 2646 -2615 -2340
3527 -2340 3110 -847 -2840 1577 943 -2815 532 3158 -1896 -965 3329 35 -1416 3589 1357
$$ packed form
3420B129n914L327M298n268j851P318l011m630N590N69n885L105L679n860k96
3435b700O576m840j433M245o72n708M818K069n523J986M358n002m89M950k975
3450c40k571M755O24m612K377M160n242R3L652j547m375O130r60n315N185J164
3466C178n768K597L349m999j303O205l238l987N437K74n266L128L575m986J13
3481a691M010j356l604N630j103m536L226K563n358J646M133l843r41M522k681
3496F17m303N033L99m877K575K365m165Q3N376m091j833O168j836m270L603K964
3512C808m818M00L330l538j317N106l057l289N386j352l818K665L140n261K75
3527b340N450l957j993M417o34l758L347K626n054R31M294l294j451N005k232
$$ plain form
3542 1357 -3660 1547 2135 -1631 65 2067 -2919 -964 3702 -63 -1877 2741 1042 -2793 313
3557 313 1991 -2337 -619 2800 -1034 -2039 2487 1174 -3191 1921 1832 -2179 142 2818 -1337 -2228
3573 -2228 2289 112 -2856 2288 1842 -2039 704 2377 -1830 -2158 3696 -764 -2328 1844 483
3588 483 -3051 138 2479 -2492 -1313 2419 -897 -2592 2141 -209 -2815 1439 1722 -1916 893
3603 893 2727 -1029 -1323 2240 -495 -1643 1338 58 -2633 727 1670 -2324 -1012 2300 -1926 -2640
3619 -2640 1919 692 -2287 1451 1741 -1870 302 2130 -1583 -569 2416 783 -731 3000 2401
3634 2401 -2148 1787 2070 -1438 315 3412 -608 -1076 1724 1889 -2572 1644 1766 -2488 -1084 1888
3650 1888 -2273 -846 2026 -1096 -2578 2028 822 -1492 524 2422 -735 -917 2340 -836 -289
$$ packed form
3542A357n017N207N88l766J696K002m986J955M666l765j814M618j699l835L106
3557C13J678m328J718L419l834j005M526j313m365N112q9m011K321K676m155q91
3573b228M517k177k968N144m46l881K743J673m207l28N854m460j564M172j361
3588D83l534L189K341m971J179L732l316j695M733k350k606M254K83l638K809
3603H93J834l756k94L563k735j148K981j280k691L360R43l994J312L312m226p14
3619b640M559j227k979L738K90l611K172J828l713J014K985j633j514L731n99
3634B401m549L935K83l508J753L097m020m68K800J65m461M216J22m254J404K972
3650A888m161J427K872l122j482M606j206k314K016J898l157j82L257l176N47
$$ plain form
3665 -289 1093 -600 -1585 1237 809 -2590 862 3773 -1899 -1543 1679 -256 -1792 1446 1066 -2402
3681 -2402 409 1860 -1628 -298 1631 -813 -1875 1134 89 -2794 714 2001 -1909 -147 1696
3696 1696 -909 -234 2059 -741 -1350 1244 1269 -3415 97 1718 -1119 -1249 1410 -541 -1895 2110
3712 2110 127 -2296 1205 2202 -1303 67 1880 -988 -1867 2097 116 -828 1492 1670 -1650 755
3728 755 2497 -1235 -248 3114 -850 -1929 1069 858 -2077 -30 922 -1836 73 2064 -773 -1193
3744 -1193 3004 -121 -2040 1331 1536 -2116 -50 2605 -791 -209 1716 909 -1109 1913 -886 -1443
3760 -1443 550 1201 -968 -828 1657 -713 -2417 1546 8 -1560 933 1209 -1886 -771 1610 -1759
3776 -1759 -900 2248 -869 -2356 1642 -48 -2105 17 774 -1265 268 589 -1565 -1534 2228 -125
$$ packed form
3665b89J382j693r85K822m28l399L452K911n672L56L222j935j536L238l80l468
3681b402K811J451l488J330J929k444j062L009j045k883L508J287l910J762J843
3696A696k605O75K293k800o09K594K5m684L512J621k837j30K659j951j354M005
3712B110j983k423L501R97l505J370J813k868q79L964j981r44K320J78l320K405
3728G55J742l732R87L362l964j079K998k11k935K047R52k758J909J991k837m20
3744a193M197l125j919L371K05l652K066K655l396N82J925q07k018L022k799n57
3760a443J993O51k169J40K485k370j704L963j538j568K493K76l095J115K381l369
3776a759Q59L148l117j487L998j690k057K122P57k039J533L21k154L1L762k353
$$ plain form
3792 -125 -2693 1722 3359 -2624 -462 2029 721 -985 -2 -445 -2183 2011 1344 -1916 248 1450
3808 1450 -2090 -1025 1558 707 -2704 827 -147 -959 1819 -967 -2278 1260 3035 -1834 -1151 4268
3824 4268 768 -1919 464 1405 -508 718 1665 -1441 -427 2715 -1046 -2322 2741 1618 -3044
3839 -3044 338 2138 -514 210 2179 -1490 -344 3184 -583 -780 2027 1167 -2880 157 2453 -1820
3855 -1820 -1621 1047 152 -1181 916 643 -2343 1608 795 -1765 -148 2617 -1051 -262 2553 -27
3871 -27 -1863 439 620 -1568 837 624 -2489 39 1154 -759 -1908 1419 1141 -3429 165 2585
3887 2585 -1002 -449 2024 -436 -438 1532 118 -1330 3570 1341 -2697 981 3367 -1668 -2860 1051
3903 1051 281 -907 115 -196 -1184 2033 855 -3349 637 4530 -1297 -3542 1234 2349 -1523 404
$$ packed form
3792a25k568M415J637n983K162K491j308j706R83m43j738M194o67l260K164J202
3808A450l540J065K583q51l411L531r74q12K778k786j311L538J775m869O83N419
3824D268l500k687K383R41j913J226R47l106J014L142l761j276N063j123m662
3839c044L382J800k652P24J969l669J146L528l767j97K807q60m047L037K296m273
3855a820J99K668q95j333K097k73k986L951q13k560J617K765l668P89K815k580
3871b7j836K302J81k188K405k13l113K528J115j913j149L327k78m570L594K420
3887B585l587N53K473k460kJ970j414j448M900k229m038L678K386n035j192L911
3903A051p70j188J022l11r88L217j178m204L986L893n827k245M776J115l872J927
$$ plain form
3919 404 1540 -871 2258 1321 -2600 528 3839 -2034 -3698 2163 3013 -2287 -1754 1147 129 -17
3935 -17 1493 -2346 46 2581 -1489 -4172 2094 3550 -2686 -1091 3372 146 -1286 713 -808
3950 -808 229 2396 -487 -3612 2308 2746 -3907 -2240 2909 -703 -2020 279 -162 -1155 31 223
3966 223 -1728 1531 2181 -1690 -1358 2722 1241 -2829 459 1509 -2054 -391 877 -1351 629 994
3982 994 -2360 -1048 2715 449 -2525 2085 3330 -1837 426 1700 -728 -843 151 -1519 -1003 2085
3998 2085 -558 -3360 1021 2526 -2178 -1029 2804 -129 -1704 1584 344 -278 722 282 -2027
4013 -2027 953 1490 -2709 -1406 4178 -53 -3601 -349 1902 -1153 -1254 -482 -1575 1291 1933 -3389
4029 -3389 -328 4042 795 -4336 162 3707 -503 -1006 651 926 444 1765 -2458 -633 3933 540
$$ packed form
3919D04J136k411L129r37l921L128L311n873j664N861Q50n300N33K901j018j46
3935a7J510l839K392K535m070k683O266J456o236J595M463l226j432J999j521
3950h08J037K167k883l125N920M38o653J667N149l612j317K299m41r93J186J92
3966B23j951L259O50l871L32M080j481m070L288J050l563J663J268k228J980L65
3982I94l354J312L763k266k974M610J245n167K263J274k428j15R94j670N16L088
3998B085k643k802M381J505m704J149L833k933j575L288j240o22J000m40k309
4013b027K980N37m199J303N584m231l548L252K251l055j01P72j093K866O42n322
4029c389L061M370l247n131M498L545m210n03J657K75m82J321m223J825M566l393
$$ plain form
4045 540 -4155 500 3803 -1723 -2939 1221 1315 -59 27 -1193 -578 3372 220 -4741 1241 4737
4061 4737 -1671 -3231 1970 2368 -585 802 -491 150 2663 254 -2436 1017 3948 -2123 -2595 2354
4077 2354 2518 -1835 -397 1159 -960 -410 476 -2588 332 2363 -1902 -2016 1900 1430 -2553 -38
4093 -38 2912 -556 -393 1060 -16 469 2233 -31 -1788 2846 931 -2590 -645 3131 -900 -2355
4109 -2355 -56 705 -1540 155 63 -860 1843 222 -3562 723 2860 -1665 -2807 2206 1579 -3061
4125 -3061 68 1600 273 -816 395 -1944 1054 3171 -1972 -2563 3032 1502 -3165 -1304 2321
4140 2321 207 -1854 19 -1200 762 1528 -2412 -1481 2964 1754 -4701 -2429 2816 1680 -1202
4155 -1202 -209 1757 435 1018 -1702 -1155 2806 2412 -4414 -1424 4210 -180 -3569 -482 1693 -298
$$ packed form
4045E40m695M655L303n526j216M160R4j374Q6j220O15L950l152m961N982L496
4061D737o408j560N201L98k953J387j293O41K513k409k690L453K931o071m72M949
4077B354J64m353J438J556k119N50Q86l064K920K031m265j14L916m70l983K515
4093c8K950l468J63J453j076M85J764k264j757M634j915l521J945L776m031j455
4109b355K299P61k245J695r2r23K703j621l784M285K137m525j142N013o27m640
4125c061L129J532j327j089J211k339K998K117n143n91N595j530m667J861L625
4140B321k114k061J873j219J962P66l940R31M445j210o455K272N245j136k882
4155a202R93J966j322N83k720N47L961l94o826K990N634m390l389L087K175j991
$$ plain form
4171 -298 -923 -1542 -1336 2724 181 -4548 -305 4791 324 -3753 359 2939 -236 -1394 -181 95
4187 95 1076 700 -3887 523 4027 -1295 -3990 1861 3416 -2225 -1517 462 -49 840 -420 -2979 202
4204 202 3569 660 -2966 1084 2955 -2612 -1891 2457 1181 -1272 573 -243 -71 1304 278 -1651
4220 -1651 1074 2082 -2047 -1782 3179 -187 -3038 1822 1500 -1562 -403 1054 -1351 24 1044
4235 1044 -1872 -1137 2109 -183 -3091 956 2064 -1370 -1462 2693 184 -302 904 -721 59 2726
4251 2726 -431 -2580 934 2778 -1975 -2564 2360 672 -388 -1911 338 189 1764 -497 -2749
4266 -2749 2016 1654 -2828 -3225 2877 1895 -2743 95 1942 892 414 -706 -1758 3492 2542 -3385
4282 -3385 -2277 3142 1736 -4399 -2007 764 373 -1199 -951 -1354 1642 2494 -3238 -1560 4384 2705
$$ packed form
4171b98o25o19K06M060k543m729M243N096m467m077M112K580l175j158J213K76
4187I5R81l76m587M410L504n322k695N851J555n641P08J979n11Q89j260k559L181
4204B02L367k909l626M050J871n567P21M348j276k453J845q16J72J375j026j929
4220a651K725J008m129K65M961l366k851M860l22l062J159J457k405J375J020
4235A044k916P35L246k292k908M047J108l434r2M155k509m86J206j625P80K667
4251B726l157k149L514J844m753n89M924j688j060j523K249j49J575k261k252
4266b749M765l62m482l97O102r82m638K838J847j050m78j120j052N250r50n927
4282c385J108N419j406o135K392K771l91j572K48m03K996Q52n732J678N944j679
$$ plain form
4298 2705 -3156 -864 1825 431 -1570 -597 690 1179 1387 -2076 -1847 2609 1626 -4127 -1686 2697
4314 2697 291 -2664 1064 744 679 920 -1122 -1185 2317 1616 -1435 -682 3571 3 -1677 59 765
4331 765 -1110 304 625 -1549 310 937 -866 -1548 1649 416 -681 1336 1118 -2153 582 1621
4347 1621 -70 -1059 2089 -582 -418 826 1166 -1859 838 584 -2152 157 2046 -627 -2073 1661
4363 1661 945 -168 -962 -82 126 1449 1111 -2033 302 3458 -1125 -2302 1296 1810 -1273 -1853 522
4380 522 90 228 68 -1614 -608 2139 -982 -2366 1772 2249 -1965 -1850 2422 2314 234 -206 -812
4397 -812 628 1449 -516 -2345 2007 1676 -2376 -2323 1490 1568 -647 -786 -1261 815 1397 -288 -2626
4414 -2626 2128 2254 -1768 -1779 1294 1348 -1197 424 762 567 1122 -356 -1605 1368 2321 -1038 -890
$$ packed form
4298B705n861K292K689j394k001R73J287M89K08l463K29M456r83n753K441M383
4314B697k406k955L728l20o5K41k042o3L502p01l051P53M253l568j680J736P06
4331G65j875J414L21k174J859O27j803o82L197j233j097K017k18l271K735J039
4347A621j691r89L148k671J64J244L40l025K697k54k736K309J889k673j446L734
4363A661p16j113p94Q80K08J323l38l144K335L156m583j177L598N14l083n80K375
4380E22m32J38j60j682J006K747l121j384M138M77m214J15M272j08k080m40o06
4397h12J440Q21j965j829M352l31m052N3L813P8k215j39m75K076N82j685k338
4414b626M754J26m022j1L073N4k545J621L38j95N55j478j249K973R53l359J48
$$ plain form
4431 -890 552 1195 -2752 -1416 647 580 850 218 -770 -381 1487 -1685 -1484 2727 1501 -1167 589
4448 589 1970 -532 -154 545 -986 -1293 756 -127 -2023 782 1054 -1864 -442 -50 -639 -520 1440
4465 1440 -703 -1236 1453 1578 -1385 372 1784 -1184 738 1216 -1160 -596 2310 -262 -1821 451
4481 451 1795 -704 -838 1712 450 259 722 -1284 -174 1533 -640 -1965 131 1558 -266 -1909
4497 -1909 664 813 983 88 -358 91 2249 59 -2026 -184 2517 -345 -2434 803 1123 -101
4513 -101 -421 -74 582 562 130 -1674 -98 2425 -1648 -3134 269 1408 -557 -41 590 -555 -413
4530 -413 58 -1157 -781 2351 -1056 -2167 807 2841 -767 -513 -400 -747 -534 100 -1449 -1376 1257
4547 1257 136 -1761 193 1581 -841 -347 374 567 -751 804 -101 -441 1179 809 -989 726
$$ packed form
4431h90J442O43l947J336K063o7K70o32r88L89J868l172K01M211j226k668J756
4448E89J381k502L78O99j531l07K049q83j896K805K72k918J422L92n89J19J960
4465A440k143n33K689J25k963J757J412k968J922M78k376N64K906k572j559K272
4481D51J344k499j34K550j262j91M63k006J110J707k173j325K096J427j824j643
4497a909K573J49J70q95m46M49K158k190k085J842K701k862k089L237L20j224
4513a01l20L47O56k0m32j804J576K523m073j486L403J139j965N16O31j145J42
4530d13M71j215L76L132l407j111K974K034l608K54J13l47K13O34j549P3K633
4547A257j121j897J954J388k422M94P21J93j318J555r05l40J620l70j798J715
$$ plain form
4563 726 1688 -968 -1344 976 -852 -2120 115 499 -1910 939 1197 -384 -783 1085 995 -775 1351
4580 1351 156 -122 1822 912 -1466 -648 1732 -1015 -334 1237 570 -778 686 -319 -1749 737
4596 737 -306 -1639 -305 1149 -455 -1068 653 1197 325 117 -408 -1904 740 929 -1444 -777 1480
4613 1480 -1072 -2439 212 958 -614 -556 647 -662 519 1511 -1462 -332 1533 441 -2630 -109
4629 -109 1093 -426 -373 561 501 -140 470 -933 -819 407 377 -1829 -194 1628 -573 137 440 111
4647 111 -875 1011 -151 -785 1062 1568 -1239 8 1374 -684 -531 1656 300 -1078 106 -86
4663 -86 -1210 -816 891 -1882 -342 1197 426 -990 1703 1148 -2487 187 1129 216 280 1431 -566
4680 -566 -1696 1327 468 -1448 1072 266 -1629 -116 1806 -876 -728 1231 19 -955 1467 874
$$ packed form
4563G26R62k656l76K320j828j268K235L84k409K849K58j581l99J868r0j770K126
4580A351j195k78J944r10k378Q18K380k747O81J571o67j348J464j005j430K486
4596G37j043j333J334J454j604o13J721N44q72k08n25j496K644J89k373O67K257
4613A480k552j367K651P46j572N8J203j309J181R92k973J130J865j092l071K521
4629a09J202j519N3R34o0o41O10j403J14J226l0k206J635J822k201P10L03l29
4647A11r86J886j162o34J847N06k807J247J366k058J53K187j356j378J184j92
4663h6j124L94J707k773J540J539p71j416K693n55l635K674R42r13O4J151j997
4680e66j130L023q59j916K520q06j895J513J922k682J48J959j212r74K422n93
$$ plain form
4696 874 -842 -625 1048 -1191 -371 1123 -207 -372 2223 263 -255 639 1733 -709 83 1435 -947
4713 -947 -248 612 -404 -1229 1287 163 -1289 191 953 -782 294 142 -101 105 850 193 -2145
4730 -2145 1239 1092 -1297 -269 199 -452 27 518 -165 -501 447 555 -1584 128 967 -1421 -1038 1495
4748 1495 283 -419 680 -235 -943 259 181 -1073 -900 979 -1365 -850 761 -940 -579 -388 -984
4765 -984 -1133 -917 846 -593 153 1748 -932 -1489 715 -84 -963 1106 684 -344 417 1082 521 -1325
4783 -1325 1743 278 -1641 902 867 -1903 -757 494 1039 -349 398 -219 -466 563 294 -1107 689
4800 689 972 -993 195 2294 -236 -980 1893 183 -894 576 790 -2460 -1024 962 -948 293
4816 293 622 487 -911 1002 423 -1605 706 1554 -671 -894 1088 -516 -687 886 244 -1262 561
$$ packed form
4696H74j716K17J673k239Q20J494j330j65K595j960n18Q94J094k442P92J352k382
4713i47O99Q60j016q25K516j124j452J480P62j735J076j52k43K06P45o57k338
4730b145L384j47k389J028M68o51M79M91o83l36R48J08k139J712Q39k388L83K533
4748A495j212p02J099r15p08J202p8j254J73J879k344N15J611j701L61J91n96
4765i84j49K16J763j439P46J595k680n57K204p99q79K069m22j028P61O65n61j846
4783a325L068j465j919K543l5k770J146J251N45j388P47o17k47J029k69j401J796
4800F89K83j965J188K099k530p44K873j710j077J470K14l250J436J986j910J241
4816B93L29j35j398J913n79k028K311Q48k225k23J982j604j71J573o42j506J823
$$ plain form
4833 561 -104 -976 548 1851 -1793 -1338 1441 473 -512 329 930 -1260 16 2260 -114 -729 1287
4850 1287 -382 358 801 568 -199 1558 716 -1663 -14 1247 -582 -1124 683 -884 -516 682 161
4867 161 -1896 -115 414 -1335 -479 1811 -1038 521 1792 934 -998 621 1277 -1411 428 924
4883 924 43 52 1325 -57 -1077 605 234 -1193 131 384 -224 -490 1118 -199 -603 184 -305 -1227
4901 -1227 1510 1146 -1434 -347 1318 -1723 -1609 732 -158 -421 140 950 -855 193 2467 -221
4917 -221 -616 1387 -585 -1488 1268 -391 -1049 -88 952 -1398 46 -588 -1249 -1217 1820 166 -1948
4934 -1948 619 -258 343 318 327 -1372 -480 1266 -655 -939 593 269 -826 -49 1221 -537 385 482
4952 482 -432 -1025 1200 -68 -391 248 126 -1167 -418 512 -1487 -715 856 -520 -1114 985 -293
$$ packed form
4833E61o65q72J524J303l644M55K779r68r85Q41O01k190J276K244k374o15K016
4850A287j669P40M43k33p67J757q42k379J649J261j829n42J807j567L68J198n21
4867A61k057J781N29j749Q56K290k849J559J271q58j932J619O56k688J839M96
4883I24q81RJ273j382j020J682l71j427J324K53o08k66J608j317m04P87m89r22
4901a227K737l64k580J087J665l041J14K341q90k63N61Q10j805J048K274k688
4917b21l95K003j972r03K756j659o58R61J040k350J444o34o61L2L037j654k114
4934a948K567q77O01k5Rj699Q92J746j921k84J532l24j095P77J270j758R22R7
4952D82r14n93K225j268l23O39j22j293P49R30j999P72J571j376n94K099j278
$$ plain form
4969 -293 -1151 381 1448 -893 344 1484 -507 -1664 2362 293 -1262 1065 380 -524 -120 70
4985 70 -645 -747 968 -18 -1358 1036 -238 -115 79 857 -1512 526 631 392 -1085 1638 53
5002 53 -714 1010 533 -905 80 927 -460 588 1989 -415 -320 210 164 -948 178 679 -907 120
5020 120 -209 -319 -1597 738 -336 -1212 364 370 -681 318 902 -928 -59 1481 -893 -1043 1631 634
5038 634 -1259 -347 819 -1525 -209 556 -150 -1612 886 126 -693 607 -83 -415 579 477 -1974
5055 -1974 -319 637 -295 -1479 1361 218 -1647 1236 409 -971 441 1131 -185 -853 1714 -889
5071 -889 -628 1095 96 -1001 24 611 -887 339 793 211 -330 530 -547 -690 1098 1067 -582 -685
5089 -685 778 -904 -36 527 51 -717 336 320 -593 592 932 -1268 -856 1519 -38 -1260 170
$$ packed form
4969b93q58J532J067k341J237J140j991j157M026k069j555K327o85r04M04J90
4985G0p15j02J715r86j340K394j274J23J94P78k369K038J05k39j477K723j585
5002E3p67J724m77j438R85Q47j387J048J401k404R5N30m6j112J126N01j586J027
5020A20l29j10j278K335j074q76J576Oj051R99N84j830Q69J540k374j50K674r97
5038F34j893R12J166k344J316P65p06j462K498p60q19J300o90l32R94j02k451
5055a974J655R56r32j184K840j143j865K883q27j380J412O90j316o68K567k603
5071h89K61J723r99j097J025N87j498J226M54n82n41Q60j077j43J788l1j649j03
5089f85J463j682Q68N63m76p68J053j6r13J185L40k200M12K375j557j222J430
$$ plain form
5106 170 414 -323 733 1577 195 -664 874 -41 -111 954 -707 -843 794 970 -366 549 -291 -1022
5124 -1022 -723 176 361 -1109 934 876 -865 654 399 -947 -762 245 -442 -254 1054 81 -1117
5141 -1117 977 231 -1031 1072 1319 -362 -1303 869 -1116 -464 312 614 -1243 91 694 -1246 -20
5158 -20 88 -450 -429 590 24 -1092 390 719 -1819 -120 625 -14 157 1525 182 -544 1187 335
5176 335 -839 418 538 733 -951 1021 -762 -1160 725 969 -620 612 143 -890 213 797 -962
5193 -962 -522 1477 418 -968 75 771 53 793 -28 -737 341 525 -503 -565 237 -82 -199 343
5211 343 791 -734 -22 -36 -714 -706 1047 51 -1309 1355 -117 -1111 693 910 -116 91 1166 -193
5229 -193 572 1073 -773 -352 1043 584 -1009 -617 -309 -861 823 1232 -593 -900 -133 603 -537 -1027
$$ packed form
5106A70K44p37J056Q44j382q59J538r15p0J065j661j36J637J76j336R15q40p31
5124a022K99Q99J85j470K043n8j741J519k55j346J85J007o87J88J308r73j198
5141a117K094p46j262K103K47j681r41K172j985O52P76L02j857J334O03j940J226
5158b0J08n38K1J019n66j116J482L29k538J699P45o39J71J368j343p26J731q52
5176C35j174J257J20J95j684J972j783l98J885K44j589J232m69j033J103N84j759
5193i62M40J999j059j386J043O96p18P40q21p09J078J84j028o2Q02l19j17N42
5211C43M48j525P12j4o78QJ753r96j360K664j472r94J804K17j026K07J075j359
5229a93P65N01j846M21J395m59j593L92L08n52J684M09j825l07P67P36j140m90
$$ plain form
5247 -1027 411 -398 -422 748 217 -2 759 -781 -485 -159 1206 -628 -144 1065 -1097 477 440 94
5265 94 -1348 701 -249 -602 -29 467 -946 353 1472 -707 1116 1174 -539 -1068 722 575 155 -673
5283 -673 -330 -920 -12 1351 -622 -826 -5 -132 -936 815 1428 -584 -642 660 374 -689 -222 1102
5301 1102 -1328 85 37 -977 -42 -75 -161 26 1291 415 -506 209 651 -119 -914 996 -65 873 915
5320 915 663 -259 776 275 -1575 81 290 -227 448 1408 -377 -380 951 646 -1417 -718 183 -516 533
5339 533 80 -895 -279 520 -600 -875 716 32 -792 -173 234 -744 267 1278 999 -1523 -391 89
5357 89 -469 475 1010 -902 -743 706 -176 -945 355 -246 -518 633 -631 -950 76 802 -489 -693
5375 -693 567 -843 -378 825 48 -346 87 60 49 33 577 -682 -756 310 -902 -387 -138 -87 -1208
$$ packed form
5247a027J438q09k4J170n31k19P61j540K96L26J365j834M84J209k162J574l7l46
5265I4j442K049r50l53N73M96j413J299J119k179J823N8j713n29J790j47m20q28
5283f73L43n90R08J363j973k04Q21j27q04J751O13k012n8J302k86j063M67J324
5301A102k430J413m8j014R35l3q6J87J265q76r21P15M42p70p95J910j061R38M2
5320I15k52r22J035n01j850J656K09n17O75R60j785lJ331l05k063O99R01o99J049
5339E33m53r75O16P99j120k75J591o84q24O19M07r78J011J011k79k522J132M80
5357H9n58R44N35j912J59J449q82p69J300o01k72J151j264l19J026P26j291k04
5375f93J260j410M65J203p77l94M33k7j1j6N44j259p4J066j212N15K49N1j121
$$ plain form
5394 -1208 563 387 468 510 889 340 -137 1273 -681 -627 983 1048 122 440 733 482 -470 967 -683
5413 -683 -161 778 36 -240 -89 519 -552 -984 211 -522 -945 424 297 -334 2308 132 -859 407
5431 407 1540 409 -726 350 108 -458 996 -80 -975 20 744 179 -479 142 703 -205 898 101
5449 101 -666 199 942 73 -572 697 -365 -611 787 -108 -620 580 108 -852 -759 828 -51 239 1081
5468 1081 -550 -1010 409 -58 -896 290 -56 -922 -919 752 -419 -446 1187 404 -1218 456 -290 -627
5486 -627 -650 -153 739 -291 1841 971 -978 259 1167 -108 -102 599 124 559 386 344 -60 1172 -7
5505 -7 -653 -204 232 -443 -478 -177 -715 -54 -27 99 -758 731 1311 -1673 933 329 -565 431 1924 -762
5525 -762 -1083 1057 -100 -629 -93 762 -1471 631 338 23 -861 -236 1022 -861 26 67 -628 -741
$$ packed form
5394a208J771j76Q1M2L79n49m77J410j954N4J610O5r26L18K93k51r52J437j650
5413f83N22R39p42k76J51O08j071m32J195p33m23J369j27o31K642k176r91J266
5431D07J133j131j135J076k42n66J454j076q95R95P24n65o58O21N61r08J103p97
5449A01p67Q65P43q69o45J269j062k46J398q95n12J200m72r60R3J587q79K90Q42
5468A081j631m60J419m67q38J186l46q66LJ671j171k7J633p83j622J674p46l37
5486f27k3M97Q92j030K132q70j949J237R08j275OP01m75M35j73m2m04J232j179
5505go46M49M36o75l5L01n38O61K7J26q57J489N80k984K606o04q94R96J493k686
5525g62l21K140j157n29N36Q55k233K102k93l15q84O25J258j883Q87M1o95j13
$$ plain form
5543 -741 -563 -421 -941 -261 -368 -557 1148 468 -660 -226 1341 239 -888 332 -1611 -418 511
5560 511 70 -840 693 190 -438 86 -10 -1249 -869 480 -865 -303 358 1066 -1480 -12 2113 -465
5578 -465 117 892 -467 -833 65 349 -164 -62 938 -1036 77 384 -683 72 1392 -434 -865 457
5596 457 365 -795 210 1194 -269 564 294 486 -104 772 -94 -411 139 843 -897 440 274 -562 243
5615 243 1668 -766 527 640 -598 -825 -898 744 -587 193 410 -111 -1256 -674 88 -389 1082 240
5633 240 535 1335 256 -865 -406 1019 381 -420 911 374 34 1355 252 -550 27 657 -1011 195
5651 195 6 1086 -980 -216 865 -2005 673 112 -1283 -648 409 -1201 -799 674 -208 -962 29
5668 29 854 -555 -271 51 207 -1029 334 -578 -452 1315 424 -661 840 1281 -454 -124 662 -799
$$ packed form
5543g41J78J42n20O80j07j89J705o80j128M34J567j102j127J220j943J193R29
5560E11m41r10J533n03o28N24r6j239L80J349j345N62O61P08k546J468K125k578
5578d65N82P75j359l66Q98K84n13J02J000j974J113L07j067P55J320j826m31J322
5596D57r2j160J005R84j463Q33k70J92n90Q76q66l17N50P04j740J337j66q36Q05
5615B43J425k434J293J13j238k27p3J642j331P80K17n21j145N82P62m77J471q42
5633B40K95Q00j079j121M59J425o38q01J331n37l40J321j103q02N77O30j668J206
5651A95j89J080k066P64J081k870K678n61j395O35J057j610M02J473q82p54R91
5668B9Q25j409K84L22J56j236J363r12J26J767q91j085J501M41j735L30P86j461
$$ plain form
5686 -799 -1528 -26 754 543 690 564 -584 -366 277 -405 -342 495 -369 -72 902 -43 -646 510 1719
5705 1719 -966 -625 -382 -127 -1650 -713 1 -441 419 1174 -227 650 276 480 -1438 1036 -48 -778
5723 -778 800 410 -908 -67 699 147 105 738 -306 -622 1051 590 741 -36 -273 -976 -896 -378 47
5742 47 -234 935 -793 -286 -125 752 -1316 420 442 -471 -25 1442 171 -275 161 -728 -1059 324
5760 324 663 -544 64 251 -753 -527 1199 -789 -536 692 50 -553 -281 544 -62 -358 1688 511
5778 511 -391 221 75 -149 260 243 -666 188 1094 78 -1288 1483 -42 7 475 1158 -373 -216 158
5797 158 -122 -87 555 584 -394 866 408 292 664 582 246 -177 -39 1128 89 467 63 -929 238 182
5817 182 -496 -165 725 -191 -730 458 616 -962 116 606 -388 344 -999 -898 782 888 115 -994
$$ packed form
5686g99p29J502P80k11J47j26j148K18O43o82O3Q37q64K97R74r45o03J156J209
5705A719k685L41K43K55j523R37P14m42Q60P55j401Q77l74K04j918K474j084p30
5723g78J578l90j318Q41P66n52m2O33j044l16J673m61J51p77k37p03Q0N18M25
5742D7k81J169j728N07J61Q77k068J736K2r13M46J467j271m46M36q89l31J383
5760C24L39j207O08J87j004K26J726j988K53J228o42o03K72Q25o06k96K046j177
5778E11r02O12j46k24M09j7r09Q54R06j016j366K771j525M9M68O83j531J57L74
5797A58k80L5O42K9r78J260m58j16L72q2l36m23J38J167j039L78m04r92J167n6
5817A82o78L31Q90r16n39J188J58j578J078M90r94P32j343J01J680J06p73j109
$$ plain form
5835 -994 -484 1114 -225 -224 87 -681 331 748 -571 -799 776 317 -501 1156 1026 237 446 1129 -659
5854 -659 -319 739 56 961 653 1080 -281 264 1023 -1061 363 419 328 -1249 514 -633 -210 445
5872 445 514 -645 367 1128 -512 -142 1418 1007 -761 738 420 -903 215 -263 -535 -15 550 -1165
5890 -1165 -684 359 376 -753 405 1111 -524 20 364 -275 14 190 -176 -269 844 4 -885 680
5908 680 113 -971 -809 644 485 -275 -273 589 -228 779 127 -177 -18 1157 323 562 1894 511 -580
5927 -580 159 268 -180 932 439 152 633 889 -583 106 1788 -365 13 -275 944 -780 -703 -17
5945 -17 408 499 -137 260 -50 516 225 -360 -557 979 -387 -406 273 -887 -78 239 -153 -1267 310
5964 310 752 -177 574 300 -517 -1058 488 367 -890 -484 -367 138 647 -160 -144 -29 758 -1157 -993
$$ packed form
5835i94N10J598j339JL11p68J012M17j319k28J575m59q18J657j30p89K09O83j788
5854f59L40J058o83R05l08M27j361N45P59k084J424N6r1j577J763j147M23O55
5872D45O9j159J012P61j640L70J560m11j768J499l18j323J118m78k72N20N65j715
5890a165M81J043J7j129J158P06j635N44L44o39K89J76l66r3J113q40q89J565
5908F80n67j084J62J453j59p60KQ62q17J007o52l04J59J175q34K39J332j383j091
5927e80P39J09m48J112m93k87M81K56j472O89J682k153L78k88J219j724P7O86
5945a7M25R1o36L97l10N66k91n85j97J536j366j9O79j160Q09L17l92j114J577
5964C10M42r29P51k74q17n41J546j21j257M06J17N05N09q07J6J15P87j915J64
$$ plain form
5983 -993 758 13 -363 99 -165 -61 -16 588 -571 -93 485 -577 288 1234 166 -790 325 1759
6001 1759 308 168 43 -756 -428 235 -786 -175 609 -527 -480 -229 928 1192 -930 -301 98 -13
6019 -13 -163 336 -120 543 -471 -666 1080 1079 -534 -1101 -194 505 -35 -974 -504 -464 -209 670 -558 713
6039 713 1130 -284 -1387 775 1174 -811 -528 -45 187 -126 123 -73 26 888 -1748 -876 -199 910
6057 910 -248 -426 294 496 -616 -685 -362 362 499 349 -358 1585 836 -704 2 768 -176 400 759
6076 759 817 974 -402 -173 201 1129 522 -923 -1036 772 -851 -376 133 415 -429 -115 108 -512 680
6095 680 262 -1009 -505 696 -482 -1110 230 1152 -1497 442 -187 172 823 -688 144 87 426 -364
6113 -364 -1044 1389 1037 -605 -407 -36 -230 -945 349 535 1018 -229 155 -883 1137 443 -629 -855
$$ packed form
5983i93J751p45l76M62k64J04M5O04j159M78N78j062Q65R46j068r56J115J434
6001A759j451j40j25p99L28O63j021O11P84j136M7K51J157K64k122O29L99j11
6019a3j50M99m56O63j014j95J746jj613n67R07O99n40r39M70M0K55Q79j228J271
6039G13M17j414j103K162L99j985K83M83K32l13K49j96R9Q62k636Q72O77J109
6057I10j158j78P20K02j112o9L23P24J37j50p07J943p49j540P06P66r44N76L59
6076G59N8J57j376K29L74R28o07j445j13J808j623M75N09K82q44L14K23o20J192
6095F80m18j271N04J201j178o28J340R22k649J939o29L59O51j511Q32n7L39p90
6113c64o80K433l52j642J98L71j94p15J294J86M83j247L84j038K020o94j072k26
$$ plain form
6131 -855 1513 44 -451 -198 334 725 -282 -1041 353 645 -141 -1241 -476 1606 322 -1110 63
6148 63 845 11 -606 -679 595 398 720 -273 -231 -120 -351 -1311 -826 695 187 -119 270 97 1094 -577
6168 -577 33 99 1628 -78 -959 118 564 -824 -956 -405 460 -98 -166 -205 -100 196 -18 -1203 50
6187 50 687 -768 -1376 527 486 -414 -1951 -66 81 53 -160 -743 227 963 -318 -523 1461 362 -708
6206 -708 -161 667 751 260 -462 274 -257 248 -431 284 530 976 -1132 -425 1450 -484 -598 -123 437
6225 437 168 -894 -340 865 -168 622 -234 -113 1186 -467 -1573 419 795 -1068 -543 -447 617
6242 617 664 -401 126 383 1343 -588 -1176 853 521 -522 -78 1837 178 -962 -1020 -418 298 -137
6260 -137 -172 -792 884 1011 -1166 -697 761 1098 -1097 -870 214 608 -309 -754 -856 553 690 -872
$$ packed form
6131h55K368j469m95K53N32L91j007p59J394K92p86j100P65K082j284j432J173
6148F3P82q34o17p3J274j97L22r93M2J11k31r60M85J521n08l06L89j73R97j671
6168e77O10O6J529j706q81J077M46j388j32N51Q65n58o8l9J05K96k14j185J253
6187E0O37j455o08J903m1r00j537J885J47k8k13n83R70P36j281k05J984j099j070
6206g08N47Q28Q4m91p22P36n31N05o79P15K46M46k108P07J875j934j14M75N60
6225D37k69j062N54J205j033P90q56J21J299j653j106J992L76j863N25R6J064
6242F17M7j065N27K57R60j931n88K029l32j043M44J915j659j140n8O02P16m35
6260a37l5o20J676J27k177M69J458L37k195K27J084L94r17m45j02J409J37j562
$$ plain form
6278 -872 -512 1412 89 -571 -320 -319 3 -1207 -490 -989 558 -250 -1597 -155 1261 332 -219 67
6296 67 -14 -357 -676 420 448 -319 -539 -621 -711 789 407 -128 -34 410 -359 -967 -215 173 -505 241 -107
6317 -107 362 570 -392 -498 -911 1008 827 -301 485 604 -490 -175 724 -602 -775 1270 -267 179
6335 179 439 -1565 256 17 234 -1799 -528 862 247 -695 139 -575 -272 1038 406 -594 142 327
6353 327 -1043 472 1232 885 -1489 -54 635 -1311 -132 -829 -449 1147 -454 -1006 354 481 -331
6370 -331 -262 804 -415 -287 -243 -413 181 754 380 -582 931 1316 -186 -986 317 1107 -503 -177 266
6389 266 327 -10 -222 -25 -101 105 -1502 -1192 703 731 -1271 -609 1025 340 -915 -796 256 -115 911
6408 911 -532 141 580 540 -1355 -446 1874 -46 -814 -623 -154 557 385 86 -950 -537 822 -99
$$ packed form
6278h72L60J924j323o60K51JL22j210P17m99J547q08j347J442J416r29n51K86
6296F7q1l43l19J096K8p67k20q2r0J500l82n35R4M44p69o08P52L88o78P46l48
6317a07M69K08r62j06m13J919j81j128P86J19j094L15Q99j326j73K045j537M46
6335A79K60k004J821k39K17k033J271J390o15r42Q34p14L03J310o32j000P36J85
6353C27j370J515P60l47k374J435O89j946J179o97L80J596j601n52J360J27q12
6370c31O9J066j219J28M4j70N94N73l74r62J513L85j502q00J303P90j610L26M43
6389B66O1l37k12J97p6K06j607L10J895K8k002O62J634o85j255J19J052l71J026
6408I11j443O73M39m0j895R09K320j920p68J91M69P11j72k99j036M13J359r21
$$ plain form
6426 -99 270 559 -365 -282 758 213 -454 615 -634 -1152 672 -103 -542 -850 730 796 -967 -52 1019
6445 1019 -226 -1067 657 -939 -127 697 365 -454 -33 177 188 -59 -27 -380 -5 250 -355 -622 -318
6464 -318 496 -608 -818 -919 -266 143 1171 -1269 218 963 925 -22 142 2 -454 -789 -614 -216 -466
6483 -466 -420 -471 -494 742 -400 -528 734 953 -891 -758 -123 409 148 -231 -456 1276 1477 305 -926
6502 -926 650 1014 -299 -587 -741 650 -427 -428 193 2 777 -916 -1096 146 1579 -912 -1288 410
6520 410 -740 -161 -47 32 -936 28 403 -979 -212 289 120 68 451 601 793 -273 -69 90 504 89
6540 89 -180 329 612 -526 112 36 -196 291 -566 -639 268 -360 -215 -85 -167 -86 864 -151 796 1083 -82
6561 -82 507 682 -470 -712 339 -83 14 145 707 -961 213 552 617 338 -76 -57 222 804 -38 -843
$$ packed form
6426i9L69K89r24Q3J040n45o67J069j249n18J824p75m39l08J580O6j763R15J071
6445A019j245q41J724j596Q12Q24l32q19M21K10J1k47L2l53L75K55o05k67L04
6464c18Q14j104k10j01O53M09J028k440J487P45l8r47J64j40m56l35J75L98k50
6483d66M6n1k3J236j142j28J262K19j844J33O35N32k61l79k25J732K01j172j231
6502i26J576L64j313k88j54J391j077jO21j91P75j693j80J242J433k491l76J698
6520D10j150N79J14P9r68R64L75j382P67N01j69n2L83J50J92j066K04J59M14m15
6540H9k69N09K83j138O38p6k32M87q57p3R07o28J45J30q2Q1R50j015R47K87j165
6561h2N89J75j152k42J051m22R7J31N62j668J174L39O5k79m14J9K79N82q42q05
$$ plain form
6581 -843 1278 -50 -177 995 252 -269 -448 18 -182 -81 1177 811 -1171 -360 819 -338 482 111
6599 111 334 -279 589 418 193 1205 347 -645 -687 1215 8 324 404 -443 -190 292 -755 -564 737
6618 737 547 -684 -372 -251 181 -550 152 283 -182 616 -40 -34 464 194 -913 61 588 -515 -259 -55
6638 -55 -182 77 -835 -217 -175 83 460 -978 302 572 -171 -114 416 -375 -895 -63 140 402 1142 610
6658 610 580 580 375 762 477 -106 170 -852 -120 65 -219 71 -357 -611 208 -118 -119 420 -497 895 445
6679 445 -867 -324 -24 -979 193 57 -967 198 28 -139 -187 1207 124 -974 788 227 -330 581
6697 581 -244 -680 190 157 117 -611 340 884 144 175 321 -172 -330 286 357 -105 -55 525 -1493 -70 992
6718 992 715 121 -201 215 183 -227 -315 43 488 174 -212 307 756 -343 -304 -161 1189 -369 -159 -497
$$ packed form
6581h43K121j328j27J172p43n21j79M66k00J01J258l66j982Q11J179j157Q20l71
6599A11K23o13Q68j71k25J012q58r92m2J902j207L16Q0q47K53M82j047J91J301
6618G37j90j231L12J21M32p31P02J31m65P98o56OM98k70j107R74N27j103K56K04
6638e5j27K59r12O18M2K58L77j438J280K70p43N7N30p91n20Q32K03K62P40n32
6658F10l0%k05L87k85n83K76j022P32J85k84K90m28k54Q19l26jN39r17J392m50
6679D45j312N43L00r55J172j36j024J165j70j67m8J394j083j098J762n61n57R11
6697E81q25m36Q70l3m0p28R51N44p40L1J46m93j58O16P1m62N0N80k018J423J062
6718I92k77n94l22M16l2m10q8L58M45l14l86N19M49j099L9J43J350j558K10l38
$$ plain form
6738 -497 -605 180 446 -346 662 831 -1028 549 -438 488 -720 119 -661 -169 17 613 -144 -192 1207
6757 1207 38 -490 732 870 -419 405 352 -735 -295 -368 -670 -514 891 -63 -36 477 526 -231 10
6776 10 21 -1406 7 81 1231 -282 140 -1034 147 -577 -409 144 151 645 239 41 664 352 -368 95
6796 95 -110 -194 -657 258 -512 -925 -408 -272 189 -550 -336 269 117 -68 -361 1368 24 180 135 82 -812
6817 -812 -359 227 -1202 -473 -574 807 153 242 1164 -868 389 426 369 3 1070 297 -389 -609 259
6836 259 -202 -403 73 105 -186 1730 653 242 617 -440 -57 -262 912 -781 -797 219 198 -788 443
6855 443 -8 -244 336 -234 -189 94 259 248 -788 -96 -307 89 625 -270 -898 176 -366 -927 530 1208
6875 1208 -12 1326 81 216 -783 -110 50 -17 610 298 148 -1174 762 227 -144 -672 295 -907
$$ packed form
6738d97j08P85K66p92J008J69j859J577r87R26j208Q39p80M92J86N96p57m8J399
6757A207j169n28J222J38j289Q24n3j087M40p3l02J56J405r54K7N13M9p57K41
6776A0J1j427J413P4J150j513M22j174J181p24J68N53PM94m06j98O23l12p20M63
6796I5k05q4m63R15p70m13N17J36M61p39K14O05j52j85k93J729j344J56m5n3q94
6817h12M53N86j429P29j01J381o54Q9R22k032J257L7n7l66J067p73o86k20Q68
6836B59m61k01M76L2k91J916j077m11L75j057L83k05J174j693j6J016k1r86J231
6855D43m51k36N80n70M5K83J65j1j036O92k11L96N36q95o28J074n42n61J457O78
6875A208j220J338j245J35r99O73J60o7O27l12j50j322J936n35l71n28R67j202
$$ plain form
6893 -907 699 701 -379 29 697 517 -256 -196 711 -98 1114 339 696 515 133 154 -14 -64 17 -188 569
6914 569 -406 -214 375 -80 759 -193 670 -778 -366 819 -415 132 445 661 -793 906 490 -92
6932 -92 537 475 19 60 1643 -148 -104 143 267 -19 -17 259 171 -865 338 -692 -100 257 300 -302 259
6953 259 -555 106 -206 -641 305 -655 206 -561 314 402 205 512 -301 374 -447 -519 830 86 -510 151
6973 151 -136 -674 126 30 -262 -459 -510 413 323 164 906 120 -597 495 646 -224 422 139 -530 -383 760
6994 760 -349 488 546 -1267 -172 -604 596 27 -141 919 -428 -231 852 -517 178 75 -511 1017
7012 1017 118 -36 -26 705 -895 22 550 1570 178 -143 301 241 43 -478 247 -694 131 735 -13
7031 -13 415 542 -538 -410 172 631 -74 554 -178 -120 -511 1000 -141 -1107 -482 372 -488 -86 92 -104
$$ packed form
6893i07J606Kj080M08O68j80p73O0R07q09J212p75L57j81l82K1j68n0Q1k05P57
6914E69r75J92N89m55Q39r52Q63j448M12J185j234N47L13K16j454J699m16n82
6932i2O29o2m56M1J583j791M4K47J24k86KK76q8j036J203j030N92L57M3o02N61
6953B59q14O61l12m35R46r60Q61p67Q75Q8j97L07q13O75q21p2J349p44n96O61
6973A51k87n38Q00r6k92j97n1R23r0j59P42p86p17J092J51q70O46k83o69J47J143
6994G60j109Q37N8j813J095m32J200n69j68J060j347J97J083j369O95j03n86J528
7012A017q99j54J0P31j600R17N28J020j392l21M44o0j98n21P25r41Q25O04p48
7031a3M28J27j080J28N82M59p05O28p32N8l91J511j141r66O25Q54q60M02J78j96
$$ plain form
7051 -104 467 276 -533 192 937 866 618 -152 -1025 -14 889 -52 -22 657 -185 -253 348 11 374 64 -264
7072 -264 703 910 -195 35 776 -706 -318 -878 450 310 605 327 869 1022 521 528 -54 -589 690
7091 690 420 -109 -95 297 923 -1046 277 -416 85 -301 1080 -510 -602 872 92 -19 81 485 -40
7110 -40 524 347 -164 -791 -112 -344 -1119 -420 306 -127 1036 330 -702 426 598 -149 -598 632 386
7129 386 -764 -553 -457 208 -496 -14 336 4 -298 485 -90 788 -202 -535 -547 262 -142 0 353 538
7149 538 216 -277 -515 484 218 982 90 -215 -570 -425 -90 870 215 -689 -1011 86 -439 164 761 575
7169 575 -186 636 627 -158 234 -380 -132 -755 250 280 -12 899 -674 530 8 60 -886 595 -391 -398 471
7190 471 896 411 388 805 -491 -48 344 -467 -666 1110 -125 -1012 -536 437 -555 -1034 192 -472 -211
$$ packed form
7051a04N71j91q09P25P45p1k48p70q73J011R03r41L0O79q42o8O01l37L63l10l28
7072b64R67K07j105K30P41j482L88n60J328j40K95k78N42J53n01Pn82n35J279
7091F90k70n29J4L92O26j969J323o93N01l86J381j590r2J474p80j11J00M04n25
7110d0N64j77n11o27O79k32p75O99P26m33J163p06j032J128J72p47m49J230k46
7129C86j150K11R6O65p04M82L50l32l02P83n75Q78r90l33j2Q09m04J42L53J85
7149E38l22m93k38R99k66P64q92l05l55J45L35R60o55r04l22J097n25O03N97j86
7169E75p61Q22rp85L92o14K48o23J005L0k92R11j573J204n22N2r46J481r86pQ69
7190D71M25m85k3M17j296M43L92q11j99J776j235q87M76R73r92m79J226o64K61
$$ plain form
7209 -211 112 536 590 -497 -499 -253 651 -22 321 -238 -461 -269 -411 -82 -152 -527 281 68 691 -166 56
7230 56 -554 -22 143 -504 -106 362 -585 200 -677 -804 123 4 -198 -214 -229 -363 -44 314 -93 329 -468
7251 -468 315 202 499 -1048 1301 316 -441 -895 -196 609 918 1521 -178 -324 -554 66 -227 980 -32
7270 -32 -229 -65 -642 -502 -521 1087 960 -77 529 14 900 337 -201 -38 115 98 861 -764 129 179
7290 179 377 315 680 1209 -313 -81 76 61 -315 -87 490 -301 499 -151 -1189 -512 928 1386 567 -243
7310 -243 347 569 -538 -355 -16 -20 -762 123 410 -90 658 1204 -16 725 226 -343 -638 664 330 -402
7330 -402 30 -97 460 -172 -375 -619 -98 -395 557 361 204 -21 -201 -452 342 258 -608 133 -225 -50
7350 -50 95 965 -120 -304 -13 176 -224 159 -666 -207 317 529 -276 -656 -159 32 134 352 208 -121
$$ packed form
7209b11L23M24N4j087kK46R04o73L43n59k23J92j42L29p0l75Q08k13O23q57K22
7230E6o10N32J65o47L98M68r47P85q77j27R27j19k02j6j5j34L19L58m07M22p97
7251d68P83j13K97j547K349r85p57m54O99Q05L09O03j699j46k30O20k93J207j012
7270c2j97J64n77J40j9J608j27j037O06n15Q86n63n38J63J53j7P63j625Q93N0
7290A79J98o2L65N29j522K32J57j5l76K28N77p91Q00o50j038O77J440M58q19q10
7310b43N90K22j107J83L39mp42Q85K87n00P48N46j220P41m99n69k95J302l34p32
7330d02M32j27N57o32k03k44N21k97R52j96j57k25j80k51P94q4q66P41l58J75
7350e0J45Q70j085j84K91J89m00L83q25M59N24K12q05l80M97J91J02K18j44l29
$$ plain form
7370 -121 283 820 525 -471 -75 476 378 261 1141 -358 313 591 -794 -645 176 302 578 -262 -205 165
7390 165 929 120 -545 582 -226 -332 -1064 -314 -117 -432 457 100 493 -543 -244 -122 -545 38 -499
7409 -499 -261 -70 -72 305 61 617 84 80 -967 -313 606 86 690 254 274 175 225 172 394 -127 -232 95
7431 95 261 -946 145 -469 -832 -252 -728 -411 191 430 -118 19 425 176 -532 1672 950 153 129 663
7451 663 -31 34 639 -687 -287 792 -340 -306 55 269 -846 353 528 -417 48 -414 -50 -36 -103 -795
7471 -795 -352 260 -141 719 958 -54 -337 -631 218 -635 -56 376 460 -312 -289 1215 13 -159 -246 -209
7491 -209 384 -1220 453 737 -847 909 -77 -73 -186 -187 732 55 1012 -338 29 298 -427 880 -313
7510 -313 116 71 131 404 -293 811 226 -684 -511 692 26 1701 849 -385 189 839 211 433 719
$$ packed form
7370a21M04N37k95r96L96N51r8j17Q80j499O71K78j385J49Q21J26K76q40N7L70
7390A65P64q09o65J127q08j06p32P50J97l15Q89l57L93j036K99J22m23N83n37
7409d99K38J91kL77k44N56n33mj047O54R19n20O04m36K0r9N0n3K22n21j05L27
7431I5J66j207J091o14l63N80m76L17O02K39n48J37M06k49p08K204p22p97k4N34
7451F63o94O5O05j326M00J079j132L4L61K14j115J199J75r45M65m62L64J4o7o92
7471g95M43O12m01Q60K39j012k83k94Q49q53N79M32Q4p72K3J504j202j72q7L7
7491b09N93j604J673K84j584J756r86Mj13jR19o77R57j350L67K69p25J307j193
7510c13M29m5O0K73o97J104n85r10J73J203o66J675q52j234N74O50o28K22K86
$$ plain form
7529 719 -384 -1612 543 -20 -1059 -97 -838 730 -555 49 -25 -513 1013 -105 32 -481 -99 -702
7547 -702 177 251 821 -652 992 243 626 955 755 -409 52 281 -677 -399 327 367 -1083 129 179
7566 179 -342 94 828 -566 -844 -317 -335 -660 -421 361 -205 -170 768 472 -223 -424 -901 259 -93 229
7586 229 585 -618 -154 19 334 -68 -1039 264 456 49 259 -90 701 510 -152 628 735 42 1653
7605 1653 -80 328 194 211 -344 597 777 492 585 -330 685 -1456 -532 784 -297 301 -471 -1184 216
7624 216 -839 -8 157 -243 535 908 930 171 -785 503 427 425 1443 153 -757 -304 1133 -204 594
7643 594 264 -142 -238 881 -224 278 309 157 -503 -729 83 682 -989 -129 -429 -302 -256 -314 17 839
7663 839 -199 -319 25 -103 -452 -189 -87 -220 270 -16 -135 -359 326 235 295 575 6 944 -433 346
$$ packed form
7529G19j103j228K155n63j039R62p41J568j285O04p4m88J526j118J37n13L82o03
7547g02Q79P4N70j473J644p49L83L29k00j164M61K29r58K78P26M0j450J212N0
7566A79n21M36P34j394k78N27j8l25K39P82n66L5R38k96o95k01m77J160l52L22
7586B29L56j203M64J73L15m02r71J303J92m07K10l49P91j91o62P80J07o93J611
7605A653j733M08j34J7n55R41J80k85R3r15J015k141R24J316j081N98p72p13J400
7624B16j055Q31J65m00P78L73K2p59r56J288p6kJ018j290r10M53J437j337P98
7643E94l30m06r6J119j105N02L1j52o60k26Q12N99j671Q60l00J27M6n8L31Q22
7663H39j038j20L44j28l49K63J02j33M90k86j19k24O85r1O0K80n69R38j377P79
$$ plain form
7683 346 -344 149 497 142 -136 142 147 -332 166 -182 657 -803 533 305 -450 593 -1211 547 -464
7702 -464 -901 322 641 377 447 -609 209 -61 312 -148 836 117 -89 -528 -426 504 -351 -502 278 -326
7722 -326 -862 1010 -216 0 351 -611 -223 307 -507 -324 -415 521 -88 390 -214 -152 -1174 -655 1058
7741 1058 266 71 -679 -523 338 -139 -1001 -383 207 -455 23 166 838 -840 338 811 -299 343 1073
7760 1073 122 -257 -635 -613 -568 487 1081 -510 -586 -219 -755 533 -315 235 133 -705 237 15 196 262
7780 262 158 -329 583 355 893 651 493 -224 383 -508 -29 1046 1054 173 381 474 -326 269 169 971 -241
7801 -241 -9 -22 -1424 261 -245 42 -295 -629 -25 276 -502 -19 -358 3 -45 -583 82 647 -202 505
7821 505 509 367 328 -251 -269 -59 -217 -37 -434 -529 -232 172 -1065 437 1434 -341 643 -142 779 602 -331
$$ packed form
7683C46o90M93L48l55k78K78Nm79M98l48Q39j460J336k28p55J043j804J758j011
7702d64m37J223L19k64P0j056Q18k70L73m60R84p19k06m39J02R30q55j51P80o04
7722c26n36J872j226K16L51r62L88N30q14J83r1R36o09M78o04O2j022N19J713
7741A058p92j95p50J56Q61m77q62O18N90o62M78J43O72j678J178M73j110O42P30
7760A073r51l79l78K2M5J055N94j591p6L67n36J288q48N50j02q38R42k22J81O6
7780B62j04m87R12k28N38k42j58p17O07q91M79J075Qq81K08R3q00N95j00Q02j212
7801b41K32j3j402J685n06K87l37l34O04L01p78M83l39L61m8n38O65N65q49P07
7821E05Mj42l9n79j8K10j58J80l97r5K97M04j237J502R97j775R84p85R21j77r33
$$ plain form
7842 -331 184 -619 -227 -304 -829 671 1030 44 -19 277 -1048 139 38 -1251 -213 19 -320 76 636
7861 636 720 -1366 -579 -1037 614 366 -642 -74 -516 -467 -459 454 -281 489 59 554 279 -193 312 323 -267
7882 -267 585 1231 864 89 675 707 -393 15 -157 203 225 297 312 199 1054 485 -607 919 124 245
7902 245 576 -861 21 190 134 601 817 -372 -576 -783 223 912 -926 -300 796 101 -355 -39 -100
7921 -100 -1253 101 18 262 -39 -141 822 707 -171 318 -365 -1044 822 -158 -91 108 113 -338 265 1049
7941 1049 271 -493 271 18 -372 339 -77 294 758 401 359 213 -39 -161 -167 65 -207 276 -533 214 497
7962 497 365 -738 -834 748 -506 641 197 67 -573 127 62 -220 -309 423 1212 -792 105 810 -347
7981 -347 -117 -217 -583 305 -136 -2 -532 -477 -143 170 592 611 -132 -1151 334 26 597 787 246 -383
$$ packed form
7842c31N15q03L92p7n25J500L59r86o3K96j325J187j01j289J038K32l39L96N60
7861F36Q4k086P87m58J651k48j008N68m42M9QR13p35P70m30M95k75m72N05J1n90
7882b67Q52O46l67p75N86L2j100M08j72L60K2P2J5j13Q55n69j092J526p95J21
7902B45L31j437Q82J69n6M67K16j189k04k07J006O89j838O26J096o95m56L16o1
7921a00j153J354q3K44l01j02R63j15q78M89o83o79J866r80O7J99Nm51O03P84
7941A049p78p64P64k53l90P11m16L71M64l57m2j46k52j22oK32k72M83q09P47K83
7962D97j32j103r6J582j254J147m44j30o40P00o5k82q9P32P89k004Q97P05j157
7981c47K30j00l66Q88m41J34n30N5L34L13M22J9p43j019J485l08N71J90n41o29
$$ plain form
8001 -383 -191 150 1168 -53 509 154 889 -517 188 721 194 1146 394 -1073 701 -549 -490 456
8019 456 -99 -40 259 1053 523 -303 760 -507 -218 -220 -705 560 244 -640 -630 -94 1359 -313 173 -415
8039 -415 -259 170 269 -452 -496 501 -639 -178 621 724 -67 -507 479 -664 -404 454 324 -332 699 21
8059 21 -538 -402 65 878 422 691 854 28 -707 1250 -501 487 497 580 -685 -651 -851 250 974 1283
8079 1283 471 204 383 -535 629 582 248 102 147 -455 -935 884 -91 -30 -17 1095 -252 561 409 390
8099 390 606 794 647 -721 241 -68 -745 378 309 15 -421 5 294 -207 -1214 768 -199 -578 980
8118 980 -163 1020 1457 -644 125 735 250 198 886 -298 264 572 -503 -24 887 336 -385 696
8136 696 238 500 -270 260 640 -12 479 4 -85 -985 3 1666 525 389 227 -314 573 -95 302 -578
$$ packed form
8001c83J92L41J018j221N62l55P35j406P05N33n27R52p52j467J774j250N9R46
8019D56n55N9K99P94n30q26J063j267K89km85J265l16q84J0N36J453j672M86n88
8039d15J56M29R9p21m4R97j140M61P99J03p91m40R86j143K60Q58j30o56J031o78
8059B1n59J36M67Q13m56K69J63q26p35J957j751R88J0Q3j265L4k00J101P24L09
8079A283q12k67J79r18J164m7l34j46M5o02m80J819r75O1J3J112j347Q13j52j9
8099C90K16J88j47j368R62l09o77J123o9k94m36M26K89n01j007J982r67l79J558
8118I80j143J183M37k101P69O10m85n2O88j184N62L08j075M79R11n51p21J081
8136F96m58K62p70N30L80o52M91m75q9r00R88J663j141j36j62n41Q87o68L97q80
$$ plain form
8156 -578 649 569 -213 -244 -595 -38 79 -8 -716 889 956 22 -277 1011 -354 -155 -72 -221 609 192
8176 192 -1116 120 -27 1220 150 162 275 365 -601 -903 1028 -177 -513 548 -17
$$ packed form
8156e78J227q0p82l1l51N57J17q7p08J605O7r34k99J288j365J99Q3j49Q30m17
8176A92j308J236j47J247j070J2J13R0r66l02J931j205l36J061n65
8191a7
$$ Imaginary data points
##PAGE= N=2
##DATA TABLE= (X++(I..I)), XYDATA
$$ plain form
0 0 0 0 0 0 0 0 0 0 0 0 0 0 0 -3 108 -108 108 -108 108 -216 216 -217 324 -324 432 -436 540 -648 754 -845
30 -845 960 -1083 1213 -1388 1547 -1748 1967 -2198 2447 -2731 3032 -3368 3738 -4136 4567 -5037
46 -5037 5568 -6134 6757 -7441 8187 -9035 9958 -10997 12160 -13475 14981 -16725
58 -16725 18764 -21183 24118 -27750 32412 -38582 47184 -60041 81298 -122560 231727
69 231727 -1134062 -2403758 839036 1107329 -388561 -57947 516650 179618 975660
78 975660 776753 -368388 672755 1677092 -430098 -983882 1288313 1126892 -983715
87 -983715 -519352 525946 33223 27066 83394 -777866 -75092 1067257 -333903 -1153076
97 -1153076 713951 848913 -927257 -403728 795374 -25028 -308160 310608 -198116
$$ packed form
0@%%%%%%%%%%%%%lJ11k16K16k16K16l24M32m33N41o48P56q68R76j188J402j599
30h45J805k043K296k601K935l295L715m165M645n178N763o400P106p874Q703r604
46e037J0605j1702J2891j4198J5628j7222J8993k0955K3157k5635K8456l1706
58a6725L5489l9947M5301n1868O0162p0994Q5766j07225J41339k03858L54287
69B31727j365789j269696L242794K68293j495890L30614N74597l37032P96042
78I75660j98907j145141J041143J004337k107190n53784K272195j61421k110607
87i83715M64363J045298m92723o157N6328q61260P02774J142349j401160q19173
97a153076J867027J34962j776170N23529J199102q20402k83132O18768n08724
$$ plain form
106 -198116 -113669 910826 100329 -749166 709130 1076000 -451026 -93334 1038852
115 1038852 176739 -244728 612320 163234 -380449 485555 266928 -734494 42815 562167
125 562167 -577584 -452280 527182 -223759 -633593 447718 150977 -767257 139980 570733
135 570733 -514096 -310041 477917 -187856 -335716 380496 -207110 -568171 517315 263544
145 263544 -901728 -56335 785194 -324090 -600415 356712 133539 -285953 141260 -156012
155 -156012 -423850 464065 255623 -926747 -187826 877785 -217609 -855858 255808
164 255808 414268 -284504 -82641 -12360 -201022 428220 312542 -761281 -135653 1020798
174 1020798 -41829 -924939 283109 689099 -274533 -275315 107040 -40846 272757 238196
$$ packed form
106a98116Q4447J024495q10497q49495J458296L66870j527026L57692J132186
115A038852q62113m21467Q57048m49086n43683Q66004k18627j001422P77309N19352
125E62167j139751J25304R79462p50941m09834J081311k96741r18234R07237M30753
135E70733j084829K04055P87958o65773j47860P16212n87606l61061J085486k53771
145B63544j165272Q45393Q41529j109284k76325R57127k23173m19492M27213k97272
155a56012k67838Q87915k08442j182370P38921J065611j095394o38249J111666
164B55808J58460o98772K01863P0281j88662O29242j15678j073823O25628J156451
174A020798j062627q83110J208048M05990r63632p82L82355j47886L13603l4561
$$ plain form
184 238196 -631932 -160228 950408 33338 -920871 265155 838779 -228164 -334897
193 -334897 312559 184789 200582 315755 -274569 -50343 899592 231048 -719698 279053
203 279053 888886 -218952 -431396 338954 134290 -165568 69755 -274952 -347803 376393
213 376393 18793 -821110 -55316 581947 -354397 -548142 312182 154453 -266581 125006
223 125006 54773 -223009 306440 268924 -451139 -17770 580925 -156561 -416975 346120
233 346120 176813 -350088 107790 200015 -310837 37639 326656 -295042 -216607 369265
243 369265 -81497 -398447 203052 65565 -460718 37338 222652 -451174 -231754 341996
253 341996 -166546 -395892 194222 71258 -266807 153873 119718 -308606 165395 406246
$$ packed form
184B38196q70128M71704J110636r17070r54209J186026N73624j066943j06733
193c34897O47456j27770J5793J15173n90324K24226R49935o68544r50746R98751
203B79053O09833j107838k12444P70350k04664k99858K35323l44707p2851P24196
213C76393l57600q39903P65794O37263r36344j93745Q60324j57729m21034L91587
223A25006p0233k77782N29449l7516p20063M33369N98695p37486k60414P63095
233C46120j69307n26901M57878R2225n10852L48476K89017o21698P8435N85872
243C69265m50762l16950O01499j37487n26283M98056J85314o73826K19420N73750
253C41996n08542k29346N90114j22964l38065M20680l4155m28324M74001K40851
$$ plain form
263 406246 -321448 -214636 520501 96569 -410740 138790 279163 -152035 26183 118056
273 118056 -204503 131493 376842 -297268 -273774 531985 199627 -487670 32011 402218
283 402218 -106994 -153952 73935 -126663 27027 228353 -332634 -364815 418098 171301
293 171301 -596004 -107066 445825 -76254 -278645 97417 41964 36078 229909 -140620
303 -140620 -228862 452614 316490 -451461 -62103 563916 30054 -312093 144317 152017
313 152017 -57704 114459 -67631 -260990 236995 228663 -464375 -206575 415342 -64784
323 -64784 -458572 54027 125549 -221973 -41920 -5257 -251903 67216 213139 -315966
333 -315966 -190174 402973 56029 -339779 165431 304363 -111670 47279 245371 -51845
$$ packed form
263D06246p27694J06812P35137m23932n07309N49530J40373m31198J78218R1873
273A18056l22559L35996K45349o74110K3494Q05759l32358o87297N19681L70207
283D02218n09212m6958K27887k00598J53690K01326n60987l2181P82913k46797
293A71301p67305M88938N52891n22079k02391L76062n5453n886J93831l70529
303a40620q8242O81476j36124p67951L89358O26019n33862l42147M56410P700
313A52017k09721J72163j82090j93359M97985q332o93038K57800O21917m80126
323f4784l93788N12599P1522l47522J80053L6663k46646L19119J45923n29105
333c15966J25792N93147l46944l95808N05210J38932m16033J58949J98092k97216
$$ plain form
343 -51845 69792 327925 -67431 -140820 342769 132896 -290957 87911 237858 -210110
353 -210110 -102069 180542 -156433 -194939 173540 -64867 -302479 97948 94215 -278980
363 -278980 -22426 171590 -203455 -105144 244110 -85597 -232567 223336 132038 -244316
373 -244316 54143 228476 -109986 -17077 200963 -91128 -67431 270555 -29379 -271873
383 -271873 184021 192950 -291931 -103644 203144 -111725 -182343 69841 -103166 -159924 139253
394 139253 -62208 -320910 109643 216794 -287192 -167788 263145 4175 -204601 79057
404 79057 49175 -87119 127072 31496 -218643 124765 284151 -200270 -168526 311799 112321
415 112321 -212623 61247 152575 -58763 59095 70956 -166810 52668 252070 -163383
$$ packed form
343e1845J21637K58133l95356p3389M83589k09873m23853L78868J49947m47968
353b10110J08041K82611l36975l8506L68479k38407k37612M00427l733l73195
363b78980K56554J94016l75045R8311L49254l29707j46970M55903r1298l76354
373b44316K98459J74333l38462R2909K18040k92091K3697L37986k99934k42494
383b71873M55894Q929m84881J88287L06788l14869p0618K52184j73007n6758K99177
394A39253k01461k58702M30553J07151n03986J19404M30933k58970k08776K83658
404G9057k9882j36294K14191r5576k50139L43408J59386m84421L1744M80325j99478
415A12321l24944K73870R1328k11338J17858J1861k37766K19478J99402m15453
$$ plain form
425 -163383 -220863 255713 127862 -252561 7722 192083 -69668 -17012 116395 -92687
435 -92687 -11528 220228 -82054 -218273 193877 136364 -263469 -45742 196427 -90119
445 -90119 -106588 129844 -27959 -68564 195496 39053 -149850 187253 225415 -153787 -10929
456 -10929 260676 -28799 -135335 127908 -5767 -179129 55004 4902 -251475 -26290
466 -26290 107338 -214874 -154920 145555 -63954 -194948 99523 42793 -185657 43750
476 43750 115479 -175281 -64882 146986 -108073 -160388 110961 -24547 -192424 75051
486 75051 72402 -188992 11664 182767 -107787 -91867 190035 19321 -128709 111302 62045
497 62045 -141743 60239 108177 -171480 -36120 192053 -79368 -148893 175845 89243 -129726
$$ packed form
425a63383n7480M76576j27851l80423K60283J84361k61751N2656J33407k09082
435i2687Q1159K31756l02282j36219M12150n7513l99833K17727K42169k86546
445i0119j6469K36432j57803m0605K64060j56443j88903L37103L8162l79202J42858
456a0929K71605k89475j06536K63243j33675j73362K34133n0102k56377K25185
466b6290J33628l22212N9954L00475k09509j30994K94471n6730k28450K29407
476D3750P1729k90760J10399K11868k55059n2315K71349j35508j67877K67475
486G5051k649k61394K00656J71103k90554J5920K81902j70714j48030K40011m9257
497F2045k03788K01982M7938k79657J35360K28173k71421o9525L24738q6602k18969
$$ plain form
508 -129726 90190 150224 -66525 62288 168128 -89878 -32761 209406 -38150 -196442
518 -196442 115761 91091 -198735 -30860 119615 -91307 -37944 139594 -41747 -36497 234961
$$ packed form
508a29726K19916O0034k16749J28813J05840k58006N7117K42167k47556j58292
518a96442L12203k4670k89826J67875J50475k10922N3363J77538j81341N250K71458
$$ [...]
8191d04
##END NTUPLES=NMR FID
##END=
