##TITLE=1H_SAM_6.172
 CDCl3, 108 sc, 
 18.12.2019
##JCAMPDX= 6.0         $$ Bruker NMR JCAMP-DX V2.0
##DATA TYPE= NMR FID
##DATA CLASS= NTUPLES
##ORIGIN= UXNMR, Bruker Analytische Messtechnik GmbH
##OWNER= root
$$ XWIN-NMR		Version 3.5
$$ Wed Dec 18 15:27:19 2019 Russian Standard Time (UT+4h)  she@DPX200
##.OBSERVE FREQUENCY= 200.13003
##.OBSERVE NUCLEUS= ^1H
##.DELAY= (6, 6)
##.ACQUISITION MODE= SIMULTANEOUS
##.ACQUISITION SCHEME= undefined
##.AVERAGES= 108
##.DIGITISER RES= 18
##SPECTROMETER/DATA SYSTEM= spect
##.PULSE SEQUENCE= zg30
##.SOLVENT NAME= CDCl3
##.SHIFT REFERENCE= (INTERNAL, CDCl3, 0, 15.7039)
##AUDIT TRAIL= $$ (NUMBER, WHEN, WHO, WHERE, WHAT)
$$ ##TITLE= Audit trail, XWIN-NMR		Version 3.5
$$ ##JCAMPDX= 5.01
$$ ##ORIGIN= Bruker BioSpin GmbH
$$ ##OWNER= she
$$ F:/spectra/data/she/nmr/H-F/1/audita.txt
$$ ##AUDIT TRAIL=  $$ (NUMBER, WHEN, WHO, WHERE, WHAT)
(   1,<2019-12-18 15:26:09.46 +0400>,<she>,<DPX200>,
      <continue with go, POWCHK disabled, PULCHK disabled
       configuration hash MD5:
       00 E9 B6 7A A2 85 ED C7 34 08 36 98 17 FE 4E 26
       data hash MD5: 16K
       33 2B 28 52 DE CD 88 04 86 AD D4 94 7C 02 7A 99>)
$$ ##END=
$$ 
$$ hash MD5
$$ 9D FB A1 9A E8 91 AF 5E 1B D0 DE B7 86 80 8B 1F
##$RELAX= 
##$RELAX= 
##$RELAX= 
##$RELAX= 
##$RELAX= 
##$RELAX= 
$$ Bruker specific parameters
$$ --------------------------
##$DU= <F:/spectra>
##$EXPNO= 1
##$NAME= <H-F>
##$PROCNO= 1
##$TYPE= <nmr>
##$USER= <she>
##$AMP= (0..31)
100 100 100 100 100 100 100 100 100 100 100 100 100 100 100 100 100 100 
100 100 100 100 100 100 100 100 100 100 100 100 100 100 
##$AQSEQ= 0
##$AQ_mod= 1
##$AUNM= <au_zg>
##$AUTOPOS= <>
##$BF1= 200.13
##$BF2= 200.13
##$BF3= 200.13
##$BF4= 200.13
##$BF5= 200.13
##$BF6= 200.13
##$BF7= 200.13
##$BF8= 200.13
##$BYTORDA= 1
##$CFDGTYP= 0
##$CFRGTYP= 5
##$CHEMSTR= <none>
##$CNST= (0..31)
1 1 145 1 1 1 1 1 1 1 1 1 1 1 1 1 1 1 1 1 1 1 1 1 1 1 1 1 1 1 1 1 
##$CPDPRG= <>
##$CPDPRG1= <>
##$CPDPRG2= <>
##$CPDPRG3= <>
##$CPDPRG4= <mlev>
##$CPDPRG5= <mlev>
##$CPDPRG6= <mlev>
##$CPDPRG7= <mlev>
##$CPDPRG8= <mlev>
##$CPDPRGB= <>
##$CPDPRGT= <>
##$D= (0..31)
0 1.2 0 0 0 0 0 0 0 0.06 0 0.03 0 0 0 0 0.0002 0 0 0 0 0 0 0 0 0 0 0 0 
0 0 0 
##$DATE= 1576668052
##$DBL= (0..7)
120 120 120 120 120 120 120 120 
##$DBP= (0..7)
150 150 150 150 150 150 150 150 
##$DBP07= 0
##$DBPNAM0= <>
##$DBPNAM1= <>
##$DBPNAM2= <>
##$DBPNAM3= <>
##$DBPNAM4= <>
##$DBPNAM5= <>
##$DBPNAM6= <>
##$DBPNAM7= <>
##$DBPOAL= (0..7)
0.5 0.5 0.5 0.5 0.5 0.5 0.5 0.5 
##$DBPOFFS= (0..7)
0 0 0 0 0 0 0 0 
##$DE= 6
##$DECBNUC= <off>
##$DECIM= 16
##$DECNUC= <off>
##$DECSTAT= 4
##$DIGMOD= 1
##$DIGTYP= 9
##$DL= (0..7)
0 120 120 120 120 120 120 120 
##$DP= (0..7)
150 150 150 150 150 150 150 150 
##$DP07= 0
##$DPNAME0= <>
##$DPNAME1= <>
##$DPNAME2= <>
##$DPNAME3= <>
##$DPNAME4= <>
##$DPNAME5= <>
##$DPNAME6= <>
##$DPNAME7= <>
##$DPOAL= (0..7)
0.5 0.5 0.5 0.5 0.5 0.5 0.5 0.5 
##$DPOFFS= (0..7)
0 0 0 0 0 0 0 0 
##$DQDMODE= 0
##$DR= 18
##$DS= 0
##$DSLIST= <SSSSSSSSSSSSSSS>
$$ [...]
##$SUBNAM2= <"">
##$SUBNAM3= <"">
##$SUBNAM4= <"">
##$SUBNAM5= <"">
##$SUBNAM6= <"">
##$SUBNAM7= <"">
##$SUBNAM8= <"">
##$SUBNAM9= <"">
##$SW= 41.9190550511907
##$SWIBOX= (0..15)
0 0 2 0 0 0 0 0 0 0 0 0 0 0 0 0 
##$SW_h= 8389.26174496644
##$TD= 16384
##$TD0= 1
##$TE= 0
##$TE2= 300
##$TE3= 300
##$TEG= 300
##$TL= (0..7)
0 120 120 120 120 120 120 120 
##$TP= (0..7)
150 150 150 150 150 150 150 150 
##$TP07= 0
##$TPNAME0= <>
##$TPNAME1= <>
##$TPNAME2= <>
##$TPNAME3= <>
##$TPNAME4= <>
##$TPNAME5= <>
##$TPNAME6= <>
##$TPNAME7= <>
##$TPOAL= (0..7)
0.5 0.5 0.5 0.5 0.5 0.5 0.5 0.5 
##$TPOFFS= (0..7)
0 0 0 0 0 0 0 0 
##$TUNHIN= 0
##$TUNHOUT= 0
##$TUNXOUT= 0
##$USERA1= <user>
##$USERA2= <user>
##$USERA3= <user>
##$USERA4= <user>
##$USERA5= <user>
##$V9= 5
##$VALIST= <valist>
##$VCLIST= <CCCCCCCCCCCCCCC>
##$VD= 0
##$VDLIST= <DDDDDDDDDDDDDDD>
##$VPLIST= <PPPPPPPPPPPPPPP>
##$VTLIST= <TTTTTTTTTTTTTTT>
##$WBST= 1024
##$WBSW= 4
##$XGAIN= (0..3)
0 0 0 0 
##$XL= 0
##$YL= 0
##$YMAX_a= 487267
##$YMIN_a= -109317
##$ZGOPTNS= <>
##$ZL1= 120
##$ZL2= 120
##$ZL3= 120
##$ZL4= 120
##$ABSF1= 10
##$ABSF2= 0
##$ABSG= 5
##$ABSL= 3
##$ALPHA= 0
##$AQORDER= 0
##$ASSFAC= 0
##$ASSFACI= 0
##$ASSFACX= 0
##$ASSWID= 0
##$AUNMP= <proc_1d>
##$AZFE= 0.1
##$AZFW= 0.1
##$BCFW= 1
##$BC_mod= 2
##$BYTORDP= 1
##$COROFFS= 0
##$CY= 11.3945322036743
##$DATMOD= 1
##$DC= 2
##$DFILT= <>
##$DTYPP= 0
##$F1P= 16.9975609425685
##$F2P= -3.02152046262296
##$FCOR= 0.5
##$FTSIZE= 0
##$FT_mod= 4
##$GAMMA= 1
##$GB= 0.15
##$INTBC= 1
##$INTSCL= 1
##$ISEN= 128
##$LB= 0.24
##$LEV0= 0
##$LPBIN= 0
##$MAXI= 10000
##$MC2= 0
##$MEAN= 0
##$ME_mod= 0
##$MI= 1.114404
##$NCOEF= 0
##$NC_proc= 0
##$NLEV= 6
##$NOISF1= 3.799351
##$NOISF2= 2.8
##$NSP= 1
##$NTH_PI= 0
##$NZP= 0
##$OFFSET= 15.70392
##$PC= 1
##$PHC0= -10026.27
##$PHC1= -8.799183
##$PH_mod= 1
##$PKNL= yes
##$PPARMOD= 0
##$PSCAL= 0
##$PSIGN= 0
##$REVERSE= no
##$SF= 200.130013532006
##$SI= 16384
##$SIGF1= 3
##$SIGF2= 2
##$SINO= 400
##$SIOLD= 16384
##$SREGLST= <1H.CDCl3>
##$SSB= 0
##$STSI= 0
##$STSR= 0
##$SW_p= 3612.71676300578
##$SYMM= 0
##$S_DEV= 0
##$TDeff= 0
##$TDoff= 0
##$TI= <>
##$TILT= no
##$TM1= 0
##$TM2= 0
##$TOPLEV= 0
##$USERP1= <user>
##$USERP2= <user>
##$USERP3= <user>
##$USERP4= <user>
##$USERP5= <user>
##$WDW= 1
##$XDIM= 8192
##$YMAX_p= 0
##$YMIN_p= 0
$$ End of Bruker specific parameters
$$ ---------------------------------
##NTUPLES= NMR FID
##VAR_NAME=  TIME,          FID/REAL,        FID/IMAG
##SYMBOL=    X,             R,               I
##VAR_TYPE=  INDEPENDENT,   DEPENDENT,       DEPENDENT
##VAR_FORM=  AFFN,          ASDF,            ASDF
##VAR_DIM=   8192,          8192,            8192
##UNITS=     SECONDS,       ARBITRARY UNITS, ARBITRARY UNITS
##FACTOR=    0.0001192,     1,               1
##FIRST=     0,             0,               0
##LAST=      0.9763672,     0,               0
##MIN=       0,             -109317,         0
##MAX=       0.9763672,     487267,          0
$$ Real data points
##PAGE= N=1
##DATA TABLE= (X++(R..R)), XYDATA
0@%%%%%%%%%%%%%%%%%%%%%%%%%%%j%LmJJkKmJ2j8J9k1K1j7J5j2J0j2J6k0K4k2
50iK1k2K4l0M1n2O3p8R7j26J74k49L64n44Q63j468K866p077L2216M60193r5080
71C92187j29771p1083o7869n6843l7237l7863m8087j2501K8419K4724l525j3698
83c3147j5249o108K1068L0814j990k5832j4488K773J3987K5631J6394j3050j6909
96a6106J0024J9164k60j5635j5622j2829K952L0065K6017n285j7658j0900p20
109f793Q421J8146K662j8258k806K3939K0421J798r603k7906l4466m909J7719
122a1635L395j5926r889P587K1692L3860K3729j1171k7470q365Q504L257j0485
135G083k4950k8337n137K6010K4875j946j3661o195M855J5138K0198k721k6011
$$ plain form
0 0 0 0 0 0 0 0 0 0 0 0 0 0 0 0 0 0 0 0 0 0 0 0 0 0 0 0 0 -1 -1 2 -2 -1 0 -2 0 -4 8 -10 9 -12 9 -8 7 -5 5 -7 9 -11 13 -9
50 -9 12 -10 14 -16 25 -27 36 -42 55 -71 103 -146 218 -326 537 -931 1935 -5142 27074 487267 392187
71 392187 262416 191333 123464 66621 29384 -8479 -56566 -69067 -40648 -15924 -19449 -33147
83 -33147 -48396 -54504 -33436 -2622 -4612 -30444 -44932 -42159 -28172 -2541 13853 803 -16106
96 -16106 -6082 13082 12822 -2813 -18435 -31264 -28312 1753 27770 22485 4827 -6073 -6793
109 -6793 1628 19774 22436 4178 1372 25311 45732 47530 37927 10021 -24445 -29354 -11635
122 -11635 -8240 -24166 -34055 -26468 -4776 29084 52813 41642 14172 5807 14311 17568 7083
135 7083 -17867 -46204 -51341 -25331 -456 -2402 -16063 -22258 -17403 -2265 17933 15212 -10799
148a0799j3661J5900K1620R154k029j1824j5515L360K0471O998j9322j9539m674
161a9860J0440J9744J4594j0135k2033n889J1413J0585K890p692j3960q61K3675
174A2911K2816k267j9085j7695j1151J127R203p25j9983j4609Q654K0152J6638
187E986N827q146j3339M250K0498R214j3216k1557j4906O67J8079J7869n292j7936
201a2002m177J4734J3706M277q015j7188o298J7577K4658N365j2263j4507q143
214b276M897J2541M12j9350j7759J598J3249J1366J351j3606j8009J013K1018
227c555J4221l916j2514p628M306J6157J5700m668k0023j2177N648R199J959r798
241g089j8230q883J2516K2583J2842k503o834k969Q765J7128N367j5875j9236
$$ plain form
148 -10799 -24460 -8560 13060 22214 20185 8361 -7154 -3794 16677 23675 4353 -15186 -19860
161 -19860 -9420 10324 24918 14783 -7250 -13139 -1726 8859 11749 4057 -9903 -10764 12911
174 12911 35727 33460 14375 -3320 -14471 -13344 -4141 -4866 -24849 -39458 -30804 -10652 5986
187 5986 11813 3667 -9672 -5422 15076 24290 11074 -10483 -25389 -24722 -6643 11226 5934 -12002
201 -12002 -16179 -1445 12261 16538 8523 -8665 -14963 2614 27272 32637 20374 5867 -2276
214 -2276 2621 15162 15574 -3776 -21535 -19937 -6688 4678 6029 -7577 -25586 -24573 -3555
227 -3555 10666 6750 -5764 -13392 -9086 7071 22771 18103 -1920 -14097 -8449 750 2709 -7089
241 -7089 -25319 -34202 -21686 897 13739 11236 4402 1433 10198 27326 32693 16818 -2418
254b418n246Q643J0312K015j1137j9442m096J4176J2425k845j4015j0097J226
267b0499J5583J7348J159j4284r024N920J2993Q892n064j7578j3100N155J5650
280C151O089q041j2417p688N473J6271R782r255j4455j152J2345J4723P027p784
294A4069j5494n153J0429J1321l242j4125j4740k759J1224J6135K286j1842q018
307i909N205J2017Q873m47j2315j4354J671J3327R275n946j3674j0493J971J3099
321a700Q695p127j4646o075Q168J3988R825m789j3195l821J2183J4549K576r628
335I003j2056o242Q693J2868J360j2304j3374m00R975R688J587r969j2133J190
349a2114J4356J1838j734j0125r753P21J2229Q649p034j4530q876M429J1196Q298
$$ plain form
254 -2418 -7664 979 11291 13306 2169 -17273 -21369 -7193 5232 2387 -11628 -21725 -20499
267 -20499 -4916 12432 13591 -693 -9717 -3797 9196 18088 13024 -4554 -17654 -12499 3151
280 3151 9240 1199 -11218 -18906 -13433 2838 12620 3365 -11090 -12242 103 14826 21853 14069
294 14069 -1425 -6578 3851 15172 11930 -2195 -16935 -19694 -8470 7665 9951 -1891 -9909
307 -9909 -4704 7313 16186 15739 3424 -10930 -9259 4068 13343 7397 -6277 -16770 -14799 -1700
321 -1700 6995 -132 -14778 -20853 -12685 1303 11128 6339 -6856 -10677 1506 16055 18631 9003
335 9003 -3053 -9295 -602 12266 13626 1322 -12052 -12452 -2477 7211 8798 -1171 -13304 -12114
349 -12114 2242 14080 12346 2221 -7532 -6811 5418 14067 7033 -7497 -16373 -11944 -748 7550
363G550m178j2643o835R421J3985N122o922j0774m557O744J3064N035r464j1784
377f236k698P149J0891K958r906j3749k058J1195J1469P05r108r814o09J2977
391C166J1891j637j3784q978K781J0089Q344m223j2473r869M672J1986O475n114
405C326j0229p520O967J3753O253o409j1466l710O610J1107M247q021j3323m292
419a2707Q841J1165J607r183j0248j225J0485J2759m03j1394q534K266J0325R184
433A2938q71j0653r677K419J0579O324l809r878q984J852J1931Q066m796j1809
447f368m718N000J1615O174m661j2287m781P419J1050L157p924j1724l691P693
461d046J2099P66q951r126n75Q463J0503K062r009r573J006R588Q721r43j0255
$$ plain form
363 7550 3372 -9271 -16106 -6685 7300 12422 5500 -5274 -9831 -3087 9977 15012 5548 -6236
377 -6236 -8934 -1785 9106 12064 2158 -11591 -13649 -2454 9015 9720 612 -9202 -9811 3166
391 3166 15057 13420 -364 -9342 -6561 3528 11872 7649 -4824 -14693 -10021 1965 8440 3326
405 3326 -6903 -14423 -7456 6297 12550 6141 -5325 -9035 -2425 8682 12929 4908 -8415 -12707
419 -12707 -3866 7299 8906 -277 -10525 -11750 -1265 11494 11091 -303 -8837 -6571 3754 12938
433 12938 12067 1414 -8263 -5844 4735 11059 7250 -2628 -11612 -9760 2171 10237 5441 -6368
447 -6368 -11086 -6086 5529 11703 7042 -5245 -10026 -2607 8443 11600 3676 -8048 -11739 -4046
461 -4046 8053 8819 -132 -9258 -9833 -1370 9133 11195 2186 -7387 -6381 3207 11928 10985 730
476G30r601J047J0281Q171l458j1178p886L655J0079P351l949j0721o080O330
490e229J0949M498m923r874n213N794J1544K189o785r418k818O140R656L141p605
505B046r582j514Q902Q602J618p768r932K52R327Q976k215r190q028J163R265
520A922P023k520j0068p493M108R941N827l284r035o430M996R863N667m918j0888
535e289l450M837J0338M270o459j0818l055P100R498K742p715r689j849Q649R643
550H753N41r192r072J410P908Q326j57j0151p658K116Q297O907j858r686n778
565i294K933R558O106l858q766m942L260R338N690m619r846m144N066R084L992
580I558n644r675k999O847R077J145o395q601j738O856Q743J137q549p698J24
$$ plain form
476 730 -8871 -7824 2457 10628 7170 -4008 -11894 -8239 1840 9191 5242 -5479 -11559 -5229
490 -5229 5720 10218 5295 -4579 -9792 -3998 7546 9735 2950 -6468 -9286 -3146 6510 9651 2046
505 2046 -7536 -9050 -148 8454 10072 2304 -7628 -7376 1951 10927 8712 -478 -8506 -7343 1922
520 1922 8945 6425 -3643 -11136 -7028 2913 8740 5456 -3579 -10009 -5013 4850 10517 5599 -5289
535 -5289 -8739 -3902 6436 10706 4247 -6571 -9626 -2526 6972 9714 1999 -7690 -9539 -890 8753
550 8753 9294 102 -8970 -7560 348 8674 8517 -1634 -9292 -7176 1121 8028 6170 -3516 -9294
565 -9294 -6361 3197 9303 5445 -3321 -8263 -5003 4335 10025 5406 -4440 -8584 -3518 5566 9558
580 9558 3914 -5761 -8760 -1913 7164 8309 1914 -6687 -8425 -1569 7174 8311 -238 -7936 -7812
595g812P291P551K56q005p277P10Q875O552k331p775o354J639R335O552l450q700
611b943n639L992R307M292l835r021m505N009Q991K988n551q729k850N119R129
626E754J804o760q039j315O595Q041J452p531p753K66P484P162n47p295p476J255
642f903Q202O702j398q673o939L378Q373N540k276q773n477L521R171L378l574
657D252q399l818L795Q142M148n662q449k769N033Q355K218n015q191k328O154
672b534Q377R11o417o961k84P026O936k48p363o460Q15P133O234r80p721n684
688g220J923Q199M559k772p202m817K271P756N296m207p446m141L561P880L476
703G116m725q098k991N256Q176K151n314p050k624O547P627R40o191p163k0O318
$$ plain form
595 -7812 -521 7030 7286 -719 -7996 -7286 1589 8141 5810 -1965 -8319 -6680 2655 9207 5757 -2943
611 -2943 -8582 -4590 4717 9009 5174 -3847 -8352 -3343 5648 8636 3085 -5644 -8494 -3375 5754
626 5754 7558 798 -7241 -8556 -1961 6080 7532 1 -7752 -7486 -2 7160 6613 -682 -8158 -6903
642 -6903 1299 8001 6603 -2070 -9009 -5631 2742 8282 6006 -2767 -8244 -4723 4448 7826 4252
657 4252 -4147 -7965 -4170 3972 8120 2458 -5991 -8760 -3727 4628 6846 1831 -6360 -8688 -2534
672 -2534 5843 6754 337 -6624 -6908 118 7054 6806 -557 -7017 -6202 931 7165 6185 -1536 -7220
688 -7220 -5297 2902 7461 4689 -2513 -7330 -5059 2697 7993 3786 -3660 -7801 -4240 3640 7116
703 7116 2391 -5707 -8698 -3442 4734 6885 1571 -5479 -8103 -1556 6071 7011 820 -6343 -6363 -45
719d5O728J52p162o478M16P650N231j087o437n961J432P286N616k296p464n258
735g677K680P436M569k644p939m520M460P185L217m493p111k767M629P276K452
750F753m881o926j549N694O756K437o800p006q14O566O033m49o151n780L88N733
766DO071j111o697n085Q96P248N727k555o810n539L077P713L980l603p081l566
782g331K894P845K741l920o711k412L766P528J914l728o782j927N320O461J357
797G015n598n892j505M879P353n09n929o206M96N523O074j067o241n268J982O446
813A553M986k113o572m148K390O134M303k356p445l403K766P018K861k694p158
828c878k308M069O018L002m141o310k103M375O931J164n395o242m38M677N659
$$ plain form
719 -45 6683 6835 -327 -6805 -6389 1261 6492 5405 -1032 -6993 -5561 1725 7341 5045 -2419 -7677
735 -7677 -4997 2439 7008 4364 -3575 -8095 -3635 3550 6767 2274 -4837 -7604 -2975 4301 6753
750 6753 1872 -5054 -6603 -909 5847 8284 1484 -5522 -6336 230 6263 5814 -337 -6117 -5729 4
766 4 6075 4964 -1733 -6818 -5922 1326 7053 4498 -2312 -7851 -4774 2939 6919 3316 -3765 -7331
782 -7331 -4437 3408 6149 2229 -4482 -6894 -3128 4400 6314 2586 -4196 -6123 -803 5658 7015
797 7015 1417 -4475 -5980 -1101 6252 5743 -186 -6392 -5896 -373 5701 4634 -1607 -6875 -4893 1553
813 1553 6539 4426 -2146 -6294 -3904 2230 6533 4177 -3268 -6671 -3905 3113 5974 3280 -3878
828 -3878 -6186 -2117 3901 6903 2762 -3548 -5651 -1276 5655 6819 1424 -4818 -5256 -579 5080
843E080j66n357o302R87N444M890Ko034n032J360O792M015j227n588m872K341
859c667O011M162k214p068l328J980P161L688m100n605l929M429O470K691l572
874C109o727j245M168O251R01m687o015j552M993N822l55n123n593n22N751N250
890D426M18o208l961O46O019N372k018n531m462K400N586L247k226o870k991K247
906c906O412K289k082o254k312L202O526K176l303n806k447M763N482J049m106
921A683n510j477M644N244l30m755n195q9N428M889K55n628m797J129O468M802
937F761j659n972m180J754N766K907j856n939m216L326N327K890k745n338k616
952e790L980N393K606l224n700j789M233M672J181l717o255r33M405N042N41n274
$$ plain form
843 5080 4914 -443 -6745 -5758 -314 4576 4578 -1456 -6488 -5128 1664 5679 4452 -1136 -6008 -3667
859 -3667 2344 6506 4292 -2776 -6104 -4124 3037 6725 2625 -2980 -6909 -2480 3990 6681 3109
874 3109 -3618 -4863 -695 5556 6457 1770 -4245 -5797 -804 5018 4663 -460 -6053 -6575 -824 4426
890 4426 4844 -1364 -5325 -4679 1340 6712 4694 -837 -5299 -2899 2687 5934 3708 -3162 -6153 -3906
906 -3906 2506 4795 2713 -3541 -5853 -2651 3875 6051 2748 -3058 -5505 -742 4740 5789 1683
921 1683 -3827 -5304 -660 4584 4254 -501 -5696 -5785 -357 4532 4787 -841 -5638 -4509 1959 6761
937 6761 5102 -870 -5050 -3296 2470 5377 3521 -2418 -6634 -3308 2019 4909 2164 -3174 -5790
952 -5790 -1810 3583 6189 2965 -2735 -4524 -291 4381 5562 1845 -4410 -5343 -938 4104 4645 -629
968f29m884M06N109N103j60n219l647K58N130M155j237m892l523R34N552K748
984E204j910n418l713K306M776K932k411m638k978L125O155K568l334n168k300
999d804M228M695J545m036n899r25L811M447L94m384m196l8M498N120M30m494
1015C92m109R40M466L998r54m728m811Q03M805L705j980n472l356K677N251L014
1031D641k773m921j902L293M809K695l705m325j125J990N354J206l553n785j241
1046e342M123M335N13m549m069k11N034M937j30m317m070N32M951L578n19n193
1062c97l548K95M266L060j645m699k772K131M749L147k455m809j877L029L990
1077B465K731k050n197k256L090M437R44k978m631j734L338M920M26l894m283
$$ plain form
968 -629 -5513 -5107 2 5105 4945 -274 -3921 -3663 1467 5622 4385 -507 -4030 -3096 2456 5204
984 5204 3294 -2124 -5837 -3531 1245 4177 1766 -2872 -5850 -2725 3430 5998 2664 -2504 -4804
999 -4804 -576 4119 5664 1628 -4271 -5196 -1385 3062 3456 -928 -5124 -5162 -664 4456 4886 392
1015 392 -3717 -2777 1689 5687 4733 5 -4806 -4003 802 4507 2527 -2945 -6301 -3624 1627 4641
1031 4641 1868 -3053 -4955 -1662 3147 5842 2137 -2188 -3313 -1323 4031 5237 1684 -4101 -5342
1046 -5342 -1219 3116 3629 -920 -4989 -5200 -166 4771 4641 324 -3746 -3214 1737 5315 4796 -397
1062 -397 -3945 -3650 616 3676 2031 -2668 -5440 -3309 1440 4587 2132 -2677 -4554 -1525 2465
1077 2465 5196 3146 -2051 -4307 -1217 3220 4164 1186 -3445 -5179 -1841 3079 3505 -389 -4672
1092d672n8L912M135N60m456l739P88M574M027j092m499l548O57M067L130j684
1108B102m132l572J890M786L247j376m625k242K296N051K093k944m437k265K106
1123b022M752J171l117m950p61L363M303K45k645m126o50M487L851J91m058l943
1139c909P34L784L636m30m632k799J030L845K739q91m623l324J483M649L759k095
1155B956m877k077K492N097J798k517m838k058K806L538P19k150n047q33K739
1170b252L977J086l029l861K60L294M247J203m055m176J63M027L199k24m652l305
1186d098J311L072L660j138m738k214J485M199K432j649m150j680J407M843J336
1201D078k420m206j442K418L490J318k637m010j786L206M059J019k420l831m72
$$ plain form
1092 -4672 -4730 -818 3317 3877 -579 -4318 -3530 1044 5071 3979 -520 -4068 -3411 656 3786 2102
1108 2102 -2030 -5602 -3712 1074 4321 2945 -1680 -3922 -1626 3425 5518 2574 -1863 -4128 -2022
1123 -2022 2730 3901 784 -4166 -4927 -1564 2739 2984 339 -3787 -4437 50 3901 4092 34 -3909
1139 -3909 -3175 609 4245 3815 -817 -3616 -2586 1259 3998 3107 -1516 -4840 -3357 1292 5051 2956
1155 2956 -1921 -3998 -1506 3591 5389 2872 -1966 -4024 -1218 2320 3039 889 -4158 -4991 -2252
1170 -2252 1725 2811 -218 -4079 -3819 -525 3722 4925 870 -3306 -3143 884 4083 3859 -793 -4098
1186 -4098 -2787 285 3945 2807 -1931 -4145 -2660 1539 3971 2322 -1828 -3508 -2101 2742 4078
1201 4078 1658 -2548 -3990 -1572 1918 3236 599 -3411 -5197 -1991 2068 3087 667 -3164 -3636
1216c636L520L822R49l731l267Q8L675K763l34n072l113J100L446K490k63m218
1232a781k614K380L632K437j342l829j830R43M210J620k110m365j759K685L367
1247A644K145l093l844j189K979M783K27k519m104l29L337L580R66l725l292l9
1263b473L420K543K71l751k988N93K308L197j198l259k828J003M255K527r06l642
1279i28j912J627L828J286k176m001k124K145L634J294k290l342p16K640M011
1294B976K24k446l119j41K328L961O86l664k921q20L443K579j96l812k147K22
1310b847K664L590j647k634k849J458L238K208j74m125k616J789M273J272k189
1325A411l148j928K377K711J166k028l394r80K078M062J608k403l421n24K738
$$ plain form
1216 -3636 -116 3706 4655 924 -2343 -2255 1420 4183 3849 -1223 -4336 -3236 210 2700 2437 -1781
1232 -1781 -4395 -2015 1617 4054 2712 -1117 -2947 -2004 2206 3826 1716 -2649 -4408 -1723 1644
1247 1644 3789 696 -3148 -4337 -1358 3425 3652 1133 -2971 -3300 37 3617 4583 858 -2434 -2473
1263 -2473 947 3490 3761 10 -2978 -2385 -77 3120 1922 -1337 -4165 -3162 1093 3620 2714 -928
1279 -928 -2840 -1213 2615 3901 1725 -2276 -4400 -2255 1379 2673 383 -2959 -3675 -1035 2976
1294 2976 3200 754 -2365 -2506 -178 3783 4469 805 -2116 -2936 507 3086 2890 -922 -3069 -2847
1310 -2847 -183 3407 1760 -874 -3723 -2265 973 3181 3007 -1118 -3734 -1945 2328 3600 1411
1325 1411 -1737 -3665 -1288 1423 2589 561 -2833 -3813 -1735 2327 3935 1532 -1889 -2413 325
1340C25K949J171l390l115r70L444L314m50m152k462O93K827K919j165k744j492
1356b298L24K639K744j329l691j918J645M417R86k286k080k252J815K484K422
1371C622k754k472k089K690L339J103k176k445r17K128L102K98k752l416m2K889
1387A08K405k01k942k862O42K775K526p03l112k362J852K879K475p73l339j844
1403b476P24K974K380j880m006j578K098L544J051k098k333j629K715L439N04
1418C429k206l226q91K454K888Q12k531l171l56K917K194J2k825k952K92L450
1434B90K196l43k312k967P99L186L409k174k908j915R91L258J794j422l036j940
1450c094J624L366Q43j826k562q46K215K964M85j439l795o32J371L718L70k470
$$ plain form
1340 325 3274 4445 1055 -2060 -3030 414 3728 3278 -874 -3336 -2643 184 3103 1938 -806 -2298
1356 -2298 -1974 665 3409 2080 -1611 -3529 -1884 2533 3519 1233 -847 -3099 -1284 1200 3622
1371 3622 868 -1604 -3693 -1003 2336 3439 1263 -1182 -2099 29 3131 3429 677 -2739 -2781 108
1387 108 2513 2312 -630 -3492 -2850 -75 2451 1748 -1364 -3726 -1874 1005 3480 2707 -632 -2476
1403 -2476 -1752 1222 3602 1722 -2284 -3862 -1764 1780 2831 733 -1600 -3229 -514 2925 3429
1418 3429 1223 -2003 -2894 -440 2448 3260 729 -2442 -2798 119 2313 2325 -500 -3452 -3160 290
1434 290 2486 2143 -169 -3136 -2337 849 4258 2084 -824 -2739 -1748 1510 3304 1882 -1154 -3094
1450 -3094 -1470 1896 2739 913 -1649 -2495 -280 2684 3169 1730 -2065 -2697 -1326 2392 2762 292
1466B92k300q59K737J757P90k904k913N27L103K707o67k908k144J147K821J802
1482B988p82k361k111N47L452J742j695l096j342J229K528J068j744k565q67J729
1498a280L529L99j385l414k26J903K857L5j598m021L58K397K532M58k737k497
1514b690l26L517J780J6k727k091L51K874K143q71k770j614O07K836J431q25l164
1531a523j880K055K843R64j186l382n92J757K715J109k528k477r05K509K089R27
1547B495k276k245n40K769J915P30k560k778K14L021J474j31k116l068J740J765
1563D09K074o40k655j516N35K744J509n74k803j958J282L169R89j035k578j720
1579b768K231J801P89j123l455O1J768K504P16k013k184o63K038K317K67j980
$$ plain form
1466 292 -2008 -2867 -130 1627 2417 -487 -3400 -2873 230 2937 2270 -638 -2782 -1635 1186 2988
1482 2988 2206 -155 -2266 -1719 1733 3475 1780 -1316 -2658 -1429 1099 2167 423 -2142 -3009 -1280
1498 -1280 2249 2648 1263 -2151 -2377 -474 2383 2418 820 -3201 -2843 -446 2086 2544 -193 -2690
1514 -2690 -3016 501 2281 2297 -430 -2521 -2170 704 2847 1976 -794 -2408 -1801 1035 2466 1641 -1523
1531 -1523 -3403 -1348 1495 2459 1273 -2109 -2701 -944 1771 2880 352 -2125 -3030 -521 1568 2495
1547 2495 219 -2026 -2566 203 2118 2848 288 -2490 -2276 745 2219 2088 -28 -3096 -1356 409
1563 409 2483 1843 -812 -2328 -1793 951 2460 1886 -917 -2875 -1593 1576 2565 1530 -1048 -2768
1579 -2768 -537 1264 2053 930 -2525 -2464 -696 1808 2524 511 -1673 -2336 -298 2019 2286 306
1595C06k653LK549K207n13k239k657J155K415J635l73k755k291K273K189J062
1611B313j308j478k383J742K265J053j117k569n91J482K394O74j705k688n83K073
1627d26K427K55j910j940j358K492K010j26j229k423M66J748K459q67k167k276
1643b865J097K177J947m96k636j581K19K982J369q70k615p60Q66K610P33j392
1659G85j658j831J875K812L65j552k264n97J803J857l5j364k183m64J959J974
1675A482N98j605k591k05K410J816j81j902k331R93J620K088o99j572k063P22
1691a420K155J582j427j621j632J005K584Q42m01k415j734J365K555J513j837
1706A114l542n2J884K560L08k060j630J71J415J800L61k728j982k44K609K151
$$ plain form
1595 306 -2347 -2344 205 2412 1899 -340 -2997 -1842 573 2208 1835 -920 -3211 -938 1251 2313
1611 2313 1005 -473 -2856 -1114 1151 2204 1087 -1482 -2073 -591 1803 2477 772 -1916 -2499 -426
1627 -426 2001 2256 346 -1594 -2952 -460 1550 1424 195 -2228 -1762 -14 2445 1578 -589 -2865
1643 -2865 -1768 409 2356 1860 -776 -2357 -2138 844 2213 1343 -1272 -2032 -1166 1444 2177 785
1659 785 -873 -2704 -829 1983 2348 796 -1468 -2065 -262 1595 1560 196 -1987 -2451 -492 1482
1675 1482 2080 475 -2116 -2321 89 1905 1724 -178 -2509 -1516 104 2192 1493 -79 -2142 -1420
1691 -1420 735 2317 890 -731 -2363 -1358 1226 2068 1667 -748 -2482 -1117 1438 2951 1114
1706 1114 -2428 -2480 -596 1964 2272 212 -1418 -1247 168 1968 2329 -399 -2381 -2625 -16 2135
1722B135O9k389j988Q49J883J645p72k266j445J175J816K277j547k531j030J439
1738f80K104P32j095k313j479J874K720n0j105j688j131J326K281Q95j937k331
1754a877l10J745K276K6k026j460r8J652K151k96j482j793n9J904J819r62j981
1771g71j260Q10K386P77r20j906o23J24J991O12P9k419p55P44K217J467j865j913
1789a225j192J749K404L40j711j560j183J941K242k0j812j564k32K014J630J92
1805B013k801j032O26R69K884j292j488j223j50K410P59k20j877j588N60K820
1821A370N74j137k058n94P65J985J090j270k037j164K214J346M70j000j623n77
1837a646R43K460r5j592j832O84J032J754K55k452j133K16J923J705j122j218
$$ plain form
1722 2135 2204 -185 -2173 -1324 559 2204 1432 -834 -2279 -1104 712 2989 1442 -1089 -2119 -680
1738 -680 1424 2156 1061 -1252 -2731 -857 1863 1813 708 -980 -2111 -785 1496 2391 454 -1877
1754 -1877 -2187 -442 1834 1860 -166 -1626 -1724 -72 2079 1783 301 -1492 -1551 353 2172 1210 -771
1771 -771 -2031 -1221 1165 1942 1022 -884 -1507 -1383 608 1220 1299 -1120 -1875 -1131 1086 2553 688 -1225
1789 -1225 -2417 -668 1736 2076 365 -1195 -2378 -437 1805 1785 -27 -1591 -1823 191 1821 2013
1805 2013 -788 -1820 -1194 -225 2659 1367 -121 -1344 -1494 916 1675 1455 -422 -2010 -1450 1370
1821 1370 1944 807 -1251 -1845 -1080 905 1995 725 -1312 -2476 -262 1084 1554 554 -1069 -1646
1837 -1646 -703 1757 1662 70 -1762 -1078 -46 1708 1963 -489 -1622 -1406 517 2222 1100 -118
1853a18j883P37J490J497m2k544p38R24J960O75o00k340j007J308J808O88j146
1870F69j930m84J739J776k94j137j783j5R89K176l1j240j552j57J834J418j52
1887A826k403j365Q53J022K046q81j447j860N64J942J552m82k210r74J347Q45
1903C75J311m85k059l52R53J152J262j674j362m62L61J893Q60j742j556j27J210
1920d42J511P25j370j515RR72J369L13j229j839k92J817J720j2k272j265O34J289
1938A23J731p82k125j114R07J569J650j195j073j147L04J873J119j182j313j184
1954a839J038J544R52j158j701p65K299J109K54j162j911jR66J800M20j150k248
1971a553L84Q09K249j94k219j545J333J216J283j015o07j502M10R34J729o37j122
$$ plain form
1853 -118 -2001 -1264 226 1723 1681 -863 -1601 -677 1283 1958 1358 -982 -1989 -681 1127 1815 669
1870 669 -1261 -1745 -6 1770 1476 339 -1444 -1459 -470 1706 1675 435 -1117 -1274 560 1978 1826
1887 1826 -577 -1942 -1089 -67 1979 1098 -349 -2209 -1645 297 1849 1367 -843 -1817 -470 375
1903 375 1686 1201 -858 -1210 -257 895 2157 483 -879 -1341 -980 913 1773 31 -1525 -1652 -442
1920 -442 1069 1794 424 -1091 -1082 -110 1259 1572 343 -1496 -1788 29 1749 1737 -535 -1800 -1166 123
1938 123 1854 1072 -1053 -2167 -1260 309 1959 764 -309 -1456 -1152 721 1840 658 -655 -1839
1954 -1839 -801 743 1695 537 -1164 -1929 370 1479 1733 571 -1340 -1341 -375 1425 1845 695 -1553
1971 -1553 -1169 -360 1889 1695 -524 -2069 -736 480 1763 748 141 -1361 -951 -17 1712 1075 -47
1988d7j841R47J346J348j349j009j074J591R59N65j094j767J77P10J639N24j302
2005C23j459k56J358J170N18j847j085q3J684J627q14k026q71P42J038J249p90
2022D78p65j327J453J218N68j045j372m85J60J322J181p68j563m32M51J946L77
2039A397j565p59l0K03K420O6j837p34m42J300R95M38j410j296mJ415J336n23
2057I70j277o95p8J409J236o44j263j046P98J672K95l86j707r90R86R07J322l63
2075A146j775q08L79J325J387j250j717j35P40J633K09l54j828j89J222J275j34
2092A126j068j634K74J619J226n71r56j351q3J434J104L43j873l86J09J254R06
2109A473j69j548j655Q92J581O70m36r40j113R09O75R58j338p67n12J116J269
$$ plain form
1988 -47 -1888 -941 405 1753 404 -605 -1679 -88 871 1436 342 -1425 -1248 -538 1101 1625 323
2005 323 -1136 -1392 -34 1136 1654 -193 -1278 -1361 323 1950 1136 -890 -1761 -1019 19 1268 478
2022 478 -287 -1614 -161 1057 1625 580 -792 -1277 -1117 205 1386 618 -945 -1377 -926 1020 1397
2039 1397 -168 -927 -957 -754 1666 1732 -105 -839 -1281 19 1014 1452 42 -1254 -1258 157 1493 970
2057 970 -307 -1002 -1080 329 1565 921 -342 -1388 -590 1082 1377 991 -716 -1706 -720 187 1509 1146
2075 1146 -629 -1437 -1058 267 1654 404 -1313 -1448 -708 925 1134 780 -1048 -1237 -15 1260 1126
2092 1126 58 -1576 -1302 317 1543 972 16 -1335 -1418 16 1120 1463 -410 -796 -687 567 1473
2109 1473 1304 -244 -1899 -1007 574 1244 808 -132 -1245 -336 339 1297 -41 -808 -1320 -204 1065
2126A065L90p81j865m70J801Q79L98j307r68m25O42K460o95j186j228M50O78J369
2144A207q64q22n03O02M69J045k72j375p16N57J916j19k62j914l44Q99J328O13
2162A445j380q72j60N21J736j83r96j347Q44K13J037L52j365j120K47R49J038
2179I59m59k66j130j96J416N99j5q70j553P42J519O86q57j175j011Q35J021Q92
2197A137m4j599r59Q52Q65J279j132j104o04K48K146K48r52j185K59K18J519k4
2215A168j403j407O09J469N39j10m78j204k80J060J068j81j005j482J114J114
2231E91O92j86j789o28J56J285Q77n70j311j67M05J153Q93p33q19p85L44J752
2249A160M12j334q95o59J442O89k49j59j432K88R72J96N95j442j010J61J246J240
$$ plain form
2126 1065 1455 674 -1191 -1661 140 1019 1417 110 -858 -1283 -641 1819 1124 -62 -1290 -840 -162 1207
2144 1207 343 -479 -982 -380 89 1134 862 -513 -1229 -672 1244 1125 863 -1051 -1395 -496 832 1445
2162 1445 65 -807 -967 -446 1290 1107 111 -1236 -392 -179 858 1210 -155 -1275 -1028 -79 959
2179 959 500 234 -896 -1092 324 923 908 38 -1515 -773 746 1432 575 -600 -1611 -776 245 1137
2197 1137 1093 -506 -1465 -613 252 1531 399 -705 -1309 -1061 1085 1333 381 -804 -545 -327 1192 1168
2215 1168 -235 -1642 -1033 436 975 865 387 -817 -1097 -37 1031 850 -155 -1637 -523 591
2231 591 1283 1097 -692 -1320 -1164 121 998 428 -883 -1050 -645 508 1401 668 -151 -936 -592 1160
2249 1160 1572 238 -657 -1316 126 815 566 407 -1025 -737 235 431 1026 -416 -1426 -1265 -19 1221
2267A221k80j729m6M53J76J775q99j761j54K57J491R39q47j480J50N47O12N65
2285I90p18j207j89J013J443l2j018o83r04Q20J299l0j195l10j24M43J247j57
2303F88J91j671j75J310K88K05r17r89K81Q70J052p27j153l64J398J84Q20j325
2321c4J85j050N42O49O73j4j677l08J228O01J79m5j528n42R27J343n60q55p52
2340a038m59J360P51M11r54p53J60L60J097rj558j32j00J096P91k21j479n47N98
2359f26R00q9K35q92j156P65J904L91j518m94o9j69Q82L96l44r12j8M54J492k80
2379H52j661l6k58Q49O27L37o41o85J51K22J485o97j048l44m37J007J210n31l97
2398En83o7P82Q59m47j233l38K96J365j40m38m54p42J021R81M08p27r55j17j35
$$ plain form
2267 1221 941 -788 -834 -381 -205 1570 671 -1090 -1244 -987 504 1443 596 -884 -734 -187 425 990
2285 990 272 -935 -1124 -111 1332 1300 282 -401 -1305 -485 814 784 -411 -721 -845 -402 845 688
2303 688 879 -792 -967 343 631 836 -81 -1070 -789 81 1133 406 -747 -1111 287 471 1291 -34
2321 -34 151 -899 -357 292 965 951 -726 -1034 194 795 974 929 -599 -1141 -214 1129 569 -286 -1038
2340 -1038 -1497 -137 614 1025 71 -682 -522 -162 935 926 -632 -764 -864 232 1023 802 -677 -1224 -626
2359 -626 274 185 420 -472 -1628 -863 1041 1432 -86 -580 -649 -818 64 460 116 -796 -814 -360 1132 852
2379 852 -809 -845 -1103 -254 373 710 69 -616 -465 -243 1242 545 -503 -847 -1284 -277 933 402 5
2398 5 -578 -645 137 996 549 -684 -1022 -726 639 499 61 -393 -1135 -114 867 1275 548 -407 -524 -659
2418f59J401M96j056j145J98J402J49K7j357Kj39L51R88L58j406J59n07Q55O64
2437G81m28p80m77K93J075M17q28m75m93P92N87Q86p28j029Q2o3J020O5p14m14
2457d31r27J030J068M37q40j327N40k92J294K27j126p00o3J140O04J17q26j349
2475a424Q91L64J129q23l33j065P93N08J093n74q36n2J55P73J25p46m04r1M62
2494e5J85N46m90p55j90J44J380M5p84M7n46N55J96Q82r11j027k22Q75J241n00
2514F16r95k53j25R26M23n85k99q16R44Q27l12k52l01o72Q19O83LK34j182m41
2534g58N66O57R08j359o49l76J008R10L77j108o70p71J168J197k46n35r85N86
2552h0m30R47P1n10j411J093J87P6K6K29n44L68j92Q24R6p97m65K46N22M26Q9
$$ plain form
2418 -659 742 1238 182 -963 -765 637 786 813 -544 -542 -681 -330 658 1016 -390 -231 -738 117 781
2437 781 353 -427 -904 -611 464 881 53 -422 -915 -123 464 1350 622 -407 -325 -388 632 697 -17 -431
2457 -431 -1358 -328 740 1177 337 -990 -450 -742 552 779 -347 -1047 -1110 30 634 751 -75 -1424
2475 -1424 -533 -169 960 137 -196 -1261 -468 40 1133 559 -277 -329 -174 599 724 -22 -426 -517 -55
2494 -55 130 676 186 -569 -759 -615 765 810 26 73 -473 82 278 1160 249 -778 -1000 -125 1116 616
2514 616 -379 -632 -757 169 592 7 -292 -1108 -164 663 351 99 -202 -874 -55 628 631 865 -317 -758
2534 -758 -192 465 1373 14 -635 -1011 -3 907 1284 176 -494 -1265 -97 1100 854 319 -666 -80
2552 -80 -510 437 508 -2 -1413 -320 -133 -57 -31 198 -346 22 -170 654 750 -47 -512 -266 256 682 771
2573G71j294l15N34J093j33k16r12N4j33P92N44n81q39k15M42R91o18N5p85K90
2593d75N6O97M37j010m40j02J374P7j90n31p43O5J363P4n56k57k56j10O47N46
2613F66k42n52m83M91L41K85J93j060o70Q59P22m8n14j059Q91o36J398j11j08
2632C63j161M80n62J909k72n35o85j37R52J36L06n68j209J222l97J170n85p37
2650c10l53K24K82J148o89k35j35K74M36j65J8r86l88M93J139k29l12o82L32J44
2670FJ080K03j070k92l79N67J240l48j172m14J47M69Q16k98n19p73J94Q64J09
2689D30m14k92m34N21K66O67m60r38j67L75J188j18r01k68k30k01J411J3M21j450
2709e81n28Q43J324l6l85j134k02N13R44j8j203l54M69M80L13L41j188n06N30
$$ plain form
2573 771 -523 -838 -304 789 656 440 -472 -418 -551 241 785 204 -635 -850 -408 583 -35 20 -765 -475
2593 -475 -419 278 715 -295 -735 -837 537 614 424 -107 -850 -785 578 652 96 -161 -417 -527 120 666
2613 666 424 -128 -611 -120 221 506 699 -361 -1031 -172 550 502 -12 -1071 -180 -816 582 471 363
2632 363 -798 -318 -880 1029 757 222 -463 -600 352 488 794 226 -983 239 -158 1012 427 -310
2650 -310 -663 -439 -157 991 302 67 -68 206 642 477 495 -491 -879 -386 753 524 212 -470 -138 6
2670 6 1086 1289 219 -73 -452 115 1355 1007 -165 -579 -432 37 853 555 36 -737 -543 321 430
2689 430 16 -276 -710 -189 77 744 284 -654 -821 -446 742 624 -277 -545 -775 -976 435 448 869 -581
2709 -581 -1109 -266 1058 1022 637 -497 -699 -186 758 740 -463 -817 -348 132 445 786 -402 -908 -378
2728c78P34j43L11j020p80O02R36K72l71q60O1j1O01J293p33p26R7J20O68p6l83
2749B14m81j04k7M52O66n22j128l3Q54R43l93k26m13k64L81J127o71l11r12J86
2769f62J038k22N02j166m76J86R71O62p92m20j49K99N78Q38n81m90j057R50J8
2788B7L60J60m92p09P83M05l82l03j71l95N51P95j59l75k20j65L39J72M99m17
2808C03q84Q46l9j21j79q3m63j91K52J495n8p63p97L72p8R32k77p09J31P77K59
2829G25n08N1k99o53J205m70Q70q59j428J219m80J22Q42k58q30J86N30K99L87
2848F51o62o63R2M61J178p79p25L68j23K72J209j139j24p48J98J185j6j035r7
2867d97m79J190J09M03n01n12O4K4O10k65K60l85m79P17N5J59r05k77O32rL03
$$ plain form
2728 -378 356 213 524 -496 -1276 -674 262 534 163 -697 -636 -647 -46 1247 514 -212 -115 5 673 597 214
2749 214 -267 -371 -398 54 720 198 -930 -963 -109 834 441 215 -198 -462 -81 1046 375 64 -848 -662
2769 -662 376 154 656 -510 -986 -800 171 833 41 -379 -528 -229 349 1187 606 116 -941 9 27
2788 27 387 547 55 -654 129 534 152 -151 -322 -717 -166 629 470 95 -125 -290 49 221 720 303
2808 303 -581 265 226 105 -74 -157 -620 -811 -559 936 878 115 -682 -310 -388 544 267 -442 -311 466 725
2829 725 217 268 -31 -684 521 51 921 62 -1366 -147 -627 -505 337 79 -751 -565 -35 264 651
2848 651 -11 -674 -582 -121 1057 278 -447 -79 -202 70 1279 140 16 -732 -534 651 635 -400 -497
2867 -497 -976 214 323 726 225 -287 -223 -199 411 146 406 21 -458 259 314 473 -432 -709 -77 -86 217
2888B17M87p46J6NJ11N64l78l8o06l09J29P62k09j76l18N35l11R69l89q00j74
2909f59K94J154m3o22m52r9K46M90k01m61L62j072R49J156j037M99q13J70L4N89
2929D84J65q11o46l2J152J57n67n43Q6J98M20M33L97j395M9K01M23J63N05j187
2949c48m09L78L13O24m21p26m89O39P56N47n87q59J67l10J405j03k06p65J46L86
2969A38L90J64n39p29J73N63k12P04n43m02n2L21J84l4l18n95k34O96J162o81
2989A56j046K17Q32k76Q23o28l56J67n35P59O16o66n70J74K9M63r4m55K60j17
3009b47K47L02m09m55P3l53J291K75K4j250j68K01P30N50k25o04o1n04J30N11
3029E8l8M98j418N95O30L61j45o91j35k0R47k1K68j000l28L09J21P33o32r38R57
$$ plain form
2888 217 704 -42 -26 -21 90 654 276 238 -368 -677 -548 214 5 -171 -489 46 -265 704 315 -485 -659
2909 -659 -365 789 746 124 -328 -427 -181 309 108 -353 9 -1063 -114 1042 5 504 -309 -139 -105 484
2929 484 649 -162 -808 -840 312 469 -98 -641 -555 -357 63 496 893 -502 -453 -252 171 334 839 -348
2949 -348 -757 -379 -66 558 137 -589 -1078 -439 317 864 277 -582 -415 -725 680 577 371 -394 -248 138
2969 138 528 692 153 -576 -403 160 -52 652 109 -293 -345 -24 160 126 -192 -787 -1021 -325 837 156
2989 156 -890 -673 159 -117 706 78 -278 -111 -646 113 729 63 -507 -333 -304 159 65 -390 -130 -247
3009 -247 0 302 -107 -562 -489 -842 449 724 748 -502 -670 -469 261 811 586 -18 -79 -583 -453 58
3029 58 20 518 -900 -305 325 686 541 -150 -285 -305 642 621 889 -111 -439 -130 -9 724 92 -846 111
3050A11K92K76r11N70q54L30K33M47m1p09K07k02P00n08N95r52m7L14O29O9l35
3071B14J12j117j72J180j47o96J55P32n68N15M73n46l78N9O3Q09l18J66m44q03
3091g11N36M64m42j23K95k01o9L42J80m65K79j15m4O40n06m02J44j10n6J171p57
3112E0p52J031n00LM73k04k94l60m3J088m72J039j875lK21R70j00J8j104p4R45
3133E7j62K70m20M69p86J072L48k92j078o6j5Q54O40k59j019R9l18Q37J06l74
3153c7J77k08j50Q84k88o04J10L31p5K72L35j098J61j98j07J012m71J22m06l29
3173e67N56N34R9m31l12m4Q35J37j99l13j074P0M39K99Q34q27m05J96m84J046
3193C89m99J36q70L71O65k6j17m80N17n95Q12L3k31p60M11j88P96K06k84j099
$$ plain form
3050 111 403 679 -232 338 -516 -186 47 494 453 -256 -49 -251 449 -59 536 -416 -463 -149 480 549 214
3071 214 326 -791 -963 217 70 -626 -471 261 -307 208 681 135 -243 -184 -121 688 370 536 92 -711
3091 -711 -175 289 -153 -276 19 -182 -251 91 271 -194 85 -30 -74 566 60 -342 -198 -308 -364 807 50
3112 50 -702 329 -171 -168 305 101 -193 -553 -596 492 20 1059 -816 -819 -598 372 272 290 -814 -888 57
3133 57 -105 165 -255 214 -572 500 848 556 -522 -588 -603 251 891 632 -387 -288 -606 231 337 -37
3153 -37 140 -68 -218 666 378 -226 -116 215 140 412 747 -351 -190 -388 -495 517 46 168 -238 -567
3173 -567 -11 523 622 191 -121 -165 670 807 608 295 -779 -709 -270 29 863 36 -369 -173 -657 389
3193 389 -110 26 -844 -473 192 166 49 -431 86 -509 303 336 105 -655 -244 -432 364 570 286 -813
3213h13L33L89N71K81j222J90o4J49M84k69K44j25q10J138k59K36j91K00j015
3232e53J064J09k52r18L67j05O36j08M81q37q01J313K44K86j141j98L6M19m30
3251c88R23l82p09k86M51K67k28L99j07m44L43N38J40n52l16L38O06oo3m29k79
3272a84k81M77N46n38k61k84O62J27j21j62O56j216k27J142p70N49k0l04Q7n3
3292a75Q59l79m07j72J07L26K7o91N08n73J134m97K28o17k72Q95m23L93o72N17
3312A16k74J56K61o5On29J4O56m49O62l15n12k85M43M79M51j121J56n43M72M47
3333B26J9k64J79r28O77N41m86N99p52M93J6n5m6l84o20L70K26P67l52m64k6K71
3355GL61J59l30n11J27N72m41J9j71K14k15k34K02M84L70q32j00m03P62N15o51
$$ plain form
3213 -813 -480 -91 480 761 -461 -271 -335 -186 298 29 273 148 -662 476 217 453 262 462 -553
3232 -553 511 620 368 -550 -183 -288 348 240 721 -116 -917 396 640 926 -215 -413 -377 42 -388
3251 -388 535 153 -556 -842 -391 -124 -352 47 -60 -504 -161 377 517 -35 -351 -13 593 587 524 95 -184
3272 -184 -465 12 558 20 -241 -525 137 264 143 -19 637 -579 -806 336 -434 115 95 -209 -122 -175
3292 -175 684 305 -102 -274 -167 159 186 -505 3 -570 564 67 295 -322 -594 301 -122 271 -401 116
3312 116 -158 -2 259 194 200 -329 -315 341 -108 554 239 -273 -558 -115 364 815 -306 -150 -693 -221 226
3333 226 245 -19 160 -768 -91 450 -36 563 -189 304 320 265 219 -165 -785 -415 -189 578 226 -238 -264 7
3355 7 368 527 197 -314 -187 385 -56 -37 -208 6 -209 -443 -241 243 613 -219 -319 -722 40 555 -96
3376i6K57j38l8N75m47K41r03P90k26M17j64m14O7n25N43P63o11K98p12N8K51
3397a4K42L54o75o04J106n31l28P33k81k13m05P38K31l61j44l48N28l73N68k84
3417f1j03J49j76J17n8K96j8q26N99J40N61k66o60K83q0N69k60k90m61N97J50
3438B02J48R6n31o4P8M04Q5O71m26j308K41M95O19o8q30k59J36N81J34k57o07
3459d60R6J213m84J64l38m08j33K14L0K53p00M64k22N60R2n56J02Lk37P13L26
3480F92n48k49p10R37k75O40k91n06P1J32j8M28k98j02k4j28N39k05J75o96M85
3501D9K0L70q52Q17j005N74K31K5j36p54K35p1M70k26N34j4k32l70R24o60L31
3522B60l91JO87j030P55m94P08p47j52M73k12r0M23k40l32O16K80q32N38p07Q40
$$ plain form
3376 -96 161 23 -15 560 113 354 -549 241 15 432 268 -146 -79 -604 -61 702 91 389 -323 -265 -14
3397 -14 228 582 -93 -697 409 -122 -450 283 2 -211 -616 122 353 -8 -152 -500 28 -345 223 -61
3417 -61 -164 -15 -191 -74 -132 164 146 -680 -81 59 620 354 -306 -23 -103 466 206 -84 -545 52 202
3438 202 350 446 -85 -149 -71 333 418 1089 663 -645 -404 91 710 642 -188 -447 -311 270 404 147 -460
3459 -460 -364 849 365 529 191 -217 -350 -136 -106 147 -553 -89 -311 249 341 -215 -113 -110 -347 366 692
3480 692 144 -105 -815 122 -153 487 196 -310 -239 -107 -125 303 5 -97 -121 -249 290 85 260 -436 49
3501 49 69 439 -413 404 -601 -27 204 229 93 -661 -426 -497 -27 -253 281 267 35 -335 589 -71 260
3522 260 -131 -130 557 -473 282 -212 496 -251 -403 70 -142 -232 191 -49 -381 235 515 -317 221 -486 354
3543C54o42N22K78m68l39N93p7j6p2j119J114N66K91q47m24J23r4K65P29n37p00
3564e00L48M87o19k14J187m49p62M13M27n18M6J9k94K58K71K9p4j07n74K39N60
3585A73j07Mk67p5P59r8k58L06n24l11M86R9K02n39q03M83Q29L63r66J33K46r99
3607h64P91L01k12j71o28L59L85N00m86o06J42N1K12K60p7k47M21K42k50R6k69
3628e0qj13J28p8M39K12q76P9O30k75R5l98J96j59l01L13M72j067K05M42m07L77
3650a44K70j56m57Q42k38m55J390o95n61L67l7q9J85l02j90L19j31L13r9l57n29
3671g54P08Q88q28N1l79K20J28Q10q23m99K95L52k7j35l60L48l56N38o32O64j6
3692A93l56k27L06j47M1M15j12j7J26m6j61m9n73N06M17K26q73L00Q3m77M12m38
$$ plain form
3543 354 -288 234 512 44 -295 298 221 205 133 -986 128 694 985 138 -286 -163 -257 8 737 200 -500
3564 -500 -152 335 -284 -498 689 240 -522 -109 318 -200 -154 -135 -429 -171 100 129 55 -52 -626 -387 173
3585 173 66 70 -197 -272 487 389 131 437 -87 -398 88 187 389 -150 -953 -470 359 722 -244 -111 135 -864
3607 -864 -73 228 16 -155 -783 -424 -39 461 -25 -631 -489 -438 -226 34 -43 -290 131 373 123 219 -50
3628 -50 -58 -171 -43 -121 318 530 -346 -267 363 88 183 -215 -19 -178 -479 -166 306 -761 -556 -114 -521 -144
3650 -144 126 -30 -487 355 117 -338 1052 357 -204 163 126 37 222 -80 -270 49 -82 231 132 -225 -754
3671 -754 -46 842 14 65 -314 -94 34 844 21 -478 -183 169 142 7 -353 -5 -361 177 -455 209 193
3692 193 -163 -390 -84 -231 -190 225 113 96 222 176 15 -34 -607 -101 316 542 -331 -31 52 -425 -13 -451
3714d51J103m25m39K73l71j28P21o36M44m86M60k14L85pk83J42K61l85L36o70
3734c70n8J62O33l03l12m1l14K61Q17Q6l73n24n5J30j40L96O00p85K77n13O45
3755B19r9l35m2K61N3N87n31m5j38K02K9j51L61l81O4j03K60L79p97L86n72L05
3777h8o9O42p49L37J10n06k09R07m36j18m86J029K55r21l03R88l80J34n92K86
3797a69k17Q77o07N7P35n42L5k0j84M07j84n46J04j06k47M89P11K46l7j320L41
3818a77j24L51l5q6j18j51M92K83l32l38J04j01Q78o38J84j88m20M74OP81r25
3839h0l53O65o13P49l70k81j51L04J40N6o3k09J15k38J70j27K91j66l47M00N1
3860e7M04M74o29o63K43r7O25l51j04PN6J44M57l26M27l53r3k7K75p66O42o66
$$ plain form
3714 -451 652 227 -212 61 -310 -438 283 -353 91 -395 65 -149 236 229 -54 88 349 -36 300 -370
3734 -370 -428 -266 367 64 -248 -289 -603 -342 475 561 188 -336 -391 -261 -401 -5 595 -190 87 -426 219
3755 219 120 -215 -257 4 57 644 113 68 -70 132 161 10 371 -10 54 -49 211 590 -207 179 -393 -88
3777 -88 -157 485 -264 73 183 -323 -532 375 -61 -179 -665 364 619 -302 -605 383 3 137 -455 -169
3797 -169 -386 491 -116 -59 676 134 169 149 -35 372 188 -358 -254 -360 -607 -118 593 839 802 -518 -177
3818 -177 -301 50 15 -71 -189 -340 152 435 103 -235 -131 -232 646 8 192 4 -416 58 64 845 -80
3839 -80 -433 232 -381 368 -2 -283 -434 -130 10 66 3 -206 -91 -329 -159 -286 5 -161 -508 -108 -57
3860 -57 347 821 192 -471 -228 -325 300 -51 -155 -148 -92 52 509 183 610 257 164 137 412 -354 288 -378
3882c78O23l09M54o86j23M05K0N01n62J023j008l63Q40l41j2k33J93j57M01j31
3902A57J94p27k00N54J41j0k09L79j65k84O17n11p4K40l67k31O28K32m70o31Q45
3923A08m15M37N24q58P5L14o30J181r02J47q51N13J48K9J26J02k50m58Q39l01
3943a22L06n28M3L62l8l20O9k87N70k4K53k34m99O53J47l01k48Q54q24N26k25
3964A33O0l53O33m78j37n47J113j15k64ol66L07N4P8l6o02K29K91l74J078m92
3985B06M47j204N83L33o69J98M51o13p04J211m08P82o95J92L57k70k17J34q09
4004f95R15n16M07K07p02l4k3l4J00P27n82m5L95K1M38k66N74q51r10M35J050
4025F11m38J91r54O14o26Q64l6j8n79M05M47m07N44o26q6L35L31n56k01J19j12
$$ plain form
3882 -378 245 -64 390 -296 -419 -14 6 507 -55 968 -40 -403 437 96 84 -149 44 -113 288 157
3902 157 351 -376 -576 -22 119 109 -100 279 114 -170 447 -64 -138 102 -265 -496 132 364 -106 -737 108
3923 108 -307 130 654 -204 -129 185 -445 736 -166 -19 -870 -357 -209 -180 -54 48 -202 -660 179 -122
3943 -122 184 -344 -301 61 23 -297 -228 -515 55 31 284 50 -449 204 351 50 -198 656 -168 358 133
3964 133 193 -160 473 -5 -142 -689 424 309 45 39 -327 -20 34 112 76 -526 -297 -6 -380 698 206
3985 206 653 -551 32 365 -304 -106 345 -268 -972 239 -169 613 -82 110 467 197 -20 114 -695
4004 -695 220 -296 111 318 -384 -418 -441 -475 -375 352 -230 -275 120 141 579 313 887 36 -874 -439 611
4025 611 173 364 -590 24 -602 262 226 208 -371 34 481 74 618 -8 -94 241 572 16 -185 -66 -178
4046a78P55m11L44k93r13M23L77L42N6j22p22L11k15L96p50M56J11J38N18m49
4066A74L98o13m60K28K2L18j92l80O69l20L87m61L35J2l8l12L46j25K85n22L65
4087A16k87J387j045l0n55L6J91M75k40p20N04n55P24j42P29n11k11L35n7l60
4107b16M67o24R82q51K65j21o09R06nk02Q8K94Ko95J07N19m29P58r98M98j55k04
4129b23N2Q56m85n13N42k16j30L27l31J82k54Q5J30M3l25q9L34R0J19J5o42K29
4151b04l08K51L02r7J80j31k97O45j33k93J9l57k2R30p72L55o09N10L36n47L53
4172A11J40o80p8K37P63k74l32K27O1l95K49K24J9k42j52k0K95n86N16l88k64
4193e69O61J69n38R59p42m55J097j20L4n25m67N76l87K24L56L80r30Q02o9j71
$$ plain form
4046 -178 577 166 510 217 -696 -273 104 446 502 380 -342 -31 -246 150 -600 -144 -33 105 623 174
4066 174 572 -41 -501 -273 -251 67 -125 -505 164 -156 231 -230 105 117 79 -233 113 -12 273 -249 116
4087 116 -171 1216 171 141 -414 -378 -187 288 48 -672 -168 -723 1 -141 588 77 -134 201 144 -216
4107 -216 251 -373 609 -242 23 -98 -707 199 194 -8 80 374 376 -319 -212 307 -122 636 -362 136 -19 -223
4129 -223 -171 685 200 -313 229 13 -117 210 -121 61 -193 -108 22 65 -260 -349 -15 75 194 209 -433 -204
4151 -204 -512 -261 41 -56 124 -7 -304 341 208 -85 -66 -423 -445 485 -287 68 -541 -31 305 -242 111
4172 111 251 -429 -507 -270 493 219 -113 114 175 -220 29 253 272 30 -122 -142 153 -433 83 -305 -569
4193 -569 92 261 -277 682 -60 -515 582 462 496 -29 -496 80 -307 -83 273 653 -277 525 456 285
4213B85p24Q73p15M74M17j231Q05Q7m99L79K4o4J37o40K79L70m36j25n9L55j8
4234b6M72q66j79O86k95K12P6M27j59J18j298J180n98L93l72K48O9O6L9r94J229
4255D28o01L42r55Q91m3M56j032j20K57M03O1r4r4L42L14p09O12m03r9j13J61
4276Dn00P05p4K90m35K18K15o54K54k87N5N19r1j73p26O72m19O61o07Q14lj47
4298B91l19j4R3r9k62p1M80K87M1l83M89m47O08J3o7r66M82K94l70l81P76m76
4320al32R05r03L00K37m88J90J62k66M97l76j94m07J763p20j46M92j266K50K42
4340f1Q49m50k52l93j95L77L44J30j84l15l59M37j01R6L15k71L40J52m68K9L39
4361C59k19J84m8j80J34p00Q17j4m91N17m55K61l21L14Q5J91m22j37k48K97k8
$$ plain form
4213 285 -439 434 -281 193 610 -621 184 271 -228 151 175 111 248 -392 -113 257 -179 -304 -363 -8 -26
4234 -26 446 -420 -599 87 -208 4 80 507 348 466 -832 348 -250 143 -229 19 88 154 193 -801 428
4255 428 -173 169 -786 105 62 518 -514 -634 -377 26 87 -7 -101 241 555 -154 458 55 -44 -157 4
4276 4 -496 209 135 425 -10 208 423 -231 23 -264 -209 310 219 46 -680 -8 -427 234 -373 441 438 291
4298 291 -28 -42 51 -48 -310 -381 99 386 427 44 533 86 694 707 640 -326 156 450 80 -301 475 -1
4320 -1 -333 572 -331 -31 206 -282 -92 70 -196 301 -75 -269 -676 1087 367 221 713 -553 -303 -61
4340 -61 788 338 86 -307 -502 -125 219 349 165 -150 -509 -72 -173 -77 238 -33 307 459 -9 20 359
4361 359 140 324 276 96 230 -470 347 333 -158 359 -96 165 -156 158 243 434 12 -125 -373 -76 -104
4382a04O49o87k24N01j57m27R16r65L79j21J29l8P2K56l21K58m9n9j44j34r5K32
4404a33k92O07R9o82J21K95M59j51m3n27J58L60l54l44J91M23o98M20Q9r0p5p0
4426b37J9P29q86N72L02r75K68L46k90l12K81O2q0O4o31P25k17O55m93j17L51
4447A36J7J78m42l7L36j08Q32r36j68M23k86K83l65R8J97o72O46m39o3J85M90
4468C05n25Q88n78o60L16K94j6J45J66j93j41n72J50M39L22r20M3J181q30P34
4488E48p48K28l17P28m12J88K67m07k80M72m40O98K51p03m46L50J33J69J6q36
4508e41M55J04J55m6n16O0M54j89N80M9p16l3O4M31j93J26o02J29J19j6M33p27
4530d20N27J53l20L30j58m22%M35n7j33l2J8n0Jl03M34l63K25kL26m3k69O40k72
$$ plain form
4382 -104 545 -142 -366 135 -22 -449 467 -498 -119 -240 -111 -149 -77 179 -142 116 67 8 -136 -270 -365 -133
4404 -133 -425 182 281 -401 -280 15 474 323 280 -247 -89 271 -83 -427 -236 187 -511 -91 -2 -92 -167 -237
4426 -237 -218 511 -375 197 499 -476 -208 138 -152 -464 -183 -121 -201 -137 -768 -43 -260 395 -98 -215 136
4447 136 153 331 -111 -148 188 80 912 -24 -192 231 -55 228 -137 -39 158 -514 132 -307 -370 -185 305
4468 305 -220 668 90 -570 -254 40 24 169 335 142 1 -571 -421 18 340 -580 -537 644 -186 548
4488 548 -200 28 -289 439 27 215 482 75 -205 267 -173 525 776 73 -373 -23 110 279 295 -541
4508 -541 -86 18 173 127 -389 -329 125 -64 516 565 -151 -184 -120 311 118 244 -358 -229 -110 -126 307 -420
4530 -420 107 260 -60 270 112 -310 -310 125 68 -65 -97 -79 -129 -128 -431 3 -360 -135 -137 189 146 -123 517 245
4554B45k85L36k96L27n06k26P56l03J61L16n62K52p06M40M16m07O22o32L42o83
4574c93p7L18K29o54J06L37L59j42J35m07j33P06k6m03J20p9K74m96k29R77m03
4595A19J49j87J57k21l36q1J019l21n31M00p58J55O57m73L69K02n71M16r04R84
4615B44K1L30m88m51L43n42M81j32M41j91J55n73P24rj14k68L86m3n38JO58n64
4637a29k72K00N3m98K99O01r5J2p84Q74m85k43N96J1K02n35K04k05j20J51K1O10
4659D68l79k12M7L6j69J19K58j54l71J0L65O9L02m59K79L61o55k47l07r4K84O30
4681A81L36n51l5L3mL77r0n22M21n03O49K06n9m18j96L96j116Q36J70K14k41m44
4703c60J139p11l58M84p61O68L66q62L62l35M26o05L65p6P46n32K29m85M98L96
$$ plain form
4554 245 -40 296 0 327 -179 -405 351 48 209 525 -37 215 -491 -51 365 -42 580 -52 290 -393
4574 -393 -470 -152 77 -577 -471 -134 225 83 218 -189 -322 384 358 -45 75 -4 270 -226 -455 522 119
4595 119 268 81 238 17 -319 -400 619 298 -233 167 -591 -436 221 -252 117 319 -252 164 -740 244
4615 244 265 595 107 -344 -1 -543 -62 -194 247 56 211 -362 362 353 239 -29 357 314 -224 -223 435 -129
4637 -129 -401 -201 -148 -646 -347 254 159 171 -613 261 -224 -467 129 140 342 -193 11 -194 -314 -163 -142 468
4659 468 89 -123 -76 -40 -209 -90 168 14 -357 -347 18 87 389 -70 209 570 -85 -332 -639 -733 -449 181
4681 181 517 -34 -69 -36 -40 337 247 -275 146 -357 292 498 439 21 -175 221 -895 -59 111 325 84 -360
4703 -360 779 68 -290 194 -567 101 467 -395 -33 -368 58 -547 -182 -258 488 -44 185 -300 198 594
4723E94K05r10J84j54N0m9J73j39o12L14R83n14n85K5M06O1m93M82j19J50J09
4744A61k39J57K31o86J90K96K08p74L16P19n38J28Q9Q67n79q91K17L91L4K70n49
4765A8j77p9J79L35m53N3L23l86K51l00M65l48j47O5m4M04Q4m61L64m98M96o01
4787d57R7K29J46k83L17kM5k90Q09j113Q74l4O1n35L45K80l82k92M3M20o16N85
4809B47l21N46n91R8q43R35O2N8m25J86l43L68K83o1q3J1q8K33M14r79M20q73
4831g46L10K51J6L96n26K04J3J06r6k72L05o84P69m21M30N28n64r7m51O78m76
4852c27q8J52J99q65O97k60j92M01K69N4M08j68l68K67l63l86N82P01l41n55L67
4873A84m0k30M03m18k80j70k3J86O58p4k18k62L47M1j77L42j28l41r2Q2O25j46
$$ plain form
4723 594 799 -111 73 -81 -31 -80 93 -46 -658 -344 639 125 -460 -435 -29 32 -461 21 -98 52 161
4744 161 -78 79 310 -376 -186 110 318 -456 -140 579 41 169 258 1125 546 -345 -128 263 297 567 18
4765 18 -159 -238 -59 276 -177 -124 199 -187 64 -236 229 -119 -266 -201 -245 159 243 -218 146 -352 144 -457
4787 -457 -360 -131 15 -268 49 47 92 -198 611 -502 372 338 399 -136 209 489 107 -185 -142 278 -338 247
4809 247 -74 472 -119 -21 -864 71 133 191 -234 -48 -391 -23 260 199 116 127 39 272 686 -293 127 -746
4831 -746 -436 -185 -169 227 -299 -95 -82 24 -72 -344 -39 -723 46 -375 55 583 19 -78 -529 149 -327
4852 -327 -415 -263 -64 -929 -232 -492 -684 -283 -14 40 448 280 -88 179 -184 -570 12 713 372 -183 184
4873 184 144 -86 317 -101 -381 -551 -574 -388 270 196 -22 -284 63 104 -73 269 141 -200 -292 -210 415 269
4895B69n39O37r9m57L81k15M29o16L4R2kk96M64n16M94M35l87l01O57m23J99n14
4917b74N39j58l3K60n26j98N28k8k66k35K81L07j22l59K36k59P10m90p0J23M14
4938C80n86R3P3K53l21Q00o20k03q8j34j11N36l20J48K32J03L15m10r3L88m14
4959B1k26L79l29Qj22L50J8K62k34L2J71q02J11P31q2j05l08j58L13q64R80L12
4981D58l54m06P52l63J2POk07pj30N6M19l85M14l56l97O39K95l23k7j47K4j92
5004b12M45M65m14m63R2J79n95R56n17N30n34nn8j40o33N10Q7R56l26m49J72j62
5026a16L89j09j21q59M78J30N19K8l43J5n7P9lj26k19O08k89j03N6M95m51j25
5048a24Q3m3l54J098k59j040M50L37k73M36o73LO45p54J44L12l3n8m87J152r42
$$ plain form
4895 269 -270 367 268 -189 192 -23 406 -210 -176 -84 -86 -382 82 -434 60 495 108 -193 464 41 240 -274
4917 -274 265 107 74 334 -192 -390 138 110 -156 -391 -110 197 75 -284 -48 -307 403 -87 -157 -34 380
4938 380 -206 -113 -40 213 -108 692 72 -131 -219 -353 -464 72 -248 -100 132 235 550 140 47 435 21
4959 21 -205 174 -155 -147 -269 81 99 361 127 159 330 -472 -361 370 288 183 -125 -283 30 -834 146 458
4981 458 104 -302 450 87 99 106 112 -95 -102 -232 -176 243 -142 272 -84 -481 158 453 130 103 -44 -20 -212
5004 -212 233 698 284 -179 -87 92 -503 453 -64 466 -68 -73 -131 -271 -904 -394 -307 649 323 -126 46 -116
5026 -116 273 164 43 -816 -338 -208 311 339 -4 11 -46 33 30 -96 -315 293 4 -99 -43 452 1 -124
5048 -124 -41 -84 -438 660 401 -639 -189 148 -125 311 -362 -359 286 -468 -324 -12 -45 -103 -590 562 -380
5069c80O51n87K12J79k05O69m38n43P44m22j73M41n01L8L71L50m72L7k02P26k99
5090A96m64Q7J37j79K77k44L61o10K48j71J1P50m49j7J73o0p6K73J97o8j84M90
5112F78k50n63M47j17p59P21n59N52o8n9q72J174q67K98M41L9n62L42J59k96J11
5133a0L42p53L00M01m83M2R2k6M27k15m67R12m66m33J39J125m60q27N02l96L60
5154A06k80n09R67r7J18l63N1Kk54O8K93K08l19q9P58n98o4n4P61j082k7L69j95
5177b30J98j36L44N2n24L43N36m97J32l52j88M18k0m51O21m32r1O25L26o81K77
5198B70l56L6l93L75M0l3j49O1N50p53l46P94m49K7O18J8n03O47l69J25l8M19
5220E91n35K98l14L29m71j34K76k79o1L31j90O60q78L93m44M60J49J08j010Q15
$$ plain form
5069 -380 271 -316 -104 75 -130 539 101 -442 302 -120 -293 148 -353 -315 56 406 -66 -29 -231 495 196
5090 196 -268 -181 -44 -223 54 -190 171 -439 -191 -362 -351 399 -50 -67 106 46 -30 243 440 372 188 678
5112 678 428 -135 312 195 -564 157 -402 150 82 23 -849 325 -542 -244 197 236 -326 16 175 -121 -10
5133 -10 332 -421 -121 280 -203 -161 -69 -95 332 117 -350 562 96 -337 -198 927 467 -360 142 -254 106
5154 106 -174 -683 284 187 305 -58 -7 -5 -259 -191 102 310 -9 -98 660 62 -2 -56 705 -377 -404 -35 -230
5177 -230 -32 -168 176 228 -296 47 583 86 218 -134 -322 96 76 -375 246 -186 -277 348 674 -7 270
5198 270 -86 -50 -443 -68 -28 -61 -210 -149 401 -352 -698 96 -353 -326 292 310 -193 454 85 210 172 591
5220 591 56 354 40 369 -102 -236 40 -239 -300 31 -159 501 -377 16 -428 32 181 289 -721 94
5240I4l96o24J047L64q81L7O13l26K95n00O1KM02o7j31L90j105N35l3L16K83J74
5262E50k98m26J32J07J01K95r54L6Q31l58L72R1n79K5M81o00Q89p88L5l21M90
5283A11l33J91K90j092R57K3m82l02J377p51m21N47M34q04M10m14J42L48K68j94
5303C05k31K1n40M49O2k96L95m63J41m1K1P01m98m72L36O0j54k15O43p99R0M91
5325FN97o07m11l05P81J50L9n42k43L23K86J94J50j28m15p28J081k44j71P62j038
5346d63L96p5M54L30n10m04K62k88O77l02k86N20k93K91j035J038l06L1m2m60
5366d65L42j42J54K36K86o61N68m04j52J67K10k04j02K73J70k87n06Q39j75k59
5386a12J17k27N91k09K77K40l07n07K42Q8o35O09k57J56m29K9O51m94r3K35N53
$$ plain form
5240 94 -302 -926 121 485 -396 -359 254 -72 223 -277 -216 -214 188 121 -10 380 -725 -190 -223 93 376 550
5262 550 252 -174 -42 65 166 461 -493 -457 374 16 388 479 -100 -75 406 -194 695 -93 -58 -379 111
5283 111 -222 -31 259 -833 124 147 -335 -637 740 -11 -432 115 549 -255 155 -259 -117 231 499 305
5303 305 74 95 -445 4 66 -230 165 -298 -157 -198 -177 524 26 -446 -110 -50 -204 -419 224 -575 -485 6
5325 6 603 -4 -415 -720 61 211 250 -292 -535 -212 74 268 418 290 -125 -853 228 -16 -187 575 -463
5346 -463 -67 -142 312 642 132 -272 -10 -298 379 77 -209 311 18 309 -726 312 6 37 -5 -465
5366 -465 -123 -265 -111 125 411 -250 318 -86 -238 -71 139 -65 -167 106 276 -11 -517 322 147 -112
5386 -112 5 -222 369 160 437 677 370 -137 105 193 -442 167 -90 66 -363 -334 317 -177 -270 -35 518
5407E18m75L28n44j76N19n41J94O35p08j47J10L04L46p13P10n88K78qK29n25L81
5428A27N50l92n4q0k34K8J92j31k70K38k07P8k13N7K30L75J55k55K38o91m1N01
5450B01p50L15M17m81K82p5L38q8k56J89J23L90n21J65l56k08N93j71K35k71l5
5471C6N25l27q82N93p25P80k19M15m92J43M33o7Q0N1n14M1n16O00n95P24j8ql33
5494b75O93k63j65K8l99L37q6p08P41J09l18M83K75m14L6M17k04n6j73K41j061
5515g62P02N65m00n70O19o9j29K78k00o0M27j151Q70K6j76L05n83N78j81l52P11
5536D48o84K08N08q64O85km04J32m18O10j61n11R2J86K87j78j77J84P3m7L87q41
5558d87J351n95m4j70K6K40j83l00N76o88M44l12p9L27m08r8L11O05o90K96j64
$$ plain form
5407 518 43 371 -173 -349 170 -371 -177 458 -250 -397 -287 17 363 -350 360 -228 50 42 271 -254 127
5428 127 677 285 231 151 -83 -55 137 6 -264 -26 -233 -155 -368 -311 -81 294 449 194 432 -259 -300 201
5450 201 -549 -234 183 -298 -16 -91 247 159 -97 92 215 605 84 249 -107 -315 278 107 342 71 36
5471 36 561 234 -648 -55 -780 0 -219 196 -296 -153 280 213 293 344 -170 -129 -645 -45 -640 84 66 58 -275
5494 -275 418 155 -10 18 -381 -44 -130 -838 -97 12 -306 177 452 38 74 491 287 231 58 299 -762
5515 -762 -60 505 105 -465 154 85 -44 234 34 -26 401 -750 120 146 -30 275 -308 270 89 -263 448
5536 448 -236 -28 480 -384 301 299 -105 27 -391 219 58 -453 -361 -175 112 -66 -243 -59 14 -33 354 -487
5558 -487 864 269 225 55 81 321 138 -162 414 -274 170 -142 -221 106 -302 -400 -89 516 -174 122 -42
5579d2k54K83j44N69q10P07p0J50p53L72J21J90o85j42M31O48r24M23m66M62j86
5600a20l72N21O0l35L01J33n15K81k32K51m02Q12k5m33P1K07N6n28j43L15R2k94
5622b99J67l56R11m79R9l52J10K6P65l72m06K99J91P03j293l06L41L16j31j38
5642b04M86j02j50k06l25R38n23M9j83j4L32J08L7Q1k77R9L65q10J082o63k87
5663a67M66O8q93O10J91j21J55m71j13O95r28K51N86j63j96j50K62M19m50K75
5683C26k76p1L85l43Q9k63m85O89k12J85l23N81N6n55K48L40k13j85m59N81J69
5704B64o82p2J081n44J48m69R06j089L38K42m62K53k71L05L36j20L81j270O52
5723g3l55K66J71J09o8j48K45N23p35O14q67j87j55J233p69K27%LK13p97P98p24
$$ plain form
5579 -42 -296 -13 -157 412 -398 309 239 389 -364 8 129 319 -366 -508 -77 571 -353 70 -396 66 -120
5600 -120 -492 29 89 -246 55 188 -327 -46 -278 -27 -429 383 358 -75 -4 203 259 -269 -412 -97 -5 -299
5622 -299 -132 -488 423 -56 43 -309 -199 -173 592 220 -186 113 304 1007 -286 -592 -251 65 -66 -204
5642 -204 282 180 30 -176 -501 437 -86 -37 -220 -234 98 206 243 324 47 146 511 -299 783 120 -167
5663 -167 299 367 -526 84 275 154 309 -162 -275 420 -508 -257 329 166 -30 -180 82 501 51 326
5683 326 50 -21 364 21 110 -153 -638 51 -161 24 -299 282 338 -217 31 371 158 -27 -486 95 264
5704 264 -418 -490 591 47 195 -274 632 -457 -119 123 -339 -86 -357 -52 284 164 545 -725 -73
5723 -73 -428 -162 9 118 50 -98 147 670 -65 549 -318 -505 -660 573 -196 31 31 34 247 -550 248 -476
5745d76Q4M28l56N68o35j01Q89m67j55L28n2k47j70J69L01n9m68L22J04q3Q9k00
5767a87L84m33n4L98l60J39l13O22m94K51j47O65q8n57j51Q70j51m9n18L32j12
5788D7M71o91j69k0M44k81N75j016O48r9L15m63M72p46J91N12n00M17j90k20M20
5809A17K77q23J016n16K07l41J20j93M73j60n00J04K34O5k03m01L61J20M46o63
5829b60K68L4N14n09k23J63L78j95m31N95l31M55k88l60L25k89M95r63K10M89
5849G7n55O88j20j97j47K6n4J95N64k10p64N88r2K53K62n06J58K5m40N18k84K42
5871B27K58o4r02Q12j81m08N13P66p53l81M41o74M44N76j053R60p66Lm14J116
5891E20k52o59J02k85M14o94O43M41m21M67l59M8L80K65p28L37l09L83n29N68
$$ plain form
5745 -476 -392 36 -320 248 -387 -488 401 -66 -221 107 55 -192 -362 -193 108 49 -419 -97 7 -76 13 -187
5767 -187 197 -236 -290 108 -252 -113 -426 196 -298 -47 -194 471 383 -174 -325 545 394 345 -173 159 47
5788 47 518 -173 -342 -362 82 -199 376 -640 8 -91 224 -239 233 -513 -322 190 -310 107 -83 -303 117
5809 117 394 -429 587 71 278 -63 57 -136 337 177 -323 -219 15 80 -123 -524 -163 -43 403 -260
5829 -260 8 42 556 47 -176 -13 365 170 -261 334 3 458 170 -190 135 -154 341 -622 -412 77
5849 77 -478 210 90 -107 -254 -228 -282 -87 477 267 -497 91 -1 252 514 8 166 191 -249 269 -15 227
5871 227 485 421 -481 331 150 -258 255 1021 268 -113 328 -346 98 674 -379 581 -185 -182 -596 520
5891 520 268 -391 -289 -574 -160 -854 -211 230 -191 276 -83 -35 345 610 -118 219 -90 293 -236 332
5911C32j03l47k9M22j113Q99K6L92k79p9l4N45k71l52l7M50m29N1l16J12N69p75
5933c66Q40q47j07K47j89J88N48o90P83p73N58j71j46L38K99m50L10L16j022N79
5953B45L99j087N72l5k74l58J41M22J08j66M43o36K25k03N62l77J61n63N90j89
5973b0j6K99J68J5l17j18k78N36m97K58j49j5J82k20j9O04m49J19K44J06j35R0
5995C88o85Kl2M58j7n83R92m87K44J19k82J28j23m41J001q10L53O08j161N47o10
6016c91P11k44k80J84j48N4q1q6l40N72j71n28M41k08N62J7N12k15j06J53r7o63
6038c52L45Q20r08L86m91K44KJ07k29j90l56r1O73J98l0j23J53N2l66N67o47Q78
6060F42jj377O42q8K91M83n49m61O12L72q41J6O3J10K48m29M05J4k43L00J6r4
$$ plain form
5911 332 229 -118 -147 275 -838 61 87 479 200 121 87 632 361 9 -28 422 -7 44 -272 -160 409 -366
5933 -366 474 -373 -480 -233 -422 -234 314 -376 407 -366 192 21 -125 213 512 62 372 688 -334 245
5953 245 644 -443 129 94 -180 -538 -397 25 133 -33 410 -226 -1 -204 358 -19 142 -421 169 -20
5973 -20 -36 263 431 446 129 11 -267 269 -228 30 -119 -134 48 -172 -191 413 -36 83 327 433 298 388
5995 388 -297 -295 -327 131 114 -469 523 36 280 399 117 245 122 -319 682 -128 225 833 -328 219 -391
6016 -391 320 76 -204 -20 -168 -114 -195 -281 -621 -49 -220 -748 -307 -515 47 64 576 361 255 408 311 -352
6038 -352 -7 813 -95 291 -200 44 46 153 -76 -266 -622 -713 -40 158 128 5 158 210 -156 411 -236 642
6060 642 641 -736 -94 -182 109 592 43 -418 194 566 -275 -259 -196 -86 162 -267 138 152 -91 209 225 131
6082A31l09J93J42q7j00j2k18O1j07L0L62j29M34n76k65R51l9n97J67l76J013
6103F69k40l91M73r81j8K41J49O9q0N14q0r2n72p4M15m64K89J4K45K43k28J11
6125B12l98q1M30R9o67j51R6L43j41M40k11l11N52J4q1j26k59P97n01j80N49m22
6147Cq4j92Q88r88K42N62n35J78m71L58J89j25J13k34l9P2j11O02l84J73m01L05
6169A21l72L23l83j56J60L35l34N87o80j79O99j38j8j93J37J17n84Q83j91k55
6189a21O53m87r5P0K42l77K3K80k65M28m29n42Q84n27N14J27m64M04o95M34O06
6210F63r45M3L76j38M68m23J65j10m63M86l1J05K75k17n18J67N65m33m43N39l97
6231b66r1p8Q39n44k1M47m38N9M23j76k86N39o14L65J18q78K15J53L74m17N55
$$ plain form
6082 131 -178 15 157 70 -30 -42 -260 -199 -306 -276 86 -43 391 -185 -450 501 462 -135 32 -344 669
6103 669 429 38 511 -470 -488 -247 -98 -29 -109 405 325 233 -339 -413 2 -462 -173 -159 86 329 101 212
6125 212 -186 -267 163 262 -405 -556 -460 -117 -258 182 -29 -340 212 226 145 19 -240 557 56 -124 425 3
6147 3 -81 -273 615 -373 -131 431 -104 74 -397 -39 150 25 138 -96 -135 -63 -174 428 44 217 -184 121
6169 121 -251 72 -311 -467 -307 28 -306 281 -399 -578 121 -17 -35 -228 -91 26 -558 325 134 -121
6189 -121 532 45 -50 20 262 -115 -92 188 -77 351 -78 -620 264 -263 251 378 -86 318 -377 57 663
6210 663 -282 -239 137 -1 467 44 209 99 -364 122 91 196 471 254 -264 -97 468 35 -408 131 -266
6231 -266 -357 -435 404 -140 -161 286 -152 -93 330 154 -132 407 -207 158 276 -602 -387 -234 140 -277 278
6252B78m36M8j6j11L5k32M04k41j13M50j88K17l71O05m90J52j25o28Q72n94J051
6273E67k84m14P6M80l80K99p0n48J37K59o59M18j92K61Q9j02Q08o66j27O9l00
6294b79M57n64L16M91N0m26j79L70J62o08q7K50j29J21o3j12K21K33p7m82j44
6315d79L78n10K63K21J60j23j0J47J00n94L28p6R69m59Q0m06k12O7J53m23M90
6336F4M31o31M05j0p31N10K50l00M14m29L14q65Q90q38R17n38k46O14l91O70l73
6357A27r0k06K00j35O3L05n53M69l41K23R7n87O32n04M89j04K47m51J60J25r7
6378F9J27l91o6P81p95K52m4J33k79m49O26Kj25J4Kj82o9L70l72L99k13K49j16
6401g7m26M38J61L19m84L82j49o2j36J60o33K04O42o93O40k25k67j49N1N5M67
$$ plain form
6252 278 -158 -110 -126 -237 -202 -434 -30 -271 -384 66 -122 95 -276 329 -161 -9 -134 -762 110 -484 567
6273 567 283 -131 -55 425 45 344 274 -274 -137 122 -537 -119 -311 -50 39 -63 745 79 -48 21 -279
6294 -279 178 -386 -70 421 471 45 -134 236 398 -210 -297 -47 -176 -55 -118 -230 -9 224 147 -335 -479
6315 -479 -101 -611 -348 -127 33 -90 -100 47 147 -447 -119 -195 774 315 395 -11 -223 -156 -3 -426 64
6336 64 495 -136 269 259 -472 38 288 -12 402 -27 287 -578 312 -526 391 -147 -393 221 -170 500 127
6357 127 37 -169 31 -104 -41 264 -289 180 -161 62 159 -428 204 -300 189 85 332 -119 41 166 69
6378 69 196 -195 -261 520 -275 -23 -67 66 -213 -662 -36 -34 -159 -145 -143 -325 -394 -24 -396 3 -210 39 -77
6401 -77 -503 -65 96 415 -69 313 164 102 -34 126 -507 -303 339 -354 286 61 -206 -355 -304 -249 218
6422B18J41l18j50N58n6q70O58o62L97J09K03P9o57P00p8p91N80l85K86M93l09
6443A46K20J50n81N2K61k54l12O43m78j14O29m02J7L64l51J38k40J44M12m29q30
6464h15O35k21L29k28j36J30J07K53j5O25p23J26j27k50N53l88L86p4j71J61r1
6485F6j91K50n9k21N09l36j97j84Q15n53J22N80j230O18o8l19L55l41P66o48j76
6506d42R2J004m74k46K53m08J32J38J8m25K69o0M90k89j87Q64r44k5P76q47J052
6527G41o77J15J02l58n5J3K67n9l45J81M45j17n27P91j12o60L51J32O0k64k34
6548b10K80k36N58k07n13j69L12P14o50K09k69P26n42p6k52L44K72l48M33L47
6568G23m67m08q2L87l14R03m67m36k4j47k02N94K8j79kP61n56kk06J35M30l70
$$ plain form
6422 218 359 41 -109 449 393 -477 181 -481 -84 25 228 307 -350 350 272 -519 61 -324 -38 455 146
6443 146 366 516 -65 -13 248 -6 -318 325 -153 -267 362 -40 -23 341 -10 128 -112 32 444 15 -815
6464 -815 -180 -401 -72 -300 -436 -306 -199 54 39 664 -59 67 -60 -310 243 -145 241 167 -4 157 66
6485 66 -125 125 66 -155 354 18 -179 -363 452 -101 21 601 -629 -11 -79 -398 -43 -384 382 -266 -442
6506 -442 -350 654 180 -66 187 -221 -89 49 67 -358 -89 -149 341 52 -135 729 -215 -240 536 -311 741
6527 741 64 179 281 -77 -132 -119 148 89 -256 -75 370 253 -274 517 405 -255 96 228 288 24 -210
6548 -210 70 -166 392 185 -328 -497 -185 529 -121 88 -181 545 3 -73 -325 19 291 -57 376 723
6568 723 256 -152 -234 153 -161 742 275 -161 -185 -332 -534 60 88 -91 -93 668 112 110 -96 39 469 99
6590I9k63j87P76p07L28L3l62K69M09l46j66M7o55O33O60r92Q69j82k55l80K44
6611a28o16J131J47o85L02L9j39K5N27n50O30n59L17o8k01l40M63m56J31j35J76
6632A1k39M02p22M24K6K25mj71j96L26o6M05n10p8L28k25n13R99R1j75m39k1L34
6655B12j89K11o03N02J12q34O18j76L29q20OL39L39n29R2L96O7N31k70l84M08
6676C57n09n5O68n56O73o13l84M27L35n65l12M40L16R4l72l39Q04m34K42K2m34
6697a95j09P45j003P92m77M58l51J29K3j34J07l69J072o04l22L09O96k33m56n46
6717d68P3K03L14m55N59l40O82j004J28O80n13q1M1n8r3Q03l51K20l65j79J87
6738a7J13q72O33k7J59K38J82p74K05l89K21J43L8j53R55l36m33L93o24P59k83
$$ plain form
6590 99 -164 -351 425 -282 46 79 -283 -14 395 49 -117 -70 -725 -92 568 -424 445 263 8 -372 -128
6611 -128 -744 387 534 -151 151 190 51 76 603 53 683 124 441 373 172 -168 295 -161 -30 -165 11
6632 11 -228 174 -548 -124 -98 127 123 -48 -244 82 16 421 -89 -167 161 -64 -577 422 513 338 -101 -122 212
6655 212 23 234 -369 133 245 -589 29 -147 182 -638 -632 -293 46 -483 -391 5 72 603 333 -51 357
6676 357 -152 -207 461 -95 578 -35 -419 8 343 -222 -534 -94 222 316 -56 -395 409 -25 217 239 -195
6697 -195 -304 441 -562 230 -247 211 -140 -11 12 -122 -15 -384 688 84 -238 71 767 534 78 -468
6717 -468 -395 -192 122 -333 226 -114 568 -436 -308 372 -141 -222 -181 -239 -332 471 120 340 -25 -204 -17
6738 -17 96 -776 -143 -170 -11 227 409 -365 -160 -549 -328 -185 -147 -300 655 319 -114 279 -345 414 131
6759A31N3o4o33P99n83k54L53j24K48J40m82J58Q5K32l63j72L08J60J92m95L03
6780hJ48n49M45l97J017o24m41L28oM27j013N83L56j019L69K86q2O0j41N47j22
6801A64J51j95L0m70L98k06L95k10j72J2J74j00Mp17O94o50K84J96N54l63J08
6822H1m49J83m51O18l44J07L46K72o07M25j23k84M67j29l05j47M58m93L0O18M54
6843G27j333O68m59N04q73L89j39Q16J97l14n9l09j99O84n5J89m39k68M43m27
6863b57j7O11k53J22L61j194L00P39o84N60l93J34N00p04N82l57j63J49L97j039
6883f06P46n16M38J13o78N86M60o55k39M47K45p49J58J85J26l44K96L77k85J56
6903B61K8k95K31K73k64m21l56M79j6J16j41l24N99l57k72N31n70o6P28Pq06N90
$$ plain form
6759 131 184 120 -513 286 -297 -551 -198 -322 -74 66 -416 -258 -173 59 -304 -476 -168 -8 184 -311 -8
6780 -8 140 -409 36 -361 656 32 -409 -81 -87 340 -673 -90 266 -753 -384 -98 -180 -120 -261 286 164
6801 164 315 120 150 -320 78 -128 267 57 -115 -103 71 -29 -25 -742 -48 -698 -414 -218 336 -27 81
6822 81 -368 -185 -636 -18 -362 -255 91 363 -244 181 58 -226 241 112 -193 -340 118 -375 -345 273 727
6843 727 -606 62 -397 107 -766 -377 -516 300 497 183 124 -185 -384 300 245 434 -5 -273 170 -257
6863 -257 -274 337 84 206 567 -627 -327 412 -272 288 -105 29 529 -175 407 50 -113 36 433 -606
6883 -606 140 -376 62 175 -503 83 543 -112 -351 96 341 -408 -250 -65 61 -283 13 390 105 261
6903 261 289 -6 225 498 234 -187 -543 -64 -80 36 -105 -429 170 -187 -459 72 -498 -564 164 171 -635 -45
6925d5J01l00j40n5P0O57o55N4J26J54l2J98M82l37n75Q05m05r6m9J79j22k16
6947b01J52k7N4N50r40L30O06m65Mm67N97n54K68k00N07n05K61J83l3j33N0J3
6969E0j00j9j95N81k63l41L3P14k92o2o8J41R0m31k33K74j74J85K74rR7l27m4
6992a19M36o61Q5m1J66K84j40j58N15q38J85K71k74K8J67K38L05l62m58O73o02
7013c00P7K15o0m4M16M37p22M44p84L54j01J93J74L3q12M95M70q31L70n2j88O6
7035a50Q7j35P76p46N20m09j88M41l37J78MqL27n39J82r6N39m92N50p08R5J26
7057A7k37M45k2p72L10L58l09P53j84k46R6l01PK10P6k10o73O01R23j194N23j25
7079D6j01J4K07m73J26M90m45k70J59K51O81o17j46l00N59p22Q16O0j004Q86k77
$$ plain form
6925 -45 56 -244 -384 -439 -369 288 -367 -313 -187 -33 -65 133 615 278 -297 508 103 7 -42 137 15 -201
6947 -201 -49 -76 -22 528 -412 -82 524 59 63 -404 193 -361 -93 -293 214 -291 -30 153 120 -13 37 50
6969 50 -50 -69 -264 317 54 -287 -254 460 168 106 38 179 269 -162 -395 -121 -295 -110 164 155 252 -75 -119
6992 -119 317 -344 -259 -300 -134 150 10 -148 367 -471 -286 -15 -289 -261 -94 144 449 87 -371 302 -300
7013 -300 -223 -8 -68 -112 304 741 19 463 -321 33 -68 125 299 332 -480 15 485 -346 24 -28 -216 -150
7035 -150 -63 -198 578 -168 352 -57 -245 196 -141 37 41 33 360 -179 3 -93 446 -46 504 -204 -109 17
7057 17 -220 225 203 -569 -259 99 -210 543 359 113 209 -92 -85 125 201 -9 -682 -81 842 -352 171 46
7079 46 -55 -41 166 -307 -181 309 -136 -406 -247 4 685 68 -78 -378 181 -541 275 335 -669 217 -60
7100f0M05n51O69J96j164O48j51m10M63l70k50P19n88J28L10l57N17m61J41j29
7120b95P5K09k5L33o84K47K79l8k11k18L85l39K39M3J1O57m96n21M20pj92N9L50
7143B81j39k09l19O00N8l12L4m00K49K69k13Q4K70n12M49m31M17o50N32L46n00
7164i6J30Qm65L75L36j45j4J70k41j30q1j99q2N65K68j13M48j031Q47l26m08K55
7186G1k86K34k89M02j42N82p69M66l03M0J57J27l63Q2k48J82q7M83j20j90j36
7207a07K44K58j86n36N11p21R41m25L51l54q6L49n51L32K0l17N21l45N43k20K8
7228B50m20J78j04L2K83j26j18k37P82m47k25L59n29O26K5n15L62j21k35K11j79
7249a48m47J153o30l8J97q64N80k28q9P63k40m63j2P19J00r48O53o39L85M88m32
$$ plain form
7100 -60 345 -206 463 659 -505 143 -8 -418 45 -325 -575 144 -444 -316 -6 -363 154 -307 -166 -295
7120 -295 -220 -11 -36 297 -387 -140 139 101 -110 -328 57 -282 -43 0 11 668 172 -349 71 64 -128 -69 281
7143 281 142 -67 -386 214 272 -40 -6 -406 -157 112 -101 -17 253 -259 190 -241 176 -474 58 404 -96
7164 -96 34 42 -423 -48 288 143 129 299 58 -72 -153 -352 -434 131 399 286 734 -297 550 224 -184 71
7186 71 -215 19 -270 132 -10 572 -197 269 -34 6 163 290 -73 9 -239 -57 -144 339 219 29 -107
7207 -107 137 395 209 -327 184 -537 404 -21 330 -24 -110 239 -312 20 40 -277 244 -101 442 222 250
7228 250 -170 8 -96 -64 219 93 -25 -262 520 73 -152 207 -322 304 329 -186 176 55 -180 31 -148
7249 -148 -595 558 -72 -110 87 -777 -197 -425 -514 249 9 -454 -466 253 353 -595 58 -581 -196 292 -140
7270a40K37o78O68n40N52K03k31L54N59p10j77k3N4o81K83j02J86M92l76K26n44
7291c88O16K26k37l81j02L48l91R6j10L89N41r20N6L09K32J67j21n64L73p03J89
7312c75j68Q9L32J53J14J64l16k82M68J81k25K45p87M47O1K74k03k71o4L19j30
7333B6j06n87O2Q85k8k17m21N79J16p85K57L5K02K37J51n02L97k51K59j52l13
7354a56K88m16K74k80L81k9m91L07K48j57Q1l39K71N4j97K78M66n63n76P27m45
7375b74K27K08l58K90O8n8j14o7L99J57p50Q5J7N83n42L33M2k17l49J11L11j44
7397d2K37l35L82Q2Km29J66J8l28k98J024o84O31o20rp9K65L60o08K47L9m8J48
7420A21l4m7l5j23O64n10K29k40n21O93j36m92l55Q46j2m33l2L33O6L62m33l18
$$ plain form
7270 -140 97 -581 87 -453 99 302 71 425 984 274 97 74 128 -553 -270 -372 -186 306 -70 156 -388
7291 -388 228 454 217 -164 -266 82 -309 -213 -323 66 607 -313 -257 52 284 451 330 -234 139 -564 -375
7312 -375 -543 -454 -122 31 145 309 -7 -289 179 360 135 380 -407 40 101 375 172 -99 -163 156 26
7333 26 -80 -667 -605 280 252 35 -386 193 309 -476 -219 -184 18 255 406 -96 301 50 309 157 -156
7354 -156 132 -284 -10 -290 91 62 -429 -122 126 -31 50 -289 -18 36 -161 117 583 20 -556 171 -274
7375 -274 -47 161 -197 93 161 103 -11 -78 321 478 -272 -187 -170 413 -129 204 246 29 -320 -209 102 -42
7397 -42 195 -140 242 324 326 -103 63 81 -247 -545 479 -205 426 -194 -203 -282 -17 343 -265 -18 21 -27 121
7420 121 87 40 5 -118 546 36 265 25 -496 197 61 -431 -786 60 48 -385 -417 -84 -18 344 -89 -407
7442d07J3L71l10N44j47k55N94m66K00k22o5P00n96K72n21N13k87R9P19j232N00
7463A7j06lP8k83j10L91n8L59p53R18o07K41p10M30M55j48J42n65L54l62M70N7
7485B07J34j038MM76O53k88j70j09N78p74N86m00j86N3L15m25O75l87j05j03L98
7506I4K72n50K28K72M0K7j69o60L49n42R18J56m79j26M9P2K22K1m27K4N8n51M43
7529b59J83K46m2l45M47k55LK42j83l04n51J208n24N48m8l72K86m24j19K77K43
7550B57k60j48j10O25j85l27OM56m53P58j094J037L59j254N02j00N2n37M43M20
7570D47l91Q6k85j9k55L29K29J37j50k50M6On76P99m19M75q3k3n19N55L17k98
7592A58J9j1R91j313J15j50K99m50J101n50l15m3n5K30l38J24K08O8L42l79N19
$$ plain form
7442 -407 -394 -23 -333 211 64 -191 403 -63 137 -85 -150 550 -46 226 -295 218 -69 30 749 -483 17
7463 17 -89 -92 -14 -297 -407 -16 -74 285 -468 450 -157 84 -626 -196 259 111 253 -312 42 -320 150 207
7485 207 341 -697 -693 -217 436 148 -22 -131 447 -327 259 -141 -327 -274 41 -384 291 -96 -201 -304 94
7506 94 366 -184 44 316 356 383 214 -446 -97 -639 279 435 -44 -170 -121 -49 173 194 -233 -209 -151 -702 -259
7529 -259 -76 170 128 -217 230 -25 -22 220 37 -267 -818 390 -134 414 366 -6 280 -144 -263 14 257
7550 257 -3 -151 -261 364 179 -148 -142 314 -139 619 -475 562 921 -333 169 69 121 -416 27 447
7570 447 56 142 -143 -162 -417 -88 141 278 128 -122 -76 -70 -646 153 -266 209 126 103 -416 139 456 158
7592 158 177 166 1157 -156 -41 -191 108 -342 759 209 -106 -149 -204 26 -312 -188 20 88 430 51 570
7613E70p79M55L3p23P00n09m3J07k39M09N15j28m25O15o90j31Oj80M68J81k08
7634Dj81K74q73L64K96L8o11J056q06L97o38M74L71p6j28J27k06K48m94L37M76
7655D49o71Q4J86j02O63q23J22l32M22pl38Q93r13J44L59l36N48j43L14m00j97
7676g8m04O6L02l37P26m77L18Rk73K95l11M71n55M71j022J86M21K16k62N7K99
7697A18J5J54n34m03j47J623p29K37q9M6j011P22O44p71M63j62jJ91k58k1J82
7718B69q81P07j22P9K53l92J09J57k49R8K1mn8J4j29N93n19K05m44K0O3M27l17
7741a00J84J08k97p5K58O3j38J20K52m12L4N0m6j1jJ19k33P6N9L2p31K22O21K4
7765A78j50K53K01n77M60o85N36n88R81p49J57M42k26l60j28n5rN29j73n2M8l1
$$ plain form
7613 570 -209 246 279 -444 256 -253 -296 -189 -428 -19 496 368 -57 558 -132 -263 -257 -437 31 212 4
7634 4 -177 97 -776 -412 -116 -78 -689 367 -439 -42 -680 -206 165 89 -39 88 -118 130 -364 -27 449
7655 449 -222 -138 48 -54 609 -214 -92 -424 -2 -9 -347 546 -367 -223 136 -200 348 205 519 119 -78
7676 -78 -482 -416 -114 -451 275 -202 116 125 -148 147 -164 307 -248 223 -799 -613 -192 24 -238 -181 118
7697 118 133 287 -247 -650 -797 826 97 334 245 291 -720 2 646 -125 338 176 175 366 108 87 269
7718 269 -612 95 -27 52 305 -87 22 179 -70 28 49 45 -13 1 -128 465 -54 151 -293 -273 -210 217 -100
7741 -100 84 192 -105 -180 78 141 3 123 375 -37 -3 47 1 -10 -11 108 -125 -49 10 42 -689 -467 154 178
7765 178 28 281 482 -95 365 -320 216 -372 609 -140 17 459 233 -127 -255 -310 -319 210 37 -15 33 2
7787BP8L3J78N9n06L36J03N55q14m9m53K41j46N73K45j68m09M10n77K49j77L62
7809A25l31K04J45m5l38J39L26j62l53J80l0k57J35p08J152j53j91K62k36m31
7829e67K93L43l8J27O8l03M64m12j32L59k64p88O08N79l66j51M80m71L27m47K32
7850e9Q3J95k58K79O14p89M13j49m79l30J64J48J39R2L7n80O05q6q43J169L1k26
7872A70k4n27M5K20N10J1k69K23o77N7J50r9N36m44N20J33m69k25l1L39k63j05
7894b19L52M5K18p8n87k0k21N4P03m50P54p17rK38p93Q82l79J62J56k49l62N06
7916a4k53M77J46K3l55r5r4k21L75N3n77L22l10N45J06l67M56L8j61l10Q07m10
7938A81p23K40J32j67M37o13L40p5o4O3L60J13l50k65l9M08Nk05O03k00LM02L36
$$ plain form
7787 2 80 113 291 350 -156 180 283 838 24 -25 -478 -237 -383 190 435 267 -142 268 -309 -60 -237 125
7809 125 -206 -2 143 98 -240 -101 225 63 -290 -110 -140 -397 -262 -970 182 29 -162 100 -136 -567
7829 -567 -274 69 31 158 226 -77 387 -25 -157 202 -62 -850 -242 337 -29 -180 300 -171 156 -291 -59
7850 -59 24 219 -39 240 854 65 478 329 -150 -480 -316 -168 -29 63 100 -480 125 39 -804 365 396 170
7872 170 146 -381 -336 -116 394 405 136 359 -318 -261 -111 -210 326 -118 402 535 66 -159 -190 149 -114 -219
7894 -219 133 178 396 318 -269 -289 -510 -456 247 -203 551 -166 -175 63 -730 152 -227 -65 91 -158 -520 -14
7916 -14 -267 210 356 379 24 -71 -165 -386 -11 42 -535 -213 -523 22 128 -239 217 255 94 -216 591 181
7938 181 -542 -302 -170 -337 100 -513 -173 -248 -312 -249 111 224 -126 -391 -430 -22 -17 -222 381 181 184 586 922
7961I22j135n95R08k4j04L78p02L53k8J82j38m10R7P94l41q70K99P53p72L67o8
7982a34j3L69k78K81m0j09k98kk87O04p90J369j263O64K92n79L4J31k75o0N82
8003A98J30j69m42N54q08R10k39l8k25m50r7R88J74j350J196l20N1m83P32o60
8023c48l6R90K08q02j6K98o25P73q15K45K03k49N74l34l89L08K37o3m63L44J52
8044A92nJ99n86l1P3J47r3J38k94L71jJ50Q62j334J21m7J6K85K94l54J62l69J16
8067A2k41M42Q9k34l08K34K09n85K13l17M01j95l26J01P57p8j40P4L20p1m97k53
8089c93L84j31j7L73m72K54K65r06M29N30k60j23L24j68J6k9r9M4K6m36O89l86
8111h6J63QL68j60m45M61n07j4M22k24O1m3K39p55M52jK60n8p9q2K48k87N0j33
$$ plain form
7961 922 -213 -808 100 76 -28 350 -352 1 -27 155 17 -393 -296 498 157 -713 -414 339 -433 -66 -134
7982 -134 -147 222 -56 225 185 76 -222 -224 -511 93 -697 672 -591 73 365 -214 -180 -49 -324 -384 198
8003 198 328 159 -283 271 -537 373 134 96 -129 -579 -676 312 486 -864 332 12 63 -420 312 -348
8023 -348 -384 606 814 12 -4 294 -331 442 -373 -128 75 -174 400 66 -323 -15 222 159 -304 40 192
8044 192 187 386 -200 -231 -158 -11 -104 34 -260 111 110 260 1122 -212 -91 -138 -122 163 457 103 265 -104 12
8067 12 -229 213 302 68 -240 -6 203 -382 -169 -486 -85 -280 -606 -505 252 174 34 108 428 357 -140 -393
8089 -393 -9 -140 -157 216 -256 -2 263 -643 -214 316 56 -67 257 89 105 76 -23 21 47 -389 300 -86
8111 -86 77 85 453 293 -152 309 -198 -212 210 -14 47 4 243 -512 -60 -61 199 141 62 -20 228 -59 -9 -142
8135a42m6J453j489O7o9L47m84M80n06K71l91R32o45l39O85kj78m90M18K18m0
8156E0L65m26L98J81q70J53J4k63N55j36l29O25l61L09O6k92J2j02Q0K03L10n70
8178b8O5j84O93j513J157m20N2k13P44k58k28O96j00
$$ plain form
8135 -142 -188 1265 -224 -157 -226 121 -363 117 -389 -118 -509 423 -222 -561 124 122 -56 -546 -128 90 50
8156 50 415 -11 387 568 -302 -149 -135 -398 157 21 -308 317 -44 265 331 39 51 -51 29 232 542 -28
8178 -28 37 -147 546 -967 190 -230 -178 -391 353 95 -133 563 463
8191D63
$$ Imaginary data points
##PAGE= N=2
##DATA TABLE= (X++(I..I)), XYDATA
0@%%%%%%%%%%%%%%%%%%%%%%%%JpJ9l3M8o1P3q5R3j08J33j55J73j92K17k42K64
41A38k93L28l65M08m55M94n40O02o70P36q03Q86r78J081j197J322j471J643j845
60i79K076k350K697l135L725m549N785p930J3524j18181J33274R7229J6143K5440
74A62769p611o189r936k7433n9008l0772L557J2634J670p614l0096k3433J0539
87a0923L0530K038j8345j9822j5466o850K1513K0708r182j9263Q975K1661P511
100A3085m052j4364k6441j4726J8251K8140O140r601j1179j0873M222J7736L471
113a91j8664q082J6430K4579K4655J6683j4444l1332r532J2430r71j9057k0972
126b8468j6920M96L1383L6563N011j4218j926J4190J5001O210j6942l5249k3066
$$ plain form
0 0 0 0 0 0 0 0 0 0 0 0 0 0 0 0 0 0 0 0 0 0 0 0 0 0 1 -6 13 -20 28 -33 40 -45 48 -60 73 -82 91 -101 116 -126 138
41 138 -155 173 -192 216 -239 255 -285 317 -353 383 -420 466 -512 569 -628 694 -777 866 -979
60 -979 1097 -1253 1444 -1691 2034 -2515 3270 -4660 8864 -109317 23957 121186 137329 162769
74 162769 155158 148969 139033 111600 52592 21820 25377 38011 39681 32067 1971 -21462 -10923
87 -10923 19607 21645 3300 -16522 -31988 -38838 -17325 3383 -5799 -25062 -16087 5574 13085
100 13085 9033 -5331 -31772 -46498 -28247 -107 6033 -3568 -14747 -25620 -21398 -3662 -191
113 -191 -18855 -26937 -10507 14072 38727 55410 40966 9634 102 12532 11561 -7496 -28468
126 -28468 -45388 -44892 -13509 23054 28065 13847 11921 26111 41112 47322 30380 -4869 -27935
139b7935J0569J9370J311j2209j3011p083J1398K3438O797k1814k0246J886J5066
152a2463J5235R629q771j7309P91K1738J3397q504j7612j5772l661J8598K2103
165A7399j403j8854r043M367Q324Q025l161k0106j2238J7877K7941J4009k818
178C0319r280j1685o85J1165L187j9355k4467r143P589J4877J1571n345j5389
191a6641L82J9780J8647K047j4165k2107j1727J1497J8756j751j8652q588N959
204a6563J2245J2278p21k0024j6513P621K3707J5345M05r357q838L449J7707R499
218C0240j2094j9705q044O105J2683R093r773k2153q363J2132J4696K368q912
231a727j3492n601J4769K1283M813j1834j0765P10R214R873m281k0536k1927k341
$$ plain form
139 -27935 -17366 2004 3315 -8894 -21905 -28988 -17590 5848 12645 -9169 -29415 -27529 -12463
152 -12463 2772 12401 3630 -13679 -12888 8850 22247 13743 -3869 -19641 -23302 -4704 17399
165 17399 15996 -2858 -11901 -7534 790 8815 5654 -14452 -26690 -8813 19128 33137 30319
178 30319 21039 9354 8669 19834 23021 3666 -20801 -29944 -22355 -7478 4093 -1252 -16641
191 -16641 -16259 3521 22168 24215 10050 -12057 -23784 -12287 6469 4718 -13934 -22522 -16563
204 -16563 -4318 7960 7239 -12785 -29298 -21677 2030 17375 17780 8423 -415 3034 20741 30240
218 30240 18146 -1559 -9603 -3498 9185 18278 8505 -13648 -22011 -9879 4817 7185 -1727
231 -1727 -15219 -20820 -6051 15232 20045 8211 -2554 -1844 7370 17243 12962 -7574 -29501 -31842
245c1842J3040J1154J646o325p107N639K1423J6954l577j5246q413M558J2448
258A4352J0906n064j9146j1603P175J4360L399j1062j7244r071Q947J7269N444
271H662r924r932p92J1145J5047N522j2517j6288r58J1818J0446j210j1412j4337
285a4730l526J3210J3172l938j5600r601M991J4141J4103O29j2389q273Q064J5089
299A5342N061p792j5707j2266L771J4169N865q708j1097k107Q954J4230Q247p207
313A0755j5293l109J0752J2485K631r216j3901m899R710J2565j475j4893j3097
326a6985r87R848J2868n58j4081r172O979J4343J0111j054j1310r074L511J4070
340H509Q394o682j3424o292L698J1416P179q064j4660o028Q588J4193N737n327
$$ plain form
245 -31842 -18802 -7648 -6002 -12327 -19434 -13795 7628 24582 21005 5759 -2654 1904 14352
258 14352 25258 20194 1048 -10555 -3380 10980 14379 3317 -13927 -22998 -14051 3218 8662
271 8662 -1262 -11194 -11986 -841 14206 19728 7211 -9077 -10035 1783 12229 11019 -393 -14730
285 -14730 -18256 -5046 8126 4188 -11412 -21013 -16022 -1881 12222 12851 462 -7811 253 15342
299 15342 20403 12611 -3096 -15362 -11591 2578 8443 -265 -11362 -13469 -4515 9715 17962 10755
313 10755 -4538 -7647 3105 15590 18221 9005 -4896 -9795 -85 12480 11005 -3888 -16985
326 -16985 -17972 -8124 4744 4186 -9895 -19067 -12088 2255 12366 11312 2 -9072 -5561 8509
340 8509 16903 10221 -3203 -9495 -5797 5619 12798 4734 -9926 -15954 -7366 6827 12564 7237
354G237j2494l812J1277J3729N33j1847j2037k767Q129J0423J103j2861j2218
367a5605K105J2622Q893j123q844j0302J123J3408R799k278j1527p706K862J2742
381F169R026n558j4160q242N087J1882N675m432j3364o476Q849J4772N658q740
395F146j1112l373Q436J1742L716j0984j2070k389R405Q974J043j0130j1131j344
409a3071J1522J0156j051r443q028J482J1225J0684k051j3157q362L187J1187
422D280O743m529j3009p606O154J2315N434o079j0783n196P152J1993N225p404
436D690j0240j801O913J1047L108q915j1353l754Q974J0717l66r966r275q76R792
451a305J0528l53j0525q431K665J0760P817j888j1590q757L256J1582O474n394
$$ plain form
354 7237 -5257 -9069 2208 15937 16470 4623 -7414 -10181 -2052 8371 9474 -3387 -15605
367 -15605 -13500 -878 8015 6892 -1952 -12254 -11131 2277 12076 9798 -1729 -9435 -6573 6169
381 6169 15195 9637 -4523 -12765 -7678 4204 9879 5447 -7917 -14393 -5544 9228 14886 6146
395 6146 -4966 -8339 97 11839 15555 4571 -7499 -9888 -483 8491 9534 -596 -11727 -13071
409 -13071 -1549 8607 7556 -1887 -9915 -8433 2792 13476 11425 -1732 -10094 -6907 4280
422 4280 11023 6494 -6515 -14121 -7967 4348 9782 3703 -7080 -12276 -5124 6869 12094 4690
436 4690 -5550 -7351 -438 10609 13717 4802 -6551 -10305 -1331 9386 9020 -946 -10221 -11097 -1305
451 -1305 9223 8870 -1655 -10086 -7421 3339 11156 9268 -2322 -11079 -7823 3759 10233 4839
465D839j0590n950L480J0625O829m543j1121l576N748J0928N586n795j1198m758
479i496Q562J1084J625q672j0409k243P844J0132N45r954r169K49R400Q972o45
494G825r067r013J848J1035P150l037q777p796K261J0087O614l813j0986n015
508a0684M451R838N693m166j0360n217O273J0921L895o098j0009l116O342J0532
522H295J778p859j0668j184P718Q727J825q499q790j006Q341R374r05q295q046
537i194O20R876Q417k254j0329o391K476R200O960k996j0654o671N054J0538N579
552A0231n372r349m999N606R920M283o934r232l518O263Q866K977p660r307j519
567i744P518Q448R45o892q445j325Q394Q702O90r487p230J635Q003P780j439r165
$$ plain form
465 4839 -5751 -11701 -8221 2404 9233 4690 -6431 -10007 -4259 6669 12255 6460 -4738 -9496
479 -9496 -934 10150 11775 3103 -7306 -9549 -1705 8427 8972 -982 -10151 -9902 -502 8470 7825
494 7825 -1242 -10255 -8407 2628 9778 6741 -2036 -9832 -7571 2516 9130 5317 -5669 -10684
508 -10684 -6233 3605 9298 5132 -5228 -10445 -4172 6749 10644 4546 -5463 -8579 -2237 8295
522 8295 10073 2214 -8454 -9638 -1920 6807 8632 133 -8657 -9663 -1322 8052 7147 -1148 -9194
537 -9194 -8574 1302 9719 7465 -2864 -9255 -6779 2421 9381 6385 -4269 -10940 -5886 4652 10231
552 10231 4859 -4490 -9489 -3883 6037 10320 3386 -5846 -9364 -3101 5765 8742 1082 -8225 -9744
567 -9744 -2226 6222 7167 275 -8170 -9495 -1101 7601 8291 -1196 -8426 -6791 1212 8992 7553 -1612
583a612p587L074R151N735l385q412n884L298R607M739l448r541m506M591Q867
598D687L567n029r256l641O053Q873K536o241q199l205P455R073Q52o486r070
613h031l92Q270Q316o18q031p238R34Q446O474o63r374o327K846Q190N846l427
629E221q178n894L056Q770N649m017q751m952M756Q466M108n747p695l578M926
644c860R574J934n982r057q26O053Q239J848o463q493l63P870O917k19o916o833
660f577L00P953O650j644p809n716R54P449N927j371q698n396K836P800M712k903
676D467q221m395M154Q579L086m843p991k794M639Q625K691n998p458j689N630
691a518P754J226n923p249j089O445O848O07o120o983m97P428O179l89q240o276
$$ plain form
583 -1612 -9199 -6125 3026 8761 5376 -3036 -8920 -5622 3985 8724 5276 -4265 -8771 -4180 4687
598 4687 8254 3225 -6031 -9672 -3619 5254 7790 1549 -6650 -9855 -2400 6673 7525 1039 -8031
613 -8031 -8423 -153 8163 7545 -486 -7724 -6790 1656 8130 7467 -1907 -8234 -5388 2802 8648 5221
629 5221 -2957 -8851 -5795 2975 8624 4607 -4144 -9096 -4340 4126 8234 2487 -5208 -8786 -3860
644 -3860 5714 7648 1666 -7391 -8217 -2164 6075 7923 1460 -7033 -7396 474 7391 7172 256 -6577
660 -6577 -6277 1676 8326 6682 -1127 -6843 -5889 1560 7487 6116 -2582 -7978 -5142 2658 7370 4467
676 4467 -3754 -8149 -3995 4584 7670 2827 -5164 -7958 -3319 5306 7997 1999 -5459 -7148 -1518
691 -1518 6236 7462 1539 -5710 -6799 -354 6494 7101 981 -6002 -6499 929 7108 6719 -1521 -7797
707g797J819P858N329k698o715n720J786Q678N167l544p434m339M074P777L276
722G517m644o567l848N179P339K202m318p516j972M634P345K030o042o482j295
737f438O160P058k46n855p333L58O929N538q57o683n769Q33P817N047k178p481
753c100m127K343P293L573j757o657m252L280P201L692l466p790k585L842P158
768D648K805m960o869k466N090P217J697n650p437q81O113P336l17o286o016j81
784f157O563N916j092o125n756Q00O632N792j981o866m555K927O795M351k235
799E009p225l715K817P505K910l164p425l154M124O788K170m510o983j491M977
814a367O269J334n030o214n39N441M855R56n398n892K62N697M838j68n844n501
$$ plain form
707 -7797 -5978 1880 7209 4511 -2204 -7924 -6138 2540 7707 4163 -3271 -7610 -3536 4241 7517
722 7517 2873 -3694 -7542 -2363 4976 7178 2860 -4656 -6628 -1994 5351 7381 1339 -5143 -6438
737 -6438 -278 6780 6534 679 -6654 -6296 633 6171 5314 -1369 -7138 -6305 1512 6559 4381 -3100
753 -3100 -7227 -4884 2409 5982 4225 -2432 -6684 -3404 3797 7489 4023 -3767 -6352 -2510 4648
768 4648 7453 2493 -4376 -6842 -1752 5465 7162 1512 -5925 -6806 -693 6643 6326 40 -5976 -6157
784 -6157 406 6322 5230 -895 -6651 -5851 781 6573 4592 -2274 -6829 -3902 2893 7244 5009
799 5009 -2216 -5931 -3114 4391 7301 4137 -3288 -6442 -2318 4470 6640 2130 -4853 -6344 -1367
814 -1367 4902 6236 1206 -5008 -5547 -106 4749 5705 307 -5585 -5323 374 5212 5044 -800 -6301
830f301P45O293N136j314o508m187J703P571L878l132n456l999K870P132K439
845F870l233o581k663K998N816K925m730o091j920M795O064J603m106o288j465
860f006N305O298R81o119n826j78N794N546q32n983n689K052N268M915j447m832
876g53n168K201N964M394j969o126l483K304O192K791k598p337k279L110N486
891B729K750l625n887k568M567N568K086m358n145j501N155N648K50m380o115
906d826o48N189N203n22n095n164O15N969M610j352m619m904K150N393L991j106
922D884o140l924K388N755L181k789o111l370K887N670K028l195n429j934L967
937b132O459J333l858n383j326M891N472O57n740m984m15M697M895l01m888n183
$$ plain form
830 -6301 -5556 737 5873 4559 -1949 -6136 -4433 3138 7016 3884 -1572 -5571 -2701 4431 6870
845 6870 3637 -2944 -5607 -2609 3207 6132 1402 -4689 -6609 -1814 4250 5853 1747 -4541 -6006
860 -6006 -701 5597 6578 459 -5367 -5545 249 5795 4963 -1020 -6709 -4657 611 5526 4079 -753
876 -753 -5921 -3720 2244 6638 4669 -1457 -4940 -2636 3556 6347 3749 -3588 -5867 -2757 2729
891 2729 5479 1854 -4033 -6601 -2034 3534 5620 1262 -3883 -5384 -229 5419 5669 1289 -4826
906 -4826 -5474 -285 4918 4396 -699 -5863 -5248 721 5331 3979 -640 -5544 -3394 1999 5990 4884
922 4884 -1256 -5180 -2792 2963 6144 3355 -2756 -6126 -3239 2431 4459 1264 -4165 -6099 -2132
937 -2132 4327 5660 1802 -3581 -4907 -16 5456 6113 373 -4611 -5026 -329 4566 4265 -623 -5806
953e806N41M783N700j392m857m398J668N955L610j240n367m860K431N021L905
968E694k819o134k844K269O152K004k855n687j657M109M699K803m144m008k329
983d747M740M685P71m775m395j281M401M791p86m563m283j66N175M972p70m979
999a210l728J759N577L191j389n692l291K420M631K972l240n664k798K572N679
1014A789K601l162l971k405L516N428K162l965m572j321K958N318R49m559n298
1029d532l58M239M540j56m412m386M21M516M230k2n393k763O03M945L871j673
1045C670l870m451J340M871K810k176n535l261K946N204K350k361m503k307M162
1060a111N234J599l327n446o70L476M239J15l385n488o88M125M032M12m488l346
$$ plain form
953 -5806 -5265 -482 5218 3826 -1031 -5429 -3761 2194 5804 4564 -803 -5663 -3232 1789 5694
968 5694 2875 -3259 -6103 -3834 2318 4322 1467 -4220 -5877 -1768 2931 5734 1590 -2418 -4747
983 -4747 -7 4678 5449 674 -3721 -5002 -601 4190 3404 -1159 -5442 -5608 -433 4539 3769 -1210
999 -1210 -4938 -3179 2398 5589 4200 -1492 -4783 -2363 2268 5240 2000 -3664 -6462 -3890 1789
1014 1789 4390 1228 -2743 -5148 -1632 3796 5958 1993 -2579 -3900 -942 4376 5325 766 -4532
1029 -4532 -4890 -651 3889 3733 -679 -5065 -4644 -128 4102 4080 -1313 -4076 -3473 1472 5343 3670
1045 3670 -200 -4651 -3311 1560 4370 2194 -3341 -6602 -3656 1548 3898 1537 -2966 -5273 -1111
1060 -1111 4123 5722 2395 -3051 -3721 -245 3994 4109 724 -4764 -5452 -1327 2705 3117 -1371 -4717
1076d717M2M908M216p02l528m404R38N012L526j603m620l519J379M517L022j697
1092B770n272l199K571N023J647k446m761j186K579N166J701k271m002k403L592
1107d91L786J362m549m932K20K873M685K5l762l473N42M283L801rl548m351J110
1124b428M337L493j719n225k876J395M245K827k275m336k457K273M766K347k698
1139A669m136j852K775M061K123l568l676j601L327M035Q81k932m849j014M001
1154g56L407M67l845l669N04M401M499k79m386l026P26M566K617k027m468k843
1170d112J349M010K146j809l906l031J755N075K346k220m196j601K731M000K335
1185D872k568m112j894K422M573K43k745l831j242L563L786N89l830l565P80L875
$$ plain form
1076 -4717 -4675 233 4449 3747 219 -4185 -3247 1765 5291 3688 -932 -4451 -3072 1445 4467 2770
1092 2770 -2502 -5701 -3130 1893 3540 1094 -3667 -4853 -2274 2892 4593 2322 -1680 -4083 -491
1107 -491 3295 4657 108 -4824 -4604 -1731 2954 2979 -783 -4256 -3714 569 4370 4361 813 -3538 -2428
1124 -2428 1909 5402 3683 -1542 -4418 -3023 1222 4049 1774 -2562 -5019 -2746 2020 4367 1669
1139 1669 -2467 -4319 -1544 2517 4640 1072 -2604 -4205 -878 3157 4038 1106 -3743 -4757 -756
1154 -756 2651 3118 -727 -4396 -3892 509 5008 4729 343 -2683 -1957 2609 5226 3199 -1269 -4112
1170 -4112 -2763 1247 3393 1584 -2322 -5353 -3598 1477 3823 1603 -2593 -4194 -1463 2537 4872
1185 4872 2304 -1808 -3702 -1280 3293 3536 791 -3040 -4282 -719 3067 3656 -174 -3739 -2959 916
1201I16L233m5l864l005P96L390K626o14m003l450R55M149J654o44m888j739J856
1218b677L591L144k405l739r29K401L854J676k864m343j089K669L597J112l089
1233I09m437o61L612L447J82k668l011qL601K824k84l510l388R04L530K298q56
1250B484l861l222J330L624K658j314l334k955K341L811K254k009m300j031K244
1265a280M804J204k407l823j069J981L605P91l046m473n8K593M326J55k941k787
1281b425n09L528L009l03l507k794O90K078L471q02l640k460J94L771K354r86
1297A669k934k389J594L522L044j511m330j843K061L315K412l225l155n39J938
1312c71K923R01k849l050q22K441L557L6k451l224L19K873L053j27l726j787O5
$$ plain form
1201 916 4149 4104 240 -2765 -1969 1421 4047 3433 -570 -4020 -3065 1084 2738 2094 -2794 -4533 -2677
1218 -2677 914 4058 1653 -2086 -3015 -614 3240 4916 2052 -2291 -3380 -711 2886 3998 909
1233 909 -3528 -4189 -577 2870 3052 384 -2627 -2635 966 3790 3506 -4 -3392 -2488 1042 3340 2484
1250 2484 -1377 -4599 -3269 355 3013 1699 -1635 -4590 -2249 1562 3816 1807 -2493 -3524 -1280
1265 -1280 3524 4728 2321 -1502 -2571 -590 3015 3806 760 -3713 -3771 -1178 3148 3303 362 -2425
1281 -2425 -2934 594 3603 3300 -207 -3001 -2311 -233 3238 2436 -1204 -3664 -3470 301 2655 1669
1297 1669 -1265 -3654 -2060 1462 4506 2995 -1335 -3178 -1117 2198 4610 1385 -1770 -2309 -371
1312 -371 2552 3453 604 -2446 -3268 -827 2730 2766 315 -2909 -2590 283 3336 3209 -517 -2304 -2239
1329b239K607K918p45m015k110K67L593K313o61l816j364O81M309K220j324l309
1345f75k316K066L818R81k020m373n38J812L509Q89l019k525j115L233L102M86
1361C315l325k402r52L705K490m1k715l233P38K362K463K36l722k317M4M487J582
1378B715j257k785k409J565L588K545j430l589j521J318L658J154k632l264n34
1393b878J763K594P91k017k510p75J845L504J91k294k883k97K737L274k16k650
1409A79k658m28L216K179m05l004k066O41L287J639n9l283k557K066L237J663
1425C647j268l544j169J008L010J804j885l690j338K016K798P22j535l581q41
1440c846K634L771k36k064l190K15K747K450L39k080l475L04K790K178k92l483
$$ plain form
1329 -2239 368 3286 2541 -1474 -3584 -3317 276 2589 1928 -1888 -3252 -2571 1738 3958 2634 -675
1345 -675 -2991 -925 2893 3874 1854 -2519 -3057 -1245 2264 3153 134 -2391 -3506 -273 2829 3315
1361 3315 -10 -2412 -3364 341 2831 2790 75 -3158 -2420 -58 2405 2641 -1081 -3398 -3354 1133 2715
1378 2715 1458 -1327 -3736 -2171 1417 3962 2532 -1057 -2578 -1260 2398 3552 920 -2344 -2878
1393 -2878 -1115 1479 2270 253 -2257 -3032 -1187 2317 2508 214 -2669 -2966 -229 3045 2829 179
1409 179 -2479 -2907 309 2488 2083 -921 -2987 -2346 941 2580 2521 -762 -3319 -1253 1984 3647
1425 3647 2379 -1165 -2334 -1326 1684 3488 1603 -2087 -3425 -1409 1389 2111 576 -3005 -3846
1440 -3846 -1212 2559 2323 259 -2931 -2716 31 2481 2820 740 -2735 -2431 359 2537 2245 -1238
1456a238j530O11K577K294n85l072j846J083L128J610j191l015j053M70L224J093
1472B560j957k294j089J547K689J175k447k361p20K136K912J013k691k422j358
1487c307L178K721l27k600j980k26K597K259n87j750k766Q19K726J833k59l415
1503a084j578J405K250K010j236k535l117K716L144R38j975l274p52J692K631
1518A235J470k853k139L07J207K982N72k480k419K75J778K756o28k250j864L04
1534a747K200J971l21k714k093l6L345J588j08k805k747J515L160J458m79l187
1550a000j998J755J917K299j999k301j673K001K568Q22j260k740q90J667K491
1565A659Q89j739k726r4J178K994l17j798j951m68K418K353j77k940k107O82K628
$$ plain form
1456 -1238 -2768 -2157 420 2714 2129 -943 -2789 -1706 1422 3032 1841 -1174 -2227 -1757 1467 2560
1472 2560 603 -1691 -2780 -1233 1456 2631 184 -2177 -2897 -761 2151 3164 473 -1949 -3307
1487 -3307 -129 2592 2265 -335 -2315 -2541 56 2315 1728 -22 -2788 -1969 757 2590 2331 -1084
1503 -1084 -2662 -1257 993 3003 1767 -768 -3885 -1169 1975 2913 938 -2336 -3088 -1396 1235
1518 1235 2705 -148 -2287 -1980 -773 2209 2781 301 -2118 -1843 -65 2691 2063 -187 -2051 -1747
1534 -1747 453 2424 2103 -611 -2704 -2740 605 2193 2085 -720 -3467 -1952 1208 2666 2187 -1000
1550 -1000 -2998 -1243 674 2973 974 -1327 -3000 -999 1569 2391 1131 -1609 -2499 -832 1659
1565 1659 2548 809 -1917 -2011 -833 2161 1844 46 -1905 -2373 45 2398 2221 -719 -2826 -2144 484
1582D84J696n04k319j947L06K665K171j141k077j702J317K560J291j702k808k49
1598a959N26K773J340j944k224o03R12L824o31j850k233O1J735K168j06j399j951
1615a561k52K060J622k78j909j866R19J595K150q43k541j513J393J957M79J34
1631A546k465o35P26J931J626j784k876m40J187K620J195j848k228q86J493K787
1647A949M47j699j874p92R29K815R6j190k507m28K027K193P1k065k305O33J712
1664A2K223l5k193k159N03L092J679j952j910j138N38K661J027j291k458r15J742
1681e74J692J091r68k936l17J509K182L25j724j736l80J361K590j07j653j689
1697a334m51J849J429O14k363j471N36R84K647q32k573j572J332K262J358j315
$$ plain form
1582 484 2180 1676 -643 -2590 -2284 381 2552 1411 -666 -2368 -1051 1509 2800 1098 -1710 -1959
1598 -1959 -1433 1340 2680 736 -1488 -2091 -1179 2645 2014 164 -2069 -2008 -273 1895 1789 390 -1561
1615 -1561 -1813 247 1869 1591 -318 -2184 -1265 330 2480 1637 -904 -2417 -1024 933 1412 1546
1631 1546 -919 -1554 -828 1103 2729 945 -1931 -2371 -1184 1436 2631 783 -1445 -2331 -838 1949
1647 1949 2396 697 -1177 -1969 -1040 1775 1871 681 -1826 -2254 -227 1966 2037 -28 -2333 -1700 12
1664 12 2235 2200 7 -2152 -1649 1443 3122 1170 -740 -1878 -1340 1321 2348 1057 -1401 -2316 -574
1681 -574 1118 2209 1241 -1695 -2012 -503 1679 2004 280 -1456 -1836 -475 2115 2008 355 -1334
1697 -1334 -1785 64 1493 2107 -256 -1727 -1191 -207 2440 1608 -965 -2537 -1205 1057 2415 1100
1713A100j841j596J427J828K018j480k624q97J013K240Q07j299k986O83J081J985
1729A459P37j907k344K88J182K159L4j617j687j15J419K237K68k441j155l8J822
1746C01J365k47k094j645J593J116J381n03j965j195M22K220J654j248l119o1
1762b025R04K323N31q27j728r86J452J938N57k162j197q10J468K287P17j850j998
1779a406k3J269J617L57j483j900l26K084J759n06k026j585R50J914J134N2k406
1796e25j619N96K067J239r54k179o63R39J835J459j460j624j002J784J961m91
1812A363q12j700k98J534J546l8j577j185o02J560K304m76j529k197N7K185J614
1829A749n43j506j399M49J373J542o11j929j236R48J822J426j182j330j251Q47
$$ plain form
1713 1100 -741 -2337 -910 918 2936 1456 -1168 -2065 -1052 1188 1995 696 -2290 -1607 -526 1459
1729 1459 2196 289 -2055 -1767 -585 1574 1608 -9 -1696 -1811 -392 1845 2113 -328 -1483 -1521 301
1746 301 1666 1419 -675 -2320 -727 389 1770 1267 -698 -1893 -1471 749 2403 1155 -1964 -2025
1762 -2025 -1121 1202 1733 906 -822 -1808 -356 1582 2139 -23 -1220 -2030 -562 1725 2442 592 -1406
1779 -1406 -1429 -160 1457 1814 331 -1569 -1895 189 1948 1442 -584 -2169 -1219 695 1829 1881 -525
1796 -525 -2144 -1548 519 1758 804 -1375 -2038 -1099 736 2195 735 -889 -1891 -107 1854 1363
1812 1363 551 -1149 -1447 87 1633 1595 18 -1167 -1769 -209 2095 1619 90 -2107 -2050 135 1749
1829 1749 1206 -300 -1699 -1250 123 1665 1054 -875 -2111 -1163 659 2085 903 -427 -1678 -831
1845h31K152J53m16k230o48J617J629K05j276j522o36J622K320m77j955j247k29
1862a769J901J373J15j945j342M86J703N14Q37k623j205P07J677J218k03j913
1878d69j226P28J491J274m29k299r35P96J608J491j107j793p38R46K071O52j820
1895B41j500o20J866J427J31j324j466k44J298K176l34j835r33k09J461J097R21
1912B153j789k658Q29J836J240l54j666q64M42J627R54q06j951p11P11K238J13
1929A344j134j411p97R21K140N12q40j824n86J483J200N84j302j771l63J248K063
1946A467K82j870j543K11J308J551m02j212q74l34K132J053p11j816p89K92J343
1963H8J359k09k260K1k33J812J254j003j591j158J098K244l32r70o74j012O21
$$ plain form
1845 -831 1321 1474 1058 -1172 -1820 -203 1426 1631 355 -1167 -1803 -181 2139 1662 -293 -1540 -1769
1862 -1769 132 1505 1620 -325 -1667 -1181 522 1036 1873 -750 -1955 -1248 429 1647 1444 -469
1878 -469 -1695 -967 524 1798 1369 -930 -1865 -1069 539 2030 923 -870 -1608 -662 1409 2061 241
1895 241 -1259 -1879 -13 1414 1545 221 -1245 -1489 -191 1985 1651 -184 -1117 -1326 135 1232 2153
1912 2153 364 -2294 -1465 371 1611 1257 -409 -1273 -831 796 1750 944 -1007 -1718 -1007 1231 1344
1929 1344 210 -1201 -1998 -1077 1063 1575 735 -1089 -1675 -192 1008 1592 290 -1481 -1844 -596 1467
1946 1467 1749 -121 -1664 -1453 -145 1406 1004 -208 -1082 -1416 716 1769 1058 -758 -1547 -1255 88
1963 88 1447 1238 -1022 -1001 -1234 578 1832 829 -762 -1920 -822 1422 1090 120 -554 -1566 -945
1980i45K097K23j072j831K2J404J296P93j623j318r62K059J070j13n87k353L91
1997a449J303J734k19j636j265K91J445J725o94k019q45O35J436J308j837r19
2013a006m93O17J603R23j732j210p69J370K028j81r43j998R19O57J087P55j645
2030a8q35k57J289J156M5j637r84N72J450M27M6j930q87J72J664R61r6j753j381
2049a996J332J383P51q28k007o2R01J574O65r67j227j004J546Q93L89j360j213
2066a230j97J185J194J86n91j353j84L25J907O19j902j349K41J411N93J29j216
2083b32j436P90J069J371o81j458j392O63K113N02j186j087k82M99J304R75j682
2100a50k78n97M76J220K12p39j005o64J101J610K66j213j167m66J408J635n53
$$ plain form
1980 -945 1152 1375 303 -1528 -1506 -102 1194 1987 364 -954 -1916 143 1213 1100 513 -1840 -1449
1997 -1449 -146 1588 1369 -267 -1532 -1241 204 1929 1235 -784 -1629 -994 442 1750 -87 -1006
2013 -1006 -1499 -882 721 1644 -88 -1298 -2067 -697 1331 1150 207 -1791 -872 -215 872 1627 -18
2030 -18 -853 -1110 179 1335 1380 -257 -1241 -669 781 1208 1254 -676 -1563 -1391 273 1234 1138 -615 -1996
2049 -1996 -664 719 1470 642 -1365 -1427 -526 1048 1713 746 -481 -1485 61 954 1343 -17 -1230
2066 -1230 -1427 -242 952 1138 547 -806 -990 -665 1242 1861 -41 -1390 -1149 262 855 984 -232
2083 -232 -1668 -878 191 1562 881 -577 -1969 -1306 807 1309 123 -964 -1246 -747 557 1532 -150
2100 -150 -428 -1025 -549 671 883 144 -861 -1525 -424 1186 1452 239 -928 -1394 14 1649 1096
2117A096j224q88o09K370Q23m07q46j669j6J997R46n57j763q1JJ135J031o94j751
2136a106j64J90J732N92q91j607J71P34J578j38o46r07o65Q33J648K48j161j546
2154a105J51O16J618N5j216j428N51P49J113O25j370j939Q43J410O85p54j173
2171e69p86M54J393R73l11j951l01Q58J085N0l75j240n30K74J408M6k88j149m7
2190a006N81J207N20j321j090L16J111N25K25q11j691N43J049N43k05o05j396
2207a505O05J463J82kj069j260J119K95J228p27p17n91j58J712O90o97j794K75
2225i51L19J148O06j281r38k02J182Q15R6o99j330o9J180J444k9j622l82P4M33
2244b06J236K58j106j371k10J307J201j41j168j188qK643J11r69j307m8J79J001
$$ plain form
2117 1096 -128 -1016 -1625 745 1568 1161 315 -1354 -1370 627 1573 1016 -747 -828 -827 308 1339 645 -1106
2136 -1106 -1270 -1080 652 1244 353 -1254 -1083 -349 1229 1091 445 -462 -1127 -294 1354 1602 441 -1105
2154 -1105 -954 -338 1280 1335 119 -1309 -758 -9 1104 1729 359 -1580 -737 673 1358 604 -569
2171 -569 -1355 -901 492 1465 1154 -797 -1098 -240 845 895 520 -720 -1250 -976 432 478 190 -959 -1006
2190 -1006 -425 782 1302 -19 -1109 -793 318 843 1068 257 -1434 -891 158 701 496 -109 -1505
2207 -1505 -900 563 745 743 -326 -1586 -467 -172 1056 329 -388 -979 -1137 575 1265 568 -1226 -951
2225 -951 -632 516 1122 -159 -1097 -1299 -117 698 794 95 -1235 -1304 -124 1320 1291 -331 -713 -639 -206
2244 -206 1030 1288 182 -1189 -1399 -92 1109 968 -200 -1388 -1396 1247 1358 389 -918 -966 -787 214
2262B14P58k24j592m74J237R42J79m37j537o6N34J258P96j629r43LJ257M01L42
2281A019j389j047Q79N91O56k71o39j035K10J556Q39m60r36n62m68J636Q00n19
$$ plain form
2262 214 972 748 -844 -1318 -81 861 1040 603 -934 -1000 -466 792 1588 -41 -984 -981 276 677 1019
2281 1019 -370 -1417 -538 53 709 438 -201 -1236 -1026 530 1369 909 -27 -589 -1057 579 1379 860
$$ [...]
8191d79
##END NTUPLES=NMR FID
##END=
