##TITLE=1H_SAM_6.172'
 CDcl3/DMSO-d6, 64 sc, 
 19.12.2019
##JCAMPDX= 6.0         $$ Bruker NMR JCAMP-DX V2.0
##DATA TYPE= NMR FID
##DATA CLASS= NTUPLES
##ORIGIN= UXNMR, Bruker Analytische Messtechnik GmbH
##OWNER= root
$$ XWIN-NMR		Version 3.5
$$ Thu Dec 19 14:17:28 2019 Russian Standard Time (UT+4h)  she@DPX200
##.OBSERVE FREQUENCY= 200.13003
##.OBSERVE NUCLEUS= ^1H
##.DELAY= (6, 6)
##.ACQUISITION MODE= SIMULTANEOUS
##.ACQUISITION SCHEME= undefined
##.AVERAGES= 64
##.DIGITISER RES= 18
##SPECTROMETER/DATA SYSTEM= spect
##.PULSE SEQUENCE= zg30
##.SOLVENT NAME= CDCl3
##.SHIFT REFERENCE= (INTERNAL, CDCl3, 0, 15.7039)
##AUDIT TRAIL= $$ (NUMBER, WHEN, WHO, WHERE, WHAT)
$$ ##TITLE= Audit trail, XWIN-NMR		Version 3.5
$$ ##JCAMPDX= 5.01
$$ ##ORIGIN= Bruker BioSpin GmbH
$$ ##OWNER= she
$$ F:/spectra/data/she/nmr/H-F/1/audita.txt
$$ ##AUDIT TRAIL=  $$ (NUMBER, WHEN, WHO, WHERE, WHAT)
(   1,<2019-12-19 14:15:04.96 +0400>,<she>,<DPX200>,
      <continue with go, POWCHK disabled, PULCHK disabled
       configuration hash MD5:
       00 E9 B6 7A A2 85 ED C7 34 08 36 98 17 FE 4E 26
       data hash MD5: 16K
       ED 0C 62 A3 3F D5 13 66 A2 16 34 16 92 1E CA 3B>)
$$ ##END=
$$ 
$$ hash MD5
$$ 5C E9 0E 55 93 4F 07 39 3B 1D 4B 83 35 68 C7 79
##$RELAX= 
##$RELAX= 
##$RELAX= 
##$RELAX= 
##$RELAX= 
##$RELAX= 
$$ Bruker specific parameters
$$ --------------------------
##$DU= <F:/spectra>
##$EXPNO= 1
##$NAME= <H-F>
##$PROCNO= 1
##$TYPE= <nmr>
##$USER= <she>
##$AMP= (0..31)
100 100 100 100 100 100 100 100 100 100 100 100 100 100 100 100 100 100 
100 100 100 100 100 100 100 100 100 100 100 100 100 100 
##$AQSEQ= 0
##$AQ_mod= 1
##$AUNM= <au_zg>
##$AUTOPOS= <>
##$BF1= 200.13
##$BF2= 200.13
##$BF3= 200.13
##$BF4= 200.13
##$BF5= 200.13
##$BF6= 200.13
##$BF7= 200.13
##$BF8= 200.13
##$BYTORDA= 1
##$CFDGTYP= 0
##$CFRGTYP= 5
##$CHEMSTR= <none>
##$CNST= (0..31)
1 1 145 1 1 1 1 1 1 1 1 1 1 1 1 1 1 1 1 1 1 1 1 1 1 1 1 1 1 1 1 1 
##$CPDPRG= <>
##$CPDPRG1= <>
##$CPDPRG2= <>
##$CPDPRG3= <>
##$CPDPRG4= <mlev>
##$CPDPRG5= <mlev>
##$CPDPRG6= <mlev>
##$CPDPRG7= <mlev>
##$CPDPRG8= <mlev>
##$CPDPRGB= <>
##$CPDPRGT= <>
##$D= (0..31)
0 1.2 0 0 0 0 0 0 0 0.06 0 0.03 0 0 0 0 0.0002 0 0 0 0 0 0 0 0 0 0 0 0 
0 0 0 
##$DATE= 1576750309
##$DBL= (0..7)
120 120 120 120 120 120 120 120 
##$DBP= (0..7)
150 150 150 150 150 150 150 150 
##$DBP07= 0
##$DBPNAM0= <>
##$DBPNAM1= <>
##$DBPNAM2= <>
##$DBPNAM3= <>
##$DBPNAM4= <>
##$DBPNAM5= <>
##$DBPNAM6= <>
##$DBPNAM7= <>
##$DBPOAL= (0..7)
0.5 0.5 0.5 0.5 0.5 0.5 0.5 0.5 
##$DBPOFFS= (0..7)
0 0 0 0 0 0 0 0 
##$DE= 6
##$DECBNUC= <off>
##$DECIM= 16
##$DECNUC= <off>
##$DECSTAT= 4
##$DIGMOD= 1
##$DIGTYP= 9
##$DL= (0..7)
0 120 120 120 120 120 120 120 
##$DP= (0..7)
150 150 150 150 150 150 150 150 
##$DP07= 0
##$DPNAME0= <>
##$DPNAME1= <>
##$DPNAME2= <>
##$DPNAME3= <>
##$DPNAME4= <>
##$DPNAME5= <>
##$DPNAME6= <>
##$DPNAME7= <>
##$DPOAL= (0..7)
0.5 0.5 0.5 0.5 0.5 0.5 0.5 0.5 
##$DPOFFS= (0..7)
0 0 0 0 0 0 0 0 
##$DQDMODE= 0
##$DR= 18
##$DS= 0
$$ [...]
##$SUBNAM2= <"">
##$SUBNAM3= <"">
##$SUBNAM4= <"">
##$SUBNAM5= <"">
##$SUBNAM6= <"">
##$SUBNAM7= <"">
##$SUBNAM8= <"">
##$SUBNAM9= <"">
##$SW= 41.9190550511907
##$SWIBOX= (0..15)
0 0 2 0 0 0 0 0 0 0 0 0 0 0 0 0 
##$SW_h= 8389.26174496644
##$TD= 16384
##$TD0= 1
##$TE= 0
##$TE2= 300
##$TE3= 300
##$TEG= 300
##$TL= (0..7)
0 120 120 120 120 120 120 120 
##$TP= (0..7)
150 150 150 150 150 150 150 150 
##$TP07= 0
##$TPNAME0= <>
##$TPNAME1= <>
##$TPNAME2= <>
##$TPNAME3= <>
##$TPNAME4= <>
##$TPNAME5= <>
##$TPNAME6= <>
##$TPNAME7= <>
##$TPOAL= (0..7)
0.5 0.5 0.5 0.5 0.5 0.5 0.5 0.5 
##$TPOFFS= (0..7)
0 0 0 0 0 0 0 0 
##$TUNHIN= 0
##$TUNHOUT= 0
##$TUNXOUT= 0
##$USERA1= <user>
##$USERA2= <user>
##$USERA3= <user>
##$USERA4= <user>
##$USERA5= <user>
##$V9= 5
##$VALIST= <valist>
##$VCLIST= <CCCCCCCCCCCCCCC>
##$VD= 0
##$VDLIST= <DDDDDDDDDDDDDDD>
##$VPLIST= <PPPPPPPPPPPPPPP>
##$VTLIST= <TTTTTTTTTTTTTTT>
##$WBST= 1024
##$WBSW= 4
##$XGAIN= (0..3)
0 0 0 0 
##$XL= 0
##$YL= 0
##$YMAX_a= 502513
##$YMIN_a= -593041
##$ZGOPTNS= <>
##$ZL1= 120
##$ZL2= 120
##$ZL3= 120
##$ZL4= 120
##$ABSF1= 10
##$ABSF2= 0
##$ABSG= 5
##$ABSL= 3
##$ALPHA= 0
##$AQORDER= 0
##$ASSFAC= 0
##$ASSFACI= 0
##$ASSFACX= 0
##$ASSWID= 0
##$AUNMP= <proc_1d>
##$AZFE= 0.1
##$AZFW= 0.1
##$BCFW= 1
##$BC_mod= 2
##$BYTORDP= 1
##$COROFFS= 0
##$CY= 11.3945322036743
##$DATMOD= 1
##$DC= 2
##$DFILT= <>
##$DTYPP= 0
##$F1P= 16.9975609425685
##$F2P= -3.02152046262296
##$FCOR= 0.5
##$FTSIZE= 0
##$FT_mod= 4
##$GAMMA= 1
##$GB= 0.15
##$INTBC= 1
##$INTSCL= 1
##$ISEN= 128
##$LB= 0.24
##$LEV0= 0
##$LPBIN= 0
##$MAXI= 10000
##$MC2= 0
##$MEAN= 0
##$ME_mod= 0
##$MI= 1.114404
##$NCOEF= 0
##$NC_proc= 0
##$NLEV= 6
##$NOISF1= 3.799351
##$NOISF2= 2.8
##$NSP= 1
##$NTH_PI= 0
##$NZP= 0
##$OFFSET= 15.70392
##$PC= 1
##$PHC0= -10240.14
##$PHC1= 18.00082
##$PH_mod= 1
##$PKNL= yes
##$PPARMOD= 0
##$PSCAL= 0
##$PSIGN= 0
##$REVERSE= no
##$SF= 200.130013532006
##$SI= 16384
##$SIGF1= 3
##$SIGF2= 2
##$SINO= 400
##$SIOLD= 16384
##$SREGLST= <1H.CDCl3>
##$SSB= 0
##$STSI= 0
##$STSR= 0
##$SW_p= 3612.71676300578
##$SYMM= 0
##$S_DEV= 0
##$TDeff= 0
##$TDoff= 0
##$TI= <>
##$TILT= no
##$TM1= 0
##$TM2= 0
##$TOPLEV= 0
##$USERP1= <user>
##$USERP2= <user>
##$USERP3= <user>
##$USERP4= <user>
##$USERP5= <user>
##$WDW= 1
##$XDIM= 8192
##$YMAX_p= 0
##$YMIN_p= 0
$$ End of Bruker specific parameters
$$ ---------------------------------
##NTUPLES= NMR FID
##VAR_NAME=  TIME,          FID/REAL,        FID/IMAG
##SYMBOL=    X,             R,               I
##VAR_TYPE=  INDEPENDENT,   DEPENDENT,       DEPENDENT
##VAR_FORM=  AFFN,          ASDF,            ASDF
##VAR_DIM=   8192,          8192,            8192
##UNITS=     SECONDS,       ARBITRARY UNITS, ARBITRARY UNITS
##FACTOR=    0.0001192,     1,               1
##FIRST=     0,             0,               0
##LAST=      0.9763672,     0,               0
##MIN=       0,             -593041,         0
##MAX=       0.9763672,     502513,          0
$$ Real data points
##PAGE= N=1
##DATA TABLE= (X++(R..R)), XYDATA
0 0 0 0 0 0 0 0 0 0 0 0 0 0 0 0 0 0 0 0 0 0 0 1 -2 1 -3 1 -2 1 -4 4 -2 2 -1 -2 3 -5 10 -7 12 -10 11 -15 12 -19 19 -21 24 -26 26 -32
50 -32 30 -40 40 -42 47 -51 54 -54 49 -44 34 -5 -31 113 -262 599 -1475 4548 -27602 -561826 -593041
71 -593041 -489963 -408356 -396744 -374385 -306303 -184797 -63520 9169 54166 13335 -38940
82 -38940 -62247 -13783 50386 20369 -46390 -81617 -3348 107493 138288 110212 50314 46911
94 46911 67133 89127 92269 45513 -7177 -48552 -13248 65987 97948 67811 -1532 2726 61721
107 61721 106505 86722 6865 -38949 -44472 -7275 31404 30466 9479 -26909 -14187 42078 89734
120 89734 80542 -5424 -65832 -70664 -26158 -6502 -51347 -97990 -114786 -65476 -4068 30888
132 30888 30417 -9712 -26561 -12562 33171 54981 11696 -43549 -72624 -21868 42359 59943
144 59943 29603 -13871 994 42344 79608 75178 27669 -11688 -30748 -1763 31416 29907
156 29907 -11336 -64435 -56846 -12065 29067 12515 -47002 -75557 -60734 -13034 11170 -3782
168 -3782 -28138 -45632 -14389 32951 70391 62237 12991 -12812 -4444 40090 48272 3160 -44951
181 -44951 -62853 -23660 13120 23307 4340 -24289 -21043 4495 48928 60898 30816 -4738
193 -4738 -16861 28322 65915 63180 23427 -13286 -383 27473 50146 32543 -9957 -39616
205 -39616 -49218 -20545 -699 -10576 -50091 -84417 -61987 -18100 12981 -4432 -43074 -50167 -27712
218 -27712 11106 21900 3239 -25869 -41324 -17099 18234 40907 21657 -16347 -23010 3327
230 3327 45063 46177 11049 -22641 -25881 9126 35759 38180 13298 -13143 -8984 16546 49877
243 49877 47058 12861 -19411 -19693 17052 38989 28042 -8347 -31286 -15399 15841 35087 18882
256 18882 -12972 -32052 -25566 7398 19467 2536 -33881 -52932 -30309 2821 18536 -4860
268 -4860 -36036 -40670 -17160 15871 19828 -1330 -29758 -35860 -6922 22726 30755 8406 -20009
281 -20009 -15766 15355 49471 42652 12417 -15603 -13861 14451 28699 20254 -11312 -34994 -26129
294 -26129 1364 25414 15185 -15871 -34340 -22498 14553 30452 14770 -18715 -31710 -9992
306 -9992 18600 31707 10191 -16432 -25914 -9068 21701 28244 6936 -24205 -31431 -5798 24240
319 24240 29955 1978 -23697 -22510 5584 30816 24908 -820 -25075 -23803 3395 24357 21682
332 21682 -8413 -28440 -19025 11823 34693 20876 -7866 -27610 -15092 12609 21528 5725
344 5725 -24444 -38138 -22918 4792 20878 4792 -20761 -29754 -8060 24069 31940 9848 -19292
357 -19292 -22335 1030 24390 26408 1338 -21184 -22519 -325 25529 25172 976 -24765 -19952
370 -19952 8376 30150 26308 -3715 -20987 -11241 13261 30328 18680 -7513 -27371 -16348
382 -16348 9938 22964 9735 -17960 -31523 -14313 15337 28756 8952 -16580 -24285 -6122
394 -6122 20082 22621 2384 -24622 -29293 -9964 13404 17363 -4946 -26784 -26836 -1656 23328
407 23328 22077 -1267 -22682 -14806 9032 26904 21412 -4516 -21420 -14937 10994 26573 17225
420 17225 -7281 -24536 -11863 14002 25767 13281 -13694 -22731 -7445 17426 24233 8246
432 8246 -15003 -23711 -7118 15411 20461 2724 -21300 -24775 -4660 19821 20133 -720 -20631
445 -20631 -20419 3533 22378 18186 -2326 -22914 -18599 2097 19445 14809 -8813 -25748 -17538
458 -17538 6729 24123 14388 -8622 -23129 -10974 13276 23438 12483 -11063 -21037 -8251
470 -8251 13124 21768 7332 -15621 -23942 -7294 15949 22010 4214 -18322 -20545 -2130 17801
483 17801 19459 1671 -18600 -19300 680 18625 17883 -2130 -20981 -17314 2466 20311 16546
496 16546 -5564 -19278 -13579 9502 22121 13866 -6920 -20955 -10513 9790 21158 10941
508 10941 -10756 -21787 -10194 11926 20882 7001 -13369 -20345 -5444 14322 21082 5176 -15032
521 -15032 -18184 -3525 15570 17943 1382 -18727 -18225 -640 16479 15908 -1989 -19424 -16051
534 -16051 3958 18388 15028 -4048 -18415 -13296 5718 19517 13294 -7619 -19451 -11122 8468
547 8468 21319 11364 -8982 -19158 -8630 12278 20141 7603 -11077 -18647 -5400 13343 19781
560 19781 4325 -13879 -17708 -4093 14923 16370 1561 -16080 -17368 -328 15388 16469 -296
573 -296 -15771 -14623 1825 16071 13987 -3241 -17205 -13953 4556 16730 10697 -6262 -17658
586 -17658 -10135 7453 18125 10445 -7493 -17069 -8979 8975 16932 7508 -9515 -18017 -5786
599 -5786 11662 17314 4189 -11727 -16652 -3455 12670 15350 2296 -13291 -14620 -1277 14813
612 14813 14914 517 -15162 -15572 1757 15656 13305 -4247 -16455 -13134 3685 16844 11288
625 11288 -4906 -16590 -10650 6283 17524 10698 -6408 -17344 -9614 8130 16264 6633 -9211
638 -9211 -17760 -7024 10360 15629 5231 -9712 -15578 -3555 12457 14394 2967 -12461 -14346
651 -14346 -675 12729 14166 -308 -13936 -13268 1352 13731 12194 -1581 -13750 -11528 3124
664 3124 14981 12537 -3241 -15394 -9344 5234 16423 9251 -6331 -16059 -9149 6876 14973
677 14973 7523 -8487 -14868 -7623 8978 16035 5374 -9457 -14829 -5281 11856 13937 2346
690 2346 -11567 -14472 -2055 11160 12676 195 -12950 -12690 1088 13805 13603 -19 -13278
703 -13278 -11139 1391 13928 10365 -3971 -15374 -10181 3908 14517 8836 -5680 -14145 -7862
716 -7862 7304 14695 7185 -7178 -14311 -6187 7918 14780 5435 -9256 -14336 -4081 9283 13463
730 13463 1912 -10192 -13016 -2233 11303 13304 647 -11091 -12188 -516 11444 11776 -998
743 -998 -13033 -10368 1804 11887 9722 -3239 -14020 -9281 3996 13206 8913 -5257 -13550 -7171
757 -7171 6272 14088 8246 -8124 -13383 -6033 7136 12445 5408 -6858 -12473 -4807 8761 12233
771 12233 2981 -9629 -11855 -2462 9172 12440 588 -11299 -12317 -762 11006 11191 -516
784 -516 -11446 -9984 871 12526 9225 -2753 -12612 -9721 4719 13138 7821 -4201 -12393 -7354
798 -7354 5511 12403 6223 -5939 -11646 -5476 7291 12087 5536 -7255 -11743 -3891 7063 11109
812 11109 3588 -8372 -11446 -2310 9641 11054 1785 -9394 -9738 -272 9825 9577 703 -9332
826 -9332 -9756 1781 10443 10436 -893 -10601 -9277 2994 10506 6821 -4181 -11520 -7490 3329 9795
841 9795 6024 -5213 -11031 -5239 4739 12063 5511 -6040 -11357 -5166 7461 10970 3507 -8436
855 -8436 -11195 -2922 7974 9920 1457 -8506 -9957 -826 9119 8934 294 -9553 -9744 -396 10261
870 10261 8387 -1853 -8277 -7083 2431 10091 7949 -1723 -10667 -7287 4060 11974 7277 -4349
884 -4349 -10239 -5245 4528 10501 4542 -5405 -11032 -3739 6523 9727 2256 -7629 -10419 -2827 7399
899 7399 9620 2118 -8159 -8830 -35 8607 8786 338 -8261 -8440 -607 9593 7266 -1821 -9009
914 -9009 -7562 1150 9204 7250 -3778 -8900 -7318 3161 10782 5680 -3592 -8920 -4973 4730 10034
929 10034 4959 -5780 -8976 -4936 5549 9266 3037 -6220 -10150 -2849 6666 8418 2179 -7556
943 -7556 -8824 -2064 8098 8734 376 -8109 -8825 -363 7705 8233 -1396 -9020 -8158 840 9013 6940
959 6940 -1377 -8199 -6001 3224 9130 6504 -2401 -8726 -5650 3144 8237 4746 -4824 -8572 -5366
974 -5366 4897 9210 3444 -5788 -9763 -3402 5597 8545 1619 -6562 -8960 -2820 6507 7691 434
989 434 -8371 -8666 -553 7028 8932 -467 -7936 -8266 1506 8062 6753 -2508 -8345 -6547 1988 9037
1005 9037 6930 -2009 -9438 -5201 3396 9677 4895 -3592 -8003 -4162 5277 8522 4017 -4219 -8153
1020 -8153 -1994 5416 8102 2641 -6179 -8414 -2750 5988 6967 453 -7103 -8852 -669 6331 7517
1035 7517 -495 -7581 -5929 6 7452 6183 -1162 -8684 -7384 2755 7881 6143 -2152 -8765 -5345
1050 -5345 2374 8447 4458 -3079 -7748 -4491 4939 7890 3986 -5019 -8083 -3103 4620 9393 4081
1065 4081 -5276 -7198 -1551 6348 7295 2055 -5850 -7191 -1024 6224 7070 -240 -7146 -6495 -1014 7007
1081 7007 6578 -950 -7359 -5621 1120 7383 5825 -2457 -8410 -4796 2644 7667 4728 -4906 -8395
1096 -8395 -3997 3335 7895 3741 -3939 -6085 -4164 3900 7391 1730 -4341 -7097 -2223 4683 8276
1111 8276 1910 -4888 -7119 -2601 6613 6580 1330 -6545 -6562 -110 6226 6677 -1416 -6773 -6316 533
1127 533 6979 5718 -1572 -6798 -4666 1599 5944 4398 -2444 -7424 -4579 3153 7222 3998 -2887
1142 -2887 -7745 -2590 4343 6848 2780 -4119 -7140 -3018 6535 6388 3231 -4203 -7739 -1001 5730
1157 5730 6785 1839 -5734 -6764 -581 5888 5960 1278 -5739 -6528 272 6110 5744 -576 -7802 -5500
1173 -5500 1994 6853 5052 -2573 -7051 -4947 1508 5970 4578 -2877 -8340 -3936 2407 5993 3198
1188 3198 -5558 -9079 -3095 3392 6845 2208 -5188 -7148 -954 5215 6567 686 -4192 -5947 -585
1203 -585 5876 7224 682 -5864 -4908 618 5582 6377 -444 -5930 -4862 2313 6558 4563 -2153 -6025
1219 -6025 -4834 2081 5904 4278 -2603 -6792 -2749 3256 6405 3973 -3492 -5787 -3147 3777 6297
1234 6297 2077 -4599 -6648 -2334 4333 5461 714 -5052 -6312 -1167 6492 6465 -35 -5524 -6013 -634
1250 -634 5539 5494 -671 -4793 -4268 1165 6930 5461 -1150 -6127 -4619 1418 6902 3785 -2620 -5561
1266 -5561 -3711 2812 5687 2536 -3957 -6280 -3545 2609 6805 2081 -3648 -6024 -1967 4208 6254
1281 6254 473 -3890 -5048 -1068 4892 5052 912 -5906 -4528 -209 5771 4036 -25 -5854 -4121
1296 -4121 1982 5112 5065 -974 -5298 -4368 1581 5446 3761 -1616 -5502 -2869 2564 6346 1795 -1732
1312 -1732 -6298 -3651 2564 6444 2875 -4228 -5235 -1724 3699 4912 451 -4391 -6074 -1956 3586
1327 3586 4081 -469 -5138 -5474 -174 5318 5696 111 -4989 -4919 1077 5428 6037 -17 -5822 -4652
1343 -4652 2547 5440 2575 -898 -4141 -3380 1593 5446 3468 -2622 -4638 -2644 2188 6755 2043
1358 2043 -3387 -5945 -2037 3817 4265 1624 -3894 -5296 -1738 4192 4553 1019 -5053 -4903 -730 4081
1374 4081 3603 -1183 -4741 -5569 -269 4053 5853 -2328 -5294 -4426 306 4999 3680 -1236 -6090 -2728
1390 -2728 487 5570 2356 -1336 -4971 -3468 2488 6600 948 -2555 -5390 -2491 3125 4426 2425
1405 2425 -3281 -5506 -1480 3577 4431 1184 -3761 -5499 -991 4185 3810 1023 -4154 -5116 8 5141
1421 5141 4694 -763 -4884 -3877 407 5380 3891 -1020 -5330 -3749 2198 5009 3745 -1376 -5891
1436 -5891 -2100 2201 4773 2530 -2336 -3803 -2073 2882 5696 1900 -2860 -4349 -1284 2835 5277
1451 5277 974 -4276 -4604 -1 3628 5138 1492 -4366 -3973 -280 3524 4741 -661 -4623 -3202
1466 -3202 443 4972 3889 -1069 -4925 -3070 1446 5345 2590 -1041 -4787 -4064 2247 4936 3923
1481 3923 -1936 -4970 -2444 1761 4960 3080 -2171 -4767 -1790 2858 5040 1275 -2887 -3890 -996
1496 -996 2717 4425 1273 -3547 -3592 23 4390 3715 -50 -5544 -5220 -884 3787 3871 -626 -4644 -4756
1513 -4756 268 3935 3919 -542 -4101 -2851 663 4704 3260 -1252 -4690 -2239 2559 3861 1835
1528 1835 -2209 -4780 -1613 2733 5171 1538 -2282 -4769 -337 3177 4700 1557 -2603 -4025 -860
1543 -860 4190 4038 -488 -4139 -3363 -73 4368 3209 -849 -4000 -4211 366 4336 3944 -1759 -4164
1559 -4164 -2859 906 4751 2299 -1216 -5134 -2764 1872 4216 2846 -1830 -5214 -2236 2503 4078
1574 4078 1658 -2401 -4737 -1379 2204 4659 1687 -2761 -4829 -1077 2744 4213 112 -2789 -3244
1589 -3244 -302 4107 3222 -385 -3252 -2732 4 3079 2828 -657 -4181 -3175 889 2971 2210 -1406
1605 -1406 -4442 -1744 1222 4899 1427 -1234 -4327 -2885 2001 3392 1169 -1600 -3739 -2405 2518
1620 2518 3742 757 -2804 -4606 -1794 2319 3715 1209 -2447 -3209 -1974 2926 4187 44 -3773
1635 -3773 -3803 51 4050 3244 -870 -3839 -2729 740 4152 2414 -2572 -4404 -2193 641 1940 2420
1651 2420 -1293 -3981 -2076 1362 3839 1476 -2077 -4055 -1402 2224 3498 1863 -2620 -3246 -1783
1666 -1783 2759 3641 1328 -2177 -3518 681 2972 4234 561 -3426 -3948 648 2754 2955 -723 -3120
1682 -3120 -3266 376 3674 2337 -1257 -3233 -1432 711 3880 2278 -973 -3443 -747 2084 3501
1697 3501 1943 -2142 -3772 -2113 1190 4490 1210 -2573 -3364 -1735 2889 4484 272 -3191 -3041
1712 -3041 -2217 3265 3871 141 -2394 -3060 -76 3612 2960 -596 -2085 -3704 1504 2423 3388 356
1728 356 -3627 -1789 835 3025 1428 -1208 -2638 -2821 657 4225 2277 -1974 -2741 -1049 1902 2519
1744 2519 1165 -1716 -3627 -1788 2008 3619 1001 -2804 -4044 -584 3088 3430 1048 -3156 -2689
1759 -2689 -265 3683 2935 601 -3227 -3651 -54 3121 2231 -486 -3169 -3157 242 2678 2193 161
1775 161 -4236 -2394 811 2867 2468 -1782 -3161 -2093 1623 2784 2532 -1059 -3500 -2039 1919 2901
1791 2901 509 -2587 -4158 -494 2220 2948 -133 -1957 -4026 -535 2256 2874 -434 -3281 -2376 -807
1807 -807 2954 3354 -74 -3258 -1932 -18 2571 3352 -685 -3623 -2719 2188 3480 1721 -1428 -3519
1823 -3519 -3509 1441 3168 1834 -1390 -2885 -450 1128 3283 1473 -1107 -3259 -670 3203 3548 894
1839 894 -2151 -2833 -338 1402 3088 1351 -2155 -2764 -603 2989 1761 -345 -3000 -3602 532 3784
1855 3784 2629 -1472 -3738 -1587 1174 2329 1854 -2057 -3060 -1889 898 3073 1593 -801 -2575
1870 -2575 -1605 2111 2305 1029 -1610 -3407 -1477 1750 2518 1643 -1945 -2964 -249 2393 2355 -692
1886 -692 -2067 -3198 -1707 2677 2635 53 -2310 -1469 -913 3259 3309 38 -2873 -3226 455 2636 2069
1903 2069 -955 -3631 -2109 492 3249 1535 -2188 -3352 -794 1649 3734 2375 -2258 -3517 -1175
1918 -1175 2108 2831 1039 -2463 -2571 -431 1272 3272 -236 -1900 -3405 245 1737 3021 1131
1933 1131 -1145 -3302 -577 3573 1266 -135 -2490 -2590 351 2622 3026 515 -3749 -2372 569
1948 569 2290 1830 -1461 -3711 -2009 1353 3392 748 -2187 -3400 -1944 782 2713 1057 -1431
1963 -1431 -3123 -547 1869 1710 853 -1772 -1726 -1401 3011 2842 409 -2668 -2154 147 3390 2422 -354
1980 -354 -2977 -1637 1017 3306 1278 100 -2805 -2042 -760 1931 1265 -1614 -1084 -1747 1395 2402
1996 2402 2171 -1587 -2443 -1732 2022 2645 635 -1664 -3681 -751 2240 2677 1056 -1979 -2944 -626
2012 -626 2432 1924 344 -1080 -921 324 3020 2651 -321 -1673 -3182 109 3204 2438 -467 -2131
2028 -2131 -1760 647 2489 2057 -464 -2100 -843 1339 4558 819 -1063 -2997 -2265 1358 2261 1435
2044 1435 -1945 -1993 -98 873 2400 1698 -1487 -1994 -1358 1921 2385 524 -1166 -3328 -734 2588 2792
2061 2792 660 -2174 -1402 -546 2411 1460 -25 -3616 -3064 -226 2930 986 -1016 -2608 -2975 -105
2077 -105 3016 1265 -2066 -2242 -2161 1995 1663 687 -1479 -1772 -1171 1386 2373 547 -1593 -3460 -1588
2094 -1588 1901 2648 -23 -1370 -2132 -43 1576 1705 484 -392 -2678 101 1856 2378 453 -2710
2110 -2710 -1222 386 1976 2607 -272 -2791 -2084 145 2527 930 72 -2451 -1340 608 2708 806
2126 806 -923 -2480 -1509 1430 2981 968 -1691 -2962 -2055 962 2766 1272 -455 -1703 -1122 1756
2142 1756 1792 778 -2379 -842 -709 734 1663 -1069 -1961 -1530 481 2410 1574 264 -2157 -1791 -77
2159 -77 3095 1346 -1207 -1454 -2216 308 1361 1319 -1884 -1949 -1890 1750 2009 1586 -1256 -3293 -777 1689
2177 1689 2048 346 -1489 -2967 -863 1568 2625 1021 -1793 -1561 46 1438 1871 -351 -1875 -2440
2193 -2440 548 1852 2399 -1007 -1494 -1563 550 2668 1005 -220 -2704 -110 1037 2083 1600 -1762
2209 -1762 -2692 -1904 1369 1498 1736 -1757 -2689 -1150 2239 1909 1332 -1066 -2537 -1028 1864 2664 -539
2226 -539 -1149 -1651 -303 2058 1781 1100 -1280 -1775 610 762 577 -493 -1480 -2450 212 1945 1043 -278
2244 -278 -2229 -3033 -130 2462 1429 -726 -2316 -1281 684 2682 1064 -806 -1672 -1691 1048 2181
2260 2181 1929 -1455 -1925 -613 1487 2477 258 -1373 -1296 797 1420 1623 431 -1529 -2211 -146 3023
2277 3023 1561 86 -713 -1797 -169 1451 2069 -166 -1606 -2505 53 2112 1200 -1256 -1578 -1593 765
2294 765 1301 38 -866 -2914 -1762 431 1650 874 -1545 -3071 -1782 1798 2515 1383 -1379 -1342 -1240
2311 -1240 918 2596 1062 -675 -2253 -1139 1786 1605 -779 -1294 -2624 -68 2308 2144 -596 -2216
2327 -2216 -1091 -151 2379 934 -184 -1554 -1703 1293 2499 2003 -547 -2677 -1372 751 1599 1787
2343 1787 -968 -2177 -465 1068 2279 849 -1097 -1256 -771 1354 2867 1538 -1076 -2118 -190
2358 -190 2529 1785 518 -1686 -1234 -628 2176 574 -280 -2763 -2239 374 2718 2208 -492 -1914 -2002
2375 -2002 543 1381 1230 -426 -1545 -1497 905 1514 1636 -535 -2405 -1267 1114 3151 897 -1430
2391 -1430 -1997 -908 2025 1693 1254 -641 -1602 -240 1667 609 46 -2075 -1045 72 1803 2920
2407 2920 306 -2308 -1891 -481 1838 1961 -290 -1257 -1159 492 1965 1379 -160 -1234 -1089 570 2767
2424 2767 2179 -428 -1777 -748 1322 2278 962 -943 -3820 -1108 303 961 470 -1221 -2628 -515
2440 -515 1924 1991 -500 -1609 -1974 327 2235 1688 1107 -2145 -734 74 1523 2393 -755 -1318 -1391 316
2458 316 1917 1267 -509 -2227 -303 1351 1846 1796 -294 -1416 -1247 2116 1474 185 -1532 -2271 -822
2475 -822 147 1215 256 -791 -1555 -376 1496 1691 365 -1328 -1513 -1262 1161 2321 234 -1393 -2402
2492 -2402 -63 2627 1212 461 -921 -2416 -1169 2197 1429 -354 -926 -849 1158 993 1333 -1197 -1827
2509 -1827 -771 628 1109 1707 -1774 -2263 434 1515 2800 82 -233 -2762 -1952 1313 1593 -164
2525 -164 -1124 -1267 -249 1130 1149 -493 -1071 -937 1063 1460 1476 1449 -1656 -1701 609 1694 830 43 -1933
2544 -1933 -1043 519 1127 1529 477 -1763 -586 -342 1560 1908 -1150 -1762 -1184 1763 2015 218 -392
2561 -392 -1821 244 2469 2714 50 -1494 -2349 -743 477 1583 -165 -1189 -2050 -50 1437 830
2577 830 -57 -1763 -1758 -184 2819 1742 -1051 -683 -2128 77 2250 2028 350 -2284 -1353 615 1071
2594 1071 914 53 -2103 -958 -15 1277 774 -246 -2083 -304 571 2126 518 -1842 -1476 362
2610 362 732 2149 -650 -557 -2165 -213 1688 1883 1239 -2190 -1082 -662 1607 1806 -42 -1681 -1933
2627 -1933 -663 1331 1024 -21 -1940 -525 62 2285 677 105 -2675 -1127 992 1022 1476 -645
2643 -645 -1820 67 552 1455 1326 -356 -1041 -477 1624 1923 552 -586 -1319 -1959 2181 709 178
2660 178 -2197 -1163 -397 1145 1264 79 -1001 -1666 -426 1872 1707 72 -1241 -1700 634 1517 965
2677 965 -1487 -2090 -1081 352 1879 164 -1102 -2154 -675 17 1764 716 -31 -890 -647 1516
2693 1516 2372 510 -1569 -1126 -1207 1744 1370 -98 -1830 -2048 421 1943 596 438 -788 -1588 -790
2710 -790 1455 1236 -1023 -1196 -775 94 540 871 383 -1085 -384 470 1263 1535 -1243 -1800 -353 974
2728 974 1701 637 -1749 -1215 -152 732 1669 509 477 -1493 -1066 837 1911 626 -1872 -1665 -200
2745 -200 1712 456 23 -1328 -2210 -39 2001 1783 159 -1114 -590 435 1231 1683 -220 -1405 -610
2762 -610 -209 1056 870 -501 -2193 -41 818 1734 433 -783 -1819 -1439 1226 2430 989 -872
2778 -872 -1331 160 -58 1052 -686 -1365 -2425 -1171 1437 1287 140 -503 -915 -452 953 107 -266
2795 -266 -1621 -1005 336 975 1352 757 -1648 -1504 1384 1288 971 -121 -1830 -1441 455 1296 875 -225
2813 -225 -1013 -416 1857 -218 765 -596 -1295 -488 749 2010 1024 -337 -555 -1007 1393 1102 615 -1000
2831 -1000 -2760 480 2070 1802 426 -1989 -539 -694 2022 710 88 -1826 -2451 366 1328 -91
2847 -91 121 -1836 -1990 371 1366 1146 -1092 -1620 84 908 169 1677 -770 -958 -958 2579 2011 1124 -1396
2866 -1396 -1657 -614 723 934 85 -778 -648 -952 1982 707 -1498 -663 -2383 -262 1516 1403 -740
2883 -740 -2125 -1869 -912 472 626 -469 -1397 -1784 1174 913 923 199 -1027 -790 810 1636 815 -1154
2901 -1154 -868 -1514 28 2078 285 -718 -1575 -1849 1074 1288 782 -1076 -1192 -89 783 2047 260
2918 260 -1740 -2701 -1303 1088 1475 113 -1220 -476 -600 1401 1553 -795 -1358 -1396 1076 1486 944 -215
2936 -215 -1976 -1156 559 1765 1064 647 -841 -356 1265 1881 1673 -493 -1800 -458 894 2154 964
2953 964 -2135 -1219 -931 906 805 37 -627 -1400 295 2009 789 206 -547 -1442 -1592 1371 1267 74
2971 74 -1149 -1605 56 1673 937 457 -639 -1391 55 1052 1569 -236 -1149 -1594 415 1200 251 195
2989 195 -425 -1108 -413 608 1344 -1340 -1685 -1156 984 1717 698 -1264 -778 -399 1018 741 -33 -1785
3007 -1785 -930 -629 -373 704 -280 -355 100 836 1513 784 -197 -1006 -1059 -59 1552 277 -600 -1575 -870
3026 -870 -235 1342 185 -1128 -1858 251 648 1448 484 41 -612 -622 1178 522 -369 -433 -236 525 1401
3045 1401 1418 -181 -111 -1770 -341 1191 1753 -264 -651 -304 -372 1369 1563 519 -2010 -277 347 1607
3063 1607 868 -489 -1430 148 416 312 1126 -4 -1919 290 519 1974 326 -2119 -1560 -1154 522
3080 522 1146 656 -373 -706 -841 1375 607 -74 -1075 -869 -1389 1059 1813 -86 -878 -1586 -474 1366
3098 1366 1859 -693 -2004 -2168 -914 1526 1409 427 -1896 -788 228 749 1328 -52 -2181 -840
3114 -840 40 121 758 -822 -1381 480 1019 1833 1081 206 -948 -547 300 186 1239 30 133 -188 367
3133 367 555 113 -181 -661 422 622 1308 1312 -287 -1200 64 1757 -623 709 -287 -1081 3 57 177
3152 177 -250 -1112 -828 39 26 379 -1324 -1785 -1151 -292 1048 408 -361 -1515 -3 235 959 1497 -409
3171 -409 -628 -107 317 895 -53 -1822 -531 86 908 1099 -636 -822 -2128 615 1954 2134 -75 -2698
3189 -2698 -1041 112 1037 1872 621 -1867 -1375 256 698 275 -1158 -694 -1097 1324 1041 327 -680
3206 -680 -1252 -1138 1054 1440 548 -1097 -619 201 1136 956 693 -174 -539 -357 -488 -203 594 -1137 -1733
3225 -1733 -925 1177 908 14 -1175 -192 -608 306 777 268 -287 -731 176 37 948 -149 -632 -1454 126
3244 126 197 -99 -109 -536 -966 408 619 -333 -348 -1374 261 1453 882 53 773 -580 -927 45 746
3263 746 -73 -1254 -590 -565 -437 444 118 -1710 26 76 1397 -186 -390 -254 -693 -609 1511 1027 -616
3282 -616 -921 -1077 850 609 515 -97 -935 -1129 678 351 1099 -842 -2039 -409 -528 1038 -205 -989
3300 -989 -1056 314 -571 849 872 -299 -1165 -442 273 773 423 -93 -994 -597 631 878 658 -1065 -217
3319 -217 309 794 684 -1060 -323 -171 -361 1220 847 -452 -636 -915 -428 1089 1110 1 -1021 -1385
3337 -1385 608 334 815 -973 -1524 -1131 949 922 -304 24 -1220 -1039 781 1196 -698 -1302 -801 1286
3355 1286 1899 361 -337 -976 -709 308 -510 243 -290 -1056 -734 -607 45 412 -477 -1221 -1225 911 811
3374 811 103 -343 -1628 -396 1057 73 323 -459 -1600 -938 75 1797 534 -635 -1969 -700 684
3391 684 2043 -161 -141 -1339 -503 718 29 315 -356 -1303 173 1105 1045 -124 -898 -1272 109 81 609
3410 609 1288 -1474 -1086 507 342 52 -217 -467 266 -94 581 -84 -286 -401 -850 -331 1381 1058 -440
3429 -440 -389 -901 930 268 1162 -873 -694 -1043 588 -196 283 280 -598 696 1367 1682 1686 272 -489 -240
3449 -240 1676 257 -735 -777 -953 -798 1396 1500 491 -885 -62 1434 1604 20 205 -665 -473 1344
3467 1344 1050 1143 72 -119 -499 507 1580 129 -968 -662 -325 -386 166 -110 -1310 -555 -361 1178
3485 1178 418 -182 -387 -925 -780 1887 567 -291 -977 -1376 343 1091 58 230 -354 -1218 393 822
3503 822 1472 -1000 -193 -489 727 33 -917 434 -1304 178 405 1217 705 -460 -1401 1081 700 620
3521 620 -302 -882 -828 -296 328 314 -12 -488 284 -132 576 56 1115 -382 -535 -190 -27 878 212 -886
3541 -886 -58 1305 2132 700 -120 -783 -561 397 711 361 492 -742 -492 269 542 1409 127 -158 -139
3560 -139 310 982 -746 -1170 -848 -68 1610 462 215 -504 -15 -842 760 -245 339 -504 -413 313 361
3579 361 451 -776 -1912 148 -331 -369 957 -423 -626 -920 144 1216 -489 99 -1163 55 1116
3596 1116 1123 661 -1207 -1018 -52 624 235 711 -332 95 648 278 702 621 -582 -1013 -627 630 1369
3615 1369 503 -30 14 -293 -455 1580 1174 -778 -1012 -128 985 566 -321 -92 -1473 504 1635 581
3633 581 -1408 -539 -1061 1537 401 587 -58 -772 1490 870 1083 452 -1316 -1856 -25 1075 986 251
3651 251 -738 -877 -1004 551 1310 1066 159 -388 -9 1003 452 677 197 -521 -35 450 883 24 -1256
3670 -1256 -629 -701 889 1765 -247 -180 -649 229 143 -433 309 -469 -1199 1034 1304 1117 -581 -174 -292
3689 -292 583 1276 1153 523 -1362 -16 1086 1020 990 -82 -1104 191 1182 1382 -668 -489 -438 -233 1485
3708 1485 388 -314 -1562 212 -169 -508 1063 -192 -41 -1606 331 -1 664 -658 275 -535 -120
3725 -120 1545 -1326 -490 -410 525 945 1254 599 45 -1113 -51 1481 324 236 -318 -903 -614 1396
3743 1396 872 575 -613 -46 -1133 1233 699 -129 1081 -108 -223 -587 890 309 -1017 -460 -479 1278
3761 1278 864 411 -754 -351 -79 566 767 -168 -918 357 -262 1768 -110 -211 -214 3 519 1489 -701
3780 -701 735 -986 144 541 294 550 -255 276 181 -86 589 143 -772 448 137 669 116 -481 -1989
3799 -1989 -73 142 594 1904 -391 -14 130 -991 -93 531 -176 -426 -550 468 63 256 -563 -24
3817 -24 399 716 1035 12 68 -978 -752 893 1241 51 467 -287 -1446 -132 430 -129 -108 -1862 713
3836 713 995 -298 -51 -559 -1118 -1929 1061 610 323 -393 -662 361 288 504 -186 -412 -269 1547 980
3855 980 -651 -669 -196 -891 -851 986 666 -629 -932 -1103 -317 450 -374 103 -1291 -173 923 1404 180
3874 180 -844 -446 81 310 194 168 -543 -535 82 228 267 287 -1222 -559 15 866 682 -1091 -499 -813 -524
3895 -524 930 -494 21 -1827 -320 -4 266 674 286 -1125 -698 265 705 488 -591 -967 891 227
3913 227 -377 -415 -649 -943 -149 -24 584 741 -1233 -149 -279 -196 748 203 -795 -381 494 979 372 324
3933 324 -590 -227 -64 744 105 -424 -505 -178 944 268 902 89 131 -474 656 22 -179 -1028 -796 -331
3953 -331 565 -68 578 -859 -837 -441 703 1233 597 -715 -1013 126 798 -64 394 394 -176 358 -203 -450
3973 -450 -646 -1412 -526 332 515 1043 -254 -440 -1260 161 178 544 -765 134 50 1055 280 -790 -57
3992 -57 -654 -868 277 327 -342 -1131 -584 327 1245 -57 558 688 5 141 857 1114 -608 -404 -626 634
4012 634 619 129 -340 -1537 -674 -176 806 1094 -752 295 -298 792 807 191 -664 -598 -896 1030 525
4031 525 840 -286 -581 -116 538 288 -182 810 -315 313 -251 1057 50 -174 -234 -742 -435 85 -19
4050 -19 291 -1078 -37 -556 664 475 -352 -137 -496 687 58 810 -237 -334 253 223 -520 -267 -825
4069 -825 272 -1318 1337 -71 -321 -820 -504 960 73 95 -299 -946 -107 455 85 -412 -1084 -137 -720
4088 -720 -120 -206 254 -221 -667 12 298 648 -47 263 -540 -80 180 -633 -572 -1470 -624 -967 374 1112
4108 1112 -459 -855 300 632 1112 195 -412 -538 -760 -882 1233 723 -85 -1696 -1260 2193 70 -528
4126 -528 236 -937 -859 1309 380 1150 -573 -1732 444 588 628 1002 -356 -317 -179 1367 371 -885
4144 -885 -498 -58 1569 234 283 178 -203 -404 570 626 -87 -2 -984 478 -62 620 -327 -883 -1545 660
4164 660 -415 108 154 -83 -81 -271 1236 725 -827 -54 724 -89 49 523 -67 -690 -1225 198 282 -445
4184 -445 198 -1347 -668 71 -768 -128 52 -532 83 -423 127 648 -607 -701 -802 -264 206 844 -823
4203 -823 160 -19 -151 649 495 -72 -622 -1274 543 1326 1092 -995 -314 -214 -70 486 571 -1039 442
4222 442 242 97 641 -1028 205 99 1405 691 248 506 30 117 278 845 -605 206 -283 -477 420
4241 420 230 223 190 -758 -115 -633 913 -293 -585 -1000 -214 1492 400 174 -1079 -702 -264 317 938
4260 938 -193 -1420 -351 252 660 633 -1070 -834 214 549 572 497 -919 -811 -39 352 1191 524 331
4279 331 175 -313 422 -76 -272 389 -1321 -578 -516 1236 1002 -598 -1366 126 410 588 -342 -130 -1191
4298 -1191 116 648 -739 -433 -342 -918 -363 -59 436 437 -231 -906 -258 1069 1304 -385 -874 -105 -175 628
4318 628 793 -361 -652 406 39 790 212 -175 -270 -58 -501 551 1017 -7 -908 -279 -100 -109 181 641
4338 641 -1007 669 602 654 1001 -1242 -505 -73 356 269 550 -808 555 64 985 493 -33 -1403 -917
4357 -917 -823 731 434 603 -56 -22 -383 -659 723 758 -521 55 174 982 807 -115 34 -449 -970 29
4377 29 -454 -234 -538 395 377 271 -382 -1051 -268 -585 846 660 709 67 -1062 -740 -28 -381 -960 -184
4397 -184 613 429 621 876 1306 -255 281 162 624 -348 -717 -39 -804 437 -198 526 186 -528 -313
4416 -313 106 135 -61 336 -971 139 1230 1179 1151 -660 -751 766 -220 988 -1025 -389 801 -388
4434 -388 86 296 -429 89 -579 81 104 646 -381 -1009 220 -455 551 -111 -488 -855 -289 81 540
4453 540 214 20 -1117 -639 16 -25 -676 -706 -1240 182 -77 102 -1398 1282 -240 -810 -358 83 -49
4472 -49 -105 -18 -1053 -399 1308 -782 -886 -1272 -502 -167 266 886 -252 -529 -672 814 657 -998 -249
4491 -249 -1419 90 791 -237 346 -1391 280 1588 -65 -38 -91 -464 -176 489 -741 565 183 -1122
4509 -1122 -395 685 908 696 -1079 -499 -1011 1144 201 -132 -360 -808 -409 266 61 512 186 -912
4527 -912 -323 859 917 29 -1314 -165 39 981 194 -438 -572 157 308 673 -719 -561 -866 -1234 742
4546 742 323 -251 646 -292 253 997 690 34 -294 291 224 -173 1556 376 -424 -426 -132 599 383 39
4566 39 314 -480 632 75 950 303 140 293 424 807 -579 311 -138 -994 1106 931 -498 771 -350
4585 -350 -778 -319 873 -196 -1135 -495 -437 303 354 84 -364 367 -1986 245 328 -518 704 72 139 714
4605 714 909 -203 91 -497 251 588 974 -7 -949 -957 -137 347 470 122 -324 987 941 3 554 46
4625 46 -117 -954 -28 329 1629 -984 -99 -609 149 -667 958 274 -287 798 -433 1061 -36 -21
4643 -21 -298 -606 494 -605 -1035 -1004 -423 138 663 1128 -877 -593 303 569 -291 -676 -721 -666 -1806 907
4663 907 460 126 561 700 1167 411 247 -291 27 -950 -595 228 -347 -179 -649 391 190 1076 688 1632
4683 1632 3 -672 114 321 909 -8 -468 601 463 397 475 1520 -1043 -222 331 -1250 932 -973
4701 -973 195 175 715 394 -64 -726 -687 -861 793 127 -566 -1241 -665 -122 -6 851 132 -741 -409 385
4721 385 1277 626 -197 475 -314 704 -337 983 599 630 1793 -694 251 1093 -136 -272 -573 -460
4739 -460 496 -178 17 -424 -86 -288 254 206 31 -146 418 812 356 570 183 -521 72 791 1451 -1241
4759 -1241 -1143 -901 409 885 -296 514 -420 -108 -710 872 -500 -547 -1121 694 -154 68 1054 782 -125
4778 -125 -357 1011 587 399 -307 -669 -19 -403 1351 -161 -546 -974 -1333 386 1003 1343 -302 -17
4796 -17 -698 -58 103 194 -21 -751 -360 954 -752 616 -430 -750 49 -450 647 657 118 -234 48
4815 48 813 -196 565 -364 -95 788 734 -89 -84 -590 -731 -916 55 -547 -492 421 1055 262 55 921 310
4836 310 -81 -126 1039 164 369 -332 -724 -916 108 955 -4 -75 -366 62 445 273 1336 328 -910
4855 -910 -1190 756 -31 -376 681 362 651 600 -410 -554 -736 -156 391 -126 589 -450 -140 -359 466
4874 466 142 -313 -120 -1081 -157 -213 1101 346 -1012 -827 -488 -58 1586 -271 3 -399 -559 1308 1001
4893 1001 -301 -310 -452 5 843 481 104 297 -1120 -125 -483 -990 -231 89 -226 830 150 -248 -180 -1511
4913 -1511 -838 -873 977 -101 -489 -1350 388 793 1082 49 -975 -695 -1212 721 799 454 -134 -873
4931 -873 745 1143 902 -339 23 -310 11 -19 584 625 134 -802 -43 808 -390 -552 -486 -439 -945 -599
4951 -599 867 -727 -955 760 -106 1531 -388 -119 -185 -379 -551 262 -208 -801 -326 181 277 -230 -375
4970 -375 -1436 -644 -13 599 243 -429 632 381 -30 -470 1747 292 -1088 -841 37 -201 563 -260
4988 -260 -366 -660 -198 431 -215 -1086 159 -535 177 606 1044 -111 -184 604 165 -371 -78 360 -1076
5007 -1076 211 1025 294 513 394 -873 122 216 370 -293 92 -603 -243 241 -298 201 -931 -62 126
5026 126 415 -66 -365 -1391 -898 -581 473 702 378 -332 -206 273 305 848 -1399 195 -1345 237
5044 237 1 971 592 -353 -494 -585 -107 940 1241 72 -17 285 -571 365 416 832 482 117 286 388
5064 388 -560 -454 527 1427 281 -492 494 -6 -639 -533 224 -220 -400 -1350 46 253 140 -1104 -135
5083 -135 -944 825 408 -413 422 -1338 -908 -305 -202 128 556 -914 263 850 856 -286 -1203 -42 910
5102 910 724 -36 979 -1695 1068 1007 159 -12 1182 734 -153 184 467 551 -889 489 439 -1269 651
5121 651 223 -817 -525 246 376 31 65 -247 -451 -431 -15 207 -584 -404 -746 -431 -899 994 -127 100
5141 100 -460 -262 517 1215 -161 -681 -99 10 214 407 260 -458 -381 1006 391 -538 846 -944 247
5160 247 -512 635 -1645 -788 370 -155 447 -43 860 91 259 292 53 -418 -7 -336 -1061 7 127
5179 127 204 937 -792 -212 163 645 320 598 1021 7 430 616 299 -239 -463 -740 -540 392 396 682
5199 682 127 -625 281 1143 1364 -1283 618 21 269 858 497 337 65 -681 -99 705 -222 423 -248
5218 -248 -747 586 -248 425 -730 -320 169 967 365 1263 -40 273 264 1121 260 22 -1203 76 964
5237 964 -228 379 -330 443 -533 -171 169 401 130 98 -456 590 -577 24 180 -838 -75 -820 525
5256 525 485 -417 -1797 -227 346 557 235 165 -410 -375 -1278 170 505 -115 -1155 41 1033 325 -406
5275 -406 586 -1064 -652 373 -414 305 697 -243 -35 -558 -137 177 3 -937 -321 572 137 -6 -140
5294 -140 -907 83 -352 619 -139 -83 -289 286 -589 761 747 -1126 -781 -377 543 141 -23 -384 -385 1164
5314 1164 503 644 -464 -66 446 -172 748 -432 77 346 -363 1179 -453 273 -273 342 -203 925
5332 925 780 292 137 -247 296 -130 200 89 157 -112 725 2 1018 -925 -1079 -188 -526 848 991
5351 991 755 -65 -226 840 602 -969 -478 282 -348 -812 72 240 -140 172 -137 -181 1504 756 -645
5370 -645 109 -221 666 -50 67 955 587 -755 392 185 1137 -701 -522 116 540 998 -621 -222 -1230
5389 -1230 -273 1288 1009 156 266 -918 -609 333 170 344 -6 -473 -74 676 66 -218 486 -360 210
5408 210 -543 369 36 -576 -911 40 -134 1387 -468 -649 109 -602 650 72 -540 -591 148 427 1705
5427 1705 8 228 -1220 431 68 799 -1115 -318 -650 111 414 478 532 112 -994 -235 108 -450 -695
5446 -695 -10 103 -768 216 464 194 -332 -1046 1149 175 178 77 -534 390 -668 -744 -164 -558 405 624
5466 624 781 1732 75 -183 -551 1174 236 -1117 207 -1090 -721 -1079 369 321 -623 -359 -558 40
5484 40 -398 518 -204 -1227 448 417 165 934 -924 284 -831 335 654 218 188 1645 538 104
5502 104 23 -60 206 260 212 414 -78 -557 -167 -583 -106 -768 -129 381 397 -87 654 930 39 -60 316 -579
5524 -579 178 -339 -837 516 -242 277 87 554 -548 -415 -20 84 -71 576 323 -288 -585 -711 1420
5543 1420 -264 173 -158 -185 1275 -562 -258 -1033 -1111 206 -999 710 -16 799 1150 -293 155 1099
5561 1099 674 -1085 -634 -1121 544 -635 509 -585 14 226 359 121 750 -317 102 -411 -244 460
5579 460 -1146 154 -775 -810 -740 469 458 -448 1234 720 -1159 91 1767 112 -497 907 966 1136
5597 1136 158 -544 981 804 -129 -278 337 -527 32 -273 92 273 -222 -1344 -312 539 -86 964
5615 964 325 -813 603 959 235 -33 -1010 34 -681 -489 -710 1010 878 -51 31 591 195 782 578
5634 578 168 652 -482 -379 -644 -631 -564 -48 422 66 298 -845 -1269 633 67 229 434 383 -546 251
5654 251 341 -145 723 111 -41 -34 222 -496 -404 1166 -59 -264 408 -323 -472 -104 758 54 530 54 -107
5675 -107 -1275 -140 -175 -968 125 -850 -117 -505 -823 1255 327 -179 -508 224 534 271 -708 -984 836
5694 836 -534 -377 -661 224 -339 251 -361 1027 339 -577 353 -608 -722 -159 156 -887 -32 731 907
5713 907 813 -244 -204 808 -47 -411 20 240 -1276 -305 1045 -644 -179 -536 -596 -171 295 -595 735
5732 735 -552 105 41 912 -1132 391 353 -556 49 291 430 547 146 -660 -744 -373 -55 465 210 233
5752 233 435 -538 1032 402 181 327 -406 219 1724 161 265 -140 -1117 -478 29 130 -1445 232
5770 232 -186 270 1626 765 -376 -271 48 446 -817 -758 -451 -130 865 479 -286 610 -670 -501 342
5789 342 235 -608 1442 656 127 -22 765 773 -1042 -411 -240 -532 88 -1268 523 -68 -455 -439 -432 -216
5809 -216 207 -488 -1453 1066 586 -674 -1040 -1179 1172 -663 1365 -801 -643 -506 476 -226 399 -589
5827 -589 303 -660 -74 124 -82 -266 -820 408 166 162 694 -867 -2151 943 418 -191 414 -711 15
5846 15 144 25 1092 628 -238 286 486 95 -161 -50 -730 437 -94 154 -498 -108 -1458 511 644
5865 644 164 178 -451 109 -153 440 477 -333 60 -758 555 65 -156 26 584 565 378 -717 -1040 117
5885 117 -255 -495 -1166 -224 -1635 -165 153 -769 76 -529 15 -236 146 -602 228 766 1337 141 -903
5904 -903 -806 -91 549 743 -643 -18 205 564 1516 362 928 28 641 -790 441 -231 -98 849 316
5923 316 660 -555 145 1213 -595 149 291 -351 -318 -444 -826 -93 -214 -34 -672 -416 828 -28 -305
5942 -305 -400 291 371 46 32 368 542 -387 -174 -203 797 79 -9 599 500 631 -330 -350 -163 -460 -562 645
5964 645 -648 -205 290 656 988 672 1761 1921 519 -173 18 281 582 447 784 -76 -159 1231 -239
5983 -239 -548 -411 213 783 253 -222 -180 -629 297 71 -634 771 219 -510 -617 -388 -418 32 295 521
6003 521 -185 57 -446 415 142 -860 -533 -539 1261 1188 274 898 -673 -19 -856 164 -398 -1221 -916 217
6023 217 698 655 585 -304 348 127 727 -589 561 171 -447 -896 -1059 725 -632 -326 369 1173 -412
6042 -412 169 -210 -379 564 160 184 -1 48 -106 -981 994 -489 520 -1014 -467 591 163 -331 -346
6061 -346 142 -1279 11 494 561 349 431 406 145 109 -187 -62 -496 -178 399 954 -149 -618 -783 -668
6081 -668 -146 -160 370 -330 -299 -297 -186 -49 -388 77 -206 -510 808 326 -316 406 -347 212 313 509 1032
6102 1032 -618 -47 206 -89 56 -116 -204 -39 -396 -677 -751 -67 -155 -1232 -357 -298 272 55 -54 1039
6122 1039 -10 355 90 32 -264 -123 -79 1003 346 -545 -891 -322 -42 779 -258 739 573 -486 718
6141 718 -850 1176 564 -739 161 294 688 710 -130 285 459 368 -258 903 -665 256 -65 204 722
6160 722 954 -968 -645 999 481 198 -505 175 -38 949 -637 -331 -471 293 -560 -1010 138 47 -337
6179 -337 -744 -472 -143 996 231 -409 -119 -329 -1 690 132 -208 -367 23 93 29 -508 -348 -170 325
6199 325 -607 380 -459 -524 803 -260 -376 544 -329 26 -184 416 -526 218 54 261 -597 235 1393
6218 1393 349 -336 -17 -75 239 -811 -622 -1280 -1408 640 121 973 104 39 1060 384 219 48 -482
6237 -482 304 -228 475 -480 -314 572 -210 705 54 -14 -1 -472 -390 288 387 147 736 601 358 -282 79
6258 79 -50 928 139 676 -363 -149 452 245 -489 115 83 -1293 644 -625 -33 -622 -1076 -176 441
6277 441 -693 -723 153 -74 -715 733 -7 -890 35 273 173 172 -612 353 65 -436 24 -342 -198 8
6297 8 266 -580 -246 -436 -168 48 -467 -601 -38 -25 -93 327 -366 190 -150 -25 204 -1159 1303 -798
6317 -798 -206 117 -556 31 -267 -240 -472 1191 538 108 -986 -416 -389 -96 -384 33 471 -244 307 -836
6337 -836 171 230 -867 -463 789 7 -675 99 -291 -88 362 725 324 212 -42 558 -11 28 235 -359
6357 -359 -952 -751 -214 -1552 -83 1003 296 -69 388 -35 258 609 -746 -792 -241 466 -39 439 -227
6376 -227 75 514 65 249 -912 -659 302 625 -883 76 769 157 -60 -169 5 -333 14 434 842
6395 842 -463 -196 840 -584 -857 -837 -382 -540 -511 718 -441 79 132 -968 -607 -401 -347 528 -1134
6414 -1134 -477 -482 -329 -125 -427 537 451 1026 161 52 410 -76 234 674 250 689 633 723 388 323 729 436
6436 436 -617 -1022 367 -894 736 122 756 -278 31 16 970 821 -1012 494 1003 186 1119 -440
6454 -440 -239 -914 237 -326 611 409 -177 48 454 671 20 -584 502 -335 -346 -501 -741 -15 99 -454
6474 -454 37 633 -474 39 713 -542 904 553 -370 -883 -665 -536 339 -6 -652 -1035 -174 -17 1370
6493 1370 17 -1052 -214 364 76 -46 537 -981 -813 -34 667 317 826 -617 -113 63 -375 672
6511 672 -1303 -1171 -34 -162 -965 469 -279 -101 -362 511 -76 80 1222 -950 -415 -326 10 473 806
6530 806 -994 -359 382 -248 296 -591 -333 -412 -513 923 218 -487 -680 -364 482 -358 482 -889 -175
6549 -175 -33 394 255 582 -30 596 38 847 199 889 642 173 244 312 -393 366 -177 -121 666 -254 -848
6570 -848 -22 631 -62 173 410 -270 137 -125 -506 826 446 -104 166 394 -427 -660 472 -142 -671
6589 -671 -311 -758 579 -238 479 -237 56 231 579 -1008 -467 402 -1285 -663 -349 182 1704 108
6607 108 -504 746 189 467 -1240 314 -733 771 133 275 74 -1027 -629 -214 178 581 -675 -95
6625 -95 570 -769 712 83 -621 -199 -4 -54 -125 -653 -244 45 -363 -963 22 838 702 603 821 517 -418
6646 -418 -434 229 0 238 -1156 -883 -404 -930 -528 158 238 304 -62 -509 187 -233 -318 484 721 -678 -122
6667 -122 -201 16 -443 -627 -996 1180 -281 1312 810 737 83 -65 -318 -209 -411 -582 -129 326 185 198
6687 198 -892 262 286 -841 -259 333 -1467 -480 206 -415 184 -714 -333 107 -384 744 -191 471 1223
6706 1223 -444 -121 598 -56 -769 -155 -690 -211 -443 895 -328 -460 -105 175 -21 1372 219 -354
6724 -354 321 808 -182 -337 192 -764 -112 1787 991 -508 322 -878 -145 57 -8 -451 -319 -360 -720 341
6744 341 472 308 -139 -125 -490 -16 234 -343 -209 525 -567 51 831 617 -574 -126 -362 -594 129 -411
6764 -411 -81 109 153 1153 -29 -253 63 -632 -735 393 -327 -121 -202 -233 167 170 -187 7 -127 346 -398
6785 -398 -182 -384 -121 254 -561 875 830 -326 326 132 -262 -254 -258 1296 160 -769 -538 264 765 1192
6805 1192 -815 608 -1086 -659 -964 137 -151 -11 -651 -339 -171 -30 55 12 349 633 -556 25 26
6824 26 47 -36 21 712 -290 120 475 461 -81 -447 1263 1336 442 257 409 -19 63 693 138 151 402 190
6846 190 529 -615 458 1150 966 -3 121 -59 258 1040 772 854 -339 969 144 371 -29 -452 -430
6865 -430 685 381 -538 152 -605 155 -86 1111 305 1668 64 -701 1153 268 -160 318 183 -279
6883 -279 592 387 -375 418 12 114 -47 -1631 -710 -98 -98 -613 25 -534 253 190 -469 245 79 216 -116
6904 -116 467 -1757 -688 -791 -475 -1647 203 -1109 41 -300 700 141 -403 131 -144 164 -487 326
6922 326 -699 973 -827 565 -571 -990 -587 -175 125 1170 -691 -573 -719 -108 121 380 151 -110
6940 -110 242 -170 398 -152 -22 473 -682 -504 -306 636 16 447 161 652 114 -108 1081 488 -679
6959 -679 887 253 -770 -56 -307 889 -212 804 -756 -489 -153 73 -300 -697 1161 -556 590
6976 590 -248 626 222 -107 -56 128 -242 -53 319 -103 -62 156 205 357 101 300 -964 345 175 -98
6996 -98 -324 466 -350 118 -371 1034 1043 609 84 -445 -426 -83 548 437 451 -87 -63 -689 412 -214 -85
7017 -85 211 -787 851 -468 243 -259 -519 685 -269 -1873 202 -267 1324 330 212 805 255 -174
7035 -174 30 -731 310 70 -456 96 -996 -112 -236 -668 -907 -575 219 -12 961 948 -574 266 169 -260
7055 -260 232 -395 618 -725 334 -214 -205 508 -763 873 713 -273 -169 -542 -240 170 121 189 744 -342
7075 -342 -163 -810 532 -155 -785 -867 -1087 -17 -887 -909 348 11 -35 -194 -1106 403 -165 -427 -1456
7094 -1456 -93 -281 -37 -777 -132 378 482 231 123 712 -328 -1207 856 384 -337 199 -1241 167
7112 167 454 -298 -925 -215 -311 238 450 -206 671 206 -229 -753 -668 -581 -240 402 -999 1049 -41 -704
7132 -704 -44 422 634 79 -170 -275 -464 -293 62 204 -399 -182 -388 672 131 216 515 438 -388 557
7152 557 -390 795 -546 -835 680 -692 -41 -569 942 123 -567 505 178 -242 819 -720 -834
7169 -834 -836 244 491 400 -544 -594 -74 139 371 777 -445 834 -853 -687 1131 359 176 476 -351 -384
7189 -384 -65 -559 -388 -171 -651 90 676 -497 117 -767 191 109 108 368 546 4 -298 -419 182 599 -979
7210 -979 83 -370 -288 764 -302 -585 -225 -935 -120 24 856 85 -399 -972 -184 1564 -300 100 1031
7229 1031 -731 201 182 440 -317 -38 -6 10 971 934 148 999 165 563 1148 -646 -518 -1248 540 219
7249 219 283 -388 -412 203 334 -123 429 534 567 -153 636 1131 116 1172 -178 557 -184 767 68 -469
7269 -469 171 890 448 422 337 435 -1060 229 -373 25 253 -61 -425 37 291 474 122 -434 74 -398
7289 -398 -732 -47 -251 631 -855 -210 254 82 944 -346 -62 -505 711 -926 -499 -275 603 356 448
7308 448 -355 442 -232 -478 -673 821 367 -1340 557 -237 -120 -141 -309 -894 120 -359 -504 -203 749
7327 749 703 52 188 -28 94 -374 -330 -1077 -992 -251 812 -265 -649 -501 575 27 363 131 -847 -971
7347 -971 -568 203 18 -780 493 579 20 -378 373 276 -1255 -304 -129 690 750 835 210 521 -711 -289
7367 -289 315 -228 438 450 -215 239 877 -567 36 -724 522 299 -901 1149 -307 -1404 35 -23
7385 -23 110 322 680 374 488 -130 218 854 -446 -363 641 789 17 -24 -342 465 342 564 702 9
7405 9 80 -472 -656 -342 -373 -30 -104 -1129 461 -73 -137 97 -362 229 856 221 -752 -760 1174 -363 -13
7426 -13 -1104 -347 466 -914 -32 197 62 -146 312 405 -66 -158 -1100 46 42 -676 290 479 -175 -54 564
7447 564 1171 -304 297 -680 -1340 -46 963 -17 -139 180 -573 -674 1230 228 -1260 -25 -1090
7464 -1090 -531 138 431 441 -437 114 -240 403 -223 -455 73 -869 304 65 172 -247 525 56 -947
7483 -947 985 -381 -595 -114 -959 -729 455 459 -403 219 -469 759 1440 111 296 -375 -1135 154 -296
7502 -296 121 -103 146 520 587 361 -122 -818 481 -56 630 -74 735 -485 -704 -108 -769 97 -347 -856
7522 -856 -807 -406 29 398 -478 -447 -327 578 -166 -650 145 492 364 49 385 -477 188 513 94 1907
7542 1907 871 225 429 -1044 -747 294 1606 -314 1305 156 71 15 -380 -285 -792 405 -186 1249
7560 1249 659 431 -1089 170 -100 -37 855 52 -516 -342 529 -1453 -592 -6 11 -236 186 -295 -1083
7579 -1083 56 -224 940 310 -738 -735 -740 -333 399 -43 455 -648 706 -1081 -322 -674 -8 -550 365
7598 365 453 -1960 1119 -709 -180 -1033 -811 -341 -936 266 -712 641 1038 -112 -603 378 -615 75
7616 75 101 -240 -516 836 269 -510 327 -326 419 13 -68 -822 -511 -226 -560 484 103 855 75 637
7636 637 -39 273 209 -1243 51 212 1110 372 69 -26 -38 -75 -464 -1101 -714 -892 36 -151 -401 368 -376
7657 -376 -301 -143 -223 -390 495 -510 -32 -994 -843 449 451 251 -549 -420 -168 -280 81 -470 841 61
7677 61 -873 255 492 -433 111 403 643 248 -404 -345 491 -465 1095 454 166 -26 576 -525 -1190 -362
7697 -362 -506 60 63 -587 1427 940 -565 350 304 -670 -218 20 445 609 246 -79 -161 -1297 586 183
7717 183 275 -1014 -418 -486 -433 274 163 641 193 96 913 605 -775 -370 -101 -870 428 -312 -358 -304 720
7738 720 1041 367 -534 229 -232 5 -193 -171 474 -852 924 -187 756 361 1326 822 -230 -93 -521
7757 -521 1330 -708 636 782 -874 -101 -211 253 -432 266 654 -297 -244 137 -929 -587 -1222 -258 188
7776 188 735 -133 -872 103 -251 -629 302 -448 950 764 -37 -29 285 -232 625 -163 -379 -422 -1596 -83
7796 -83 -227 671 78 -470 415 434 57 375 -124 550 -307 -375 -498 769 -363 2021 267 -390 34 -808
7816 -808 -559 122 487 439 176 17 -436 354 77 -535 -287 305 -179 -180 -529 972 42 -300 -143 -1009 -874
7837 -874 -171 -1342 273 -546 244 724 -832 -35 -328 -337 364 1131 261 -451 594 362 303 713 -444
7856 -444 293 -761 362 -737 580 585 -258 -168 -370 1264 -670 99 96 -455 -696 -658 -129 690 -189 -1551
7876 -1551 -678 295 -502 -170 -672 118 162 64 561 -957 -258 -160 131 300 -965 169 -581 151 -262 39
7896 39 501 896 -727 -199 -891 10 -197 20 216 -533 567 1248 565 456 286 -33 -302 406 200 -143
7916 -143 189 68 473 627 60 514 -321 169 595 483 -261 -42 1110 -857 -718 -103 468 -860 -493
7935 -493 -1645 261 -89 -388 807 1311 -400 -1160 -500 -909 -370 1217 207 -628 -248 641 924 -506
7953 -506 750 -119 -808 872 -45 172 441 -37 -461 -220 493 -159 17 19 96 23 334 -411 -106 -234 200
7974 200 266 -88 -215 -132 -1002 775 256 256 -228 153 678 457 -347 1022 -451 -131 525 87 345 876
7994 876 470 314 573 -865 -502 252 127 -504 -764 1357 -149 -21 703 -898 -1415 215 53 -76
8012 -76 183 1176 522 -409 276 -399 -306 615 -428 -1829 -154 -1162 134 -744 53 -284 65 -558 -1078
8031 -1078 228 171 433 -1024 908 354 -536 50 319 12 -732 630 596 -345 -362 -258 767 274 283 898
8051 898 -657 1616 202 -891 -194 -522 -221 1876 163 1150 -1551 -321 662 -154 710 -213 687
8068 687 1034 108 -470 -913 -206 -395 92 515 -494 217 368 -53 -775 394 715 -405 -5 227 661
8087 661 556 -48 1159 -837 101 978 -402 -784 -533 284 -659 374 -87 -110 285 -1008 508 -154
8105 -154 -354 -798 86 99 -105 21 -866 603 -339 -198 -248 166 -617 1112 171 396 743 191 407 -94
8125 -94 132 -468 -491 144 -273 -1181 132 -400 -205 -662 776 -1078 8 140 202 -591 159 139 226 -650
8145 -650 170 -500 369 261 -7 -113 -384 -1349 442 816 -621 635 216 583 -399 -137 -501 -242 898
8164 898 817 627 86 -658 -31 821 -144 491 1425 -983 -187 -391 3 538 396 228 209 446 489 282 -512
8185 -512 74 -420 -119 -167 -30 37
8191C7
$$ Imaginary data points
##PAGE= N=2
##DATA TABLE= (X++(I..I)), XYDATA
0 0 0 0 0 0 0 0 0 0 0 0 0 0 0 0 0 0 0 0 0 0 0 0 -3 7 -9 18 -23 31 -35 40 -46 56 -61 71 -79 93 -104 110 -129 143
40 143 -165 178 -197 221 -245 272 -303 334 -364 402 -442 482 -537 582 -648 715 -789 873 -964
59 -964 1073 -1186 1339 -1502 1690 -1902 2114 -2132 1027 12284 502513 270281 66383 6043
73 6043 -48675 -128200 -243795 -276648 -276251 -203476 -124046 -54239 -41306 -99454 -128523 -93961 -24653
86 -24653 -21198 -118310 -181231 -166066 -66574 -3060 -2913 -22340 -38819 -8259 27969 65019 60590
99 60590 -5628 -63159 -75259 -3857 51843 33769 -19464 -46804 15532 83137 105580 67213
111 67213 2874 -15184 -10194 27359 43968 19075 -18372 -41412 15880 89773 126837 87029
123 87029 17626 8455 35372 66186 37193 -32858 -79734 -89524 -43885 -5126 10731 -12174
135 -12174 -50796 -39593 1095 50737 37206 -30002 -77166 -71739 -9217 19686 1547 -35522
147 -35522 -50486 -7038 38854 71158 56780 15742 -6749 1998 49952 70487 41248 -12401
159 -12401 -41127 15 44609 55187 9072 -44485 -50636 -29950 991 -5124 -38119 -69959
171 -69959 -76923 -31861 16368 39019 10326 -26944 -15662 24998 63701 40432 -12809 -46305
183 -46305 -42250 -7610 8426 -121 -33351 -57790 -41296 -3770 34410 20727 -20301 -39533
195 -39533 -16584 38043 54506 35102 1155 -2929 30637 62404 78525 55246 18649 2936
207 2936 14456 50369 50054 12707 -36434 -49721 -13348 15392 16501 -23408 -50563 -40876 -14365
220 -14365 14430 6929 -21759 -51283 -53354 -17170 12551 12864 -24422 -49504 -30379 9327 37448
233 37448 12944 -22022 -39080 -24296 10302 22088 10955 -19857 -33268 -12318 25179 47685
245 47685 23828 -11533 -22667 1861 37966 41000 15187 -17570 -17599 12102 37538 44941 19099
258 19099 -8976 -12827 11535 42106 35452 3601 -30056 -28665 3596 24638 16162 -16823 -39098
271 -39098 -28610 591 21350 6816 -21124 -44725 -35144 -2507 15117 3336 -30297 -42227
283 -42227 -18093 19792 38283 17080 -9340 -16705 4267 34457 37418 16979 -17714 -25782 -4814
296 -4814 21702 29447 840 -26968 -30239 -2335 27578 20888 -5019 -30256 -24372 4534 25737
309 25737 23082 -5781 -25725 -19917 8721 31380 20604 -9136 -34075 -21367 9666 28048
321 28048 14678 -19027 -28490 -10850 18677 32096 14080 -13193 -27439 -9599 18847 27099
333 27099 7722 -24329 -27304 -3424 27133 32581 7352 -15406 -17084 8028 30176 25968 1446
346 1446 -26920 -26194 -4236 18691 15205 -14999 -35543 -27995 4372 25625 13738 -11607 -29721
359 -29721 -15414 11698 25605 14802 -14736 -27024 -15740 14105 27074 9604 -18196 -31149
371 -31149 -9968 19142 26545 7683 -19866 -21312 1019 27489 30934 8126 -14403 -20075 3954
384 3954 25477 25362 -1240 -27443 -23527 2722 26269 20425 -5007 -22543 -15338 13507 28952
397 28952 19719 -4713 -25393 -15438 8569 22304 9008 -18696 -32210 -18998 10500 21289
409 21289 3797 -20993 -28681 -8444 15433 22759 6020 -18942 -22362 -4131 20504 23240 4023
422 4023 -19625 -23216 1873 22875 21440 -3161 -21400 -16985 5599 26444 20395 -2852 -20397
435 -20397 -15205 9803 25360 15839 -9207 -25403 -15933 8821 23198 10880 -13336 -23977 -9035
448 -9035 16258 23563 10637 -13472 -22000 -6677 15715 22399 5563 -18218 -24335 -5268 17406
461 17406 19661 1466 -20994 -22130 339 20942 20330 -1305 -17929 -16168 3728 23131 17565
474 17565 -4333 -20867 -16741 6468 21149 14429 -8851 -22521 -12866 9363 22402 10327 -12046
487 -12046 -20921 -10034 12103 20831 9268 -14094 -22295 -6450 13678 19963 3147 -15650 -19061
500 -19061 -4681 17282 18813 3571 -13955 -17147 -88 18751 18768 -503 -18878 -16183 2860
513 2860 19669 14877 -5027 -20538 -13557 6451 20129 13346 -5929 -18787 -11826 8509 21500
526 21500 12300 -8962 -20765 -10609 10647 19218 7238 -13524 -20833 -6899 12961 19553 5411
539 5411 -13978 -18688 -4412 15131 18050 3488 -15592 -18324 -1496 15950 16993 -599 -16746
552 -16746 -16663 2468 18081 14263 -1870 -17426 -13741 4952 18464 13997 -5948 -17357 -11709
565 -11709 7207 18490 9973 -9066 -19289 -9597 9316 17395 6872 -11156 -18080 -6084 11015
578 11015 19098 6114 -12235 -17645 -4283 13389 16435 2510 -15568 -16645 -1656 14688 15040
591 15040 -423 -14997 -14545 1744 16401 15374 -1129 -16645 -13274 3353 17423 12855 -6567
604 -6567 -17855 -11481 4412 15980 9200 -6165 -16780 -9275 8847 18158 8447 -9303 -17863
617 -17863 -6749 11075 16783 4806 -12162 -16580 -6253 11083 16364 4745 -12852 -15971 -2446
630 -2446 13867 15286 2305 -13105 -15056 1079 14804 14403 -1297 -15918 -12877 2058 14692
643 14692 12363 -3724 -14386 -11288 5816 16702 11299 -5287 -15113 -8722 7003 15349 8271
656 8271 -8502 -15949 -7001 9428 15322 4378 -9681 -16315 -4200 10485 15782 4216 -11272
669 -11272 -14431 -3487 12992 13789 1505 -13126 -13808 -467 12797 13095 -1184 -13391 -12450 2701
683 2701 14437 11130 -4414 -14709 -9758 5206 14385 10098 -4176 -14408 -9490 5907 15004
696 15004 7827 -7369 -15906 -6811 9683 14607 6373 -9641 -15398 -4920 9874 14496 4824 -12482
710 -12482 -13761 -2398 11904 14089 1286 -11143 -13778 -1038 11404 13736 -37 -12943 -11853
723 -11853 1208 13345 10780 -2372 -12913 -10432 3682 13799 8930 -4490 -13350 -8055 5064
736 5064 13927 8300 -7229 -13022 -4988 7104 13479 5779 -8057 -13587 -4453 9078 12850 3598
750 3598 -9514 -12932 -2994 9750 13722 1719 -9988 -11874 -652 10243 11553 283 -12642
763 -12642 -10610 1490 12117 10282 -2488 -11845 -9562 2968 11876 8170 -4431 -13345 -8671 5667
777 5667 12093 8789 -4221 -12392 -6305 7157 13052 5659 -7703 -12777 -4653 6952 13334 3960
791 3960 -9033 -11907 -2018 8114 12033 1914 -10307 -10958 -521 10800 11384 -443 -10021 -10589
805 -10589 169 11077 9721 -1758 -10994 -10073 2795 11338 7750 -4293 -11051 -7751 4060 11512
819 11512 7254 -4986 -11445 -7795 5387 11685 4795 -7008 -11568 -4457 7142 12210 4418 -7179
833 -7179 -9761 -3599 7936 11710 2043 -8678 -10799 -915 9324 9849 -273 -10208 -9746 922
847 922 9547 9423 -658 -10450 -8156 1968 11320 8417 -2947 -12094 -7932 2688 11345 6105 -4995
862 -4995 -11904 -6073 4000 9373 5106 -5615 -10352 -4593 6083 11187 3228 -7792 -10437 -3952
876 -3952 8529 10200 3086 -8439 -9812 -1037 9474 10526 852 -8687 -9193 920 9874 9342 260
891 260 -9265 -7990 2312 9561 7289 -3005 -9615 -8400 3253 10874 5810 -3439 -10701 -5630 4450
906 4450 10034 4322 -5322 -10708 -3906 5446 9211 4894 -6978 -9569 -3273 7733 8344 1742 -8128
921 -8128 -9344 -1541 7147 9321 1773 -7834 -9126 124 8293 7851 362 -8358 -7386 2208 9838 7976
937 7976 -1066 -9257 -6164 3251 10346 6695 -3756 -9312 -5268 3811 9425 4881 -5375 -10476 -5394
952 -5394 5217 9458 3518 -5242 -9165 -2842 6099 9995 2290 -6861 -8430 -478 7711 9048 2624
967 2624 -7287 -8432 -165 7660 8781 385 -8478 -6941 404 8231 7422 -2047 -8377 -6722 1876
982 1876 8132 5290 -3194 -8982 -4667 3759 8670 6015 -3972 -9469 -5222 4907 8972 3557 -6083
997 -6083 -8578 -2672 5172 7845 2210 -5781 -8942 -2707 5991 7212 1022 -8036 -8203 -669 6504
1012 6504 7950 147 -8994 -7279 752 9119 7991 445 -8826 -6796 2721 9175 7372 -1887 -8388
1027 -8388 -4807 3254 8852 5622 -3477 -8627 -3996 4871 8400 4439 -5031 -8941 -3088 5654 8916
1042 8916 2286 -6640 -8388 -1988 6544 8471 1221 -7059 -8025 -1373 7069 7099 679 -7884 -7733 173
1058 173 6319 7322 -1431 -7698 -6420 1799 8108 6118 -1949 -8189 -5756 3301 7995 5406 -2576
1073 -2576 -6754 -4027 3441 8201 5054 -3996 -7973 -2988 4148 7871 3200 -4722 -9079 -1877 5808
1088 5808 8046 1432 -5086 -7832 -912 5780 7015 874 -5686 -6744 -599 6313 6878 447 -7075
1103 -7075 -6098 325 6980 5935 -1247 -7732 -5047 2392 7939 5256 -3087 -7321 -3520 3288 7862
1118 7862 4363 -2825 -6946 -2753 4004 7537 3760 -5153 -7352 -2956 5121 7823 2544 -6273 -7778
1133 -7778 -2008 6307 7391 836 -5626 -7267 -914 5958 5093 -812 -7049 -5640 192 6250 6300 -1786
1149 -1786 -6453 -5408 780 6914 3960 -2574 -7488 -4611 2327 6511 4536 -3587 -6412 -3326 4273
1164 4273 7790 3212 -2757 -6672 -2073 3680 6744 3265 -4820 -7114 -2794 5693 6802 2803 -5562
1179 -5562 -5286 474 6671 6733 1746 -5957 -6154 834 7210 6503 -1089 -6166 -4641 83 5747 4593
1195 4593 -1720 -7154 -4890 1376 5532 3400 -3676 -6758 -4085 3421 5943 3094 -3723 -6690 -3070
1210 -3070 4556 5694 1986 -3266 -5972 -1954 4589 6543 2700 -4964 -6800 -1072 5683 6538 603
1225 603 -6018 -5726 -93 6382 5733 613 -5446 -5295 1823 6744 5235 -1267 -6139 -4360 3309 5610
1241 5610 3848 -2224 -6275 -3906 2429 6003 2729 -3731 -7222 -4550 3271 6153 2329 -3907 -6598
1256 -6598 -2739 4154 5019 1968 -3873 -5512 -564 5601 7460 661 -5469 -6133 532 4956 5005 -1041
1272 -1041 -5084 -6117 -286 6220 4761 -765 -5488 -3154 1871 6357 4708 -2315 -5774 -4022 2565
1287 2565 6847 3219 -2617 -5658 -3091 3430 6029 2196 -3416 -5445 -3076 4107 5328 2922 -3466
1302 -3466 -5818 -1009 4287 5305 1452 -4809 -6365 227 5323 6136 477 -4215 -4703 2059 5041
1317 5041 4982 -454 -5619 -3361 1045 5412 3843 -988 -5413 -4627 2024 5446 3309 -2628 -5942 -2942
1333 -2942 1977 4940 2077 -4151 -6357 -3118 3118 5929 963 -4490 -5877 -1272 3663 4625 902
1348 902 -3914 -5420 -1278 5013 4540 168 -4036 -4186 -114 5063 4358 234 -4730 -4680 1218 5012
1364 5012 4002 -1044 -5095 -3074 1689 6392 4440 -2315 -4177 -1904 1487 5091 2670 -2461 -5672
1379 -5672 -1968 2500 5294 1174 -3063 -5954 -2195 3714 4680 980 -4464 -5932 -1450 4462 4279
1394 4279 735 -4454 -4955 92 5471 4667 -1429 -5334 -3952 145 4695 4942 -329 -4962 -2613 1817
1410 1817 5929 3456 -1312 -5949 -2764 2032 5335 3212 -2523 -4867 -3132 3076 5818 2083 -3274
1425 -3274 -4925 -1908 2998 5413 1264 -4092 -4780 -1181 4241 5352 -42 -4789 -4401 -178 3464
1440 3464 4405 33 -4310 -4548 -537 4247 3359 -519 -4992 -4594 1093 5332 3874 -643 -4099 -1925
1456 -1925 1547 3506 3411 -2214 -5405 -2668 2768 5528 1073 -3008 -5828 -2148 2670 3555 1985 -3326
1472 -3326 -3948 344 3235 3849 746 -4825 -5214 -877 3446 4255 619 -3737 -5539 -185 3999 3445
1488 3445 90 -4432 -5156 761 5559 3325 -1936 -5201 -2285 786 4804 2667 -1055 -4488 -2164
1503 -2164 2385 4434 1196 -2740 -4514 -1900 2804 3886 2209 -1903 -3755 -1923 3607 3618 728
1518 728 -3910 -4590 -1324 3949 4634 386 -4263 -3829 -1693 4884 5130 -723 -4939 -3595 1803 4536
1534 4536 3993 -525 -4711 -3538 1680 4193 3267 -1148 -5270 -3204 1550 4196 2178 -2319 -4605
1549 -4605 -1095 2297 3682 1818 -2649 -4746 -1727 3234 5196 1150 -3272 -3732 -1029 3527 5304
1564 5304 -91 -3848 -3945 -388 2678 5060 631 -3898 -2005 140 3025 3562 -708 -5535 -3823 1462
1580 1462 3986 2459 -1992 -3970 -2568 1852 4023 2616 -1179 -3810 -3573 2411 4524 971 -2396
1595 -2396 -4384 -1664 2764 3223 790 -2932 -5102 -973 3719 5404 88 -3364 -3262 -265 3134
1610 3134 3112 -1086 -4025 -4037 68 3344 4034 -608 -3755 -3466 748 3442 1914 -1535 -3224 -3130 2055
1627 2055 4620 2431 -1317 -2567 -2014 2502 3801 2367 -1481 -3966 -1691 2522 3951 1379 -3774
1642 -3774 -3199 -859 2372 4111 787 -2320 -4437 -777 2476 3287 1009 -3400 -3072 -151 3189 3184
1658 3184 -163 -2889 -3455 477 2851 3746 -986 -3583 -2451 1251 3434 3438 -1722 -2731 -2586 1282
1674 1282 4080 1972 -1773 -4054 -2403 1303 4416 1549 -1637 -3008 -635 1647 3114 491 -1501
1689 -1501 -2895 -499 2356 3110 1294 -3519 -3747 -342 3608 3746 -705 -2646 -3354 843 4156 2632
1705 2632 -678 -3270 -3134 970 3773 2437 -747 -3807 -1911 470 3742 1535 -3277 -3153 -1974
1720 -1974 1419 3075 1248 -2645 -4648 -1506 1805 4310 1159 -2547 -3704 -1370 2913 3153 827
1735 827 -2268 -2574 71 3391 1942 524 -3521 -4013 -1341 4031 3132 -621 -2124 -2644 -237 2768
1751 2768 1615 -754 -3094 -1716 1477 3407 2561 -1385 -3225 -1718 2231 3775 1880 -1396 -3521
1766 -3521 -770 1392 2731 1063 -2534 -3864 -726 3500 3352 859 -2372 -1966 -284 2992 3691 1060
1782 1060 -2677 -4068 -194 2649 2901 -245 -4064 -2494 364 2616 2413 -183 -3479 -1867 1343
1797 1343 3435 2251 -1101 -3570 -1809 1202 3225 1503 -1405 -3454 -1067 1979 3463 1995 -1775
1812 -1775 -3370 -617 2583 2759 807 -3103 -2968 -498 1669 3003 824 -2771 -2877 49 2573 3424
1828 3424 179 -3029 -3591 -389 3754 3178 -14 -4067 -2449 335 2606 1672 -547 -3008 -1833 1265
1844 1265 2457 1867 -1491 -3686 -1940 2013 3081 1151 -3051 -3380 -1473 2623 2859 1044 -2864 -3961
1860 -3961 -620 1632 3431 1254 -2146 -2774 -134 2780 3090 116 -3056 -2233 341 2823 1477 2
1876 2 -2909 -1425 -275 2219 1742 -1078 -3823 -791 1442 3092 1942 -1292 -1689 -1864 1285 2690
1892 2690 1216 -752 -3962 -1931 2595 2439 905 -2482 -2869 -813 1587 3535 1194 -1867 -2221 -830
1908 -830 2866 2483 -30 -1742 -3295 -913 3137 2311 -489 -3129 -1095 861 3617 1453 -842 -2047
1924 -2047 -2117 552 2297 1335 -586 -2733 -2207 936 2975 1402 -736 -2665 -1684 2125 3328 1752
1940 1752 -1923 -3374 -1331 615 3693 366 -2742 -2087 -900 2173 3395 95 -2471 -2414 -329 1397
1956 1397 1857 628 -2447 -2302 -922 2413 3262 -414 -2163 -2664 805 1570 2715 -691 -1673 -2053 927
1973 927 2885 1025 -978 -2680 -2209 1389 3361 1517 -1245 -2853 -684 1310 2029 491 -2124 -1744
1989 -1744 -281 2474 2420 945 -854 -2087 -472 2356 2276 1044 -1331 -1340 109 3689 3174 -881 -3145
2006 -3145 -2333 1066 2945 2559 -358 -3091 -2154 1376 2757 1967 -651 -3254 -1535 1062 2886 1737
2022 1737 -2226 -2902 164 974 3084 742 -1879 -2140 -339 1466 2130 177 -1241 -3551 -234 1549
2038 1549 2725 152 -2447 -2631 -550 2125 2284 -462 -3215 -2775 313 3438 1871 273 -3049 -1268
2054 -1268 -465 2871 2288 -1572 -3480 -837 1040 2769 1987 -115 -2457 -1912 2027 2508 1619 -1246
2070 -1246 -2343 -274 1071 3235 478 -2169 -1250 -101 1781 2321 1725 -1607 -2597 -773 2067 2678
2086 2678 205 -2713 -2951 933 2814 2061 -610 -2027 -2059 156 1342 2239 -193 -2136 -1895 1846
2102 1846 2900 1914 -1798 -2971 -1172 1285 2180 -20 -673 -3110 -1352 1612 3154 467 -1238 -2166
2118 -2166 -447 2100 2412 411 -756 -2636 183 2808 2266 -354 -1949 -1425 -344 2252 2126 -523
2134 -523 -2925 -2460 -151 1573 540 -916 -2895 -2320 913 1916 1369 -856 -2391 -1141 1174 2594
2150 2594 2082 -1659 -2215 -1508 1834 1730 813 -1682 -2956 -28 993 3350 296 -1924 -1534 -704 1762
2167 1762 2887 -641 -1171 -3009 360 1713 1432 -127 -2686 -1242 1507 1616 3153 156 -2265 -1676
2183 -1676 792 2253 1428 -943 -2490 -1680 726 2681 1636 260 -2780 -543 544 2391 101
2198 101 -1122 -1800 -1430 1055 1478 -1 -1735 -1737 -1231 642 2768 607 -2707 -1603 -615 1860 1923 -1024
2216 -1024 -1496 -1129 733 2331 1305 389 -1851 -2056 513 2279 1516 -204 -1649 -1635 27 670 1365
2233 1365 -1681 -2261 -1768 849 2856 974 -530 -1960 -1210 1649 2246 525 -1657 -2096 -446 1795
2249 1795 1365 1072 -1607 -1722 459 2380 2831 -90 -2329 -2125 480 2232 1113 -94 -1437 -1836
2265 -1836 656 1583 1442 601 -2134 -1510 857 1616 1551 -515 -2070 -813 2244 2243 1203 -1126 -1726 -97
2283 -97 1515 1643 1439 -463 -2042 -547 761 1652 1256 -1410 -2507 -288 794 2094 -172 -1389
2299 -1389 -3325 366 1542 1410 -361 -2443 -1461 780 1769 922 -481 -2060 -1733 1124 1840 1010 -1068
2316 -1068 -2307 -514 599 2259 1915 -1277 -2095 -288 1651 2908 680 -1219 -2303 205 1893
2331 1893 2224 -293 -780 -2057 -1085 1416 2037 360 -1919 -2579 -283 1276 2249 -1022 -1230 -1333 625
2348 625 3414 2206 -749 -689 -936 -279 2257 1669 125 -2487 -1069 -381 2527 303 -1522 -2022 -225
2365 -225 849 1723 969 -806 -2225 -658 1758 2105 759 -923 -1094 -346 2841 1656 -136 -2126
2381 -2126 -2371 -245 1163 2394 980 -1401 -1745 -613 2157 1605 -670 -2306 -1961 -22 2085 2093 36
2398 36 -1504 -1154 863 1898 2358 -582 -2210 -1196 1187 1889 648 -528 -1791 -601 1581 2178
2414 2178 993 -1340 -1249 -252 1111 1532 557 -2299 -3450 -119 1165 1082 194 -1198 -2291 -413 1772
2431 1772 374 -124 -2475 -1622 450 2226 1345 330 -1931 -1837 -805 1502 845 -982 -1283 -1194 795
2448 795 1599 509 -1128 -2139 -1515 1236 1578 296 -897 -2028 -765 1768 1432 1095 -1420 -2031 442
2465 442 1925 2824 63 -2011 -1655 -258 2738 2326 211 -1138 -632 1202 2152 1174 201 -1641 -722
2482 -722 402 1821 703 -926 -2366 -1322 1026 1591 1462 -386 -1498 -523 1590 2711 -509 -2225
2498 -2225 -1599 -178 739 2547 395 -1168 -2008 -1025 1171 2503 1983 -2177 -1775 -898 1072 2071 405
2515 405 -1260 -1712 -412 1962 1326 -295 -2690 -1953 -587 1893 1392 -795 -1100 -884 822 2641 1073
2532 1073 -317 -2089 -1072 1396 1326 414 -1130 -2104 -1408 785 1617 -139 -2479 -1438 -1104 1351 1310
2549 1310 -184 -590 -1427 617 1563 1140 203 -1223 -1028 -744 1630 1895 -44 -875 -1810 204 1120 781
2567 781 -1462 -1035 -1011 734 2151 540 -674 -1375 -103 1259 1232 830 -858 -356 -1748 1995 2316
2584 2316 99 -549 -1388 508 1561 2433 1020 -891 -1568 -65 560 1315 -759 -1955 -1314 -786 1397
2601 1397 1917 74 -1417 -2742 96 1168 1986 120 -1922 -1398 -102 1424 710 -792 -1415 -888
2617 -888 1127 2283 773 -308 -952 -1565 1173 2157 264 -1646 -1057 660 -127 1977 -198 -1668
2633 -1668 -600 -648 1400 1993 500 -400 -1034 -168 379 1030 63 -2193 -1570 838 2752 -248 473 -955
2651 -955 -1905 712 3066 544 -673 -1571 -414 2256 458 -275 -1830 -2678 -1419 918 1283 376 -931
2668 -931 -2054 -158 812 1427 146 -751 -1565 211 1423 1929 1002 -1567 -884 -66 1418 1541 80
2685 80 -1675 -499 966 1777 1371 -118 -2271 -1358 -561 1354 910 -1303 -715 -1041 910 2011 419
2702 419 457 -942 -659 831 2298 629 -765 -1458 448 533 1481 1208 -1651 -1840 -729 922 1650 1165
2720 1165 -1128 -1548 -779 1030 597 488 -1348 -949 -810 1411 1366 807 -1682 -2189 -791 1020 355 231
2738 231 -1429 -1063 -14 2063 793 80 -2054 -721 809 1164 498 -114 -1572 -757 421 1064 1034
2755 1034 -1022 -749 -825 1455 1923 1204 -1364 -2286 429 1617 1669 788 -1379 -1777 508 1901 101
2772 101 -195 -988 -1269 1309 1355 742 937 -1674 -1851 959 550 994 -1741 -1480 -1594 -147 1119 1413
2790 1413 -282 -1425 185 145 1722 913 -586 -2239 -215 140 691 1083 -108 -1867 -1707 1185 932
2807 932 911 -1247 -1783 -112 461 355 -49 -1125 -2900 1035 1245 -196 9 -806 -59 185 2181 833
2825 833 -620 -1907 -652 286 1991 1551 272 -535 -805 1539 769 1322 -723 -1775 317 -28 1020
2842 1020 -212 -213 -2053 594 1229 2229 576 -1401 -2258 -506 1882 1113 1016 -348 -655 1556 929
2859 929 1102 1092 -178 -1093 -224 2042 1045 157 -1733 -1056 63 1877 231 -336 -421 -1445 275 1477
2877 1477 888 -497 -1261 -1105 236 1954 -264 -1370 -1633 -594 508 1049 1081 -1149 -2141 -623 2109
2894 2109 2050 -23 -1148 -10 779 1851 1681 -464 -1344 -1866 354 1347 666 -830 -961 -415 -530 704
2912 704 838 -156 -2050 -404 1335 1943 332 406 -326 -1 -40 2245 97 -450 -2760 -756 683 1132
2930 1132 -442 -2292 -808 295 1318 2170 714 -520 -668 -469 -903 1589 290 -1167 -1733 435
2946 435 827 542 335 -1355 -1966 -470 1376 469 737 -1603 114 628 1912 119 -377 -687 -735 658
2964 658 685 1089 -909 -1380 -101 395 1173 513 -874 -1204 -108 1260 2472 760 404 -560 -972 64
2982 64 860 328 -1097 -455 240 1318 2369 923 -1401 -1323 -624 2017 2288 428 -895 -1196 756 1886
3000 1886 709 -543 -893 -994 873 1564 692 602 -1297 -337 1422 1165 554 52 -1126 -1012 -136 814
3018 814 320 -1397 -1843 -128 656 1293 -18 -801 -1787 -509 1275 1619 644 -1045 -1080 590 1535 1059
3036 1059 9 -1723 -980 -429 768 1753 542 -1062 -1597 1470 1078 1058 693 -1604 148 -754 965
3053 965 23 -1734 -1312 -748 1124 719 483 395 -1628 -1098 1130 738 97 -862 -1971 -306 1221 694
3071 694 921 -1216 -686 -747 2047 284 526 -1240 -1115 -62 721 1289 77 -1912 -1584 -255 403 1336
3089 1336 -844 -1239 -370 662 862 847 -398 -1387 -887 209 985 1547 -623 -874 265 1155 1267 1297
3107 1297 -334 -560 239 704 973 397 -464 -228 -157 1023 546 591 -236 -535 -922 368 450 -253 -368 -1298
3127 -1298 -298 406 933 -80 -496 -960 765 -119 661 -126 -1687 -693 -139 1187 562 -532 -868 35
3145 35 896 444 1311 -865 -1873 -777 725 886 -35 -1596 -641 505 1350 1287 -886 -1792 -1575 366
3163 366 639 478 698 -150 -1068 -303 2622 575 134 -692 -1827 -1 249 246 -699 -743 -606 867 906 814
3183 814 333 -530 -65 82 1309 1043 -1792 -1989 -1238 308 -65 411 -560 -553 -233 -142 1941 267 -854
3202 -854 -2075 -941 1743 958 669 -528 -1023 513 -735 853 125 -847 -1131 685 1057 710 -1099
3219 -1099 -92 -364 -576 2027 1576 -928 -954 -873 153 1227 320 -531 -1114 -988 117 815 -113 -289
3237 -289 -373 -38 772 1136 649 -446 -764 -993 128 1685 818 -895 -998 1375 306 927 780 -788
3255 -788 -898 822 639 1276 261 -905 -1792 1109 801 1308 -754 -1150 -367 242 102 347 -627 -1351
3273 -1351 -219 -214 1854 377 -335 -284 -24 175 853 354 -499 -690 -782 1747 396 -586 -129 -1814 226
3292 226 474 346 873 -635 -1048 360 301 664 -267 -773 -1697 -616 676 1863 195 -1212 -1802 306
3310 306 889 1721 -825 -246 -80 619 1134 896 271 -1087 444 -448 1179 861 -227 -1754 -921 607
3328 607 972 -252 -251 -585 605 111 513 -306 -1192 -225 159 919 91 -383 -1023 -1591 466 830 342 -575
3348 -575 -1125 -593 -595 2217 718 41 -614 -627 -30 969 929 -429 -692 -1044 -129 517 897 -1487 -1218 698
3368 698 -25 772 102 -183 -1098 -760 351 345 300 -1538 -1143 -242 1174 912 -523 -969 -754 -40 1331
3387 1331 1525 -780 -1775 -672 -716 967 -734 -505 -797 -777 802 1373 -211 -798 479 -455 395 951
3405 951 1192 -802 -1783 -398 1698 245 -8 -765 -77 -281 500 438 -139 -469 -853 34 -3 891 -85
3424 -85 13 -1276 410 564 63 509 -992 -536 359 1623 1381 -2 -1387 -283 -276 648 -541 78 -485
3443 -485 -876 1044 1215 799 -260 -860 -520 12 771 -197 -687 -766 -166 321 1239 251 -688 -764 -457 1419
3463 1419 838 -353 -380 -1226 -624 147 1192 1033 -1104 225 433 127 1250 28 -865 -576 406 1439
3481 1439 257 -257 -2216 -1446 859 1435 -92 -1030 -844 246 -406 -44 1374 -375 -38 -114 159 504
3499 504 -153 -795 -744 -539 -104 370 -116 -497 -763 -1616 912 1191 145 341 -808 455 756 451 -894
3518 -894 -1723 271 350 -398 378 -1064 -954 -1053 697 1436 401 -596 -315 -526 308 27 896 -1480 -2477
3537 -2477 124 378 988 419 -170 -1848 -11 163 1012 207 -1470 -906 -1197 809 709 -189 -390 -702
3555 -702 -99 817 778 168 -1799 -88 -74 678 452 -1253 -889 -836 198 1256 -603 -426 -899 131 700
3574 700 1532 1071 -913 183 -953 1141 758 193 -668 350 551 979 1145 1485 -635 -189 11 773
3592 773 1077 -617 -671 -35 -422 -60 656 -190 -298 -1442 -135 374 1862 -23 -1181 10 586 707
3610 707 768 -326 -702 -1269 1561 779 1119 39 -799 -288 -632 574 202 165 -449 104 1033 800 42
3629 42 -1722 -366 1272 -79 1062 570 -880 -822 -398 486 353 -17 -1343 -1478 394 703 10 -1145
3647 -1145 -888 -204 410 545 1246 -435 -263 -607 134 300 663 419 -995 661 438 669 197 -509 -697
3666 -697 858 359 957 1397 -238 -1515 162 460 1351 723 -145 -1014 -243 371 1197 110 313 -308
3684 -308 -253 950 1524 306 -954 -297 -541 92 323 -636 -1228 -495 711 671 1469 -388 103 -226 784
3703 784 1297 495 -555 -1476 -634 -409 889 -19 -1080 -717 -383 292 1996 -126 -500 -562 -772 492
3721 492 1154 -544 -759 -811 77 813 1430 -188 -674 -444 -259 770 737 -720 58 -501 -2 1052 1411
3740 1411 305 -696 -589 452 903 1060 -730 -466 -523 357 1224 -581 100 -1428 894 496 1266 -889
3758 -889 -1471 -1030 -172 761 737 755 -40 141 4 422 -634 -513 -566 -69 652 1126 888 322 -446 -1466
3778 -1466 360 1335 416 -576 -1100 -834 -98 303 290 87 -1245 -43 780 -569 221 68 -830 -576 4
3797 4 658 460 -525 -1539 -309 -35 1086 -577 -1352 -903 1173 -923 133 0 -1041 115 -569 485
3815 485 822 -67 -878 -968 76 369 343 -293 -973 -660 -1101 772 -159 -395 -1073 -850 842 1069 -960
3834 -960 -433 332 -350 64 1178 471 -479 -1079 1310 369 25 -548 -275 -691 435 -244 1241 582 -37
3853 -37 -46 -878 -14 1022 77 -488 -229 521 871 46 531 -1004 -208 -103 -202 -474 -1370 -268 -495 -16
3873 -16 -13 171 -497 -509 -317 481 970 5 364 -491 -431 -143 418 -459 154 -331 -774 784 1367 -855 -659
3894 -659 -1003 -603 1465 427 -469 -863 -623 1146 1125 688 469 -516 181 524 901 397 -67 37 -277
3913 -277 -302 205 1651 181 -1199 595 194 761 1141 -590 -969 -793 838 -313 1219 -1013 334
3930 334 340 -268 628 683 -99 -873 544 937 361 -166 -831 -837 792 84 290 -614 -117 -426 -270 -374 -16
3951 -16 -256 -1664 1015 128 583 182 394 -742 -537 611 500 36 -649 -550 -713 707 138 242 -200
3970 -200 -860 -478 264 129 -540 -257 -835 -238 1042 1132 647 -1591 -318 4 173 188 -52 -800 -791 473
3990 473 688 467 676 -805 -444 -41 -721 330 21 -353 234 -126 -389 1338 -512 -876 501 -654
4008 -654 286 -58 -297 -817 -1479 987 39 765 -870 499 378 -977 1076 469 -364 313 424 793
4026 793 285 1186 -1476 -563 -8 512 73 77 -1223 -77 674 595 965 -399 -315 -88 -395 668 315 -584
4046 -584 -520 -1310 1262 -720 -276 -544 -563 447 1169 962 958 -679 159 871 910 1332 -711 -21 280 219
4066 219 871 -96 684 -633 -1439 -322 215 715 -873 -496 -650 -220 -86 -306 -126 -923 -507 1004 515
4085 515 -61 617 -373 -1238 752 -394 -303 162 -932 -103 -347 521 541 129 -1094 -255 1181 336 764
4104 764 -34 -1051 258 523 431 -1017 244 -825 349 87 743 366 400 -1319 158 1032 871 489
4122 489 -602 -362 442 588 966 566 -553 -1006 -1391 1033 138 -584 384 -890 -133 692 0 -967 -209
4141 -209 -73 383 -240 -346 -761 -1067 225 -916 1349 1538 -798 -992 -340 -737 79 -90 -646 77 -55
4160 -55 -154 -29 -489 -629 808 -363 1301 1086 -203 -421 -168 150 374 1227 -124 258 -919 -471 83
4179 83 1368 -1355 -142 -128 -21 432 959 160 -564 260 282 -97 918 -676 -1754 -485 1623 1039
4197 1039 881 251 -1032 213 381 1961 1722 29 -1516 1381 637 982 470 3 766 -319 244
4214 244 -99 938 -719 -1327 824 1411 720 -602 -1308 -662 -424 1065 725 -296 -402 399 73 350
4232 350 634 431 -513 -471 752 826 239 -684 -130 368 649 110 -1089 -1192 -672 -616 527 523 399 -396 -1615
4253 -1615 -334 591 -1 -1202 -678 -613 180 776 383 -143 -608 -609 674 921 755 108 -732 327 -127
4272 -127 -297 295 -1211 106 -545 406 -58 488 -1072 -370 57 737 135 570 -622 -787 59 -115 377
4291 377 -423 -129 -739 -289 -149 954 139 -991 -296 706 54 -83 -504 936 304 206 -157 105 -548
4310 -548 -579 116 -331 673 202 157 -588 -900 0 -230 228 -430 -585 -518 957 -209 21 -495 -1005 -543
4330 -543 -83 -23 -577 505 -941 138 1040 -124 -864 -187 -402 612 784 -23 222 -331 -1171 370
4348 370 737 773 -45 -332 -1207 773 376 76 628 191 -773 272 202 215 -317 -657 436 1095 1222 -629
4368 -629 -545 586 -629 1273 432 302 -848 -1245 963 925 357 -830 -1017 -38 -1002 -138 -539 360 -1012
4387 -1012 124 188 -127 317 -70 -714 -62 473 -85 -78 86 -174 -1665 -365 1244 446 -127 11 -481
4406 -481 -279 195 735 -403 -146 -137 -26 888 167 -1061 -235 -1431 1108 379 -568 -460 -1101 716 85
4425 85 885 -71 -651 -780 904 445 972 513 -1009 1297 347 67 -16 -133 -1282 -1175 1447 155 -418
4444 -418 -763 -905 187 570 969 81 17 -615 198 -189 1340 -794 172 -320 785 248 445 -550 -2045
4463 -2045 -809 856 559 361 843 -950 -30 731 148 283 193 218 -1108 93 327 48 -779 -402 806
4482 806 520 1162 -429 -759 127 253 284 32 -344 -488 -812 -1959 940 712 557 -1242 84 651 28
4501 28 450 -39 -616 -487 -323 -891 -127 -636 542 958 685 846 472 -1197 -926 -564 -999 873 -58
4520 -58 -693 -58 -421 -612 864 1142 -247 -682 357 -63 1278 307 -278 -140 -241 755 57 -351 -322
4539 -322 -135 -299 510 1657 -248 -530 -225 -16 1140 1220 -288 -1467 -1169 6 -97 1008 -1039 -914
4557 -914 -949 280 495 -250 185 -349 660 -70 1441 1460 66 -543 -451 1268 321 -611 -42 -822 -439
4576 -439 456 -329 1206 -380 750 -512 579 126 1428 -827 -897 -236 1152 724 -473 -683 -544
4593 -544 160 234 -841 509 -351 -822 1490 -6 -466 -473 -99 -547 37 380 205 -112 -310 67 -155 -333
4613 -333 218 -689 -402 -374 -780 422 -690 -1648 -453 575 286 -253 -384 52 -701 185 -225 949 -184
4632 -184 -900 -1347 -147 200 526 61 -338 424 -584 657 -489 -20 -1308 -783 -438 1209 949 -247
4650 -247 -410 -870 305 154 1156 -1707 -1194 373 179 725 1010 -564 124 -563 103 347 -266 -521
4668 -521 -79 440 443 1204 -168 281 33 -298 91 19 -244 -466 -1257 172 -699 -233 657 -204 -651 -180
4688 -180 63 1656 -390 -478 73 225 106 992 884 375 288 -31 167 219 197 -339 505 90 554 116 525
4709 525 -368 127 64 897 240 -594 -1255 -112 -69 1164 -260 225 -1211 -241 -48 1058 -105 -464 356
4728 356 -246 923 -48 -385 -292 -52 -529 278 219 972 -1100 151 328 889 -155 79 118 439 264 -93
4748 -93 857 -556 -571 -775 -655 724 55 -693 415 -663 -184 380 747 -148 -1227 975 1356 792 212
4767 212 -466 -989 -615 -26 210 188 -651 -840 384 699 -318 391 -332 67 -258 -62 948 61 326
4786 326 148 451 686 229 1148 -793 248 743 -283 -1103 -185 -1471 1080 1100 911 -1067 -598 -485
4804 -485 -114 65 77 128 -863 -248 271 73 562 689 -1407 -49 -5 470 864 282 -712 -398 440 -164
4824 -164 965 636 -984 -542 -207 482 -967 -721 -890 -90 -248 -879 460 -95 -365 214 1218 -186
4842 -186 265 -540 -2015 657 -440 789 530 -243 -669 386 397 -955 -374 -86 -547 308 925 149
4860 149 924 -180 -288 -188 -312 -169 -75 -156 209 -526 621 98 -992 -678 283 599 -24 2 -354 -362 -947
4881 -947 125 -350 337 -754 34 -816 590 593 -833 -957 -210 577 784 1083 216 -328 -545 569 -99
4900 -99 -96 -676 937 1057 301 263 909 -170 448 877 8 1025 1294 -154 -1195 79 532 163 1185
4919 1185 -311 -533 374 1030 1392 2 -410 -1672 684 1131 523 16 -460 950 1042 226 245 -403 -140
4938 -140 92 178 1001 298 223 116 -1 1113 105 -607 -1255 -450 138 -384 1486 137 -296 261 -837
4957 -837 -286 694 966 188 -402 388 798 969 -405 -290 -827 -101 953 729 148 -449 -292 -743 539
4976 539 650 -557 -413 -837 -66 671 -202 -310 -382 -1233 115 97 1060 49 -487 -1206 -245 -329 168 42
4996 42 -730 -808 -562 32 837 -1045 -204 257 866 198 -1057 -1597 59 -245 433 1517 -21 -781 -421
5015 -421 -681 328 645 -107 -403 -784 -707 -463 -97 -99 2 -834 344 -117 -253 -27 -1108 -524 163 45
5035 45 1083 353 -784 -181 1115 737 930 -312 -745 -35 1474 342 -169 -1008 -147 386 1340 721
5053 721 -412 -1948 -1204 269 1366 1083 -205 -559 -583 1147 398 743 -415 -1240 -348 191 716 423
5071 423 605 104 -301 -858 668 -73 134 219 -1051 -36 82 1081 -537 -137 467 473 -167 550 -932
5090 -932 -233 -651 -80 108 902 -985 -192 -311 619 475 467 -1273 636 -460 -66 -147 614 -335 -434 -110
5110 -110 467 535 -806 118 -387 82 204 -115 236 -30 -538 -566 813 1546 -665 178 -528 632 361
5129 361 687 381 -579 359 267 199 -894 -223 322 -1190 -178 53 -1084 -222 -1528 604 -49 -226 275
5148 275 -1467 -1029 837 713 -373 927 -660 510 45 1329 95 3 -688 -514 -693 533 165
5165 165 -670 -1157 -173 1235 528 615 -520 -243 -297 220 -81 -128 -125 -1095 677 1100 301 98 -235 151 -66
5186 -66 90 -344 -138 -100 -118 -93 1231 1116 -119 -329 -7 1418 704 73 27 118 657 -334 679 786 -250
5207 -250 -430 566 21 428 -398 -372 -503 -80 -579 507 397 -371 -385 -661 -292 649 -441 -98 360 -356
5227 -356 -72 558 436 44 -217 636 -1089 169 -277 -875 -307 -71 -1074 143 -96 -401 -181 582 651
5246 651 -374 286 -621 225 252 403 133 -408 -32 548 -708 726 222 -324 -278 -740 -293 617 740 -718
5266 -718 -635 -588 772 876 -111 -487 -739 -280 552 140 219 -8 -120 195 13 988 -279 103 30 1390
5286 1390 603 177 213 553 28 13 396 -521 -331 -598 -182 624 206 832 300 -368 -161 786 650 -854
5306 -854 -481 283 -560 -486 -78 -627 -715 -226 12 -881 1113 1028 -319 321 -604 -330 680 530 47 795
5326 795 -913 1126 -298 402 -841 -115 179 498 -292 -902 -352 -564 702 312 16 1197 -728 163
5344 163 663 259 209 -883 -763 -45 -189 591 551 -830 -66 527 1153 614 188 -514 481 -663 1174
5363 1174 470 935 -516 -1037 133 908 -497 242 123 1181 277 -409 -361 1479 -592 -371 -56 -440
5381 -440 1106 514 -78 415 865 436 -279 -534 -402 -905 -580 -188 135 1085 891 521 251 1674 67
5400 67 -721 -338 383 -41 -552 734 -1255 432 237 156 -485 544 30 329 850 47 -485 -448 -1805
5419 -1805 -1121 -31 222 938 514 -211 -1334 609 -289 -213 35 458 55 -142 -379 1179 -491 291
5437 291 708 165 -1818 -362 486 829 -609 -474 -143 33 759 261 -387 560 380 -442 -500 -185 921
5456 921 8 1289 -889 308 -519 1019 149 -908 -247 -341 23 1337 -51 87 -1730 -58 -235
5473 -235 -63 -284 -701 513 747 -794 -544 -192 -719 915 -1094 -459 -55 -131 -94 390 -805 500 -172
5492 -172 -177 -263 335 -1101 307 352 -405 -9 -868 -795 667 389 -1157 -261 -229 76 175 -310 -870 -595 -558
5513 -558 -853 392 -126 317 -77 78 2 888 820 -127 -83 -1321 -309 1399 216 212 -163 -301 578 213
5533 213 177 647 -884 -628 327 -364 -431 -49 682 -980 -124 109 -841 -253 -48 16 -796 493 -212 192
5553 192 116 -286 1174 1348 -240 -1131 -726 1331 277 253 537 332 241 -128 -85 198 412 857 122 -91
5573 -91 357 159 -288 -132 -930 -333 1078 -397 757 686 -1206 412 -786 522 -874 -1224 219 700
5591 700 602 843 1160 -730 336 -410 1504 534 -1248 1009 -257 -176 361 -150 -410 633 946 -931
5609 -931 -173 -94 1259 -126 -67 596 832 983 -595 22 -43 -941 610 260 25 -639 361 932 474
5628 474 574 402 284 711 116 57 87 954 -367 -355 -75 -607 -727 -50 384 692 26 347 395 65 -378
5649 -378 194 1443 -767 -850 -1589 482 -1373 395 672 668 -348 -765 710 836 1093 -753 -243 -739
5667 -739 762 -61 -324 -1870 309 156 -1171 -482 -766 -149 -371 -91 318 891 -770 131 -710 413
5685 413 482 630 -353 -468 1470 -580 514 -638 -1780 -229 632 -206 1153 -31 -794 -801 -910 -39
5703 -39 -579 -269 -144 -123 535 -274 150 266 -858 -1128 305 137 266 232 -285 71 -857 935 -536 -508
5723 -508 665 971 296 -995 902 -125 625 67 -107 967 328 -810 174 -562 -65 -1113 -88
5740 -88 -1229 -1187 394 -874 119 -275 -590 -113 -496 -57 -992 386 -447 -530 326 -313 392 114 -954
5759 -954 275 -1344 -242 -16 -334 -414 -180 -92 273 -576 -608 -43 167 1330 -368 -337 -210 438 365 -226
5779 -226 -543 327 898 -496 595 72 -102 56 195 -372 318 -210 -318 421 -178 7 311 -840 251
5798 251 -431 -659 -1016 -721 1222 209 -352 -389 128 29 1215 -86 -294 -586 -576 -180 187 1135 -615
5817 -615 -831 170 674 -160 219 951 517 538 -212 -655 116 246 -1432 654 967 -283 -1042 -143 0
5836 0 30 1253 -1388 -311 507 701 1205 -55 -572 -571 -540 -144 237 -98 -169 -982 285 -568 353 -587 -242
5857 -242 -179 -274 311 -488 167 -303 307 35 -1102 264 482 719 -306 -958 529 421 811 140 -450
5876 -450 -1186 313 -85 45 220 686 -1467 -390 913 860 -73 -332 -22 462 1120 296 1167 -724 -599
5895 -599 -92 -205 -144 224 -554 -114 124 505 -168 24 -203 -4 67 -499 -201 189 188 191 660 207 417 -804
5917 -804 -440 -102 219 -385 293 -636 62 -1108 785 286 -192 -241 784 595 486 614 -111 -541 -1048
5936 -1048 -635 47 -591 -353 -34 416 -661 126 10 -948 -934 691 -535 -530 -179 -244 -48 -720 -555 724
5956 724 506 -807 -197 -324 459 1069 -598 553 52 481 760 -165 -419 354 -104 576 -81 771 -898
5975 -898 378 -1412 -615 645 253 -205 -323 -232 235 -461 144 -171 -161 -89 301 -124 343 1131 782 -311
5995 -311 -552 -659 710 194 31 -969 425 -1535 310 -1096 -723 881 266 574 -67 -812 -779 110
6013 110 115 -313 -608 406 -869 113 -386 1079 -11 -38 -61 -770 0 -317 -892 645 -268 439 0 -119
6033 -119 415 -163 252 90 1304 494 -167 -431 8 1072 -243 355 788 948 -150 -652 877 -194
6051 -194 469 -1157 -181 177 692 347 647 895 -474 -114 -763 -488 -108 119 -95 128 -250 773 -35
6070 -35 -348 -174 -795 -1 -886 -611 163 1318 -726 363 563 -322 -272 515 411 324 -668 141 -326 424
6090 424 -21 -1663 -380 491 -214 352 -587 -398 -882 -165 109 1036 1257 551 298 -339 490 -594 849
6109 849 -346 22 191 790 -661 662 -170 -292 190 107 727 558 -149 257 -379 8 861 1056 517
6128 517 -187 645 625 -245 -164 -666 -251 506 -901 850 -784 -159 -35 691 1132 236 -58 789 -866
6147 -866 191 -210 33 -131 -51 1269 593 1472 -519 -165 -272 -1423 752 820 587 117 -220 -788 -316
6166 -316 133 205 81 68 -139 169 63 731 -257 -803 355 573 204 -624 -949 -268 256 -621 440 -1839
6186 -1839 -358 -177 -13 452 429 -316 390 472 -1108 -125 -217 829 533 895 64 -49 -511 -1226 -478 -402
6206 -402 801 387 276 269 -961 1136 393 -341 367 -891 -25 -981 517 422 522 -598 1292 -423
6224 -423 -295 528 -86 -214 -488 -734 0 -744 -491 -1313 162 1336 753 140 734 -315 -314 -1255 292
6243 292 1081 222 -794 -830 228 214 368 153 234 -1221 233 460 486 -436 247 608 449 -751 642
6262 642 -270 -407 -1190 1070 173 -363 184 -518 453 870 336 1031 343 -395 -283 420 -781 248 -605
6281 -605 790 396 108 971 85 -793 -1358 219 -21 -348 -440 98 -173 584 722 304 -58 -312 -464 1280
6301 1280 491 -965 188 733 254 614 -934 38 228 -310 -144 39 1043 -744 707 76 640 545
6319 545 -341 -741 519 -114 584 -220 517 250 1109 20 462 28 266 593 -529 417 35 88 -199
6338 -199 -98 -113 -374 606 -594 -229 -790 -1176 1667 746 442 -265 -418 690 393 -230 578 168 -1041
6357 -1041 98 -490 1074 694 -461 -254 713 88 990 500 427 408 -1090 -641 311 493 -310 -925 -120
6376 -120 323 956 101 1189 -688 -318 863 199 502 -707 102 662 250 249 -309 200 830 467 987
6395 987 -341 117 243 49 -9 191 134 486 -1275 -507 243 653 -311 -802 76 -1026 131 830 223
6414 223 -370 -13 226 981 316 -928 123 992 356 912 615 -25 -963 -432 31 -663 397 136 372
6433 372 511 972 118 572 -230 -440 135 -114 -122 -1434 -801 -569 0 395 895 795 -809 236 143 -295
6453 -295 17 518 -806 -211 159 413 364 734 -476 309 278 -517 -198 74 196 -299 501 -100 421 -258
6473 -258 769 -98 -53 711 519 -721 -484 -1487 -225 -388 488 622 -367 83 -723 -527 660 -223 -1007
6492 -1007 -1413 230 7 -896 165 -978 -576 244 1260 -1240 -54 -860 -679 -108 770 -494 -369
6509 -369 -292 -484 147 853 -472 660 1183 -359 -421 1306 -152 365 -276 -229 490 -269 -547 242 -760
6528 -760 109 -139 119 54 -1160 -476 -404 860 455 592 469 -849 1171 -325 -54 -546 -34 -412 -1277
6547 -1277 -554 821 412 21 575 -322 -355 -495 -19 -291 380 -798 280 -219 547 -176 -371 934 43
6566 43 414 -1051 679 -579 103 -595 168 114 -695 -216 545 181 688 -562 -82 324 -448 -268 -728
6585 -728 77 -289 -455 -477 877 -45 -393 -501 425 159 -366 -774 -590 -435 -284 730 374 -381 -2 925
6605 925 -137 254 -149 -353 217 -262 393 722 553 -276 -842 208 -1037 29 -276 686 1130 -253
6623 -253 447 -136 -531 294 344 -1489 306 -186 -1081 -271 316 -277 293 325 -980 615 -593 922 982
6642 982 -267 1363 -170 189 -1143 1085 133 1214 185 -816 210 -551 -1174 5 621 -138 -539
6659 -539 505 -281 258 256 -488 -529 -331 -769 -999 -1171 98 -311 -277 1523 157 -192 -319 -578 242 -478
6679 -478 -475 175 -87 1035 151 702 -520 136 -522 405 -182 -815 -924 -226 -343 -300 -343 189 -1139 -452
6699 -452 -581 567 -768 -841 -252 -368 740 -1179 -438 284 29 -410 -282 186 331 466 412 800 442
6718 442 604 -362 -301 -1439 -300 581 -226 -275 -297 -17 407 -1659 217 -405 379 -961 -568 -240 512
6737 512 575 183 -644 73 479 12 -565 -265 -170 651 -922 753 -42 -1227 246 -69 -245 -143 -172 -188
6757 -188 -37 -502 -557 -657 -1422 -40 -480 -460 991 125 -592 118 -18 441 578 -450 -359 660 -346
6776 -346 168 -861 -135 36 326 362 798 827 229 161 -215 -423 493 -700 -202 85 298 -314 421 -44
6796 -44 444 -91 576 776 -47 -1436 71 410 -438 -653 -8 582 521 -753 446 519 201 352 959 170
6816 170 -380 123 81 -277 -984 43 -286 -369 132 -410 -292 -935 1233 421 -516 -175 -392 352 511 -190
6836 -190 604 -237 938 736 463 -380 -508 -380 -226 195 -1270 1343 352 -973 -737 991 -204 51
6854 51 822 925 -375 -596 1197 344 -714 -538 -61 363 -615 162 150 593 -88 22 905 -429 -347 -423
6874 -423 -139 668 -363 -472 535 1289 -430 1139 867 1090 -7 -327 278 -1197 -1160 72 148 -142
6892 -142 618 169 166 651 -224 214 1354 -529 -31 -408 103 520 -1380 -783 -168 -1116 -465 12 -191 504
6912 504 -9 -308 -154 -241 -931 -376 -672 205 564 109 -883 -563 -428 -642 346 -190 217 818 -362 326
6932 326 -541 -253 -334 -923 61 469 953 -473 -69 19 193 216 776 -1465 367 -216 -318 987 297 217
6952 217 265 -94 -1584 -601 117 87 -311 -758 224 107 504 877 -513 -76 -265 -436 300 546 -407 346
6972 346 876 250 -214 -158 872 -576 596 885 808 109 616 84 -214 296 -288 33 762 -371 -813
6991 -813 -144 155 466 393 1131 -605 22 970 -445 -49 161 996 -205 -5 -382 519 454 -242 -470 9
7011 9 -236 767 -136 -585 758 4 -281 -1300 448 41 274 295 2 -265 -50 -1268 524 -314 458
7030 458 579 -914 -766 126 -468 209 -124 -293 -409 -269 -11 159 -1542 -545 -96 -1019 -141 1151 496
7049 496 253 -118 -595 272 44 -1164 -336 280 -53 -588 -509 612 -567 390 183 725 -890 -1187 -487
7068 -487 463 327 -156 -866 -665 677 -183 1274 -167 2 -152 546 68 -388 -582 166 1057 -454 -63
7087 -63 319 -7 -614 -653 605 993 -529 300 716 -924 1223 386 -466 -28 590 495 224 196 -583 20
7107 20 -524 -471 -947 431 147 -1148 -391 -2 339 -1107 842 981 385 152 223 186 1085 307 -509 560
7127 560 1113 127 -738 266 163 435 382 -211 -54 -354 -690 -20 -31 -460 262 181 1104 1424 -15 -223
7147 -223 -292 -621 -51 321 -172 379 225 -350 -1449 -863 -731 742 509 1137 352 455 -342 -338 285 74
7167 74 -126 -702 -21 -696 -137 -565 1350 -891 -611 -601 176 -87 -131 1 -764 -444 288 766 -566 -251
7187 -251 153 682 316 -1432 -248 -154 -54 -651 566 303 -624 102 -43 -162 -1117 643 -452 1101
7205 1101 -260 -1107 -3 -488 800 -125 247 584 236 -520 827 -1033 -1167 -245 -621 1162 537 358
7223 358 -292 -146 1185 621 -449 451 -585 43 495 -261 127 -190 187 -166 386 49 718 -401 -428
7242 -428 -615 278 378 -500 -415 222 875 528 138 -1067 -55 114 -809 -828 -120 373 -69 -369 400 403 354
7263 354 1318 67 799 372 324 126 313 -575 590 -365 496 25 69 -355 -643 569 59 480 58 -590
7283 -590 -549 314 -360 -337 471 -66 619 702 -568 -989 220 352 -350 131 -834 -408 554 -321 -973 -129
7303 -129 -242 -521 652 -987 907 1064 -346 201 658 89 -353 279 -979 396 1245 -71 214 -1111
7321 -1111 820 310 -217 -470 -742 319 216 161 -421 -190 682 -827 171 -145 480 -449 -150 959 237
7340 237 -478 -615 -924 -625 -267 -379 133 -580 107 -369 759 -19 -198 363 -30 -1204 -312 -359 174 -423
7360 -423 -474 -37 -286 -629 582 -932 -422 -61 -1051 -255 -1071 -911 -225 -786 -65 591 906 -994 840
7379 840 681 421 -8 669 320 310 -132 -332 -256 -772 -1004 -113 -209 -276 -785 343 173 1215 -189 -1436
7399 -1436 691 -130 -149 1392 -778 -85 -60 350 866 677 -78 -90 -613 404 -732 -71 295 405 -724
7418 -724 -48 -741 334 415 667 645 -1112 -393 83 -734 -1060 -174 681 79 347 -38 131 -87 -316 509
7438 509 -70 198 -1178 -865 -5 518 -90 -283 326 501 178 -192 -410 1236 -133 -505 26 132 467
7457 467 -497 485 -187 321 70 -338 709 -510 -986 -13 17 627 -587 284 25 -18 180 110 824 -140
7477 -140 -273 -723 -482 145 542 55 -1193 905 -943 -732 -228 70 -295 -540 -145 494 -212 785 -448
7496 -448 252 -605 153 -266 554 149 -86 191 1192 -402 9 -49 -50 851 -858 -317 590 167 -49 63
7516 63 2 53 616 -375 205 -899 -273 969 -356 679 -140 495 17 -997 220 365 979 134 -1024
7535 -1024 113 42 -383 -623 443 -682 -402 93 172 26 -1300 549 -368 622 -505 345 568 408
7553 408 105 -547 -239 1048 -87 321 332 279 -525 147 -40 -1296 -567 -120 50 -454 -42 167 577 -276
7573 -276 -625 -573 629 158 -920 -712 -1364 240 253 -588 -528 -577 -1440 -603 1246 -307 318 -595 -762 370
7593 370 -845 56 631 926 60 39 -88 515 367 160 831 -118 -133 303 -28 -217 773 260 -214 -482
7613 -482 -124 49 391 -288 -831 351 494 -611 -368 239 299 -9 1085 1018 -590 255 855 -316 -457
7632 -457 -196 -833 -1202 -489 -120 -569 450 -467 -1177 -419 -160 -304 -596 -407 -22 -486 -168 547 -766
7651 -766 19 -314 447 112 758 63 -608 79 525 139 28 457 71 142 1456 -81 677 -1082 -720
7670 -720 -81 270 605 1083 -642 -294 442 -85 488 -334 -373 469 590 -651 661 -1015 -81 -447 -502
7689 -502 811 -625 -833 -601 -141 261 1005 -779 789 816 -180 172 421 -295 406 -697 -40 754 -239
7708 -239 -482 1050 -488 -9 -1005 694 204 58 -587 500 -108 -427 709 -267 43 -352 71 -734
7726 -734 320 491 -268 -1231 -1530 156 1578 388 327 -166 711 -45 -442 176 -49 718 -361 -513 -610
7745 -610 145 204 -199 1363 565 301 679 -145 -629 -185 760 64 412 -63 345 -175 -23 -632 -1048 -270
7765 -270 -531 713 -722 1014 360 -348 -832 -804 966 -68 -320 600 90 405 -222 1072 16 -503
7783 -503 602 -1003 -281 569 1037 -333 -270 1369 -293 -308 -583 256 796 -21 -256 -339 -76 978 464
7802 464 -663 1097 914 311 -727 476 -383 142 -49 -201 159 856 -665 -131 -807 -206 1146 -787
7820 -787 17 -226 1024 960 427 -572 63 -375 -1578 -966 -1194 -441 27 797 -609 231 -387 382 -775
7839 -775 249 -760 -265 -318 135 120 917 903 -379 -346 662 343 -32 -872 -719 -85 313 514 -846 894
7859 894 -57 -1389 -636 -631 51 101 -336 -379 -327 1111 -181 1646 -403 -159 -1268 -692 -333 41 -117 587
7879 587 -494 -154 277 281 371 -280 -552 163 -352 -575 933 1060 -298 403 245 1084 6 614 -540
7898 -540 -82 731 -513 -64 615 -422 -730 819 436 -544 170 -515 -759 -211 1283 -133 -1311 -314
7916 -314 -505 -398 -310 -447 -331 -25 413 44 676 -776 141 -246 -393 -438 222 633 131 -675 -462 -188
7936 -188 -393 -595 346 363 -736 261 -397 -196 -902 -370 -544 541 -51 -423 283 464 34 -28 -923 24
7956 24 -1026 330 -31 266 -578 894 -34 307 -638 -605 -266 -508 -1006 -943 126 -181 187 457 222 -770
7976 -770 499 60 -171 343 126 -1179 295 -135 -33 167 -1106 48 -158 673 -1064 -468 569 -733
7994 -733 1159 842 -265 -347 -256 502 -161 308 -570 -304 259 -1042 -711 -302 -199 -286 1006 -522 -924
8013 -924 -107 -163 -918 -61 -499 -235 582 392 544 -12 -251 964 -435 30 57 -69 -259 -521 -590 26
8033 26 1228 -271 -363 564 642 442 47 528 273 541 -14 664 735 -729 -8 209 -183 -463 -253 -496
8053 -496 -653 -388 159 1104 193 132 308 268 -580 -157 1029 712 31 -63 -584 -130 206 -338 -1038 -452 842
8074 842 -1016 178 345 608 715 -260 -841 -532 -30 189 1422 -1031 -393 -774 384 -218 -568 -290
8092 -290 -626 -937 912 542 685 913 144 -799 407 -293 -728 290 783 -462 -154 -904 478 246
8110 246 -1146 579 -576 -217 -641 709 -580 -134 179 165 -209 -571 -234 381 304 84 88 501 -641
8129 -641 351 -99 -1373 168 -300 -648 271 761 -547 216 -521 -478 -622 -197 395 -845 501 -242 -297
8148 -297 638 -549 -710 -636 -294 1033 -176 -394 523 864 -825 -1141 -476 424 174 257 -187 -66 982
8167 982 -94 -108 846 1417 275 -863 83 80 -131 900 -114 136 -179 -309 -1 90 -455 -438 -1483 1398
8187 1398 253 -56 -304 143
8191A43
##END NTUPLES=NMR FID
##END=
