##TITLE=1H_SAM_33.249.TFA
 CD3OD+CF3COOD,108 sc, 
 27.9.2021
##JCAMPDX= 6.0         $$ Bruker NMR JCAMP-DX V2.0
##DATA TYPE= NMR FID
##DATA CLASS= NTUPLES
##ORIGIN= UXNMR, Bruker Analytische Messtechnik GmbH
##OWNER= root
$$ XWIN-NMR		Version 3.5
$$ Mon Sep 27 11:13:23 2021 Russian Standard Time (UT+4h)  she@DPX200
##.OBSERVE FREQUENCY= 200.1314
##.OBSERVE NUCLEUS= ^1H
##.DELAY= (6, 6)
##.ACQUISITION MODE= SIMULTANEOUS
##.ACQUISITION SCHEME= undefined
##.AVERAGES= 108
##.DIGITISER RES= 18
##SPECTROMETER/DATA SYSTEM= spect
##.PULSE SEQUENCE= zg30
##.SOLVENT NAME= MeOD
##.SHIFT REFERENCE= (INTERNAL, MeOD, 0, 15.7039)
##AUDIT TRAIL= $$ (NUMBER, WHEN, WHO, WHERE, WHAT)
$$ ##TITLE= Audit trail, XWIN-NMR		Version 3.5
$$ ##JCAMPDX= 5.01
$$ ##ORIGIN= Bruker BioSpin GmbH
$$ ##OWNER= she
$$ F:/spectra/data/she/nmr/H-F/1/audita.txt
$$ ##AUDIT TRAIL=  $$ (NUMBER, WHEN, WHO, WHERE, WHAT)
(   1,<2021-09-27 11:08:20.98 +0400>,<she>,<DPX200>,
      <continue with go, POWCHK disabled, PULCHK disabled
       configuration hash MD5:
       00 E9 B6 7A A2 85 ED C7 34 08 36 98 17 FE 4E 26
       data hash MD5: 16K
       F9 44 F6 A5 45 3E 50 F3 55 1A 28 06 69 EA 88 8A>)
$$ ##END=
$$ 
$$ hash MD5
$$ 2B ED 9D 97 47 37 54 89 35 C2 45 92 83 3D C8 D2
##$RELAX= 
##$RELAX= 
##$RELAX= 
##$RELAX= 
##$RELAX= 
##$RELAX= 
$$ Bruker specific parameters
$$ --------------------------
##$DU= <F:/spectra>
##$EXPNO= 1
##$NAME= <H-F>
##$PROCNO= 1
##$TYPE= <nmr>
##$USER= <she>
##$AMP= (0..31)
100 100 100 100 100 100 100 100 100 100 100 100 100 100 100 100 100 100 
100 100 100 100 100 100 100 100 100 100 100 100 100 100 
##$AQSEQ= 0
##$AQ_mod= 1
##$AUNM= <au_zg>
##$AUTOPOS= <>
##$BF1= 200.13
##$BF2= 200.13
##$BF3= 200.13
##$BF4= 200.13
##$BF5= 200.13
##$BF6= 200.13
##$BF7= 200.13
##$BF8= 200.13
##$BYTORDA= 1
##$CFDGTYP= 0
##$CFRGTYP= 5
##$CHEMSTR= <none>
##$CNST= (0..31)
1 1 145 1 1 1 1 1 1 1 1 1 1 1 1 1 1 1 1 1 1 1 1 1 1 1 1 1 1 1 1 1 
##$CPDPRG= <>
##$CPDPRG1= <>
##$CPDPRG2= <>
##$CPDPRG3= <>
##$CPDPRG4= <mlev>
##$CPDPRG5= <mlev>
##$CPDPRG6= <mlev>
##$CPDPRG7= <mlev>
##$CPDPRG8= <mlev>
##$CPDPRGB= <>
##$CPDPRGT= <>
##$D= (0..31)
0 1.2 0 0 0 0 0 0 0 0.06 0 0.03 0 0 0 0 0.0002 0 0 0 0 0 0 0 0 0 0 0 0 
0 0 0 
##$DATE= 1632726068
##$DBL= (0..7)
120 120 120 120 120 120 120 120 
##$DBP= (0..7)
150 150 150 150 150 150 150 150 
##$DBP07= 0
##$DBPNAM0= <>
##$DBPNAM1= <>
##$DBPNAM2= <>
##$DBPNAM3= <>
##$DBPNAM4= <>
##$DBPNAM5= <>
##$DBPNAM6= <>
##$DBPNAM7= <>
##$DBPOAL= (0..7)
0.5 0.5 0.5 0.5 0.5 0.5 0.5 0.5 
##$DBPOFFS= (0..7)
0 0 0 0 0 0 0 0 
##$DE= 6
##$DECBNUC= <off>
##$DECIM= 32
##$DECNUC= <off>
##$DECSTAT= 4
##$DIGMOD= 1
##$DIGTYP= 9
##$DL= (0..7)
0 120 120 120 120 120 120 120 
##$DP= (0..7)
150 150 150 150 150 150 150 150 
##$DP07= 0
##$DPNAME0= <>
##$DPNAME1= <>
##$DPNAME2= <>
##$DPNAME3= <>
##$DPNAME4= <>
##$DPNAME5= <>
##$DPNAME6= <>
##$DPNAME7= <>
##$DPOAL= (0..7)
0.5 0.5 0.5 0.5 0.5 0.5 0.5 0.5 
##$DPOFFS= (0..7)
0 0 0 0 0 0 0 0 
##$DQDMODE= 0
##$DR= 18
##$DS= 0
$$ [...]
##$SUBNAM2= <"">
##$SUBNAM3= <"">
##$SUBNAM4= <"">
##$SUBNAM5= <"">
##$SUBNAM6= <"">
##$SUBNAM7= <"">
##$SUBNAM8= <"">
##$SUBNAM9= <"">
##$SW= 20.0188988654967
##$SWIBOX= (0..15)
0 0 2 0 0 0 0 0 0 0 0 0 0 0 0 0 
##$SW_h= 4006.41025641026
##$TD= 16384
##$TD0= 1
##$TE= 0
##$TE2= 300
##$TE3= 300
##$TEG= 300
##$TL= (0..7)
0 120 120 120 120 120 120 120 
##$TP= (0..7)
150 150 150 150 150 150 150 150 
##$TP07= 0
##$TPNAME0= <>
##$TPNAME1= <>
##$TPNAME2= <>
##$TPNAME3= <>
##$TPNAME4= <>
##$TPNAME5= <>
##$TPNAME6= <>
##$TPNAME7= <>
##$TPOAL= (0..7)
0.5 0.5 0.5 0.5 0.5 0.5 0.5 0.5 
##$TPOFFS= (0..7)
0 0 0 0 0 0 0 0 
##$TUNHIN= 0
##$TUNHOUT= 0
##$TUNXOUT= 0
##$USERA1= <user>
##$USERA2= <user>
##$USERA3= <user>
##$USERA4= <user>
##$USERA5= <user>
##$V9= 5
##$VALIST= <valist>
##$VCLIST= <CCCCCCCCCCCCCCC>
##$VD= 0
##$VDLIST= <DDDDDDDDDDDDDDD>
##$VPLIST= <PPPPPPPPPPPPPPP>
##$VTLIST= <TTTTTTTTTTTTTTT>
##$WBST= 1024
##$WBSW= 4
##$XGAIN= (0..3)
0 0 0 0 
##$XL= 0
##$YL= 0
##$YMAX_a= 1373741
##$YMIN_a= -2207482
##$ZGOPTNS= <>
##$ZL1= 120
##$ZL2= 120
##$ZL3= 120
##$ZL4= 120
##$ABSF1= 10
##$ABSF2= 0
##$ABSG= 5
##$ABSL= 3
##$ALPHA= 0
##$AQORDER= 0
##$ASSFAC= 0
##$ASSFACI= 0
##$ASSFACX= 0
##$ASSWID= 0
##$AUNMP= <proc_1d>
##$AZFE= 0.1
##$AZFW= 0.1
##$BCFW= 1
##$BC_mod= 2
##$BYTORDP= 1
##$COROFFS= 0
##$CY= 11.3945322036743
##$DATMOD= 1
##$DC= 2
##$DFILT= <>
##$DTYPP= 0
##$F1P= 2.36226072786647
##$F2P= -0.459571619588291
##$FCOR= 0.5
##$FTSIZE= 0
##$FT_mod= 4
##$GAMMA= 1
##$GB= 0.15
##$INTBC= 1
##$INTSCL= 1
##$ISEN= 128
##$LB= 0.24
##$LEV0= 0
##$LPBIN= 0
##$MAXI= 10000
##$MC2= 0
##$MEAN= 0
##$ME_mod= 0
##$MI= 1.114404
##$NCOEF= 0
##$NC_proc= 0
##$NLEV= 6
##$NOISF1= 3.799351
##$NOISF2= 2.8
##$NSP= 1
##$NTH_PI= 0
##$NZP= 0
##$OFFSET= 15.70392
##$PC= 1
##$PHC0= -14072.31
##$PHC1= 1.400889
##$PH_mod= 1
##$PKNL= yes
##$PPARMOD= 0
##$PSCAL= 0
##$PSIGN= 0
##$REVERSE= no
##$SF= 200.130013532006
##$SI= 16384
##$SIGF1= 3
##$SIGF2= 2
##$SINO= 400
##$SIOLD= 16384
##$SREGLST= <1H.CDCl3>
##$SSB= 0
##$STSI= 0
##$STSR= 0
##$SW_p= 3612.71676300578
##$SYMM= 0
##$S_DEV= 0
##$TDeff= 0
##$TDoff= 0
##$TI= <>
##$TILT= no
##$TM1= 0
##$TM2= 0
##$TOPLEV= 0
##$USERP1= <user>
##$USERP2= <user>
##$USERP3= <user>
##$USERP4= <user>
##$USERP5= <user>
##$WDW= 1
##$XDIM= 8192
##$YMAX_p= 0
##$YMIN_p= 0
$$ End of Bruker specific parameters
$$ ---------------------------------
##NTUPLES= NMR FID
##VAR_NAME=  TIME,          FID/REAL,        FID/IMAG
##SYMBOL=    X,             R,               I
##VAR_TYPE=  INDEPENDENT,   DEPENDENT,       DEPENDENT
##VAR_FORM=  AFFN,          ASDF,            ASDF
##VAR_DIM=   8192,          8192,            8192
##UNITS=     SECONDS,       ARBITRARY UNITS, ARBITRARY UNITS
##FACTOR=    0.0002496,     1,               1
##FIRST=     0,             0,               0
##LAST=      2.0444736,     0,               0
##MIN=       0,             -2207482,        0
##MAX=       2.0444736,     1373741,         0
$$ Real data points
##PAGE= N=1
##DATA TABLE= (X++(R..R)), XYDATA
$$ [...]
559 6569 -168450 -141676 51719 184284 101339 -101732 -197699 -72937 128069 175934 15591
570 15591 -164921 -153989 34450 184609 127482 -70384 -180398 -77331 118877 178055 32295
581 32295 -149244 -158447 11219 165430 124455 -64264 -182556 -89349 105206 175823 44870
592 44870 -135936 -159480 2956 164575 140230 -43638 -172657 -99778 86687 174565 62644
603 62644 -120665 -166506 -22690 143413 139983 -26791 -163855 -114110 63431 166204 75920
614 75920 -99981 -156712 -29269 136042 147905 -8261 -150599 -116046 53707 161412 79883
625 79883 -97241 -168029 -49927 122043 146851 649 -147261 -125599 42029 164060 105314
636 105314 -69299 -156632 -57507 110617 151506 19365 -137017 -139858 12307 140831 98587
647 98587 -63166 -155107 -69690 94951 151420 38666 -111710 -125812 13186 143731 113019
658 113019 -46056 -150349 -85360 71940 139326 39336 -114801 -144871 -13146 128270 121309
669 121309 -21862 -133617 -85124 68309 152243 69135 -89231 -138357 -27425 111392 114407
680 114407 -20120 -139966 -107453 41600 137249 68954 -79410 -131582 -27472 116141 134965
691 134965 8199 -122405 -106985 36270 136578 76518 -76981 -147819 -59855 87279 127389
702 127389 16181 -117124 -115201 21853 135783 101986 -41018 -124824 -59426 79786 128489
713 128489 26666 -107311 -123052 -3521 108764 88361 -40539 -128703 -71938 69477 134339
724 134339 48169 -84250 -111912 -3695 117077 108739 -23391 -129288 -89227 47105 120959
735 120959 49109 -86062 -128827 -27159 103738 115556 -2340 -110294 -84834 44755 128752
746 128752 69714 -67053 -124411 -38988 87465 106197 -3884 -116391 -100712 24802 120269
757 120269 75689 -54428 -119212 -40640 89225 123716 20890 -101427 -104861 12216 112028
768 112028 80987 -49269 -126433 -64911 66001 116201 32185 -86779 -103141 1947 109300
779 109300 94840 -24579 -110429 -66803 55492 112607 37746 -85040 -112385 -15228 96735
790 96735 94164 -19664 -111443 -72920 51628 121388 55927 -69107 -111549 -22848 93017
801 93017 101647 -8985 -110654 -89087 29233 110963 61230 -59465 -112795 -34378 85577
812 85577 107866 9049 -94778 -86531 23204 107938 67530 -52812 -113863 -45396 70714
823 70714 102609 13853 -90990 -94977 13263 108410 79054 -37957 -107417 -51623 62969
834 62969 107262 30088 -82829 -102625 -5487 94523 80845 -27108 -104051 -63305 49650
845 49650 108509 42678 -71122 -96804 -8570 91522 85613 -17351 -102095 -71752 39887
856 39887 103882 44122 -69215 -102864 -19329 86072 94564 -3285 -95970 -74400 34640 106449
868 106449 57682 -56350 -105420 -34061 71799 93625 5642 -91954 -83927 19748 98380
879 98380 63632 -42177 -95537 -36463 67644 97690 15256 -82634 -84607 9128 91468 65488
891 65488 -37896 -101647 -50573 57091 97321 25567 -74002 -87513 2093 90804 77399 -21547
903 -21547 -95841 -58898 46214 95061 32873 -67724 -92860 -12326 80491 78407 -14683 -90617
915 -90617 -60799 41080 97257 43432 -58597 -89928 -16918 76409 82223 -8296 -91226 -72169
927 -72169 28139 92846 49216 -52380 -94316 -28390 72348 90117 6189 -81477 -74088 18307
939 18307 88783 57525 -40596 -92531 -39388 57010 84612 12948 -74069 -76258 9763 84847
951 84847 63693 -30648 -87732 -40822 53332 88727 21150 -70298 -83061 -1489 80209 68566
963 68566 -25356 -90886 -53586 45211 90013 32857 -60322 -83668 -8927 78723 74969 -12389
975 -12389 -85051 -58264 31992 85786 37716 -55320 -85435 -18213 70231 76117 -4773 -79710
987 -79710 -61045 27802 87314 46426 -48291 -86261 -25684 64604 78530 3077 -76706 -70125
999 -70125 16539 83874 54594 -36916 -84255 -35009 54417 81451 14846 -68235 -72309 7043
1011 7043 77036 56603 -28864 -82201 -40499 47471 79743 20358 -63445 -74247 1590 75733
1023 75733 63286 -21371 -82119 -47211 41843 83419 27668 -60188 -79922 -8031 71808 67370
1035 67370 -12343 -79320 -54197 32583 82891 35936 -50017 -78570 -16155 63872 70440 -4698
1047 -4698 -75229 -58568 25068 79230 41004 -43055 -77923 -22538 59730 73620 3066 -70629
1059 -70629 -62304 18064 77355 48750 -35588 -79963 -33728 50834 75708 11386 -65980 -65771
1071 -65771 7882 73340 56051 -25632 -77773 -37149 44719 74381 17575 -58955 -69272 564
1083 564 68950 56885 -22173 -75862 -41612 40428 75411 25956 -54267 -71534 -4887 68155
1095 68155 63804 -14494 -74918 -48691 32395 75735 32728 -48176 -74003 -14724 61316 65622
1107 65622 -4967 -67685 -51300 23799 74306 39371 -40321 -72680 -19678 54595 65200 -534
1119 -534 -65332 -58423 17137 70629 42053 -34319 -73356 -25743 51763 68926 9273 -60832
1131 -60832 -61065 8557 69433 49095 -28927 -72828 -34515 43157 69521 16465 -55521 -63642
1143 -63642 3676 65415 51741 -20925 -67483 -35906 38042 69225 19743 -53361 -65080 -2394
1155 -2394 61568 53743 -16317 -68339 -41559 32964 69139 28665 -45265 -65980 -7967 58516
1167 58516 59051 -7332 -63692 -47847 21544 66818 32493 -39282 -65990 -17022 51521 59790
1179 59790 655 -58315 -48638 18682 65962 37698 -33546 -65763 -20978 46805 61831 3803
1191 3803 -59166 -55175 12469 64681 42595 -27469 -65935 -27104 43262 65209 13301 -53359
1203 -53359 -56464 4896 59917 45709 -21729 -64378 -34204 34775 61248 16912 -48417 -56035
1215 -56035 -754 57856 48306 -13582 -60870 -36105 31350 62709 22401 -43186 -59546 -8883
1227 -8883 52010 51289 -9757 -59537 -42494 24031 61885 29222 -35259 -58196 -12495 47305
1239 47305 54177 -2487 -54610 -44619 15059 57180 32234 -31493 -58932 -18544 42959 53740
1251 53740 2122 -51930 -44980 13708 58700 36159 -26851 -59888 -23087 38320 55899 7874
1263 7874 -49784 -51686 4600 55342 40462 -20720 -57022 -28456 32010 56614 15617 -42276
1275 -42276 -50717 -433 48894 41232 -13802 -55010 -33095 26354 53056 19467 -37891 -51016
1287 -51016 -4594 47479 45624 -7970 -51457 -34904 22130 54104 24133 -33864 -54397 -13163
1299 -13163 42181 47925 -691 -49131 -40401 15495 53117 30194 -27280 -51460 -16434 38950
1311 38950 48315 2584 -46491 -42546 9804 49872 31795 -24576 -52764 -19344 35324 50113
1323 50113 8162 -43390 -44063 6055 48570 35708 -17963 -51145 -25584 29377 49718 14773
1335 14773 -38587 -47134 -1371 45013 39574 -10952 -48120 -29746 23301 49059 19134 -34313
1347 -34313 -46601 -5773 39849 39790 -7039 -46781 -33469 18613 49376 22423 -29459 -46948
1359 -46948 -9340 38683 45110 -1279 -45323 -37232 14106 47968 27286 -26008 -48761 -17123
1371 -17123 34277 46183 3660 -42831 -37673 10216 46042 29286 -20222 -46155 -20054 30870
1383 30870 45182 6947 -38942 -41054 3494 43419 33405 -16418 -47283 -24246 27352 47929
1395 47929 13479 -34635 -43545 -1911 41232 37812 -11079 -45853 -29727 20217 45810 18123
1407 18123 -30892 -44476 -7100 39114 39370 -4573 -42057 -29685 16236 45268 21219 -27669
1419 -27669 -44788 -11111 35521 40508 -2105 -42147 -34797 12996 46007 26454 -23125 -44742
1431 -44742 -14510 31775 43584 4070 -39806 -38369 6789 43064 28791 -18254 -44550 -19918
1443 -19918 28757 42541 8820 -35939 -38027 4449 41586 31711 -13204 -44411 -23227 25089
1455 25089 43892 12858 -33549 -41099 -2026 39316 34835 -9218 -42382 -27426 20532 43445
1467 43445 18116 -28698 -41162 -6117 34732 36900 -4629 -41761 -30098 16125 42835 20630
1479 20630 -24819 -42760 -9315 34348 38901 -1149 -39475 -32504 12565 42642 23280 -23838
1491 -23838 -44044 -14104 32684 39963 3482 -38131 -34430 8105 42233 28233 -18083 -41835
1503 -41835 -18068 27223 40605 7472 -33944 -36974 3432 38114 29751 -13355 -41267 -20526
1515 -20526 23939 41209 10637 -30799 -36845 -133 37547 32238 -10348 -40135 -25500 19858
1527 19858 42067 14657 -28873 -39998 -3970 35622 34894 -6336 -39429 -28217 15789 41351
1539 41351 18833 -24689 -39767 -9530 33249 35719 -2588 -38560 -29944 12211 39673 21313
1551 21313 -22291 -39790 -10818 30740 37124 739 -34540 -31748 7819 38448 23737 -19372
1563 -19372 -40529 -15459 25643 39057 4952 -32242 -33646 4414 37615 28234 -13735 -38622
1575 -38622 -19836 22321 37891 9682 -30778 -35942 -439 34475 27785 -11183 -38185 -20793
1587 -20793 19886 39097 12401 -27649 -35311 -2178 34409 31017 -6818 -37906 -25349 16048
1599 16048 38109 15265 -25085 -36605 -7744 30868 33512 -1612 -35415 -25684 12560 37632
1611 37632 19380 -21450 -36557 -10265 28092 33241 -474 -33953 -29085 8897 36223 22243
1623 22243 -17194 -36612 -13311 25775 36138 5476 -30351 -31788 4295 34264 25637 -13479
1635 -13479 -37038 -18911 20627 34743 7757 -28361 -31732 1391 33288 27840 -9304 -34461
1647 -34461 -18848 18739 34493 10795 -25896 -34211 -2366 31854 27729 -8284 -35144 -22820
1659 -22820 16430 36593 14947 -22845 -33689 -5632 30855 31151 -3438 -33154 -26077 12155
1671 12155 34169 17447 -19684 -35000 -9685 25789 32041 1494 -31367 -26057 8395 34334
1683 34334 20876 -15744 -33865 -13107 23606 31925 3861 -29526 -29457 3535 32328 24112 -12801
1696 -12801 -33434 -15745 20957 34460 9371 -26878 -30351 1100 30646 25188 -9743 -33831
1708 -33831 -18234 17085 33387 10573 -25008 -30332 -1160 29792 26940 -6194 -32458 -21242
1720 -21242 15888 32912 12860 -22779 -33014 -5634 27192 27739 -3586 -32040 -23582 11562
1732 11562 33311 17326 -17613 -31504 -8149 23650 30397 1008 -29792 -25461 7628 30449
1744 30449 17760 -15561 -32018 -12221 22465 31186 4452 -26008 -25947 6421 31710 21782 -12512
1757 -12512 -31288 -15018 18710 30757 7014 -26463 -29130 1060 28807 22496 -9303 -31765
1769 -31765 -16588 18362 31136 10699 -22043 -29409 -1130 27232 23990 -7588 -31594 -20124
1781 -20124 13427 29558 11077 -20846 -29443 -4897 25947 26098 -1935 -28650 -21337 10786 31043
1794 31043 14766 -17738 -30948 -8520 23163 27601 623 -27886 -23495 6432 28735 17663
1806 17663 -13955 -27823 -10190 20377 28162 3393 -25362 -23824 3746 27409 18885 -11994
1818 -11994 -30387 -13689 19073 27996 5317 -22616 -25791 3490 28398 21238 -7775 -28335
1830 -28335 -15771 15477 27590 8621 -22196 -27080 -2259 24306 22580 -5791 -26037 -17565
1842 -17565 13562 28582 12201 -19001 -25972 -3504 22954 23396 -3084 -27023 -20349 9008 26431
1855 26431 12505 -16236 -26852 -7615 21687 25849 1170 -24334 -21007 6492 27420 16504
1867 16504 -13406 -27655 -11082 17383 25210 1885 -23333 -23221 4001 25494 17723 -9783 -25864
1880 -25864 -11677 15547 25857 4743 -21967 -23623 596 23683 18946 -8027 -27220 -14935
1892 -14935 13572 25905 8858 -18424 -24194 -1366 24026 21666 -4392 -23981 -17215 11384
1904 11384 25686 10185 -16384 -25243 -5943 19906 21874 -1594 -23601 -17702 8448 25461
1916 25461 14224 -13178 -24522 -7372 18330 22620 339 -23188 -20703 5002 23770 14161
1928 14161 -11470 -24897 -9796 17083 24750 4542 -20218 -21006 2654 23726 18208 -8556 -25133
1941 -25133 -13330 13808 23180 6142 -19304 -22019 178 22373 19395 -5491 -23416 -12705
1953 -12705 11907 25368 8030 -16856 -22087 -3142 20893 19569 -4268 -23421 -16616 8057
1965 8057 24071 12078 -12931 -23517 -5554 18289 22623 728 -20836 -17991 4934 23307
1977 23307 12916 -12307 -23779 -9295 15815 22201 2031 -20225 -19775 5108 23741 17460 -8065
1990 -8065 -23515 -10272 14598 23303 3587 -19329 -21375 405 21880 16798 -7998 -24364 -13045
2003 -13045 11796 24624 7472 -15727 -20983 -1423 21063 18620 -4139 -22601 -15382 8994
2015 8994 22987 8966 -16433 -22360 -3976 19322 21504 -176 -22299 -17571 8802 24197 12986
2028 12986 -13516 -24177 -7880 16500 21980 672 -22275 -20118 3441 22569 14730 -10749
2040 -10749 -22651 -8938 15530 23787 4090 -19699 -19468 3288 22621 15598 -9002 -25377 -12441
2053 -12441 13848 22252 5078 -19694 -21700 1016 22478 18316 -6136 -23641 -13955 12422 24642
2066 24642 7735 -16970 -24320 -3173 20905 20269 -3792 -23699 -16670 10132 24204 10556 -15035
2079 -15035 -24119 -3927 20225 21686 -1567 -22869 -18281 7315 23398 12018 -14001 -25811
2091 -25811 -7604 18473 24160 1647 -23088 -18561 6784 25026 15407 -11242 -24345 -9221
2103 -9221 16903 22537 3010 -21547 -22178 3358 23013 16519 -9329 -25055 -10296 16259 24995
2116 24995 5531 -20129 -21690 1635 23248 17402 -9299 -26220 -13801 13245 24400 6952
2128 6952 -19522 -23437 -1334 23365 19906 -4929 -23132 -14727 13105 25265 10110 -17926 -24629
2141 -24629 -2763 20483 20180 -3882 -24323 -16883 9697 25092 11662 -14285 -24703 -4466
2153 -4466 21495 22651 11 -23542 -18120 9391 24540 12378 -13952 -25743 -7426 18340
2165 18340 22029 361 -21901 -18734 6338 25812 14369 -11508 -23922 -8722 17401 22581
2177 22581 2186 -21696 -20555 4937 23829 15191 -9827 -24220 -8823 16071 22949 4183
2189 4183 -19991 -19583 2653 24112 17345 -8428 -24581 -12375 13666 23265 6200 -19486 -22357
2202 -22357 967 21687 18391 -5582 -22428 -12186 13499 24604 8271 -17101 -21649 -1329
2214 -1329 20049 19364 -5458 -23488 -13902 10949 23614 9442 -15741 -22250 -2373 19728 20125
2227 20125 -2851 -21262 -14871 8977 22160 10559 -14139 -21562 -5594 18050 19219 -2061
2239 -2061 -21027 -14613 7741 21419 11308 -12005 -20214 -5069 17283 21126 865 -19174 -17573
2252 -17573 5256 20507 11723 -9997 -21209 -8429 14421 20545 2819 -16819 -16990 3223 20277
2265 20277 13135 -7633 -19499 -8491 13216 19325 3265 -17076 -15861 1437 17521 14032 -6766
2278 -6766 -19637 -9192 12244 19588 4793 -14524 -17443 419 17424 13943 -4784 -19126 -11268
2291 -11268 9171 19446 6379 -13015 -17170 -446 15952 15037 -2989 -16294 -10621 8392 18388
2304 18388 7670 -11678 -17025 -3578 13840 14385 -1396 -16548 -10595 5668 16686 8906 -10247
2317 -10247 -15696 -4612 13024 15383 -117 -14345 -12790 3102 15070 8260 -7031 -16576 -6323
2330 -6323 10668 14463 1386 -12443 -12713 1756 14624 10682 -5468 -14428 -5794 8520 14430
2343 14430 1764 -11529 -12957 -172 13016 11092 -3391 -13607 -7417 7763 13051 4793 -8561
2356 -8561 -12580 -1377 11548 11724 -856 -11574 -8113 4912 12884 6723 -6027 -11551 -3339 9156
2370 9156 10759 725 -9875 -9044 3566 11724 7256 -5278 -12577 -3826 8390 11178 860 -9401
2384 -9401 -9522 1637 11631 8075 -3908 -12015 -6296 6322 11594 3940 -8174 -10109 -800 9814
2398 9814 9247 -1847 -10672 -6042 5256 10310 3980 -5920 -9749 -3250 7695 9626 -545 -9713
2412 -9713 -8090 2256 10476 6540 -4913 -9980 -4185 7922 10237 777 -8593 -9872 369 9537
2426 9537 7769 -2712 -10263 -6450 5095 10369 4461 -6225 -9459 -1296 8413 8107 -436 -9742
2440 -9742 -6964 3021 10780 5085 -5841 -9455 -3710 7938 9071 376 -9361 -7102 3367 10712
2454 10712 7030 -5169 -10302 -4924 7669 11391 2527 -9480 -9764 741 9833 7838 -3079 -10737
2468 -10737 -6051 5544 11644 5066 -8057 -10045 -524 9928 9617 -451 -10888 -8015 4500
2481 4500 11867 5571 -6929 -11099 -2812 9072 10921 -208 -10995 -9292 3435 11901 6970 -6084
2495 -6084 -13680 -4848 9073 11890 1573 -10865 -10382 1349 12234 9275 -4870 -12497 -6216 8228
2509 8228 12762 2817 -10034 -11304 1342 12548 9412 -4240 -13446 -8360 7828 14015 4841 -10091
2523 -10091 -12685 -1340 13523 11139 -1437 -14391 -9339 5334 14555 5905 -10189 -13572 -2820
2536 -2820 11583 12470 -1445 -13166 -9902 3923 14765 7477 -8223 -14149 -3791 11467 14258
2549 14258 -205 -13901 -12602 3674 14897 7950 -7526 -14676 -4858 11612 15009 2057 -14091
2562 -14091 -11885 3278 14379 10392 -6304 -15399 -7399 10521 15158 2609 -13600 -13315 1509
2575 1509 14872 11724 -6098 -15863 -7038 10376 15029 4196 -12409 -14528 105 15038 12181
2588 12181 -4578 -17019 -9738 9045 16159 6376 -12861 -15779 -1172 16696 13800 -2456 -15908
2601 -15908 -11122 6661 15355 6998 -11572 -16908 -2600 13718 14793 -3119 -16279 -11522 6923
2614 6923 17062 7350 -10825 -16326 -3255 14060 15446 -1591 -16815 -12310 5669 15829 7466
2627 7466 -10550 -16087 -4100 13258 16575 -463 -13708 -12780 4797 17800 9962 -7881 -17630
2640 -17630 -5590 11548 15686 331 -15033 -13927 3081 16647 10200 -7460 -16822 -6786 11877
2653 11877 17424 2597 -14497 -14335 2081 16333 11364 -5955 -17751 -8282 10479 16311 3427
2666 3427 -13968 -16183 873 15970 13406 -4781 -16978 -9227 9172 15692 4137 -12257 -15256
2679 -15256 423 14125 13062 -3742 -17797 -9382 8431 16727 5881 -12229 -15958 -1603 13934
2692 13934 13885 -3793 -15644 -11059 6925 16894 7108 -10902 -15303 -2756 13404 14590 -1231
2705 -1231 -14523 -11683 5002 16445 7937 -9426 -15080 -3967 13373 14192 45 -14436 -12390
2718 -12390 4603 15318 8991 -8417 -15929 -4799 10756 15235 1704 -14581 -12244 3073 15027
2731 15027 10141 -6652 -14226 -5705 10058 14122 2219 -11075 -13047 1887 13514 9923 -5707
2744 -5707 -14436 -6839 9728 14177 3292 -11381 -13848 535 12279 9859 -4927 -13916 -7619
2757 -7619 7588 14283 4881 -9978 -12771 -864 12094 11882 -2844 -13865 -8750 5675 13955
2770 13955 6057 -8854 -12832 -1986 10648 11977 -996 -12477 -9243 5031 13810 6369 -7047
2783 -7047 -12854 -3880 10322 11093 -15 -11655 -10143 3387 13108 7825 -5997 -12600 -4720 8896
2797 8896 11421 1362 -10913 -10385 2144 11225 7333 -4147 -12248 -4893 7382 11817 2043 -9841
2811 -9841 -9015 670 10931 8376 -4284 -10841 -6664 7022 10630 3697 -7829 -10856 -197 9599
2825 9599 9420 -2525 -11303 -7023 5009 10242 4405 -5824 -10560 -1275 8664 10343 -2165 -10496
2839 -10496 -8290 3456 11057 5589 -6243 -10297 -3465 8407 8983 378 -8916 -7941 3537 10277
2853 10277 6371 -4485 -10594 -3524 7719 10035 2260 -9517 -8477 1644 9703 5635 -4133 -9807
2867 -9807 -5422 5916 10208 2212 -7577 -9555 1039 10778 6906 -2575 -10468 -5638 4136 8805
2881 8805 3097 -5586 -9330 -943 8285 8026 -1329 -9496 -6308 3262 10424 5317 -4798 -9669 -2278
2896 -2278 7082 9493 -408 -8484 -8037 1883 9583 5476 -4356 -9692 -3412 6325 8931 1653 -8676
2911 -8676 -6906 825 8907 6202 -3955 -8875 -4511 6044 9858 2789 -7286 -8069 505 8662
2925 8662 7508 -1924 -9079 -5365 4431 8684 3355 -5515 -9208 -986 8614 7954 -1499 -8559 -5786
2940 -5786 3296 8970 4577 -5253 -8614 -1792 7210 9796 257 -9414 -7584 1223 9229 5578 -5283
2955 -5283 -8378 -3623 5750 9709 341 -7774 -7747 1084 9246 6661 -3724 -10306 -4653 5965 8548
2970 8548 1741 -6312 -8429 -86 8695 6685 -1890 -9331 -5474 5169 8986 4324 -5844 -9003
2984 -9003 -405 8519 8801 -573 -9552 -6941 3357 10096 4179 -5381 -9509 -2474 7397 9362 -228
2999 -228 -9176 -8277 2932 9805 5362 -3679 -10320 -3798 6785 8658 938 -9328 -8105 2822
3013 2822 9650 5974 -4569 -8876 -4479 5851 10183 1923 -8306 -9126 1427 8690 6820 -3393
3027 -3393 -8989 -4379 4852 10052 2059 -7996 -9610 -188 9167 7920 -2573 -9792 -5682 4261
3041 4261 9889 3864 -8129 -10130 -1071 8751 8735 -1019 -9321 -6524 3584 10351 4763 -6964 -9561
3056 -9561 -1687 7565 8774 -418 -8552 -7867 1966 9927 5098 -5118 -9867 -2346 8435 8947 -218
3071 -218 -8506 -7238 2909 9498 6281 -4667 -9786 -3433 6881 10068 1000 -9257 -9444 1437
3085 1437 10419 6675 -2780 -9375 -4785 5897 9422 2649 -7329 -9953 409 9260 7260 -2111
3099 -2111 -9157 -5316 5792 9419 4278 -6449 -9148 -1379 8446 8592 -2095 -9636 -6154 4507
3113 4507 9670 4357 -6629 -10375 -815 8252 9161 -615 -9137 -8383 3489 10003 5074 -4977 -9916
3128 -9916 -2143 7575 9588 78 -9166 -8056 2459 9567 6339 -5308 -10256 -4394 7304 9088
3142 9088 1400 -7795 -7624 1878 9319 7076 -3510 -9516 -3363 6910 9636 2178 -7253 -9337 -356
3157 -356 8664 7133 -2949 -9292 -5935 4869 9481 3570 -7134 -9977 -974 8061 7958 -2215
3171 -2215 -8783 -5885 4005 8999 4381 -7114 -8790 -1003 8112 7806 -546 -8819 -6409 3696 9326
3186 9326 4103 -5539 -9260 -2982 8454 8588 821 -9042 -6473 2038 10090 5961 -5048 -9156 -2870
3201 -2870 5889 10097 848 -6964 -7754 2135 10178 6180 -4094 -9180 -5298 5699 8907 1992 -7317
3216 -7317 -8747 1090 8798 6639 -2722 -8794 -4786 4445 8920 3352 -7126 -8060 -510 8004 7093
3231 7093 -1565 -8208 -4868 3630 9032 3683 -6352 -8675 -1131 6752 8224 -805 -9637 -6366 3545
3246 3545 8121 4182 -5989 -8732 -2473 6210 8321 1126 -7555 -6882 1647 9124 4832 -5447 -7880
3261 -7880 -3182 6302 8659 377 -7227 -6407 744 7789 6645 -3876 -8410 -4419 4779 8897 1974
3276 1974 -6711 -8222 379 7314 6572 -2952 -10392 -5572 4252 8739 2446 -6315 -8102 -184 8394
3291 8394 6155 -1472 -8993 -5952 4135 7911 4026 -6142 -8621 -1497 7331 7358 -1 -8075 -5906
3306 -5906 2877 8714 3944 -4907 -7542 -1725 6563 7759 542 -7653 -6517 1511 9028 4627 -5096
3321 -5096 -7678 -3880 6137 7920 1452 -7433 -6612 2228 8250 6097 -3009 -8380 -4907 4901 8312
3336 8312 2878 -6923 -6947 -343 7610 6302 -2661 -8415 -5405 4494 8508 2634 -5651 -6704 -55
3351 -55 7300 6843 -1133 -8493 -5283 3740 8775 2730 -6120 -8344 -2215 6620 7530 -564 -8526 -5936
3367 -5936 3897 8561 4198 -4275 -8007 -2058 6950 8000 -47 -7759 -6664 2599 7690 4857 -3703
3382 -3703 -8569 -3122 6059 7537 991 -7113 -6857 1183 7815 5244 -3827 -8172 -4554 4609 8220
3397 8220 2472 -7690 -8318 460 7559 5675 -3171 -7744 -3866 4679 7484 2941 -5798 -8760 -410
3412 -410 7733 6898 -2135 -7806 -4657 3093 8615 3345 -4959 -7897 -1193 7679 7472 -921 -7552 -6620
3428 -6620 2732 8070 3998 -4069 -7146 -1843 6741 7378 -438 -7582 -6692 1783 7612 4212 -4335
3443 -4335 -7235 -2767 5721 7242 1012 -7313 -6925 1084 7564 5429 -3541 -7589 -3157 3980 7439
3458 7439 1230 -7034 -7210 871 7330 6405 -2014 -7190 -3980 4369 8409 2862 -5265 -7271 -132
3473 -132 7337 6341 -1792 -7005 -4442 4031 8131 3516 -4693 -7776 -1849 6278 6003 -1570 -7426 -5888
3489 -5888 1575 7211 2656 -5236 -7355 -1563 5491 7775 844 -6176 -5244 2151 7612 4168 -3582
3504 -3582 -7277 -2637 5802 6868 1344 -5869 -7207 949 6861 4962 -2994 -8687 -3611 4838 7498
3519 7498 1503 -5303 -7130 241 8050 5347 -1547 -6939 -4778 3817 6109 2850 -5218 -6752 229
3534 229 6205 6109 -2266 -6667 -5665 3467 7970 3450 -5402 -7411 -327 5285 6303 -1391 -7402 -6006
3550 -6006 2875 6716 3834 -4280 -8488 -2280 5383 7230 612 -7238 -5903 1342 7215 4555 -4065
3565 -4065 -8122 -3672 3712 7344 1543 -6704 -6558 554 6525 5170 -3242 -7184 -2339 4078 6817
3580 6817 1116 -5156 -6259 -92 7168 4904 -2627 -7357 -4636 2853 6941 2919 -5009 -5822 -901
3595 -901 6554 5248 -2583 -6515 -3751 2046 7678 3078 -3238 -6102 -1787 6351 7080 -450 -6751
3610 -6751 -5865 2923 7595 3899 -4463 -6552 -2034 5894 7157 1066 -6548 -5187 1883 6160 5617
3625 5617 -2953 -7242 -3026 5165 6169 616 -6401 -5581 41 7125 4620 -2579 -8845 -2292 4491
3640 4491 6951 1094 -6058 -6177 527 6040 5685 -1546 -7440 -3766 3272 7924 1744 -4943 -7180
3655 -7180 -534 6475 5524 -756 -6408 -4754 3100 7075 2788 -5451 -8228 -1827 5181 6307 -748
3670 -748 -6917 -5106 1297 7163 3145 -3965 -7504 -2113 5648 6311 -61 -6225 -5873 3028 6985 4146
3686 4146 -4057 -6414 -2583 5169 6298 615 -6272 -5718 1085 6232 5747 -3133 -7043 -2452 3932
3701 3932 7440 1192 -6296 -6401 1193 7519 4493 -2708 -7323 -4713 3784 7855 2206 -5099 -6748
3716 -6748 -323 6626 5277 -1800 -7079 -4917 3351 7157 2836 -4274 -8074 -1287 6151 5266 -267
3731 -267 -6765 -4418 2817 7007 3218 -3672 -7830 -1931 6053 6164 7 -5971 -4853 1813 6744
3746 6744 3809 -3823 -6749 -3300 4577 4917 699 -6168 -6119 1790 6923 3627 -3162 -6792 -2553 4198
3762 4198 7032 986 -4555 -6294 203 6183 4724 -2989 -7095 -3391 4588 7448 2479 -5493 -6452
3777 -6452 319 6655 5505 -1894 -6924 -4318 3254 6801 1926 -3989 -6368 -1071 5335 4747 -612
3792 -612 -6378 -4685 1532 6264 3351 -4502 -6905 -1262 5141 5753 -364 -6378 -4984 1691 7207
3807 7207 2475 -3880 -7134 -1907 5658 6233 -746 -6366 -5449 1355 7071 4040 -3048 -6776 -3426
3822 -3426 4251 5811 1009 -4866 -5556 474 6818 4820 -2065 -6427 -3421 4422 7188 1808 -4950
3837 -4950 -5968 -65 6700 5660 -1923 -5638 -3367 2892 6906 2426 -4346 -5957 191 6593 5272
3852 5272 -824 -6934 -3729 2953 6468 3204 -4351 -5116 -1045 5423 6571 -797 -5974 -5276 2751
3867 2751 6273 3187 -3386 -5544 -1747 3951 5921 802 -5224 -4979 1044 6569 4499 -3071 -6587
3882 -6587 -2341 4311 6348 1847 -5131 -5840 1970 6436 4442 -1726 -5874 -2592 3150 6719 1525
3897 1525 -4937 -4979 77 5007 5594 -2093 -6166 -4057 3458 6398 1741 -3506 -5577 -270 5432 4109
3913 4109 -424 -5973 -4687 2827 5525 2951 -2827 -6444 -1572 4872 5861 52 -6240 -4183 1704
3928 1704 6278 3090 -2890 -5205 -1647 5178 4902 477 -7011 -5562 1364 5774 3807 -2813 -5853
3943 -5853 -2666 4323 7015 706 -5447 -4591 791 5159 4096 -1558 -5548 -2816 3315 7096 1242
3958 1242 -5939 -5647 -877 4755 5518 -1984 -5365 -3159 2168 5786 1705 -5038 -5794 -187 6086 5017
3974 5017 -1239 -5923 -3842 2849 5657 1769 -3539 -5167 -88 4701 4471 272 -6130 -4098 2249
3989 2249 6101 2043 -3077 -5730 -2476 4154 5380 -183 -4849 -3823 661 6218 3398 -3365 -5856
4004 -5856 -2314 3976 5324 194 -5250 -5277 -320 5169 4318 -1058 -5878 -2300 3452 5694 1144 -4356
4020 -4356 -5684 342 5786 5242 -1923 -5731 -3184 3299 5272 2709 -4209 -5355 295 4781 4163
4035 4163 -1355 -5167 -4139 2263 5909 2660 -3191 -5308 -1104 4922 5003 -623 -5818 -4414 2001
4050 2001 5198 3379 -4436 -5753 -861 4065 5062 -80 -5205 -3281 1458 5949 2362 -2255 -5213
4065 -5213 -2740 3012 4607 741 -5658 -4530 510 5684 3324 -2600 -5277 -2071 2729 4977 1233
4080 1233 -3420 -5741 -506 6212 3581 -1464 -5670 -3298 2019 5993 1600 -4287 -4202 -1067 4055
4095 4055 4019 -1112 -4666 -4727 2317 5143 1326 -3409 -5110 -2040 5246 5506 -936 -6145 -3227 2395
4111 2395 4678 2633 -2596 -5304 -707 4572 5044 209 -5379 -4255 1310 4613 3224 -2348 -5117
4126 -5117 -2215 3374 5738 -1192 -4532 -3617 682 5804 3486 -3020 -5512 -2358 3506 5545 424
4141 424 -4651 -5253 1391 5116 3439 -1923 -5159 -2619 2698 5352 1466 -3841 -5133 -1517 4254
4156 4254 3824 -285 -5981 -4086 1798 4200 1888 -3348 -4532 -323 4730 3963 -651 -5192 -2837
4171 -2837 1580 5838 2937 -3495 -5776 -1404 3817 4262 -260 -4653 -3961 1637 5467 3058 -2058
4186 -2058 -6621 -1925 3262 4539 -260 -3971 -4223 728 4924 1985 -2111 -5621 -1647 2946 5856
4201 5856 498 -4169 -5074 404 5003 3031 -877 -4116 -1980 2419 5456 1678 -3778 -4631 31
4216 31 4901 3717 -1959 -4641 -3380 3461 4294 1644 -4667 -5475 -161 4480 4550 -1790 -4414 -3855 1881
4233 1881 5332 2695 -3134 -5403 15 4784 4607 10 -5560 -3613 2394 4964 2696 -1685 -4954
4248 -4954 -1889 3951 4566 -428 -5405 -4112 989 5281 2936 -1532 -5496 -1694 3348 4256 -132
4263 -132 -4808 -3893 610 4072 2887 -3157 -5085 -2781 3213 4995 1497 -3990 -4136 110 5208 4411
4279 4411 -1945 -5210 -2512 2831 4418 1398 -3245 -3824 318 4667 4682 -1113 -5225 -3962 2094 5009
4295 5009 2254 -2144 -5713 -391 4272 4950 -317 -5328 -3675 2445 4456 2721 -2886 -4969 -1639
4310 -1639 3617 5887 435 -4383 -3506 1068 5013 2000 -2217 -5234 -1192 2912 3932 -133 -4298
4325 -4298 -3791 1865 4930 3835 -2608 -4281 -1787 3065 5237 1173 -3419 -3733 -316 5447 3850
4340 3850 -3125 -5340 -2660 3578 4675 1162 -3503 -3489 315 4884 3530 -886 -4925 -2458 2674
4355 2674 4828 1288 -3243 -4484 -280 3986 3880 -388 -3359 -3841 2657 4669 1472 -3042 -4699
4370 -4699 -624 4737 3747 3 -5023 -3119 2238 4130 2486 -3128 -4248 -1508 3377 4305 -278
4385 -278 -4564 -4439 874 4344 2575 -2649 -3981 -598 2707 3963 683 -4514 -3337 889 4203
4400 4203 2521 -777 -4489 -2469 2330 3997 972 -3231 -3005 -473 3593 3625 -1099 -4434 -2042 3090
4416 3090 4351 976 -3234 -4207 -63 4846 3551 -1304 -4338 -2907 2961 4584 2395 -3131 -3839
4431 -3839 -751 3103 3868 -1408 -3962 -2852 1713 4485 2932 -2775 -3759 -429 3077 4014 251 -5145
4447 -5145 -2797 295 4351 2953 -1932 -4187 -1935 3151 2989 234 -3763 -3549 1141 4658 2511
4462 2511 -1159 -4309 -1813 1999 3512 691 -3976 -3399 586 3742 3046 -1544 -3741 -2559 2154
4477 2154 2774 572 -3045 -3364 456 2931 2975 -909 -3996 -2090 1417 3882 1317 -1901 -2893 -1301
4493 -1301 3756 3750 -249 -4048 -3635 1637 3339 2817 -1810 -4447 -1009 2880 2603 -187 -3544 -2653 1370
4510 1370 2918 1951 -1593 -3648 -1750 2534 2899 970 -3400 -2930 442 2644 3012 -893 -4300 -2461
4526 -2461 1991 4264 1905 -2476 -2916 287 4261 2695 -458 -4474 -2396 2059 3259 1257 -2402
4541 -2402 -3079 -257 3166 2655 -939 -4174 -2017 547 3937 2380 -1082 -3245 -1137 2337 3091 860
4557 860 -4270 -2927 1133 3841 2492 -2266 -3238 -2159 3064 3369 472 -3430 -2476 264 3753 2612
4573 2612 -1509 -2944 -1966 2238 3177 882 -2628 -3744 46 3816 2757 -1377 -4398 -2505 2456
4588 2456 3318 1382 -2265 -3815 356 3957 3297 174 -3388 -2646 1497 4014 2274 -3110 -3021 -322
4604 -322 2962 4139 452 -3538 -2450 1152 3339 2392 -3282 -3356 -1619 2935 3344 -615 -3041 -3613
4620 -3613 -475 3958 2038 -2070 -2670 -1621 2351 3900 799 -3747 -3417 763 4783 2230 -1151
4635 -1151 -4178 -1899 3247 3400 617 -2739 -3798 -44 4855 4001 117 -3458 -2174 2175 3773
4650 3773 1096 -2858 -3734 -161 3626 3621 -1355 -5384 -1915 2588 4099 1730 -2488 -3677 -1395 3408
4666 3408 3925 -551 -4576 -2716 1288 4412 1804 -2802 -4966 -1730 3265 3767 1575 -4609 -3222
4681 -3222 956 3963 3219 -2614 -4688 -1429 3570 4894 1650 -3817 -3947 1146 4243 2778 -946
4696 -946 -4897 -2450 2571 4907 1364 -3261 -3304 449 4617 3394 -1688 -4109 -2384 3603 4933 1542
4712 1542 -4096 -3841 103 4339 3830 -1923 -3958 -2491 2292 4780 493 -2636 -4453 -442 4868
4727 4868 3813 -1128 -4656 -1652 1470 5527 2551 -3011 -4381 -1232 4678 3767 -936 -4918 -3220
4742 -3220 1628 5882 2725 -3289 -3924 -1374 3893 4434 -34 -3658 -3121 444 4680 2989 -3420 -5705
4758 -5705 -1214 3960 4436 312 -4842 -3900 1909 5380 2739 -1748 -5289 -1097 3057 4696 632
4773 632 -3859 -3192 1425 5076 3295 -2162 -4137 -1089 4184 5056 846 -4512 -4251 860 3873 2585
4789 2585 -2198 -5247 -1962 3314 4188 948 -3889 -3921 248 4209 3954 -1003 -4116 -1966 3282 4648
4805 4648 1048 -3461 -4610 -9 4455 3492 -1402 -4941 -3299 3068 4952 1587 -2372 -4232 -387
4820 -387 3420 3622 -911 -4238 -2300 2116 3495 2614 -3261 -4459 -600 3608 3669 -915 -4455 -1409
4836 -1409 1685 3847 1765 -3209 -4200 -1618 3814 3203 -34 -3505 -3516 1851 4291 2442 -3027 -4833
4852 -4833 -917 3882 3658 1259 -3987 -2720 911 3236 2308 -2479 -4106 -1038 3432 4305 -24 -3939
4868 -3939 -2928 668 3702 2389 -1814 -3561 -1565 1907 4181 594 -2750 -2708 -191 4396 4023 -1033
4884 -1033 -4670 -2372 2833 3570 2104 -3214 -2849 -518 3769 3737 -1661 -3641 -2690 1927 3165 1683
4900 1683 -2954 -3706 -305 2489 2942 -415 -2429 -2292 1534 2590 1449 -1940 -3586 127 3135 3281
4916 3281 65 -3260 -1955 1071 4589 751 -1901 -2707 -1557 2934 3328 -215 -1852 -2734 1118 3260
4932 3260 1930 -376 -2185 -1045 2712 4273 142 -2459 -2800 362 3236 2043 -298 -2817 -954
4947 -954 1793 2584 1206 -1980 -2777 -60 2524 1977 -809 -2521 -1076 2102 2781 1624 -2457 -2619
4963 -2619 -982 2426 1998 -415 -2332 -2360 1459 1548 933 -945 -2799 -1258 1871 2909 118 -1666
4979 -1666 -1393 997 2903 1270 -1063 -1155 -1406 2295 2523 -306 -1905 -1977 873 2400 1235 -773 -1908
4996 -1908 -433 1593 3408 413 -1568 -1742 423 2092 1423 454 -1831 -2237 1386 2681 372 -1186
5012 -1186 -2309 454 2252 2583 -69 -2398 -1552 448 1677 1074 -1756 -3145 -1164 2039 2642 104
5028 104 -2652 -2491 16 1717 2431 -873 -3263 -1355 657 2073 661 -1870 -1707 212 2026 2637
5044 2637 -1401 -1456 -1277 1116 2733 200 -1760 -2259 894 2430 1352 -640 -1795 -1358 596 3037
5060 3037 1205 -1172 -2112 -731 1237 1635 542 -2137 -1461 639 2841 1262 -1007 -2633 -1832 1581
5076 1581 1523 1469 -2000 -1426 503 3003 2401 -1518 -1989 -1528 1928 2023 1034 -1964 -2142 439 2241 1998
5094 1998 -997 -3077 -1386 1482 2300 1243 -2893 -2101 411 2575 1338 469 -2421 -2494 1149 2551
5110 2551 1677 -2574 -1801 -1132 1547 3104 899 -1176 -1387 1143 2625 1382 -1211 -3505 -900 1620
5126 1620 2841 940 -2268 -2304 484 3006 1050 -815 -3085 -648 1264 1989 1131 -1514 -2248 903
5142 903 3294 2241 -731 -3042 -2369 2187 3516 1138 -1925 -3207 -1190 2313 1429 -92 -3170 -1652
5158 -1652 1698 2539 1823 -2395 -2830 242 2647 2389 -315 -2839 -2146 1794 2415 2007 -1886 -3089 -1559
5175 -1559 1711 2600 -887 -3322 -2420 1446 3539 2486 -991 -3096 -272 2725 2293 -417 -4134 -2619
5191 -2619 490 3322 1170 -1742 -3676 -1053 2294 3201 169 -2954 -2686 405 3857 1269 -1314
5206 -1314 -3906 -1292 1133 2345 763 -2194 -2237 -67 3086 1995 -664 -4263 -1878 2305 2940 880
5222 880 -2258 -2891 218 3424 2167 -318 -4546 -2138 1091 3807 1368 -4121 -2646 -193 2891
5237 2891 2577 -560 -3116 -2615 1034 4293 749 -1880 -2851 571 3557 2267 -518 -3200 -2904 1088
5253 1088 2595 2188 -1815 -3275 -1382 1771 2717 273 -2973 -1538 2068 3133 2060 -1412 -4199
5268 -4199 -423 2328 2631 773 -2241 -2772 -339 2834 1502 -1811 -3523 -1656 1513 4025 219
5283 219 -2952 -1869 336 3384 2047 -1063 -3994 -898 1573 2640 187 -2548 -3164 430 3731
5298 3731 2307 -635 -2940 -1983 1966 3020 599 -2247 -3035 189 2796 1627 -769 -2498 -1788 2199
5314 2199 3094 1644 -1937 -1862 -722 3688 1899 -945 -3220 -1466 998 2835 1332 -1688 -2849 -29
5330 -29 1978 1698 60 -3323 -1867 283 3333 1366 -1888 -3750 -1734 1412 3033 59 -2967 -3177
5346 -3177 -165 1777 1911 -1535 -3896 -992 2064 2008 -106 -2165 -2256 -278 2949 2454 -846 -2543
5362 -2543 -2003 2051 2904 1188 -2305 -1576 409 3047 2275 -921 -2583 -1180 1599 3018 1076 -2642
5378 -2642 -2893 890 2441 1487 -667 -2334 -1751 1330 4695 1195 -1650 -2237 -225 3021 3127 -862
5394 -862 -3510 -1326 866 1951 923 -1399 -2334 -670 2329 2101 -177 -2393 -1848 1057 2924 1472
5410 1472 -1669 -3158 -527 1293 2795 1234 -1273 -2432 743 2633 1091 -1116 -2223 -985 1720
5425 1720 2708 311 -2345 -2753 -184 3188 2171 -1145 -2400 -1879 754 2132 136 -1632 -2359 -243
5441 -243 2064 1109 -1128 -3043 -590 1378 2843 1387 -1789 -2312 -579 1952 2025 543 -1615 -1480
5457 -1480 451 2405 841 -1563 -1646 -1188 1738 1511 -184 -2172 -2027 1461 1724 1639 -947 -1741 -508
5474 -508 1744 2096 -321 -1747 -3155 699 2352 643 -853 -2145 -976 2087 1997 1337 -1124 -1987
5490 -1987 -1067 2664 2226 -347 -2261 -982 562 1916 1350 -1848 -2084 332 1967 1576 304 -2501
5506 -2501 -1163 544 2742 1748 -1955 -3184 -808 1730 1700 -32 -2170 -1881 1689 2500 1077 -1750
5522 -1750 -1752 -495 1700 1663 -198 -2316 -1598 1223 2169 1877 -2140 -2455 -57 1214 2020 -454 -2032
5539 -2032 -1925 -501 1817 1048 -1075 -2280 -877 1735 2276 383 -2195 -1655 605 2007 2002 -871 -2088
5556 -2088 -1409 128 3197 27 -2161 -2072 272 2125 1739 365 -2380 -1212 1059 1839 606 -1779
5572 -1779 -2590 -806 1891 829 -26 -2036 -1086 -91 2094 1002 -1286 -1749 -339 1840 2984 -222
5588 -222 -3053 -3101 1336 2141 1209 -775 -1912 -489 1377 1508 -586 -1492 -1347 426 2279 1942 -756
5605 -756 -2058 -1836 2148 3658 1275 -1849 -1473 118 1414 1167 -870 -2690 -633 1759 1615 620
5621 620 -1439 -2648 -353 1645 1405 17 -1852 -1068 649 2671 1980 -2161 -1764 -241 2413 2221
5637 2221 -895 -1621 -1226 1210 2383 76 -1227 -2672 -499 2303 2736 257 -2365 -1617 485 2158
5653 2158 1579 -1163 -2145 -790 1452 2314 -204 -1459 -1672 -61 1843 1088 -642 -1953 -1397 1127
5669 1127 3058 508 -1860 -2309 -308 1472 1181 -449 -1252 -1227 1324 2318 66 -2409 -1778 140 2691
5686 2691 1089 265 -1419 -1449 798 2468 1147 -1023 -2657 452 2674 2484 -173 -2040 -1053 1045
5702 1045 1407 1478 -1366 -2114 145 1442 1525 187 -2251 -1744 1269 2285 791 -1185 -1878 -952 1033
5719 1033 791 -600 -2404 -1504 759 1512 635 -1126 -2167 -107 2234 2222 429 -1354 -2052 -283 2188
5736 2188 2346 -1736 -2605 -1614 900 1778 695 -1123 -1088 -229 1490 1648 -241 -910 -228 1019 2725
5753 2725 274 -785 -2507 247 1757 682 -171 -2535 -760 191 2303 631 -1266 -1709 355 673
5769 673 2266 -945 -2511 -1629 585 2327 885 -371 -1536 -1107 820 1245 327 -1581 -1693 -46
5785 -46 1991 1059 -1016 -2074 -761 1481 883 707 -1996 -1994 -855 1793 543 -612 -616 -973 164 2811
5803 2811 1198 -381 -2193 258 1388 1255 -720 -1601 -1102 578 2354 -87 -1410 -1840 -761 649
5819 649 1439 75 -206 -279 980 1463 2223 -471 -1956 -598 2673 1781 -80 -1004 -1143 -13 2621
5836 2621 657 -294 -1782 236 1547 1663 240 -1680 -1815 849 1869 1197 -1642 -1697 -545 503
5852 503 1426 396 -2076 -1465 520 1591 93 -683 -1175 -761 661 3366 724 -1573 -2554 -473 1005
5869 1005 1085 -316 -2287 -1986 455 1501 53 -936 -1389 -1228 1823 1836 -404 -1166 -632 1285 1674 611
5887 611 -908 -1157 -491 1132 1213 25 -1461 -2035 1505 2680 531 -993 -2066 243 1435 2871
5903 2871 155 -1589 -1568 -182 1915 1054 -709 -2117 37 783 1696 -270 -2390 -1979 -300 1758
5919 1758 1339 -775 -2296 -1649 2024 1402 926 -1607 -1091 781 1979 1489 -636 -1530 -829 1337 1865
5936 1865 -34 -1224 -1971 351 1567 1054 9 -2191 -1207 1044 1335 1003 -564 -1567 829 1259
5952 1259 1293 -813 -1891 -937 1496 1564 650 -910 -1388 -451 316 2705 -524 -2328 -2008 -425 1703
5969 1703 1355 -1492 -505 -1613 2166 1019 -630 -1785 -1513 1394 2028 939 -1394 -1617 -1132 1213
5985 1213 2567 743 -1184 -1963 -242 1713 1181 -882 -939 -640 1331 453 308 -1582 -1857 300 1858
6002 1858 1825 -420 -1245 -608 1323 342 823 -1849 -1295 -1021 1609 2136 -641 -1976 -1732 651 2427
6019 2427 1225 -517 -1646 -372 1161 644 446 -1142 -1519 391 619 597 -1089 -1208 -351 405 647
6036 647 890 -1040 -1546 591 2585 444 -1492 -1335 -153 1058 1217 632 -1050 -2135 -963 1958
6052 1958 1823 -897 -1917 -237 2057 1841 85 -625 -979 636 1780 1484 349 -1320 -1243 -526 1241
6069 1241 942 -1200 -1448 -562 1921 867 -788 -2246 -987 939 2463 660 -790 -1261 -734 634
6085 634 1777 -362 -588 -1202 160 1902 722 -1389 -579 -481 1153 1532 -81 -1105 -59 74 1862
6102 1862 1068 -216 -1493 -335 -73 602 652 -1495 -1792 780 564 1179 -15 -2480 -1630 939 2048
6119 2048 934 -1390 -836 582 835 947 -315 -1360 -904 1667 1801 1008 -804 -1606 -654 1884 276
6136 276 -123 -452 -1262 286 2313 1293 -675 -1090 140 911 904 724 -595 -1057 -298 1156 -91 -593
6154 -593 -723 474 1099 1663 585 -452 -1322 247 1521 815 -824 -1567 -447 587 1835 68 -537
6171 -537 -919 -206 1715 1500 -893 -2080 -1387 1560 1066 528 -1579 -1300 -321 1445 1128 -55 -843 -1577
6189 -1577 1130 2281 107 -1303 -1332 -305 809 1986 -16 -1238 -1532 1407 1902 500 -657 -1309
6205 -1309 418 1798 2292 89 -1394 -682 366 1667 380 -86 -1962 -588 1743 1761 674 -755
6221 -755 -1268 435 1481 664 -681 -1171 190 628 710 824 -1787 -1360 422 378 762 -877 -1041 -77
6239 -77 421 1424 460 -460 -1322 500 766 1254 -80 -1122 -1441 -71 2190 867 -738 -601 490
6256 490 948 1467 39 -619 -1060 554 1443 1669 335 329 233 267 -78 -105 -1304 -483 442 1164 914 -954
6276 -954 -1532 -810 1259 1584 587 -1117 -1148 1143 735 205 -71 -1976 -1326 1171 1519 609 -1166 -227
6294 -227 503 1235 596 -396 -1243 -766 488 727 773 -1265 -793 -939 750 882 -415 -723 -63 -161 777
6313 777 1389 -1135 -751 -712 1662 756 -389 -1368 -1019 199 937 -166 -39 -983 -141 872 611 -495
6331 -495 -1078 241 415 511 849 -951 -823 -1000 375 286 -138 -419 -15 539 960 665 182 -1059 -612
6350 -612 1512 780 1451 -992 -1903 43 1725 701 -471 -1532 -158 1140 1263 1122 -1039 -1113 493
6367 493 357 615 -12 -1481 -1296 317 1455 705 -1337 -2472 -170 970 1699 -403 -607 -1190 1366
6384 1366 810 265 -392 -1127 -660 1334 1583 -654 -1443 -726 1139 1727 -181 -632 -573 -1102 465 -231
6402 -231 -78 -1375 -354 10 1585 739 -273 -224 -225 1092 1035 -713 252 -872 527 296 1421 -912
6420 -912 -1729 -62 339 1688 397 -797 -828 451 924 746 245 -609 -919 1314 956 -189 -448 -1289
6438 -1289 538 1401 543 -401 -237 -193 93 933 265 -628 -1010 712 1531 146 115 -1663 -993 1007 1301
6457 1301 781 -418 -671 -259 919 28 142 -128 -751 -437 1681 626 -401 -378 -98 133 59 -194 -1317
6476 -1317 -1168 -624 1159 -205 305 -1393 -47 379 997 1085 -1113 -855 -478 1207 -625 -599 -1109 -608
6494 -608 85 852 -722 -696 -122 -70 541 747 -700 -1716 -684 -459 1581 213 217 253 -220 343 1288 166
6514 166 -269 -394 584 1543 1490 -579 -956 116 569 926 123 -1853 -619 -93 939 837 -654 -995
6532 -995 -316 -329 1163 236 -645 -804 -1033 298 895 -1227 -825 97 969 831 511 104 -205 254 1171
6551 1171 595 311 -1106 -553 1572 1901 378 -105 -1060 200 393 776 -139 -251 -17 1308 929 235
6569 235 -224 -539 -1122 1402 1087 -535 -934 -914 56 512 -553 -401 -261 -244 952 -57 52 -325 -1371
6588 -1371 893 1329 -128 -863 -1157 955 788 1031 -156 -1096 -1473 -283 -498 602 -38 -1144 -779
6605 -779 737 1693 341 -1334 -1179 -369 985 744 230 -169 478 1189 723 698 -659 -1238 -103 829
6623 829 1419 -439 -647 -705 1860 944 109 -133 -728 433 236 882 -23 52 -472 -269 1153 120 -1322
6642 -1322 -875 949 1241 367 -315 -968 -782 788 810 -55 -1488 -1028 -53 -163 478 -43 -1262 -1666 29
6661 29 1153 1075 -354 -1074 -194 -400 227 -273 -1862 -222 -93 389 -369 395 -1499 -1433 495 292 1233
6680 1233 -392 -1711 721 -166 489 -1135 -834 -862 1046 861 1151 -1306 -376 60 876 235 -236 -972
6698 -972 -1051 297 1354 1158 -998 -184 -197 495 -149 132 -576 -550 853 1931 402 -480 -1491 195
6716 195 109 754 -122 -962 308 -165 381 764 -811 -1375 -779 1258 1022 2 -491 -287 867 1301 -715
6735 -715 -1447 -706 -934 62 1022 694 -1030 -1563 980 376 1257 559 -1211 70 -86 997 468 -1603
6753 -1603 -827 -702 1238 1349 -1448 -1046 202 936 557 639 -474 -1404 -478 994 947 -107 -1255 -423
6771 -423 -52 1408 854 -722 -890 -199 1202 417 36 -1136 -1569 -132 378 299 117 -1112 -768 882
6789 882 868 49 -882 -1186 -102 1824 305 -875 -465 -240 986 849 1032 -589 -1079 -585 871 277
6807 277 -608 -331 -730 609 1547 450 -694 -1322 -414 371 1085 -258 -931 -1100 496 1268 1492 475
6825 475 -905 -122 1246 113 69 -1158 -272 920 1944 1398 -318 -1019 -533 772 565 180 -899
6842 -899 -364 768 188 1212 -169 -612 -452 300 542 34 -587 -85 179 1520 574 -560 -2060 -806
6860 -806 701 742 385 -747 -1361 -275 1289 772 -259 -811 -105 298 1205 462 -1664 -663 513 996
6878 996 1135 -502 -1040 -1011 451 1417 -35 -974 -959 -14 660 642 -458 -637 -1346 868 -252 424 -567
6897 -567 -1855 1095 1261 249 -498 -1850 65 238 702 1515 -810 -1099 -78 1044 158 359 -1586
6914 -1586 -460 845 1261 487 -497 -1088 76 -501 461 -34 -1576 -801 446 1207 571 196 -544 -439
6932 -439 87 382 147 -455 -1523 107 1069 103 562 -1079 1 1042 817 -84 -861 -1045 9 897
6950 897 1105 -1099 -1132 -724 244 653 197 -870 -1071 -60 637 672 187 -1148 -2012 412 498 -164 369
6969 369 -820 -723 661 1796 59 -866 -1303 -340 -138 407 -41 -1781 -1219 1295 218 105 -1340 -561
6987 -561 478 1103 617 -150 -287 474 1195 265 -474 -693 -1285 -772 365 -16 -1416 -941 -540 645 170
7006 170 405 162 -344 919 760 -547 -983 -497 -409 677 993 -539 -750 -892 894 1168 1132 -1497 -350
7025 -350 -728 360 1736 425 -205 -985 516 451 228 -427 -964 -214 -191 468 -524 496 -249 130 213
7044 213 41 1024 -1253 462 903 833 -284 -1600 -447 -305 280 1048 -776 -145 -851 1246 574 627
7062 627 718 -354 -929 29 -689 393 -611 -65 476 553 1695 -134 -531 494 415 402 50 -148 33
7081 33 347 78 -629 -639 -811 -85 -90 450 692 -917 -1071 218 587 390 168 207 -745 -995 175 999 -1275
7102 -1275 -742 -294 343 -147 148 -550 -469 -148 665 376 -18 -77 -932 288 305 -801 -959 -121 536 804
7122 804 -563 -262 217 295 427 791 -538 -236 -541 160 256 565 77 -433 -1343 -317 340 -419 -1338 -491
7142 -491 -420 103 267 48 -610 518 -1209 -363 822 82 -737 89 -305 364 -54 -61 -725 169 130 300
7162 300 -340 96 -610 -158 -376 616 291 -838 963 976 361 -163 50 -648 551 465 258 -912 326
7181 326 -914 -136 3 -588 -139 -1350 -446 963 -84 -202 -45 727 753 239 451 -828 -450 202 -98
7200 -98 -332 -883 -1412 -14 -15 -137 953 -741 -951 138 1275 534 -755 188 692 926 175 183 -70 142
7220 142 120 806 159 -28 -894 -569 377 518 1722 -23 -103 -227 642 -255 -40 -499 -174 -215 477 349
7240 349 -33 -1458 -11 167 1328 -622 638 -366 793 1561 -599 -604 -674 1236 1009 435 695 -979
7258 -979 -1284 164 516 488 276 382 -828 -236 391 62 -863 -406 212 557 530 -591 -180 167 96 877
7278 877 456 -684 -1841 -569 182 939 293 -452 -1129 629 238 -46 -607 13 973 -227 -410 -620
7296 -620 -270 -1262 -266 242 26 -209 -105 1120 448 -104 -1334 -374 947 695 -265 182 -669 107 -204
7315 -204 32 -43 -307 -560 -668 -243 644 -340 -617 -953 87 906 76 -756 -991 -21 -544 101 427 -592
7335 -592 -652 -18 348 321 -466 -297 -256 -548 1426 -321 -240 39 -765 173 -98 46 -579 -132 -73 1091 162
7356 162 -287 -685 -240 744 1090 338 -957 -754 739 911 -434 -837 -114 483 -154 -813 252 -1282
7374 -1282 246 390 1113 294 -591 -72 -205 1174 -734 -628 -319 -89 90 778 555 -350 -719 603
7392 603 872 380 235 -383 -808 -735 584 807 -492 -779 -665 457 1172 768 -591 -55 -111 12 663
7411 663 267 -848 -844 1534 743 -126 429 -768 -989 669 765 -1422 -471 478 127 873 322 -74 -819
7430 -819 -381 415 877 -290 -746 -302 -589 867 -305 -379 -1064 591 47 845 632 -73 -367 313 -23
7449 -23 676 -25 -212 -408 67 755 -77 -265 -791 -372 -124 1047 379 -1102 -389 1150 -238 -161 -679
7468 -679 -678 330 516 -370 163 -212 -93 609 378 294 -305 -1096 289 501 300 -1524 -766 -216 1121 454
7488 454 -281 -367 -272 715 -165 921 124 357 -129 220 793 882 -441 -970 435 932 1159 -180 -1072 94
7508 94 694 -8 291 -924 61 982 655 654 860 195 -1222 -1789 -48 1197 422 -924 -327 1002 359
7527 359 -379 189 -288 -470 -278 848 444 -293 -797 452 1471 -145 -216 480 112 453 -214 -936 -706
7546 -706 -156 461 280 550 645 -463 -456 54 148 -333 154 546 215 798 762 -692 -1105 783 -21 862 -300
7567 -300 -748 -457 -175 -8 125 -487 -266 -745 4 1382 608 577 -139 507 233 613 296 -687 306 25
7587 25 -78 -1383 575 -250 -271 153 -564 -185 389 66 629 1034 -272 -924 247 -249 43 527 -453
7606 -453 -402 -1346 964 554 2 -355 -1049 519 70 544 797 -588 5 1148 -55 -920 -81 -823 911
7625 911 879 1108 325 -129 -730 -544 -312 -349 -468 -759 975 1399 1165 603 -1002 915 361 678 530 493
7645 493 -1516 267 645 138 -547 -505 295 -1103 627 -551 1040 3 -729 323 407 118 -391 -666
7663 -666 727 56 564 -22 -503 -47 549 -19 -791 -800 376 -544 637 -419 52 -324 -796 -431 -807
7682 -807 541 -575 -592 -1446 -353 28 691 -689 539 562 373 -836 -159 197 -1328 -485 1175 -1045
7700 -1045 -458 -434 -302 486 729 -75 -409 40 454 -5 -198 205 -840 -440 -87 793 -528 -1051 275
7719 275 -193 -124 -464 -304 -1292 -423 443 1127 47 277 -722 66 760 212 163 -687 1290 787 996 281
7739 281 173 -40 996 -90 968 179 -846 288 227 563 76 508 -642 233 626 390 -387 -856
7757 -856 -338 141 88 -217 -996 -742 -790 602 266 -297 197 26 318 -125 -673 -83 -8 77 1050 402 -421
7778 -421 -185 -228 291 367 141 -933 -811 -806 -722 954 606 155 -600 -139 623 425 64 393 -419 594 400
7799 400 67 -294 -1376 248 443 807 -83 -438 -224 277 524 35 -292 -661 -323 559 423 808 -357
7818 -357 -163 66 363 -190 325 -53 538 241 420 -304 -230 -290 -124 906 128 -951 -753 284 -227 -49
7838 -49 -199 93 -834 589 150 316 -139 -243 213 383 607 -616 345 -813 513 367 -54 513 -443
7857 -443 -604 767 800 176 -729 -353 480 1040 573 -190 -759 98 -378 697 -358 -453 -133 89 1300
7876 1300 308 -437 -664 731 1064 390 496 -631 -948 436 -114 275 560 -1122 -65 -491 937 -190
7894 -190 -388 -990 468 53 265 -84 -1234 -278 -141 860 -344 160 -955 -200 -358 872 -362 -237
7912 -237 -117 -383 523 227 -859 -169 126 -636 588 -1469 -685 -1352 271 581 -281 -271 -260 -324 -492 129
7932 129 1195 -510 424 -63 335 -107 -937 -1175 187 531 -487 758 -83 -29 -949 -268 252 -259 82
7951 82 -338 -244 685 -449 -98 -47 -617 893 -696 718 -294 106 -512 774 -719 -33 146 593 -518
7970 -518 -691 117 -875 -9 345 278 -89 144 -140 87 -343 659 -291 329 -1090 -764 28 922 -119
7989 -119 -956 -789 -161 226 483 -290 -15 755 -121 -1350 -64 -550 632 64 1394 -631 -104 89
8007 89 -668 113 42 -305 -475 -240 -11 1354 -839 -941 9 -474 -340 761 -272 418 -802 -419 692
8026 692 -429 -997 -18 -302 507 981 -260 348 -104 -651 -153 315 -595 -139 941 602 408 264 422
8045 422 -232 307 623 741 -856 -168 -874 558 314 -688 -217 -90 -169 441 19 559 -519 -137 534
8064 534 -297 -898 -25 893 993 1016 -146 302 -59 -171 -177 514 -546 -56 -815 71 26 472 -335 -309 -885
8085 -885 297 453 106 -200 -814 565 278 1003 -402 245 -40 -55 183 946 -111 -201 -554 1052 337
8104 337 -154 -694 -811 68 634 105 454 -204 359 547 -952 -340 270 137 81 165 508 -355 -703 52
8124 52 -613 79 -241 -3 -312 -64 264 257 40 -473 11 -82 -263 132 -625 2 392 613 706 -130 -674 41
8146 41 -272 401 -780 -57 45 -81 -32 -599 381 -823 -716 -332 1557 519 -240 -1578 -1004 327 -193
8165 -193 -612 72 492 1046 772 -852 -426 286 -6 -250 255 1147 242 45 509 1225 353 -358 -1203 329
8185 329 522 -209 48 -1084 -732 -302
8191c02
$$ Imaginary data points
##PAGE= N=2
##DATA TABLE= (X++(I..I)), XYDATA
0 0 0 0 0 0 0 0 0 0 0 0 0 0 0 0 0 -108 108 -108 108 -108 108 -216 216 -216 320 -324 400 -432 535 -563 649
31 649 -756 860 -969 1086 -1232 1378 -1549 1719 -1921 2140 -2377 2631 -2916 3234 -3563 3919
47 3919 -4328 4766 -5249 5785 -6371 7026 -7758 8578 -9507 10569 -11790 13219 -14928
60 -14928 16989 -19530 22792 -27103 33124 -42107 57010 -86047 164073 -835746 -2207482
71 -2207482 -616525 73982 -254998 -453543 -589968 -907398 60162 1373741 1208625 132622
81 132622 19540 535467 876588 945618 514513 -623894 -1183592 -451222 292677 -175731
91 -175731 -1015857 -1150448 -582769 202731 768256 578743 -92400 -165197 665157 1299508
101 1299508 945661 73141 -494222 -467781 -4974 280523 -212639 -1092318 -1227266 -417281
111 -417281 350942 374816 -55444 -323162 -27236 734589 1202326 756181 -90668 -347626
121 -347626 78178 455843 253170 -421624 -1007662 -903611 -191786 293254 25079 -513980
131 -513980 -524917 104440 788276 905234 389009 -165700 -120590 413926 682345 237323
141 237323 -504530 -815175 -484549 32640 145941 -265560 -677145 -501378 174146 664189
151 664189 521638 35357 -177813 130348 605274 649634 110921 -479587 -524641 -88747
161 -88747 222560 17922 -483001 -704755 -347782 251272 481278 166405 -227388 -182238
171 -182238 280974 662089 515496 -28391 -394702 -229141 184079 290690 -77056 -531435
181 -531435 -577177 -154133 276887 257034 -124000 -346223 -100313 368641 557918 277128
191 277128 -160977 -273538 36344 356592 257105 -188127 -497643 -358805 46124 264671
201 264671 70601 -293952 -364129 -13220 382848 396301 58446 -222994 -148522 181368
211 181368 376691 176084 -226542 -384404 -143474 176354 200930 -77482 -335830 -269590
221 -269590 80948 338234 210565 -123652 -245661 -23760 275249 316136 46896 -256838
231 -256838 -261283 32657 262013 144992 -174636 -326614 -150932 158581 271024 66965
241 66965 -215104 -229842 46182 285145 216348 -65694 -243274 -130721 136799 250525
251 250525 66514 -205478 -246254 -16872 206438 176165 -58464 -234515 -152325 105983
261 105983 246139 100458 -154579 -219903 -28285 195323 207502 -3905 -205143 -164462
271 -164462 73707 229687 118365 -123944 -221226 -80598 137162 184740 8413 -191592
281 -191592 -180547 32581 202428 140020 -67882 -183244 -73223 140169 215293 55786
291 55786 -157295 -181803 474 167520 127138 -76285 -215192 -133517 82861 192665 75842
302 75842 -121768 -167233 -5385 181416 188287 6912 -162749 -131157 55057 170701 76734
313 76734 -121291 -203654 -81223 106647 152989 9858 -149828 -129631 53642 193392 139705
324 139705 -46127 -155496 -68647 112791 169398 22476 -163351 -185095 -21625 137149
334 137149 119154 -52486 -178379 -100405 101793 202798 93777 -92401 -146653 -14978
344 -14978 152702 153960 -23691 -185419 -150953 32711 151079 71970 -108437 -180412 -49532
355 -49532 145463 185805 30629 -136188 -118507 55281 183734 116288 -82824 -197927 -99496
366 -99496 93963 155044 15835 -161220 -168127 7532 175746 154922 -29453 -158489 -80707
377 -80707 112722 190938 63502 -129688 -179468 -37031 132499 129108 -50191 -192416 -125904
388 -125904 74992 188252 93525 -96756 -160464 -16695 172307 180958 -7997 -180036 -147291
399 -147291 43316 169844 85136 -120126 -212280 -73603 140687 188411 23950 -153837
409 -153837 -136655 55503 207175 140934 -74499 -196141 -88817 112878 167953 9943
419 9943 -180158 -185928 3352 179354 141116 -59867 -182279 -76079 137155 213518 68650
430 68650 -139042 -178747 -7465 169959 139863 -69949 -218168 -138838 77589 189026 74396
441 74396 -129044 -178115 -6264 191502 187666 -9653 -173204 -122545 77031 190412 74550
452 74550 -144479 -218147 -59805 145762 161050 -22443 -188135 -136941 82595 226221 128803
463 128803 -95586 -187666 -43710 163163 188042 -4775 -200951 -184641 25333 183385
473 183385 107204 -110093 -209915 -73494 148659 209432 44960 -150996 -148699 46401 203881
484 203881 136647 -85017 -210730 -104240 106962 174507 18007 -180488 -187792 13400 193803
495 193803 157171 -50896 -184001 -84464 131562 216946 66816 -151105 -192065 -16475 166469
506 166469 141205 -65669 -215512 -135142 86494 199741 77621 -129498 -174383 -3514
516 -3514 189037 180940 -20656 -184778 -127561 81228 192194 71378 -146569 -209188 -47098
527 -47098 154113 169022 -19058 -186481 -135386 80470 214152 116321 -100655 -187650 -50415
538 -50415 151146 178435 -3814 -187134 -162467 34444 177762 104765 -96713 -190936 -65026
549 -65026 138743 186395 27314 -153162 -144036 41270 185192 121500 -83018 -194183 -85633
560 -85633 116698 174646 22692 -162176 -168026 13535 179633 140135 -60129 -183958 -89934
571 -89934 112308 189558 53374 -138056 -169756 -5776 163780 138551 -50235 -183404 -106594
582 -106594 85983 176684 60799 -126930 -168349 -13162 159753 148726 -30984 -171220
592 -171220 -112010 77781 180074 74991 -115411 -173260 -31736 142106 150669 -14762 -163871
603 -163871 -128780 52175 169136 88154 -92688 -167063 -47072 127116 156409 9247 -144267
614 -144267 -126144 40496 161451 96012 -79984 -166233 -62157 109458 149627 11375 -145085
625 -145085 -137954 27869 160505 110605 -63550 -159450 -66166 107188 163237 34788 -128955
636 -128955 -145397 3306 143552 112464 -53756 -162776 -90692 78648 153602 49014 -109035
647 -109035 -135836 580 143122 126571 -28530 -142707 -90376 67531 145319 52077 -109007
658 -109007 -151429 -26854 118551 121423 -18577 -139507 -99114 59523 156567 80507 -77057
669 -77057 -136301 -33095 111973 131001 -1536 -137003 -120406 28593 132851 74734 -74866
680 -74866 -141270 -46225 102249 138998 20210 -114023 -106805 33254 139201 90195 -60566
691 -60566 -144478 -67399 81844 128645 17420 -122690 -127428 7651 131083 105885 -34363
702 -34363 -130039 -67302 81076 142209 46023 -95834 -125392 -14097 110102 99893 -33076
713 -33076 -136743 -87228 54911 127631 53644 -79455 -116079 -12287 115578 117094 -7756
724 -7756 -117928 -87729 43907 123558 57704 -82956 -134678 -41108 94725 114227 469
735 469 -113964 -96623 37132 132201 82550 -53423 -121527 -43114 86545 116101 11762
746 11762 -110709 -111748 11055 112368 78958 -50176 -122752 -52005 80349 125780 31173
757 31173 -93628 -104372 10005 116737 89809 -39781 -127270 -72661 59069 116664 35911
768 35911 -89893 -115384 -9497 108147 101977 -14841 -108958 -71237 51308 118584 51889
779 51889 -74325 -115213 -26154 88443 95316 -12700 -110476 -83656 38478 117128 62556
790 62556 -62104 -109876 -26647 91711 108555 2666 -105487 -94107 24350 111781 66336
801 66336 -59569 -118484 -46028 76745 110808 18951 -92192 -93880 16366 110626 79254
812 79254 -40240 -112605 -53948 63273 104333 22924 -90991 -101022 2621 101186 81369
823 81369 -30393 -105971 -58427 60233 112909 38398 -79360 -102745 -8699 92359 86423
834 86423 -19089 -107131 -74542 41519 107706 48113 -65567 -100724 -17370 86207 96420
845 96420 -3068 -97025 -76657 32703 102243 50098 -61333 -105877 -31252 77044 96180
856 96180 1376 -94964 -79219 29391 105815 65896 -48641 -104357 -39557 71204 99612
867 99612 11342 -92635 -91263 10231 95740 69338 -36669 -102525 -49142 62265 101562
878 101562 26547 -75522 -86845 2137 90020 74138 -30035 -101124 -56681 49783 95624
889 95624 29610 -71605 -90818 -5514 88661 82223 -14634 -93553 -61901 42916 98192 42399
901 42399 -63689 -97901 -21478 75997 83480 -8074 -91534 -69632 31524 96468 52582 -50865
913 -50865 -92372 -24150 73113 87674 1396 -85819 -74146 21021 91060 53389 -48518 -97664
925 -97664 -35251 66493 91655 13317 -79170 -78820 14883 93321 65841 -36069 -95480 -44557
937 -44557 54280 89415 20916 -72802 -84924 -375 82521 68154 -23289 -86690 -48456 46212
949 46212 89999 30337 -62718 -81543 -6569 78038 70721 -18867 -88031 -58075 37668 89508
961 89508 38633 -58893 -87464 -14142 76007 80267 -5146 -83059 -64121 28603 88223 46698
973 46698 -50191 -88928 -25061 64239 79192 2786 -78895 -68128 22274 86372 51952 -41138
985 -41138 -84866 -30105 59998 81368 9121 -74957 -73599 11726 82135 57032 -33634 -85932
997 -85932 -39989 51906 85785 21012 -66623 -74918 1826 77283 63861 -21819 -82424 -48184
1009 -48184 40956 82503 26495 -60060 -76690 -6821 71440 67076 -14153 -78606 -52690 37040
1021 37040 82211 33091 -54546 -79812 -13832 68070 72046 -7949 -79960 -59942 28969 83070
1033 83070 42761 -46580 -81435 -24106 61616 76355 1452 -73688 -63931 17761 78968 48701
1045 48701 -37651 -80035 -30470 54281 76410 10032 -65753 -65229 11604 75688 53025 -31069
1057 -31069 -79980 -36117 46927 76315 16004 -61643 -70879 1678 72418 60039 -22202 -76910
1069 -76910 -42520 40364 77778 26022 -54380 -72406 -6949 67543 61076 -16070 -74928 -47277
1081 -47277 32968 76288 31257 -50195 -72673 -9989 66014 65873 -9483 -72123 -52571 27758
1093 27758 77028 37891 -46339 -77317 -19593 57196 69454 389 -67311 -58577 19363 74660
1105 74660 45111 -36192 -74065 -25714 51130 68610 8122 -62343 -60757 10710 68885 45977
1117 45977 -30658 -71622 -31559 45344 70195 14918 -58176 -63438 5420 69137 52569 -22659
1129 -22659 -72526 -39306 37412 72282 22149 -55672 -67219 -3297 63462 57667 -14976 -68428
1141 -68428 -42551 33028 72292 27242 -48037 -67033 -8781 57945 57712 -10544 -67852 -47902
1153 -47902 27693 70957 32109 -42544 -66957 -13176 55968 64030 -550 -63781 -52190 19845
1165 19845 69279 37224 -36668 -69294 -23735 46893 63998 5553 -58784 -54594 12599 64725
1177 64725 43027 -26844 -64144 -27270 42912 64887 9843 -55291 -57052 5677 60005 45640
1189 45640 -23401 -66284 -32299 39064 66245 17867 -50246 -58995 1049 61101 51323 -16921
1201 -16921 -65503 -38616 31168 64221 21245 -44501 -60928 -7600 55495 53404 -9532 -59712
1213 -59712 -39197 26222 64500 27903 -38861 -61478 -11861 49589 53634 -6338 -58623 -45921
1225 -45921 19868 61755 33763 -34226 -61077 -17212 46725 58023 3349 -53988 -48680 11591
1237 11591 58257 36786 -27549 -60264 -24390 37979 55317 8887 -48391 -48923 7821 57123
1249 57123 40084 -20964 -57422 -27864 35725 56951 12185 -47221 -53314 510 54228 42766
1261 42766 -18562 -58065 -33019 30418 58687 20352 -40227 -53475 -4157 49689 46750 -9549
1273 -9549 -54107 -36473 22096 55256 23722 -35685 -53045 -9896 44591 47357 -3170 -50393
1285 -50393 -38744 18092 55418 27993 -31714 -54220 -15707 39959 50264 1351 -49369 -44211
1297 -44211 11466 53057 34052 -23941 -53868 -19855 36911 51538 8681 -43861 -44684 4550
1309 4550 49130 35663 -19972 -52313 -25955 30425 51232 12480 -41299 -45294 2943 48616
1321 48616 38253 -15421 -51436 -29672 27605 51645 16082 -37416 -49669 -5741 44046 42099
1333 42099 -7611 -49512 -33998 20486 50872 23268 -29379 -48357 -10777 38836 43371 -3830
1345 -3830 -45876 -36070 15175 48666 25358 -26126 -47611 -14092 37156 46053 1974 -42332
1357 -42332 -37685 9638 46547 30922 -22684 -49402 -19733 32226 45613 6951 -41441 -42144
1369 -42144 4999 45601 34075 -16878 -47399 -22459 27919 47250 11355 -37625 -42636 -424
1381 -424 43319 35145 -13438 -46045 -26562 24572 48038 17465 -32336 -43633 -3733 40637
1393 40637 39905 -6897 -44470 -31978 17951 46850 22067 -29260 -45136 -10571 36227 41794
1405 41794 -1069 -42139 -33133 13046 45571 25027 -22715 -45324 -14665 31908 41241 2154
1417 2154 -40879 -36952 8252 44333 28949 -19503 -46223 -17174 30747 45207 7507 -38718
1429 -38718 -40032 4383 43260 32730 -15720 -45862 -24070 25113 44166 13126 -34360 -40234
1441 -40234 -117 40615 34749 -10329 -44109 -26355 21528 44376 14690 -30591 -42477 -5188
1453 -5188 37068 36398 -8402 -42659 -29311 17740 44709 21630 -26264 -42793 -9011 35216
1465 35216 39321 -1151 -39572 -34104 11621 43304 24386 -23258 -43874 -14483 31347 40378
1477 40378 2917 -37328 -33516 9051 43350 26092 -20646 -43049 -16975 28763 41147 5495
1489 5495 -37645 -37135 5081 41911 29747 -15553 -42451 -20017 25527 42017 10883 -33489
1501 -33489 -39261 -625 37420 32776 -11221 -41851 -25523 20483 41442 14350 -28148 -39037
1513 -39037 -4428 35069 34202 -6619 -38903 -26930 17647 41318 17564 -26663 -41189 -8489
1525 -8489 33115 36209 -4444 -38310 -29713 14574 41514 22506 -22688 -40805 -11653 30519
1537 30519 37328 150 -36177 -32710 8044 39850 23811 -19342 -40085 -14991 28068 38794
1549 38794 5172 -34556 -33226 5809 39697 26191 -15579 -40369 -17796 23643 38320 7803
1561 7803 -32518 -36406 906 36454 30798 -10086 -39303 -22071 20175 39630 11656 -27884
1573 -27884 -36702 -2673 32952 31602 -7161 -37859 -24981 16687 38372 15681 -24622 -35941
1585 -35941 -6244 31991 34291 -3351 -36085 -26994 13498 38189 18145 -23276 -40312 -10652
1597 -10652 29745 34356 888 -34747 -29031 10091 38105 22338 -17334 -36953 -12997 26515
1609 26515 34796 4227 -33092 -30443 5299 34624 23423 -15518 -36960 -15520 23498 35609
1621 35609 8551 -28828 -32371 2539 34815 27331 -11350 -36932 -20941 18796 36507 11496
1633 11496 -27642 -33990 -2135 32027 29871 -6863 -34078 -21503 16345 35943 14488 -24071
1645 -24071 -33755 -4640 28752 29094 -4680 -34061 -24631 12740 35349 17386 -22322 -35471 -8120
1658 -8120 28423 32171 -266 -31426 -27164 9581 34437 19131 -18823 -35031 -13480 23711
1670 23711 33292 4233 -30356 -28163 6091 34426 22924 -13653 -34238 -14473 21319 33238
1682 33238 6483 -28576 -30451 1496 31219 23992 -11349 -34271 -19018 18767 34454 9466
1694 9466 -25676 -30393 -237 29780 27528 -8117 -33356 -22222 13957 32773 13503 -22826
1706 -22826 -32771 -5096 28406 28984 -3363 -30362 -21271 13331 33252 15822 -19276 -32123 -7199
1719 -7199 27150 28436 -1479 -31590 -26454 8823 33329 18692 -16680 -32574 -10872 25352
1731 25352 32795 3419 -28116 -27093 5420 29923 21746 -13738 -33086 -15691 18800 30607
1743 30607 5254 -25044 -28285 3277 30677 24436 -9977 -32591 -16308 17422 31931 8560
1755 8560 -24925 -31075 -1106 28294 23931 -8409 -32632 -18897 14527 32353 11778 -21032
1767 -21032 -29136 -4751 26546 26254 -4508 -30650 -21866 10803 30156 12713 -18679 -31421 -7772
1780 -7772 24296 27759 -1498 -28146 -22081 10452 31877 17854 -16143 -31122 -9759 21432
1792 21432 27458 1882 -27090 -26209 4974 28662 20048 -11402 -29994 -13379 20049 30020 7217
1805 7217 -22803 -26684 914 27121 20953 -10764 -30156 -15767 15571 28886 7751 -22032
1817 -22032 -26559 142 27035 23214 -6666 -27957 -16916 14289 30444 10954 -21156 -27542
1829 -27542 -4535 24111 24809 -3823 -27624 -20370 12036 29117 15154 -16382 -26909 -5358
1841 -5358 22827 25779 -1185 -25779 -21511 6966 26860 14645 -15242 -28726 -10319 20120
1853 20120 26187 2742 -23916 -22736 4679 27763 18405 -10982 -28403 -13842 16626 25795 4455
1866 4455 -23095 -24559 849 25192 19440 -7919 -25411 -14276 15026 27618 8402 -19314
1878 -19314 -23478 -1081 23377 21058 -6521 -26958 -14757 12695 25848 9103 -18901 -26480
1890 -26480 -2592 22840 23354 -2279 -24574 -17549 9736 26209 12700 -16251 -25284 -6569 19432
1903 19432 22883 -448 -23191 -19622 6524 25077 14202 -12148 -24232 -8670 17864 24503
1915 24503 3047 -22186 -21213 2683 23656 16318 -9865 -24892 -11105 14745 24834 5812
1927 5812 -19971 -21798 1051 24269 19991 -7014 -24608 -13651 11905 24207 6562 -18599
1939 -18599 -22977 -3594 20795 19064 -4050 -22855 -15182 10777 25814 10997 -15656 -23145 -4281
1952 -4281 20630 20639 -3118 -24262 -17808 7000 23179 12964 -13545 -23983 -6570 18483 23868
1965 23868 1705 -20072 -18371 4857 23613 15192 -10128 -24377 -10629 14159 21829 3018
1977 3018 -20496 -20332 2624 21636 16640 -7177 -22798 -10530 14178 23720 6504 -17751 -22011
1990 -22011 -678 20256 18046 -5470 -22849 -14904 10133 24337 10008 -16219 -22188 -1969
2002 -1969 19927 20275 -1626 -21748 -16889 8404 23950 9770 -14807 -24856 -7177 19209 20635
2015 20635 -1617 -22515 -17403 7347 23744 13885 -10398 -23835 -8465 16713 22783 2822
2027 2822 -20848 -21822 2649 21828 16039 -9530 -24014 -10955 13793 24685 5675 -18499 -21566
2040 -21566 1030 22255 18785 -7809 -23041 -13638 12000 23652 6221 -17591 -22580 -1523
2052 -1523 21669 19553 -4492 -23384 -15142 11606 24386 9432 -14925 -22231 -4664 19849 19609
2065 19609 -4277 -23872 -16647 8062 23536 12831 -13286 -22761 -5086 20219 23086 523
2077 523 -21638 -18306 6124 23218 13796 -12547 -25236 -9911 16470 23653 2030 -21055 -20646
2090 -20646 4592 24611 17379 -9022 -25132 -11260 16421 24030 5681 -20692 -22420 813
2102 813 22459 17184 -8311 -25525 -13260 14388 24034 7524 -17781 -21784 376 22062 18617
2115 18617 -6235 -25444 -13953 11306 25061 8567 -18450 -25082 -3156 21322 20619 -3881
2127 -3881 -23348 -15778 11267 25555 11500 -15625 -25371 -4919 20763 21882 -1006 -23020 -19316
2140 -19316 7665 24312 12878 -14247 -24235 -6613 19792 23711 1684 -21880 -19515 6927
2152 6927 24640 14405 -13239 -24993 -9369 16959 23861 1873 -22641 -20434 2960 24485
2164 24485 16142 -9124 -24400 -9676 16302 24461 4506 -20925 -20595 2111 22199 17113 -8811
2177 -8811 -23737 -12160 13778 24248 5727 -19097 -21189 1474 22655 18976 -7048 -23996
2189 -23996 -13852 12317 24089 7496 -16994 -23215 -2727 21361 19632 -4925 -23569 -14178
2201 -14178 10350 24210 9994 -15602 -23287 -2966 20427 19639 -3431 -23576 -15982 8030 23500
2214 23500 10121 -15330 -22694 -4390 18979 20680 -1449 -22019 -17440 6936 23390 12304
2226 12304 -11995 -23346 -6700 16709 19930 291 -20775 -18436 5537 21936 13658 -10755
2238 -10755 -21879 -7778 16652 20883 1649 -17616 -18352 3290 20510 13877 -9091 -22052 -8671
2251 -8671 13274 20942 4243 -17416 -18971 2002 19337 15869 -5602 -20442 -10137 10821 20151
2264 20151 6236 -15925 -18961 52 18146 14443 -5606 -19523 -11294 10035 19512 6822 -13122
2277 -13122 -18571 -958 17972 16268 -4225 -18426 -12059 7183 19359 6861 -12483 -18696 -2281
2290 -2281 16289 17219 -2457 -17094 -12053 6365 18455 8953 -9474 -18299 -4390 13015 15632
2303 15632 344 -16199 -13624 4084 16039 9730 -8545 -16882 -5569 12007 15343 1113 -14272
2316 -14272 -12751 3147 15690 10927 -6590 -16173 -6702 10756 15519 2059 -12030 -14279 591
2329 591 14671 11483 -3918 -15262 -7384 7999 13416 6003 -10924 -14237 -497 12811 11183
2342 11183 -3645 -14943 -7728 5984 14179 5565 -9807 -12723 -2054 11868 11901 -1290 -12162
2355 -12162 -10098 4288 13426 6324 -8325 -13014 -4091 9252 11383 260 -11326 -9373 2821
2368 2821 11780 7669 -4859 -12599 -6079 7476 10291 3024 -9411 -9976 633 11091 8975 -3544
2382 -3544 -11318 -6845 6542 10996 3932 -8101 -10285 -559 9468 9861 -1708 -10558 -7281 4147
2396 4147 11481 4926 -5943 -11172 -4126 8196 9151 719 -9810 -8529 2062 11619 6187 -4698
2410 -4698 -10413 -3589 6674 9701 1181 -8163 -9669 -330 9740 8788 -3324 -9265 -6056 4319
2424 4319 10497 4186 -6921 -10432 -1998 8296 9711 -1212 -8940 -7239 2856 10031 4583 -6354
2438 -6354 -11236 -3947 7753 9256 694 -8618 -8020 3017 9521 7354 -3592 -10957 -4005 6737
2452 6737 10603 2420 -8855 -9471 -82 8573 9160 -2671 -11357 -6827 4893 10837 4250 -7047
2466 -7047 -9837 -1629 9452 10195 -1307 -9907 -7959 3038 10647 6418 -6522 -11281 -2869 8474
2480 8474 11292 788 -9527 -9087 2578 12685 7936 -5182 -13097 -5190 7074 11310 2885 -9617
2494 -9617 -10917 975 12667 9140 -3737 -11800 -5956 7313 13508 3596 -8690 -12139 -1685
2507 -1685 11225 8919 -2450 -13060 -8282 5595 13489 4831 -8486 -13304 -1340 10970 12165
2520 12165 -1491 -13733 -9682 5219 14388 6902 -8799 -14857 -5162 10826 12329 907 -12656
2533 -12656 -11124 2852 13708 8407 -7348 -15248 -5806 10380 13602 842 -12582 -13290 1191
2546 1191 13681 9682 -6394 -13542 -5725 9782 15011 2396 -12727 -12437 2454 13829 11526
2559 11526 -5178 -14390 -8280 9140 14934 4774 -12646 -14470 -163 13861 11504 -4294 -14388
2572 -14388 -8968 8587 15900 5740 -11685 -15149 -617 14531 12833 -3573 -15986 -11129 7119
2585 7119 15692 6581 -10531 -15893 -2295 15080 14907 -1722 -16235 -11997 5126 17366 7438
2598 7438 -9923 -16647 -4094 12826 14681 255 -16041 -13891 4107 15833 9177 -9264 -15955
2611 -15955 -5184 12811 15074 976 -15226 -12691 3832 16103 10530 -8183 -17183 -5116 11738
2624 11738 15227 1153 -14289 -13315 3625 15513 11914 -7071 -17755 -6816 11443 16906 3057
2637 3057 -13781 -15443 1198 15715 11115 -6533 -16684 -9443 9496 17314 4826 -12767 -15481
2650 -15481 607 15382 14318 -5825 -17000 -9392 8608 17838 6539 -13136 -16046 -1120 15495
2663 15495 14166 -2743 -15760 -9863 7045 17784 6540 -12478 -16827 -2593 14663 13398 -2848
2676 -2848 -16138 -11431 5247 16891 7333 -9594 -16836 -2508 14197 15041 -767 -15942 -12336
2689 -12336 5761 16769 9430 -9825 -17360 -4412 12288 15602 146 -13879 -13383 2704 15758
2702 15758 10173 -8586 -17550 -5141 11473 15040 1762 -13882 -13415 2407 14758 9230 -7363
2715 -7363 -15488 -6789 10138 14968 3262 -13378 -14532 1545 14908 10938 -6067 -14588 -8163
2728 -8163 7944 15961 4527 -12179 -14083 -457 13211 11263 -3512 -15108 -8830 8312 15357
2741 15357 3977 -10234 -14566 -437 12122 10586 -3037 -14350 -8085 6514 14679 6411 -8680
2754 -8680 -13546 -1721 12255 12446 -2161 -13490 -9547 6044 13541 7472 -9494 -13284 -3633 10608
2768 10608 12001 -155 -13248 -10011 3720 13200 7883 -7261 -13163 -3898 9734 13597 308
2781 308 -10836 -10582 3439 12463 8213 -5688 -12930 -5857 7747 12694 1208 -11188 -10979 1953
2795 1953 10681 8384 -4800 -11563 -5585 6972 12013 3123 -9582 -11322 54 11105 8612 -3182
2809 -3182 -11769 -6962 6492 12158 4713 -7598 -10592 -1766 9872 9690 -1694 -11231 -8574 4410
2823 4410 10818 5838 -7995 -11668 -2924 8221 10369 758 -10536 -7512 3430 10916 6133 -6123
2837 -6123 -11127 -4284 7316 10226 396 -9108 -9465 2396 10952 5950 -5888 -10800 -4520 7442
2851 7442 11382 2324 -8567 -9509 1004 9521 7979 -3323 -10467 -5362 5701 10618 3352 -6557
2865 -6557 -8986 -1094 8316 8911 -1061 -9495 -6746 3983 9695 4531 -6982 -9628 -1822 8406
2879 8406 8542 -366 -8778 -6796 3125 9124 5397 -5311 -8460 -2566 7017 9895 931 -8794 -7773
2894 -7773 1219 9387 6595 -3567 -8792 -3344 5287 9404 2177 -7293 -8537 -148 8411 6656 -3235
2909 -3235 -9256 -4799 4231 10100 3349 -6109 -8822 -650 8181 6652 -1358 -8213 -5424 3189 10154
2924 10154 3968 -6215 -9151 -2039 7758 8269 -1572 -7968 -7068 3468 8715 4346 -4514 -9685 -3352
2939 -3352 6504 8795 -400 -7813 -7197 -236 8473 7094 -3513 -9311 -4559 6805 8758 1897 -7431
2954 -7431 -9067 -217 8393 7304 -2913 -8767 -5175 4859 9994 3068 -7327 -8992 -1005 8597
2968 8597 7889 -2002 -9698 -5380 3574 8983 3869 -5379 -9334 -2005 7583 7275 -867 -9047 -6543
2983 -6543 2188 9825 4701 -5821 -9992 -3291 7420 9119 471 -7188 -7058 1163 9813 5629 -4559
2998 -4559 -10050 -3735 6362 9255 1017 -8635 -8970 1189 9562 5874 -2857 -9506 -5199 4222 10427
3013 10427 1782 -7973 -8047 -677 8700 7748 -3204 -10088 -5867 5005 8830 3242 -6749 -8503 -755
3028 -755 9279 8540 -1326 -9548 -6614 4130 10692 4123 -6654 -9866 -1457 7707 8891 -596 -9231
3043 -9231 -7836 2747 10118 4740 -5411 -9670 -2584 7962 10432 41 -8989 -7692 1689 10429
3057 10429 5927 -5557 -10729 -3898 6335 9433 1892 -8475 -8961 588 9369 6314 -3518 -9472
3071 -9472 -4468 6428 10195 2807 -7495 -8691 654 9398 6917 -2960 -9696 -4415 4452 9651
3085 9651 3483 -6809 -8824 -667 8798 8481 -2502 -9202 -5802 4414 10595 4500 -5298 -8684
3099 -8684 -1821 7556 8683 -971 -9136 -6852 4170 10505 4729 -5780 -9671 -3152 7325 9260
3113 9260 286 -8784 -7845 1990 9830 5351 -4156 -9827 -3467 8073 8342 741 -8298 -8053 1578
3128 1578 9877 6774 -3216 -9192 -3621 6507 9016 1394 -7845 -8641 1163 9052 7031 -3373 -9068
3143 -9068 -4831 4948 9885 2932 -6903 -9222 -225 9177 7351 -2498 -9191 -4435 5142 10014 3974
3158 3974 -6330 -9046 -1206 8440 8553 -513 -9286 -5861 3883 10022 3409 -6143 -9758 -2434 7195
3173 7195 8346 -1519 -8340 -7485 3378 9887 4821 -4372 -9149 -2788 6481 10263 431 -8052 -7446
3188 -7446 2777 8803 5666 -3636 -9256 -5189 6219 8961 2953 -8357 -7726 1164 7976 7164 -3150
3203 -3150 -9070 -4842 5258 9557 2064 -7498 -8701 -199 8062 7788 -2922 -9677 -6019 5583
3217 5583 9262 3630 -6019 -10149 -1811 8074 7911 -1420 -7965 -6669 3031 7912 4331 -5454 -9186
3232 -9186 -1508 7542 7019 471 -8559 -7048 2803 9616 5458 -4285 -9286 -2716 6267 7321 446
3247 446 -6941 -7065 998 8308 4985 -5550 -8988 -3815 6120 8820 1351 -7018 -7716 126 8239
3262 8239 5915 -3392 -9732 -4070 5700 8318 1993 -6402 -6914 -662 6442 6924 -2103 -8035 -4381
3277 -4381 3852 8664 3384 -5524 -8775 -2219 7803 6695 -1373 -8025 -6130 3331 9665 3952 -5416
3292 -5416 -8056 -2052 6698 7776 -690 -8181 -6570 2772 8313 5644 -4915 -8095 -2928 6365 7529
3307 7529 1074 -7527 -6911 1070 7547 5245 -4371 -8583 -3553 5296 8006 1549 -6780 -7224 -635
3322 -635 7987 5773 -3526 -8309 -3886 4755 9510 2924 -6960 -7564 -1114 6175 7024 -1852 -7746 -4280
3338 -4280 4304 7872 4011 -5267 -7974 -1107 7694 7280 -1312 -8660 -5860 2596 7856 4260 -4821
3353 -4821 -8267 -2147 5847 8355 314 -7514 -5439 2358 7892 4948 -3703 -8070 -2810 6342 7625
3368 7625 636 -7533 -6842 1319 8315 6059 -4451 -8131 -2657 4176 8312 1235 -6848 -7743 1694
3383 1694 6968 5584 -2391 -8300 -3812 4816 8292 1561 -7380 -7805 -438 6752 7490 -856 -8259
3398 -8259 -4604 3528 7305 3419 -6697 -7293 -1271 8065 7294 -1787 -8113 -5806 2546 7635 3218
3413 3218 -5759 -7426 -2078 6658 7752 720 -8079 -6100 1812 8595 4070 -3174 -8341 -2684 5242
3428 5242 7249 709 -7435 -7641 939 7629 6237 -3433 -8948 -2819 4126 7926 1253 -6289 -7200
3443 -7200 32 8102 5794 -2210 -7599 -4266 3953 6705 2557 -6156 -6198 691 6311 6471 -2273 -7173
3459 -7173 -3886 3145 7809 3691 -6285 -7746 -1281 6978 7437 83 -7524 -5349 3311 8363 3111
3474 3111 -4946 -7975 -1188 5980 7438 -495 -7852 -5824 3241 8225 4496 -4119 -7526 -2746 4587
3489 4587 7040 971 -7265 -7433 659 7997 5381 -1627 -7851 -4300 5434 7900 1213 -5957 -7731
3504 -7731 -99 6812 4728 -2730 -7946 -4330 3482 7739 2600 -5758 -7543 -423 7114 6022 -2043
3519 -2043 -7990 -3837 3215 7991 3986 -4501 -7334 -879 6229 5991 -444 -8195 -5906 3033 8387
3534 8387 4658 -3878 -6242 -2345 6482 6745 533 -7295 -5494 3090 6829 4608 -3844 -8082 -2821
3549 -2821 5184 7494 732 -5991 -6866 1117 7394 5463 -3225 -7041 -3841 4195 6283 2148 -5347
3564 -5347 -5976 674 6677 5208 -1772 -6458 -4334 3959 6747 2435 -5290 -6736 -531 7335 5187
3579 5187 -2138 -6782 -4879 3623 7809 3380 -5023 -7438 -371 5174 5894 -438 -6926 -5483 2912
3594 2912 6876 2940 -3781 -7625 -1705 5164 7203 -1250 -6439 -6451 1631 7220 3520 -3524 -7236
3609 -7236 -2095 5783 7006 -109 -6496 -6491 943 6964 4234 -2820 -7757 -4317 4691 5700 2068 -6061
3625 -6061 -6538 395 6695 5645 -2817 -6916 -4050 4010 7186 2450 -6107 -5591 -1486 6885 5235
3640 5235 -1318 -6122 -4046 3838 7138 2214 -5208 -6549 -1046 5455 6279 -773 -7173 -5035 2534
3655 2534 7652 3913 -3937 -6927 -1556 6623 7821 742 -7497 -4948 1793 6889 4849 -3294 -7802
3670 -7802 -2555 5344 6722 1029 -6444 -6895 1440 6860 4689 -3499 -6689 -1982 4417 6690 514
3685 514 -5881 -6732 165 5876 5496 -2427 -7318 -3045 4493 7092 2123 -5461 -7315 -807 6766 5621
3701 5621 -1974 -6835 -3770 2448 6971 1920 -5401 -7448 -782 6260 5174 -1109 -7166 -4942 1899
3716 1899 7045 2999 -4131 -6984 -1734 5556 6507 265 -7209 -5202 1134 7697 3506 -2957 -7426
3731 -7426 -1830 5500 6589 507 -5951 -5251 1703 6834 5060 -2921 -6684 -3321 5021 6236 772
3746 772 -5796 -6699 433 6193 4967 -2631 -7540 -3887 4886 7085 1766 -5014 -6843 380 6068
3761 6068 4703 -1703 -6765 -3965 3466 7079 1734 -4205 -6796 278 5419 5162 -1028 -6636 -4056
3776 -4056 3201 7118 3244 -4739 -5730 -1787 5533 5929 -153 -6541 -5228 2334 6300 3852 -3463
3791 -3463 -7835 -2280 4738 5574 732 -6117 -4973 1125 5711 5066 -2518 -7193 -2653 4663 6045
3806 6045 1563 -4842 -6077 400 6424 4331 -2677 -7733 -2250 2915 6807 1965 -4869 -5750 -339
3821 -339 5693 4639 -1790 -6202 -3234 2670 5932 1766 -5258 -5991 -1007 6710 5592 -820 -5985
3836 -5985 -3986 2078 6589 2451 -3065 -5918 -826 5705 6035 -582 -6331 -4962 2371 7063 3276
3851 3276 -3759 -6422 -1463 4311 5492 1044 -5584 -5764 1360 6576 3008 -2706 -5426 -1949 3244
3866 3244 6588 -1063 -6076 -5980 1055 6479 3987 -1427 -6039 -3446 4002 6189 1951 -5258 -6482
3881 -6482 366 4332 4908 -2414 -6482 -3963 4115 6526 1309 -5144 -5477 -365 5380 4792 -844 -5380
3897 -5380 -4027 2874 7177 2971 -3821 -6594 -472 5540 4276 -601 -5845 -4064 2124 6339 4131
3912 4131 -3906 -6016 -2238 3402 5374 -169 -5905 -5028 1099 5385 3305 -2351 -5618 -2582 3273
3927 3273 5989 294 -5038 -5123 1005 5308 3831 -2543 -5313 -2334 3761 6107 1863 -3570 -5803
3942 -5803 1126 6180 4487 -2074 -5363 -2821 2852 5625 1661 -4036 -6089 -746 5326 5409 -1282
3957 -1282 -4753 -4389 2554 6840 1995 -3990 -5422 -143 4606 5271 -576 -5668 -4077 1086 5793
3972 5793 3001 -4072 -5604 -2183 4361 6331 -122 -5171 -4287 2218 6301 3348 -2522 -6658 -2013
3987 -2013 3672 5303 816 -5237 -4912 881 5864 3195 -2653 -5460 -2192 4457 5071 567 -4751
4002 -4751 -5533 167 5848 3497 -1820 -5453 -2321 3879 6545 1355 -4357 -4611 -681 4983 5239 -1210
4018 -1210 -5487 -3079 2454 5329 2779 -4898 -6484 -1168 3911 5654 -805 -6817 -4713 1294 5324
4033 5324 3100 -3608 -5374 -1765 5007 5053 -179 -5207 -4023 1116 5643 2848 -3667 -5001 -2091
4048 -2091 3155 4997 652 -4441 -4916 907 5378 3847 -2456 -6661 -2108 3623 5818 952 -4833
4063 -4833 -4639 -261 4789 4513 -1646 -4767 -3221 3901 5209 1774 -4616 -5043 -1042 5051 4362 -1083
4079 -1083 -5155 -3264 1811 6305 2369 -3402 -6242 -726 4061 4771 -1171 -4990 -3684 1499 5321
4094 5321 2200 -3849 -5269 -652 4155 5336 -98 -5674 -5074 1186 5266 2690 -2616 -5175 -1354
4109 -1354 4692 4928 262 -5130 -4803 1699 5526 3586 -2563 -4892 -1925 4917 4788 611 -4870 -4880
4125 -4880 1203 5413 3164 -2244 -5120 -2939 3724 5527 733 -4738 -4597 528 4600 4479 -909
4140 -909 -6238 -3673 3396 5638 506 -3714 -4932 -201 4772 4492 -552 -4837 -3515 2001 5146
4155 5146 2175 -2961 -4688 -872 4238 3590 -306 -5195 -3434 2388 4859 2738 -1708 -5154 -795
4170 -795 3884 4682 578 -5038 -3766 1782 6518 3797 -3117 -4599 -2058 3170 4841 779 -4136
4185 -4136 -3833 666 4873 3568 -2412 -4798 -2067 2997 4943 1085 -4712 -4968 544 4736 3363
4200 3363 -1011 -6243 -2955 2291 5070 1247 -4570 -4494 -642 5000 4254 -379 -4751 -3850 2548 4853
4216 4853 2577 -3533 -4880 -566 4107 4354 -831 -4898 -3856 1860 4432 2697 -3490 -4560 -139
4231 -139 4531 5273 73 -4599 -4890 1184 5028 3618 -2171 -4755 -1187 2732 4148 673 -4226 -4556
4247 -4556 411 4568 4236 -2057 -5805 -1251 3466 5604 690 -4722 -5081 104 5037 3545 -1272
4262 -1272 -4825 -2598 3288 5552 1603 -4038 -4467 -505 4301 4112 -118 -4561 -3424 2406 4537
4277 4537 2495 -3353 -3767 -873 3767 3900 -415 -4878 -3180 1461 4937 3722 -2319 -3801 -1393
4292 -1393 3020 4123 -847 -4533 -2354 867 4635 2495 -3541 -5354 -1420 3917 3634 167 -4443
4307 -4443 -3835 1520 4999 2839 -1821 -4005 -1268 4329 5177 1245 -3644 -4474 1538 5246 3296 -1265
4323 -1265 -4786 -2280 3116 4361 2359 -3508 -4305 -246 4369 4072 -1206 -3762 -3479 3948 4556 2396
4339 2396 -2573 -4296 -463 2871 4537 -733 -3657 -3121 2341 4409 1953 -3298 -4806 -1346 4125
4354 4125 3146 -220 -4387 -2852 1027 4631 2740 -3023 -5355 -599 3196 4081 -820 -4118 -2950
4369 -2950 918 6330 2990 -2882 -3918 -1333 4246 4061 347 -4172 -3740 662 3089 2870 -2755 -4752
4385 -4752 -1779 2837 4774 -313 -4197 -3402 -388 4504 3524 -1275 -4348 -2660 2225 4373 1697
4400 1697 -3259 -4459 140 3634 3511 -1521 -5386 -3163 1818 4864 1495 -3732 -4574 664 3332
4415 3332 4399 -630 -3753 -2607 665 4545 1731 -2882 -4336 -622 2975 3981 56 -3843 -2760
4430 -2760 1671 4356 3238 -2489 -4490 -2124 3282 3645 649 -3921 -3192 980 4830 1769 -1948
4445 -1948 -3201 -1235 2692 3913 1111 -3069 -3040 798 3925 3571 -916 -3476 -2202 2494 4293 928
4461 928 -3511 -3930 608 4294 2769 -1130 -3440 -2733 2555 3149 1809 -2959 -3771 -93 3084 3145 -168
4478 -168 -4175 -3083 825 4405 1293 -3087 -4067 -318 1672 2885 -455 -3482 -3868 1385 4418 2917
4494 2917 -2305 -3725 -1650 2535 3048 183 -3042 -3264 1293 3109 1309 -1524 -4020 -1871 2390
4509 2390 3177 1212 -2349 -4087 -111 2586 2615 -1193 -3810 -2682 1817 4457 1626 -3791 -2553 -61
4525 -61 2879 3489 -285 -3849 -1616 1199 3701 1279 -2578 -4262 -1131 3312 3034 -1074 -4093 -2942
4541 -2942 771 3334 2785 -1283 -4546 -351 3463 3894 18 -2308 -3063 549 2773 1853 -1810 -3130
4557 -3130 -844 1980 3033 817 -2852 -3414 -333 2746 2578 -197 -4133 -2387 2383 3226 1024 -3172
4573 -3172 -2965 -681 3172 2920 -895 -3312 -2916 1524 3234 800 -3137 -3330 -869 3768 3968 16
4589 16 -4536 -3090 846 3695 1232 -2471 -4660 -1989 1758 3618 -474 -3369 -3624 488 3717 3010
4605 3010 -1579 -3534 -2150 1433 3399 117 -2856 -3468 824 3042 2227 -1651 -4430 -2126 3459
4620 3459 3581 1540 -3544 -3237 366 3951 3519 -215 -3814 -2511 1725 4486 1696 -2895 -4111 -687
4636 -687 3297 3599 -917 -3684 -3374 373 4342 1992 -2255 -4311 -1313 3702 4349 -491 -3903 -3628
4652 -3628 1221 4801 3196 -3903 -4390 -1136 2831 3268 -243 -3284 -3887 997 3818 2617 -2628 -5013
4668 -5013 -1123 3315 4275 1008 -4321 -3228 923 4636 2268 -1679 -3974 -2253 3272 4632 664
4683 664 -3869 -3529 -186 4411 3035 -2411 -4225 -2178 3237 4698 1707 -2972 -4384 -322 3407
4698 3407 3741 -1706 -4784 -2359 1902 4697 1696 -2450 -4267 -971 4999 3156 -1062 -4497 -2386
4713 -2386 1801 4503 2545 -3360 -5660 -871 3736 5258 353 -5391 -3800 1658 4498 2380 -2369
4728 -2369 -4767 -1386 3008 3340 625 -5059 -2749 2091 4931 2634 -2347 -4274 -1267 4157 4061 493
4744 493 -4069 -3906 861 5099 2920 -2141 -4849 -1448 4108 4895 616 -4048 -4260 159 4382 3243
4760 3243 -2920 -4375 -2627 2282 4446 1624 -4033 -3673 -296 5689 3642 -1868 -4924 -2168 2188
4775 2188 5431 738 -4107 -3611 176 4253 3972 -1950 -4953 -2596 1446 3823 2079 -3002 -4456
4790 -4456 -339 3457 3894 -2158 -4823 -3421 1723 4337 2862 -3029 -4499 396 4244 3565 -453
4805 -453 -4475 -3781 1936 4318 1630 -3031 -4422 -14 3596 4487 -671 -4283 -3518 1767 4258 2669
4821 2669 -2807 -5195 -1379 2818 3675 102 -3210 -4024 1423 4800 2216 -1665 -4208 -1706 3346
4836 3346 5076 1367 -4030 -3518 1803 4889 2592 -3912 -4173 -1815 2379 4793 377 -3911 -3708 91
4852 91 3879 2829 -1183 -4406 -2720 2368 3543 1109 -2705 -4036 156 3576 2939 -962 -4117 -2205
4868 -2205 1967 4479 1264 -2490 -4184 227 3046 3721 -1250 -3402 -2479 2043 3765 1728 -3678
4883 -3678 -4799 88 3649 3805 -882 -3159 -1993 1850 4601 1690 -3625 -4608 -486 2799 2459 291
4899 291 -3958 -3288 564 3535 1474 -1641 -2545 -56 3422 3816 -190 -3358 -3092 1768 2528 1525
4915 1525 -1967 -4464 -628 2098 3521 477 -1876 -2574 -122 2832 2307 -871 -2962 -1242 2760
4930 2760 2939 569 -2528 -3336 -114 2696 3038 -873 -2375 -2906 1579 2016 1392 -3100 -2853 -365 2279
4947 2279 2752 -1033 -3804 -1975 1159 1964 1411 -1983 -2896 -1610 2651 2621 645 -3280 -1354 332
4963 332 2143 1903 -1887 -3041 -597 1557 2612 250 -2509 -1792 158 3043 1341 -162 -2514 -1514
4979 -1514 1739 2492 234 -1397 -2507 -454 2757 901 -1457 -2884 -1526 1390 3009 515 -1196
4994 -1196 -2393 367 1927 2422 171 -2091 -900 1231 3107 1779 -2399 -3122 -395 1804 2156 -79
5010 -79 -2433 -1069 383 2082 1172 -1578 -2663 -842 2057 2008 -708 -2160 -1868 331 2214 741
5026 741 -388 -2036 -1176 286 2064 1701 -971 -2871 -187 2005 2261 -647 -2511 -2036 1350 2194
5042 2194 787 -1736 -2276 -643 3134 2574 -707 -1689 -2035 782 1521 2381 -359 -2389 -590 1856
5058 1856 3027 698 -1991 -2226 -539 2551 739 -1293 -1911 -821 1314 2300 256 -2017 -2089 -217
5074 -217 1658 1555 327 -2368 -990 1146 2424 1320 -1008 -1321 -710 1951 1237 -697 -2385 -1701
5090 -1701 989 2658 1649 -2107 -3046 -877 2115 2113 -350 -1838 -2261 675 3096 2171 -1604 -2006 -930
5107 -930 2226 2620 1048 -2138 -2921 1141 2780 1383 -1731 -3154 -1476 1725 1588 195 -2565 -4485
5123 -4485 1268 3358 2217 -1047 -3029 -1461 1883 3366 956 -2787 -2173 -133 2590 3017 -48
5138 -48 -2540 -2308 1600 3008 462 -1420 -3441 -235 3174 2673 -507 -2890 -1750 940 2394 1123
5154 1123 -2538 -2036 -1674 2147 3500 -455 -2173 -2771 1897 3306 1427 -1576 -3451 -1352 2301 3498
5170 3498 -194 -3336 -1934 514 2688 2103 -1136 -2516 -431 2881 3251 579 -2669 -2913 -356 2814
5186 2814 2076 -1443 -3210 -1383 1066 3050 1408 -3570 -3354 -80 2729 2257 -1416 -3462 -2289 1318
5202 1318 2807 1230 -2213 -2101 -614 2899 2338 -108 -3322 -1306 1546 3419 309 -1493 -2559
5217 -2559 -204 2898 4058 -1108 -3262 -1802 696 3102 1105 -1853 -3701 -11 2327 2951 -1111
5232 -1111 -4508 -2258 949 3407 2227 -782 -3152 -475 2640 2133 187 -2452 -2183 1887 3750
5247 3750 3095 -1543 -3652 -1402 2608 3636 281 -3521 -2395 -6 3316 1391 -1300 -3593 -1690
5262 -1690 2238 2596 242 -3144 -3119 548 4851 2179 -859 -2746 -1262 1762 3719 494 -1674 -3827
5278 -3827 -726 3720 2901 -1634 -3211 -1367 790 2437 876 -3101 -2979 500 2541 4129 -962
5293 -962 -3270 -1867 1977 3542 1107 -2375 -3227 -442 2573 2030 -544 -3080 -2423 2085 2262 1474
5309 1474 -1268 -2265 -497 3122 2281 -387 -3037 -1985 1007 3387 1813 -2066 -2815 -1337 2365 1854
5325 1854 -51 -2012 -2365 1599 3008 2041 -1009 -3914 -1156 945 2136 713 -2509 -2576 -347 2736
5341 2736 1632 -1896 -3860 -178 1398 2962 794 -2852 -2369 81 3119 1946 -1061 -2859 -1902
5356 -1902 1583 3188 -8 -2320 -2855 342 1887 2086 143 -3338 -1978 1542 2612 1157 -1807
5371 -1807 -2374 -197 2535 2035 -187 -2021 -1854 1762 2841 1401 -2585 -2497 -703 2908 2757 403
5387 403 -2640 -2223 1030 3647 1297 -1182 -2226 -473 1850 3228 -478 -2415 -2250 139 2560 2128
5403 2128 -274 -2338 -791 2958 2205 960 -2244 -1965 1144 3332 1527 -1168 -2345 -1528 1394 1578
5419 1578 1346 -1003 -2131 -437 2542 1428 -620 -2859 -1183 1594 2987 128 -2287 -1739 -2
5434 -2 1792 2695 215 -2539 -1366 11 2264 471 -2144 -2413 -880 2540 2664 127 -2438 -1075
5450 -1075 -41 1551 2014 -786 -3171 -592 1773 2675 611 -990 -1759 -531 1190 1490 -1230 -2449
5466 -2449 -1427 603 1996 697 -1728 -2335 676 2744 1781 -629 -2271 -793 2313 2504 1213 -1414
5482 -1414 -2745 648 1277 2417 50 -2613 -1137 1139 2322 955 -1911 -1938 -1070 2344 2603 -491
5498 -491 -2832 -1381 124 2058 1982 -1375 -1862 -143 1786 1782 600 -1618 -650 874 1615 1375 -1527
5515 -1527 -1118 -474 1372 1974 801 -1718 -2132 503 2759 1475 -405 -2099 -241 1659 2488 489
5531 489 -2251 -2639 57 1882 1728 -715 -1998 -843 456 1831 1181 -3077 -2622 7 1754 1549
5547 1549 -1302 -2886 -1382 873 2630 1040 -1220 -1792 -253 1556 723 674 -2122 -1968 585 1526
5563 1526 1322 -1094 -2584 932 1458 1962 -48 -1760 -2237 1362 1939 1630 -1194 -2521 -1172 1553
5579 1553 1968 539 -1960 -1583 575 1685 657 -114 -1723 -887 1962 1672 1055 -1697 -3027 -357
5595 -357 2650 1546 -200 -1824 -1108 955 3230 830 -1440 -2691 -500 1531 1411 -615 -1581 -1010
5611 -1010 787 2489 687 -885 -1305 -769 1511 2184 -283 -1284 -818 740 2842 257 -1658 -1766
5627 -1766 -1087 2221 1297 87 -2592 -1399 1215 2518 1657 -1647 -1286 -500 1550 2244 147 -1985
5643 -1985 -1679 1022 2284 2014 -48 -2349 -1012 1908 2401 310 -2207 -910 -178 1512 2076 -565
5659 -565 -1435 -95 477 1726 427 -1935 -2230 307 1774 1105 -121 -2765 -1886 1224 2881 2320 -1114
5676 -1114 -1393 -506 1078 2481 122 -1937 -1635 689 2523 767 -722 -1709 -1288 1780 1255 192
5692 192 -1868 -795 385 1901 637 -1309 -1857 -1785 1264 2396 -106 -2267 -1823 110 1205 454
5708 454 -284 -2536 -864 1890 1984 61 -1592 -2407 1628 1379 1117 -699 -2495 -133 347 1757 -265
5725 -265 -1243 -1968 161 1494 1384 -244 -1715 -764 457 2248 836 -1760 -2674 485 1431 776 37
5742 37 -1814 -930 1453 2297 597 -185 -1016 -1257 1942 2258 -350 -1982 -1257 801 1641 740 -1678 -2786
5760 -2786 -899 -20 1407 760 -2295 -1865 -461 2132 1314 -1715 -806 -491 1954 2119 804 -1622 -1083
5777 -1083 -7 2278 945 105 -2477 -1011 670 1925 -59 -1710 -1430 273 2072 2173 -499 -1890
5793 -1890 -1185 951 2028 146 -1413 -1049 -319 2631 1626 95 -913 -1961 -475 1925 353 -1118
5809 -1118 -2845 -219 1781 1077 -179 -1705 -659 -173 1303 487 189 -2174 57 879 1168 215 -2061
5826 -2061 -460 262 1756 1441 -1368 -2059 -838 2078 1630 -543 -1827 -2213 558 2138 850 -866
5842 -866 -2243 -574 1001 1604 845 -1237 -1813 333 2252 2082 -1017 -2395 -1720 841 2284 1075
5858 1075 -2068 -1441 -335 1804 1919 -1268 -3321 -1021 60 1450 466 -108 -851 -505 1407 1738 -218
5875 -218 -1452 -978 343 1350 139 -1810 -1838 -475 1317 1532 -157 -1858 -997 243 1675 1760 -1633
5892 -1633 -1271 -582 1717 1803 99 -1096 -1063 847 2182 1270 -1100 -1415 -682 842 536 962 -998 -2082
5910 -2082 -118 1464 1324 -727 -2040 -647 1685 1521 871 -526 -1954 -243 1738 1626 -531 -2220
5926 -2220 -681 1647 2241 502 -1194 -1635 -485 1578 779 -407 -1246 -1271 509 1634 1535 -619 -1198
5943 -1198 -312 671 1621 178 -2114 -962 202 2393 745 -1048 -1508 -856 1128 1790 761 -1338
5959 -1338 -712 524 1160 1268 261 -2155 -706 1935 1626 205 -2174 -764 -801 1992 1622 -654 -2768
5976 -2768 -631 688 1769 -355 -99 -1444 54 559 189 334 -1801 -788 12 1119 -276 -2339
5992 -2339 -1409 -249 1408 1125 -1473 -1019 -1905 1029 1368 117 -1012 -767 -449 1869 1519 -43 -1548
6009 -1548 -993 837 2419 685 -1039 -1470 -870 1032 2076 700 -1802 -1256 -254 2745 800 -2409
6025 -2409 -1316 -1484 1837 679 141 -1336 -485 228 2489 1304 -1194 -1330 -1028 -75 1848 847 -694
6042 -694 -915 324 1579 1248 4 -1584 -784 1393 962 958 -794 -2375 465 1111 1155 -1331 -827 -3
6060 -3 762 1443 653 -687 -1186 -21 896 600 -54 -1766 52 47 2103 572 -614 -1024 1059 1589 1867
6079 1867 283 -1144 -564 267 831 974 -360 -2346 -1100 973 1204 481 -103 -1571 -100 1514 1323
6096 1323 -893 -1203 -748 616 1275 718 -1378 -1159 -990 248 382 -548 -962 -592 184 1302 764 -366
6114 -366 -1701 -421 2024 753 202 -1406 -1753 564 2580 879 -1161 -867 -23 1485 1130 -1071
6130 -1071 -2378 -870 1312 1166 654 -1037 -1804 -416 1248 1390 311 -1844 -1534 -334 799 2486
6146 2486 -683 -1242 -266 1004 1409 13 -172 -831 -396 1342 2051 -235 -1382 -1626 317 1485 1081
6163 1081 -940 -760 809 1580 842 -1174 -2075 -456 1209 1077 290 -1947 -1812 -336 1374 672 685
6180 685 -1019 -812 684 788 -35 -1549 -1849 -280 1337 804 -76 -1159 -1594 -603 1574 647 -843
6197 -843 -1696 -764 2007 506 -613 -1222 -1050 -434 125 1841 -1230 -1960 -1244 1861 1117 -73 -491 -1423
6215 -1423 -536 1345 247 -678 -1014 -513 1432 2369 81 -1471 -1072 1248 2032 1397 -1209 -1598 -669
6232 -669 1008 1128 691 -312 -1443 -876 1604 743 -488 -616 -83 520 1254 887 -1361 -1047 -480 972
6250 972 1193 -505 -1969 -1279 -46 1030 214 -1322 -1045 -331 178 1400 230 -1311 -450 -427 1711
6267 1711 364 -236 79 -1013 898 1393 471 -1855 -774 137 1759 588 -102 -708 -553 1476 1203
6284 1203 797 -873 -2007 -211 1834 1493 -275 -1149 -476 -267 1838 46 -572 -2023 926 2547
6300 2547 250 -257 -1821 510 1221 858 784 -457 -741 503 79 1030 -467 -1286 -1292 250 1060 827
6318 827 -992 -1218 -500 492 1000 707 -1570 -1029 951 803 -7 -1863 -415 195 570 1252 1151 -841
6336 -841 -1364 601 1349 945 -508 -454 -419 102 1101 371 -1734 -593 232 1378 474 -50 -902 -799 729
6355 729 1805 619 -153 -1919 756 1917 569 -610 -723 -787 49 2154 872 -585 -1220 357 1371
6372 1371 1277 -688 -1470 -620 -11 551 -354 -261 -1364 -662 1081 468 -395 -1637 195 867 708 -206 -65
6391 -65 -95 120 500 1164 141 -585 -1239 -236 1305 137 365 -1267 -316 912 608 99 -1176 -1183 459
6410 459 1339 444 -861 -2243 -641 933 49 -1146 -965 -287 68 499 901 -291 -1998 -261 858
6427 858 1461 -13 -186 -152 -521 380 581 6 -549 -1051 983 1918 1141 -1288 -1072 107 -187 1254 -753
6446 -753 -1318 -2035 80 1853 659 -664 -1020 -462 731 846 -863 -1713 -1074 656 947 732 -556
6463 -556 -1612 -538 1323 963 -433 -1433 -153 136 -49 726 -407 -750 305 -385 1199 278 -1610
6480 -1610 -808 62 382 473 -629 -1301 -896 277 1157 302 -578 -716 -93 598 499 28 -348 -703 792
6499 792 778 1266 -741 -921 -380 620 373 444 -1277 -1359 31 558 -645 -1083 -1184 -27 544 708 736
6518 736 -1620 -1237 295 1388 603 -1043 -792 -239 775 948 283 -1161 574 243 1189 939 -676
6535 -676 -899 -763 296 642 982 -1104 -1085 950 1306 426 -1126 -946 -372 624 904 -160 -1642 -704
6553 -704 342 349 1927 -827 -1133 -720 -1026 774 989 -1271 -909 -832 -173 946 -347 -359 -605 -251 969
6572 969 387 -978 -1922 -149 532 1781 18 -638 -1069 -208 411 1262 -1004 -199 -1120 -93 414 95
6590 95 -394 -1298 417 952 754 -592 -771 -377 526 1277 320 -786 -75 386 717 550 4 -992 -31
6609 -31 116 1121 605 -327 -1230 -302 1106 326 -964 -1713 322 871 1375 299 -1342 -718 -480 324
6627 324 372 -546 -110 -1368 775 518 10 -684 -1088 -325 1012 891 -343 -655 -603 1483 1183 1787 -552
6646 -552 -2007 304 1599 1186 842 -455 69 552 200 597 153 -610 -999 888 458 597 -656 -1262
6664 -1262 -353 175 1028 -587 -979 -948 15 1255 759 26 -706 -710 1126 1157 -285 -1301 -250 -693 320
6683 320 83 -196 -560 -424 1507 1650 434 -909 -571 369 992 1248 -604 -884 -21 1704 255 -271
6701 -271 -1486 -772 -504 103 357 -124 -652 -396 -110 1235 324 -73 -1317 -539 -124 603 -1057 -498 -1198
6720 -1198 -321 1042 -265 -1046 -418 697 1173 810 -249 -844 -541 748 423 -356 -1075 119 221 1935
6738 1935 596 -501 -649 -953 -160 928 677 -52 -638 -47 2177 402 187 -287 -696 1235 357 640
6756 640 -1140 -844 109 789 63 91 -592 -372 825 1151 -28 -1082 -191 -480 -282 1554 -100 -803
6774 -803 -817 21 1814 487 146 -1299 -509 258 -13 -223 112 -716 712 1974 546 516 -795 -183
6792 -183 -554 235 82 -347 -759 88 563 1892 -220 -1442 -889 -246 869 1615 -691 -869 -407 -88
6810 -88 882 -156 -979 -152 -422 1236 842 -392 -819 -1002 1324 361 309 -1474 -120 454 355 320 -578
6829 -578 -554 -109 1624 1447 232 -1165 -374 289 58 783 329 -327 151 1009 -128 -146 -394 -1085 90
6848 90 359 444 -832 -1426 -692 1332 1431 318 -201 -724 210 200 1060 23 -813 361 534 1527 1306 613
6868 613 -1234 -351 1460 -28 709 -1476 -199 1006 292 405 -404 -648 -722 1311 1030 -909 -1260 -238
6886 -238 486 1521 618 -559 -907 -281 -201 1052 -107 -1156 -225 -104 632 662 -21 -1616 -213 1226
6904 1226 1207 634 -999 -1765 -1351 1983 898 -1140 -877 -595 270 -201 522 214 -1617 40 847 396
6922 396 -22 -1976 487 676 2046 -873 -264 -252 -237 -23 -10 517 -580 -920 864 592 620 -942 -824
6941 -824 577 256 110 684 -1682 110 1120 597 1604 -1560 -469 -327 -98 119 -704 -591 -391 303
6959 303 562 854 -324 -413 -811 1586 930 667 -293 -556 575 1214 376 -260 271 -750 298 68 -890
6978 -890 -630 -1050 854 427 -774 -861 -685 124 -455 851 -37 -1230 -756 111 773 184 -493 -1187 -1323
6997 -1323 63 103 -1027 -411 -646 -938 1061 191 -1081 -531 -946 382 17 645 -966 -235 -424 1095
7015 1095 22 860 -24 533 -133 204 325 -1401 234 -647 452 1269 -324 -326 -9 191 1695 243
7033 243 -773 -672 555 1314 135 -430 -447 -276 272 1135 784 -500 -839 -633 -282 172 212 -101 846
7052 846 105 501 597 -84 -45 -703 362 849 -84 385 -796 774 952 1469 -255 -1931 -1108 -16 625
7071 625 355 -717 -1141 -271 -62 605 -183 -104 -429 570 641 -370 -321 -134 186 153 556 -318 -572 244 -534
7092 -534 -176 -219 484 -809 420 795 578 -722 -454 -429 -56 -211 258 545 -1053 -860 458 1083 -635
7111 -635 288 -420 59 -154 -444 -489 -196 212 588 673 1001 -748 -582 -174 377 317 260 -1043 -322 -59 435
7132 435 437 417 -883 -43 166 -270 -223 -1029 591 769 86 -279 -176 -645 72 782 1116 543 -46 -665 913
7153 913 -749 -87 54 -1438 -460 378 782 488 238 -872 39 694 -60 -901 -257 -316 -94 251 -575
7172 -575 -847 -165 -323 -82 649 25 328 -417 518 941 435 -1191 -486 407 331 549 -37 883 -872 -724
7192 -724 1409 744 -935 -131 -592 -55 935 468 -405 -717 152 524 456 1184 -120 -525 340 730 -324
7211 -324 273 -344 212 -148 270 67 -1202 -525 567 541 719 -553 -716 129 1122 454 -525 -912 -397
7230 -397 -573 445 966 239 36 -42 -86 1681 865 -895 -657 499 584 -14 -419 126 157 52 512 -103
7250 -103 -708 -327 415 1382 -628 -242 7 -75 549 1446 129 -632 37 283 454 -80 -49 375 -402 691
7270 691 78 248 -926 548 278 672 468 -444 -291 -977 280 579 629 -970 -149 490 315 -788 168
7289 168 -438 -351 336 30 366 -323 -1194 343 1022 522 42 -248 183 527 597 945 -417 -404 -34 217
7309 217 202 -826 -843 -163 -46 586 728 -509 -192 550 -57 445 -193 -16 105 -978 49 -388 -436 -112
7329 -112 -339 1382 -67 123 -213 -730 28 235 234 -60 -649 -340 -320 8 455 -797 -1025 507 742 1020
7349 1020 -126 -766 -202 466 1341 -91 174 1167 653 902 542 -128 30 -549 -634 876 -103 -909 -208
7368 -208 692 1922 388 -627 -1106 -389 443 1246 21 -244 -430 197 306 762 -602 -113 -241 -134
7386 -134 -490 -504 -538 -279 331 631 1143 -696 72 -522 9 411 1181 725 -960 -58 796 -770 137 -153
7406 -153 -89 619 629 326 -540 -763 305 843 689 -276 -658 -372 253 923 129 207 -418 -49 854 594 255
7427 255 -852 -267 148 317 -358 -290 -305 -1395 289 924 938 -273 -166 -40 779 -310 -1176 -1466 -35
7446 -35 513 -113 -790 -955 290 -678 -161 1353 -593 34 -356 429 203 -612 -2073 -843 61 367 1277
7465 1277 517 -41 -235 -526 -599 366 -794 -273 445 691 1682 -928 -1222 -698 -69 394 373 70 -169 -556
$$ [...]
8191e7
##END NTUPLES=NMR FID
##END=
