##TITLE=1H_SAM_33.245_2
 DMF d7, 8 sc, 
 24.08.2021
##JCAMPDX= 6.0         $$ Bruker NMR JCAMP-DX V2.0
##DATA TYPE= NMR FID
##DATA CLASS= NTUPLES
##ORIGIN= UXNMR, Bruker Analytische Messtechnik GmbH
##OWNER= root
$$ XWIN-NMR		Version 3.5
$$ Tue Aug 24 13:41:53 2021 Russian Standard Time (UT+4h)  she@DPX200
##.OBSERVE FREQUENCY= 200.131506
##.OBSERVE NUCLEUS= ^1H
##.DELAY= (6, 6)
##.ACQUISITION MODE= SIMULTANEOUS
##.ACQUISITION SCHEME= undefined
##.AVERAGES= 8
##.DIGITISER RES= 18
##SPECTROMETER/DATA SYSTEM= spect
##.PULSE SEQUENCE= zg30
##.SOLVENT NAME= DMF
##.SHIFT REFERENCE= (INTERNAL, DMF, 0, 15.7039)
##AUDIT TRAIL= $$ (NUMBER, WHEN, WHO, WHERE, WHAT)
$$ ##TITLE= Audit trail, XWIN-NMR		Version 3.5
$$ ##JCAMPDX= 5.01
$$ ##ORIGIN= Bruker BioSpin GmbH
$$ ##OWNER= she
$$ F:/spectra/data/she/nmr/H-F/1/audita.txt
$$ ##AUDIT TRAIL=  $$ (NUMBER, WHEN, WHO, WHERE, WHAT)
(   1,<2021-08-24 13:40:32.21 +0400>,<she>,<DPX200>,
      <created by zg, POWCHK disabled, PULCHK disabled
       configuration hash MD5:
       00 E9 B6 7A A2 85 ED C7 34 08 36 98 17 FE 4E 26
       data hash MD5: 16K
       EB DC AF 5C 25 B8 1E 1E 69 DF 06 B4 A7 C6 3B AA>)
$$ ##END=
$$ 
$$ hash MD5
$$ D9 B0 78 E3 7D 70 BC 45 F3 DC 46 16 05 A3 12 F9
##$RELAX= 
##$RELAX= 
##$RELAX= 
##$RELAX= 
##$RELAX= 
##$RELAX= 
$$ Bruker specific parameters
$$ --------------------------
##$DU= <F:/spectra>
##$EXPNO= 1
##$NAME= <H-F>
##$PROCNO= 1
##$TYPE= <nmr>
##$USER= <she>
##$AMP= (0..31)
100 100 100 100 100 100 100 100 100 100 100 100 100 100 100 100 100 100 
100 100 100 100 100 100 100 100 100 100 100 100 100 100 
##$AQSEQ= 0
##$AQ_mod= 1
##$AUNM= <au_zg>
##$AUTOPOS= <>
##$BF1= 200.13
##$BF2= 200.13
##$BF3= 200.13
##$BF4= 200.13
##$BF5= 200.13
##$BF6= 200.13
##$BF7= 200.13
##$BF8= 200.13
##$BYTORDA= 1
##$CFDGTYP= 0
##$CFRGTYP= 5
##$CHEMSTR= <none>
##$CNST= (0..31)
1 1 145 1 1 1 1 1 1 1 1 1 1 1 1 1 1 1 1 1 1 1 1 1 1 1 1 1 1 1 1 1 
##$CPDPRG= <>
##$CPDPRG1= <>
##$CPDPRG2= <>
##$CPDPRG3= <>
##$CPDPRG4= <mlev>
##$CPDPRG5= <mlev>
##$CPDPRG6= <mlev>
##$CPDPRG7= <mlev>
##$CPDPRG8= <mlev>
##$CPDPRGB= <>
##$CPDPRGT= <>
##$D= (0..31)
0 1.2 0 0 0 0 0 0 0 0.06 0 0.03 0 0 0 0 0.0002 0 0 0 0 0 0 0 0 0 0 0 0 
0 0 0 
##$DATE= 1629798031
##$DBL= (0..7)
120 120 120 120 120 120 120 120 
##$DBP= (0..7)
150 150 150 150 150 150 150 150 
##$DBP07= 0
##$DBPNAM0= <>
##$DBPNAM1= <>
##$DBPNAM2= <>
##$DBPNAM3= <>
##$DBPNAM4= <>
##$DBPNAM5= <>
##$DBPNAM6= <>
##$DBPNAM7= <>
##$DBPOAL= (0..7)
0.5 0.5 0.5 0.5 0.5 0.5 0.5 0.5 
##$DBPOFFS= (0..7)
0 0 0 0 0 0 0 0 
##$DE= 6
##$DECBNUC= <off>
##$DECIM= 32
##$DECNUC= <off>
##$DECSTAT= 4
##$DIGMOD= 1
##$DIGTYP= 9
##$DL= (0..7)
0 120 120 120 120 120 120 120 
##$DP= (0..7)
150 150 150 150 150 150 150 150 
##$DP07= 0
##$DPNAME0= <>
##$DPNAME1= <>
##$DPNAME2= <>
##$DPNAME3= <>
##$DPNAME4= <>
##$DPNAME5= <>
##$DPNAME6= <>
##$DPNAME7= <>
##$DPOAL= (0..7)
0.5 0.5 0.5 0.5 0.5 0.5 0.5 0.5 
##$DPOFFS= (0..7)
0 0 0 0 0 0 0 0 
##$DQDMODE= 0
##$DR= 18
##$DS= 0
##$DSLIST= <SSSSSSSSSSSSSSS>
$$ [...]
##$SUBNAM2= <"">
##$SUBNAM3= <"">
##$SUBNAM4= <"">
##$SUBNAM5= <"">
##$SUBNAM6= <"">
##$SUBNAM7= <"">
##$SUBNAM8= <"">
##$SUBNAM9= <"">
##$SW= 20.0188882624521
##$SWIBOX= (0..15)
0 0 2 0 0 0 0 0 0 0 0 0 0 0 0 0 
##$SW_h= 4006.41025641026
##$TD= 16384
##$TD0= 1
##$TE= 0
##$TE2= 300
##$TE3= 300
##$TEG= 300
##$TL= (0..7)
0 120 120 120 120 120 120 120 
##$TP= (0..7)
150 150 150 150 150 150 150 150 
##$TP07= 0
##$TPNAME0= <>
##$TPNAME1= <>
##$TPNAME2= <>
##$TPNAME3= <>
##$TPNAME4= <>
##$TPNAME5= <>
##$TPNAME6= <>
##$TPNAME7= <>
##$TPOAL= (0..7)
0.5 0.5 0.5 0.5 0.5 0.5 0.5 0.5 
##$TPOFFS= (0..7)
0 0 0 0 0 0 0 0 
##$TUNHIN= 0
##$TUNHOUT= 0
##$TUNXOUT= 0
##$USERA1= <user>
##$USERA2= <user>
##$USERA3= <user>
##$USERA4= <user>
##$USERA5= <user>
##$V9= 5
##$VALIST= <valist>
##$VCLIST= <CCCCCCCCCCCCCCC>
##$VD= 0
##$VDLIST= <DDDDDDDDDDDDDDD>
##$VPLIST= <PPPPPPPPPPPPPPP>
##$VTLIST= <TTTTTTTTTTTTTTT>
##$WBST= 1024
##$WBSW= 4
##$XGAIN= (0..3)
0 0 0 0 
##$XL= 0
##$YL= 0
##$YMAX_a= 109083
##$YMIN_a= -134557
##$ZGOPTNS= <>
##$ZL1= 120
##$ZL2= 120
##$ZL3= 120
##$ZL4= 120
##$ABSF1= 10
##$ABSF2= 0
##$ABSG= 5
##$ABSL= 3
##$ALPHA= 0
##$AQORDER= 0
##$ASSFAC= 0
##$ASSFACI= 0
##$ASSFACX= 0
##$ASSWID= 0
##$AUNMP= <proc_1d>
##$AZFE= 0.1
##$AZFW= 0.1
##$BCFW= 1
##$BC_mod= 2
##$BYTORDP= 1
##$COROFFS= 0
##$CY= 11.3945322036743
##$DATMOD= 1
##$DC= 2
##$DFILT= <>
##$DTYPP= 0
##$F1P= 2.36226072786647
##$F2P= -0.459571619588291
##$FCOR= 0.5
##$FTSIZE= 0
##$FT_mod= 4
##$GAMMA= 1
##$GB= 0.15
##$INTBC= 1
##$INTSCL= 1
##$ISEN= 128
##$LB= 0.24
##$LEV0= 0
##$LPBIN= 0
##$MAXI= 10000
##$MC2= 0
##$MEAN= 0
##$ME_mod= 0
##$MI= 1.114404
##$NCOEF= 0
##$NC_proc= 0
##$NLEV= 6
##$NOISF1= 3.799351
##$NOISF2= 2.8
##$NSP= 1
##$NTH_PI= 0
##$NZP= 0
##$OFFSET= 15.70392
##$PC= 1
##$PHC0= -13363.8
##$PHC1= 17.00099
##$PH_mod= 1
##$PKNL= yes
##$PPARMOD= 0
##$PSCAL= 0
##$PSIGN= 0
##$REVERSE= no
##$SF= 200.130013532006
##$SI= 16384
##$SIGF1= 3
##$SIGF2= 2
##$SINO= 400
##$SIOLD= 16384
##$SREGLST= <1H.CDCl3>
##$SSB= 0
##$STSI= 0
##$STSR= 0
##$SW_p= 3612.71676300578
##$SYMM= 0
##$S_DEV= 0
##$TDeff= 0
##$TDoff= 0
##$TI= <>
##$TILT= no
##$TM1= 0
##$TM2= 0
##$TOPLEV= 0
##$USERP1= <user>
##$USERP2= <user>
##$USERP3= <user>
##$USERP4= <user>
##$USERP5= <user>
##$WDW= 1
##$XDIM= 8192
##$YMAX_p= 0
##$YMIN_p= 0
$$ End of Bruker specific parameters
$$ ---------------------------------
##NTUPLES= NMR FID
##VAR_NAME=  TIME,          FID/REAL,        FID/IMAG
##SYMBOL=    X,             R,               I
##VAR_TYPE=  INDEPENDENT,   DEPENDENT,       DEPENDENT
##VAR_FORM=  AFFN,          ASDF,            ASDF
##VAR_DIM=   8192,          8192,            8192
##UNITS=     SECONDS,       ARBITRARY UNITS, ARBITRARY UNITS
##FACTOR=    0.0002496,     1,               1
##FIRST=     0,             0,               0
##LAST=      2.0444736,     0,               0
##MIN=       0,             -134557,         0
##MAX=       2.0444736,     109083,          0
$$ Real data points
##PAGE= N=1
##DATA TABLE= (X++(R..R)), XYDATA
$$ plain form
0 0 0 0 0 0 0 0 0 0 0 0 0 0 0 0 -8 8 -8 8 -8 16 -16 17 -24 25 -32 38 -41 49 -57 65 -74 86 -97 111 -127 143
36 143 -159 177 -199 223 -248 273 -305 338 -373 410 -455 503 -553 609 -671 738 -815 899 -992
55 -992 1097 -1219 1356 -1518 1707 -1931 2209 -2555 3005 -3617 4497 -5888 8413 -14507 64257
70 64257 10756 -89035 44667 109083 47968 -44521 -26427 49092 68596 -19297 -46660 23068
82 23068 45093 -25612 -34532 22665 30069 -27210 -42373 6966 44588 -3408 -67004 -34961 51295
95 51295 35588 -57385 -65689 23497 56682 -7053 -54079 -14134 45426 38026 -15560 -23562 21201
108 21201 37791 5672 -7491 10982 12332 -2348 2079 13419 5004 -12751 -11248 9099 17087
121 17087 -5339 -24906 -8484 15425 6475 -17171 -20951 -8143 1421 307 -10485 -21686 -16884
$$ packed form
0@%%%%%%%%%%%%%%qJ6j6J6j6K4l2L3m1M9n7P0p9R0j06J22j39J60j83K08k38K70
36A43l02L36l76M22m71N21n78O43p11P83q65R58j056J162j280J409j553J714j891
55i92K089k316K575k874L225l638M140m764N560o622Q114j0385J4301k2920P8764
70F4257n3501r9791J33702O4416o1115r2489J8094P5519J9504q7893k7363O9728
82B3068K2025p0705q920N7197P404n7279j5163M9339L7622m7996o3596L2043Q6256
95E1295j5707r2973q304Q9186L3185o3735m7026L9945N9560p400n3586q002M4763
108B1201J6590l2119j3163J8473J350j4680M427J1340q415j7755J503K0347P988
121A7087k2426j9567J6422K3909q950k3646l780J2808R564j114j0792j1201M802
$$ plain form
134 -16884 3540 14355 -2261 -23285 -11947 24247 30800 -6052 -25585 9065 41925 17431
146 17431 -22888 -12242 26968 25981 -11703 -20354 11062 21318 -9048 -21752 7537 20801 -12031
159 -12031 -32651 487 28542 -5594 -48345 -22544 30375 15385 -46228 -48342 15465 38235
171 38235 -17549 -54562 -7166 46232 16382 -39395 -21225 36644 32799 -19774 -25627 22156
183 22156 35515 -8908 -28832 12223 38635 -1559 -35835 -389 42036 13066 -39027 -21985
195 -21985 33134 29505 -28719 -43287 8227 35078 -8999 -48046 -16889 26354 8423 -32863
207 -32863 -24809 14593 17402 -13646 -19928 8959 20887 -3306 -16071 7701 23405 1435 -17149
220 -17149 1483 23510 10241 -14791 -9326 16860 19199 -5320 -16050 3261 17151 3031
$$ packed form
134a6884K0424J0815j6616k1024J1338L6194O553l6852j9533L4650L2860k4494
146A7431m0319J0646L9210r87l7684q651L1416J0256l0366j2704K9289J3264l2832
159a2031k0620L3138K8055l4136m2751K5801N2919j4990o1613k114O3807K2770
171C8235n5784l7013M7396N3398k9850n5777J8170N7869l845n2573n853M7783
183B2156J3359m4423j9924M1055K6412m0194l4276L5446M2425k8970n2093J7042
195b1985N5119l629n8224j4568N1514K6851m4077l9047L1157M3243j7931m1286
207c2863Q054L9402K809l1048o282K8887J1928k4193j2765K3772J5704k1970j8584
220a7149J8632K2027j3269k5032N465K6186K339k4519j0730J9311J3890j4120
$$ plain form
232 3031 -13484 -8489 3653 2409 -6792 -11070 -7960 -4527 -3568 -5054 -6774 -7902 -4741 1885 2359
247 2359 -4700 -5001 4568 7561 238 -2145 5077 7957 1520 -1361 6755 10806 1503 -5476 5766
262 5766 17453 4865 -12099 -2830 18221 12347 -13487 -16415 7895 16832 -7622 -25428 -6389
275 -6389 15789 1470 -23946 -15261 12038 9503 -15801 -16844 8861 15998 -7451 -17514 5562
288 5562 21845 535 -19334 8 25638 11218 -17646 -9636 22905 22769 -9864 -18710 11594
301 11594 27312 1099 -22256 -3366 22136 7923 -20385 -14569 11945 10524 -15326 -19378 3830
314 3830 11682 -8952 -19940 -700 14306 -1114 -18361 -5206 15435 7951 -13855 -10048 11953
327 11953 15179 -4286 -11611 5494 17614 4977 -8368 -712 13800 9637 -4192 -3676 7154
$$ packed form
232C031j6515M995J2142j244r201m278L110L433R59j486j720j128L161O626M74
247B359p059l01R569K993p323k383P222K880o437k881Q116M051r303o979J1242
262E766J1687j2588j6964R269K1051n874k5834k928K4310Q937k4454j7806J9039
275f389K2178j4319k5416Q685K7299k535k5304j043K5705P137k3449j0063K3076
288E562J6283k1310j9869J9342K5630j4420k8864Q010L2541j36l2633q846L0304
301A1594J5718k6213k3355J8890K5502j4213k8308N816K6514j421k5850m052K3208
314C830P852k0634j0988J9240J5006j5420j7247J3155K0641p484k1806L807K2001
327A1953L226j9465p325J7105J2120j2637j3345P656J4512m163j3829N16J0830
$$ plain form
340 7154 7598 -2465 -5389 1293 3366 -3715 -7319 -2213 1511 -3493 -8132 -4518 454 -1620 -5692
355 -5692 -4563 -599 472 -972 -2314 -1740 153 2450 2662 570 -821 2470 6835 5385 -532 -880
371 -880 6790 9060 1827 -3643 2486 8498 3077 -5811 -3159 5074 3486 -6736 -7237 1819 3749
386 3749 -6551 -9900 -151 4918 -4294 -11654 -3030 7496 895 -10881 -6615 8085 8038 -6323
400 -6323 -8621 5900 12727 767 -8293 2298 13944 6672 -6484 -2176 11474 8910 -4746
413 -4746 -5800 6591 9158 -3932 -9640 1260 8579 -1567 -11788 -4287 7249 1713 -11181
426 -11181 -8614 4543 5325 -7125 -10405 1021 7482 -1051 -9105 -1449 7886 3737 -4663 -2175
440 -2175 7204 6980 -1076 -1695 5437 8085 935 -2478 3269 7327 1832 -3770 -568 4746 1933 -4236
$$ packed form
340G154M44j0063k924O682K073p081l604N106L724n004m639L614M972k074m072
355e692J129L964J071j444j342N74J893K297K12k092j391L291M365j450n917l48
371h80P670K270p233n470O129O012n421q888K652Q233j588j0222n01R056J930
386C749j0300l349R749N069r212p360Q624J0526o601j1776M266J4700m7j4361
400f323k298J4521O827j1960r060J0591J1646p272j3156M308J3650k564j3656
413d746j054J2391K567j3090n708J0900P319j0146j0221P501J1536n536j2894
426a1181K567J3157P82j2450l280J1426O461q533q054P656R335m149q400K488
440b175R379k24q056o19P132K648p150l413N747M058n495n602L202N314k813o169
$$ plain form
456 -4236 -3975 1142 1480 -3218 -5597 -2474 294 -2028 -5064 -3120 -884 -1138 -2421 -1848 -762 -201
472 -201 80 305 801 847 1270 2291 2561 1800 2149 3201 3101 1616 1744 3081 2987 646 327 2294 2702
491 2702 -862 -2651 -240 1930 -982 -4850 -3195 864 -90 -4810 -5267 -263 1556 -2845 -5303 -1231
507 -1231 2814 69 -3996 -1522 3879 2772 -2103 -1128 4370 4812 -235 -1534 3427 5979 1344 -2231
523 -2231 1430 5753 2469 -3495 -1738 3341 2867 -3401 -4873 67 2471 -2185 -6121 -2293 2005
538 2005 -932 -5221 -3143 1495 805 -3180 -3242 1462 3089 -1105 -2213 1647 4270 1324 -1130 1513
554 1513 5048 3784 -60 652 3873 4392 862 -554 1969 2960 844 -1555 -489 1281 289 -2164
570 -2164 -2113 -718 -955 -2433 -2739 -1445 -722 -2011 -2461 -1334 -260 -1017 -1300 -784 600 566 194 234 1141
$$ packed form
456d236K61N117L38m698k379L123K768k322l036J944K236k54j283N73J086N61
472b01K81K25M96M6M23J021K70p61L49J052j00j485J28J337r4k341l19J967M08
491B702l564j789K411K170k912l868J655M059r54m720m57N004J819m401k458M072
507a231M045k745m065K474N401j107m875R75N498M42n047j299M961K552m635l575
523b231L661M323l284n964J757N079m74o268j472M940K404m656l936L828M298
538B005k937m289K078M638o90l985o2M704J627m194j108L860K623k946k454K643
554A513L535j264l844P12L221N19l530j416K523R91k116k399J066J770r92k453
570b164N1J395k37j478l06J294P23j289m50J127J074p57k83N16J384l4l72M0R07
$$ plain form
589 1141 1937 1765 1799 1911 2010 2536 2397 1750 1335 1714 1990 1146 210 -70 505 390 -790 -1214 -520 -759
609 -759 -1259 -1909 -1581 -574 -948 -1873 -1728 -481 -106 -1239 -1157 282 780 -207 -441 654 1815 1403 207
628 207 1016 2437 2518 836 422 1868 2248 841 -158 345 1011 164 -1076 -1306 -106 7 -1700 -2132
646 -2132 -1031 -672 -2023 -2667 -1559 -849 -1466 -2146 -1926 -530 -462 -1061 -1260 259 990 447 -138 800 2151
665 2151 1540 747 875 1737 1829 1135 513 1348 1323 587 -311 150 121 -233 -659 -1027 -572 -830 -1607 -1776 -1475
686 -1475 -1157 -1738 -1875 -1665 -1152 -1214 -1800 -1411 -888 -526 -392 -426 -30 661 711 358 948 1116 1088 1061 952 1014
708 1014 911 713 340 346 101 -181 -548 -293 -127 -637 -969 -1118 -921 -1071 -1525 -1478 -1608 -1525 -1309 -1446 -1463 -1049
730 -1049 -635 -634 -493 -178 39 255 618 1006 852 994 1412 1086 1133 825 1022 1252 903 269 583 758 357
$$ packed form
589A141P96j72L4J12R9N26j39o47m15L79K76q44r36k80N75j15j180m24O94k39
609g59n00o50L28J007l74r25J45J247L75j133Q2J439M98r87k34J095J161m12j196
628B07Q09J421Q1j682m14J446L80j407r99N03O66q47j240k30J200J13j707m32
646b132J101L59j351o44J108P10o17o80K20J396O8n99j99J519P31n43n85R38J351
665B151o11p93J28Q62R2o94o22Q35k5p36q98M61k9l54m26l68M55k58p77j69L01
686a475L18n81j37K10N13o2n86L89N23L62J34l4L96O91N0l53N90J68k8k7j09O2
708A014j03j98l73Ok45k82l67K55J66n10l32j49J97j50m54M7j30Q3K16j37j7M14
730a049M14JJ41L15K17K16L63L88j54J42M18l26M7l08J97K30l49o34L14J75m01
$$ plain form
751 357 -242 -165 -265 -400 -939 -1093 -819 -878 -1341 -1398 -1126 -813 -1135 -1590 -1030 -304 -330 -906 -834 46 716 27
773 27 171 784 1458 843 736 960 1340 1380 823 824 1493 1353 757 27 604 743 357 -429 -127 68 -225 -885
795 -885 -1086 -803 -868 -1116 -1386 -993 -560 -807 -847 -761 -230 -43 -263 233 569 445 573 831 989 1161 1029
816 1029 635 1015 1087 1119 622 896 885 566 521 397 274 -87 -40 -325 -573 -702 -416 -742 -1023 -1029 -824 -971
838 -971 -938 -711 -556 -409 -472 -329 -109 193 16 573 567 640 652 925 676 1073 863 813 835 735 743 794 311 446
862 446 453 264 119 -414 -260 -8 -658 -839 -1000 -598 -674 -903 -920 -855 -489 -645 -383 -314 -95 -13 -243 402 29
885 29 523 598 554 698 758 873 918 760 952 882 868 118 586 471 222 104 -107 47 -12 -14 -635 -624 -540 -810
909 -810 -682 -582 -786 -621 -554 -616 -567 -131 4 -131 -29 107 504 526 247 682 751 547 624 487 916 796
$$ packed form
751C57n99P7j00j35n39j54K74n9m63n7K72L13l22m55N60P26k6n76P2Q80O70o89
773B7J44O13O74o15j07K24L80M0n57JO69j40n96p30N77J39l86p86L02J95k93o60
795h85k01K83o5k48k70L93M33k47m0Q6N31J87k20M96L36j24J28K58J58J72j32
816A029l94L80P2L2m97K74j1l19m5j24j23l61M7k85k48j29K86l26k81oK05j47
838i71L3K27J55J47o3J43K20L02j77N57oP3J2K73k49L97k10n0K2j00QN1m83J35
862D46Pj89j45n33J54K52o50j81j61M02p6k29j7O5L66j56K62O9K19Q2k30O45l73
885B9M94P5m4J44O0J15M5j58J92p0j4p50M68j15k49j18k11J54n9ko21J1Q4k70
909h10J28J00k04J65O7o2M9M36J35j35J02J36L97K2k79M35O9k04P7j37M29j20
$$ plain form
931 796 303 351 827 679 337 431 446 246 -281 -158 -309 -98 -346 -709 -485 -677 -379 -641 -512 -231 -216 -669
953 -669 -428 42 82 -171 74 603 358 -21 208 805 964 539 360 1076 1102 626 137 785 747 616 147
974 147 94 413 260 -357 -390 193 73 -650 -911 -493 -134 -532 -996 -589 -12 -131 -823 -615 353 281 -457
995 -457 -415 249 858 127 -107 788 1217 699 269 451 1102 1065 54 126 1019 925 21 -259 34 645 -151
1016 -151 -1077 -439 206 -292 -971 -821 21 -234 -845 -973 -260 90 -646 -871 -51 579 198 -405 2 498
1036 498 716 -125 165 839 539 275 266 803 721 147 -177 441 184 78 -92 -195 -276 -378 -619 -644 -504 -705
1058 -705 -577 -528 -290 -775 -834 -489 -445 -410 -336 -383 425 25 -270 -99 90 352 -135 -143 630 659 163 54 615
1081 615 1068 164 -173 260 690 -278 -729 -216 392 -8 -817 -748 174 -139 -928 -1405 -142 141 -881 -1314
$$ packed form
931G96m93M8M76j48l42R4J5k00n27J23j51K11k48l63K24j92K98k62J29K81J5m53
953f69K41M70M0k53K45N29k45l79K29N97J59m25j79P16K6m76m89O48l8j31m69
974A47n3L19j53o17l3N83j20p23k61M18L59l98m64M07N77j19o92K08R68p2p38
995d57M2O64O09p31k34Q95M29n18m30J82O51l7j011P2Q93r4r04k80K93O11p96
1016a51r26O38O45m98o79J50Q42k55o11j28P13L50p36k25Q20O30l81o03M07M96
1036D98K18q41K90O74l00k64rN37q2n74l24O18k57j06j70j03q1j02k41k5J40k01
1058g05J28M9K38m85n9L45M4L5P4m7Q08m00k95J71J89K62m87qP73K9m96j09N61
1081F15M53r04l37M33M30r68m51N13O08m00q09O9R22l13p89m77J263K83j022m33
$$ plain form
1101 -1314 -719 259 -17 -844 -667 456 273 -452 -274 813 964 -143 -312 370 1412 619 -442 20
1119 20 1279 553 -383 -330 519 603 -140 -1042 -276 495 -257 -1013 -792 136 -411 -1248 -909 -82 302 -754
1139 -754 -944 -155 366 -229 -561 -54 463 194 -277 -182 828 680 286 115 825 676 32 131 518 600 226
1160 226 174 289 40 -110 -391 -293 -253 -190 -458 -416 -291 -612 -471 -589 -188 -232 -412 -94 -360 -307 15 261
1182 261 317 353 379 310 528 485 167 273 581 604 193 203 846 230 -296 -128 188 239 -159 -505 -204 387 -232
1205 -232 -470 -551 190 -74 -670 -726 -225 -59 -620 -301 -309 644 144 -424 -168 521 509 18 -339 424 662 407
1227 407 -161 637 831 285 -405 83 608 323 -433 7 100 193 -321 -584 -200 -156 -140 -635 -186 -460 -424 -458
1249 -458 -479 -238 -13 -444 -517 83 272 -109 -284 252 321 225 401 20 423 761 185 140 598 557 421 250
$$ packed form
1101a314N95R78k76q27J77J123j83p25J78J087J51j107j69O82J042p93j061M62
1119B0J259p26r36N3Q49Q4p43r02P66P71p52p56K21R28n47q37L39Q27L84j056
1139g54j90P89N21n95l32N07N17k69m71R5J010j48l94j71P10j49o44R9L87Q2l74
1160B26n2J15k49j50k81R8M0O3k68M2J25l21J41j18M01m4j80L18k66N3L22K46
1182B61N6L6K6o9K18m3l18J06L08K3m11J0O43o16n26J68L16N1l98l46L01N91o19
1205b32k38q1P41k64n96n6N01J66n61L19qR53n00n68K56O89j2m91l57P63K38k55
1227D07n68P98J94n46o90M88N25k85p56M40R3R3n14k63L84M4J6m95M49k74L6l4
1249d58k1K41K25m31p3O00J89l81j75N36O9r6J76l81M03L38n76m5M58m1j36j71
$$ plain form
1271 250 158 149 172 -22 -242 -227 -103 -167 -205 -355 -285 -248 -461 -227 -104 150 -7 -318 -410 -77 -56 -98 -72 -52 217
1296 217 338 -9 117 400 232 274 237 450 368 152 194 196 246 -14 -139 -150 156 -102 -243 -228 -288 81 -413
1319 -413 -620 -439 -477 -341 -520 -136 -158 -248 -62 -141 109 48 271 29 102 309 205 124 20 162 394 264
1341 264 187 182 39 173 253 61 46 -83 -209 1 0 -251 -288 -34 -280 -400 -541 -191 -301 -257 -213 -161 -110 -211
1365 -211 -90 2 216 -184 10 218 323 286 -160 302 268 152 24 37 202 354 0 -259 148 110 194 -215
1387 -215 -99 193 -474 -111 -168 -247 -82 -433 -324 -225 -149 -302 -314 -307 -154 -77 -262 18 144 80 -46 65 -171
1410 -171 393 265 103 284 190 324 -63 190 334 434 282 -146 -48 86 102 -311 36 -134 -232 -210 -212 -410
1432 -410 -311 -344 -179 -3 -202 -299 -147 -18 -30 117 168 150 138 -71 125 444 295 -90 269 412 12 347
$$ packed form
1271B50r2rK3j94k20J5J24o4l8j50P0L7k13K34J23K54j57l11r2L33K1m2K6K0K69
1296B17J21l47J26K83j68M2l7K13q2k16M2KN0k60j25j1L06k58j41J5o0L69m94
1319d13k07J81l8J36j79L84k2r0J86p9K50o1K23k42P3K07j04q1j04J42K32j30
1341B64p7nj43J34Q0j92j5j29j26K10jk51l7K54k46j20j41L50j10M4M4N2N1j01
1365b11J21R2K14m00J94K08J05l7m46M62l4j16j28J3J65J52l54k59M07l8Q4m09
1387b15J16K92o67L63n7p9J65l51J09R9P6j53j2PJ53P7j85K80J26o4j26J11k36
1410a71N64j28j62J81r4J34l87K53J44J00j52m28R8J34J6m13L47j70r8K2kj98
1432d10R9l3J65J76j99r7J52J29j2J47N1j8j2k09J96L19j49l85L59J43m00L35
$$ plain form
1454 347 50 471 243 41 222 136 147 -58 -153 -33 105 63 -255 -49 101 -251 -15 -488 -143 -105 -114 -217
1476 -217 134 149 -6 5 6 328 101 -127 187 578 512 54 -166 332 588 360 149 91 19 226 -67 57
1498 57 221 44 -286 -305 89 184 -97 -294 -33 98 -140 -573 -184 345 195 -210 88 67 -44 -51 -134 26
1520 26 175 221 166 12 260 244 -67 129 150 194 11 330 169 167 96 -140 -281 130 6 -54 -73 -113 4 -301
1544 -301 -230 -421 -332 123 -334 -64 -47 -26 -147 -108 39 -76 -36 241 203 -47 -6 140 205 38 19 107 167 -165
1568 -165 -127 43 84 62 -213 -73 -15 162 -224 -414 177 378 -53 -399 -518 107 -70 -556 -527 46 44 -106
1590 -106 -235 300 241 24 -234 -9 564 185 -253 55 474 297 10 -100 195 397 94 -445 -61 192
1610 192 34 -393 -155 287 -39 -425 -206 -50 -161 -200 -262 -84 62 7 -178 15 106 -121 -4 -19 241 431
$$ packed form
1454C47k97M21k28k02J81q6J1k05r5J20J38m2l18K06J50l52K36m73L45L8rj03
1476b17L51J5j55J1JL22k27k28L14L91o6m58k20M98K56k28k11n8p2K07k93J24
1498E7J64j77l30j9L94R5k81j97K61J31k38m33L89N29j50m05K98k1j11pq3J60
1520B6J49M6n5j54K48j6l11J96K1M4j83L19j61kp1k36j41M11j24o0j9m0J17l05
1544c01P1j91Q9M55m57K70J7K1j21L9J47j15M0K77l8k50M1J46O5j67j9Q8O0l32
1568a65L8J70M1k2k75J40N8J77l86j90N91K01m31l46j19O25j77m86K9N73kj50
1590a06j29N35n9k17k58K25N73l79m38L08M19j77k87j10K95K02l03n39L84K53
1610A92j58m27K38M42l26l86K19J56j11l9o2J78J46n5j85J93R1k27J17j5K60J90
$$ plain form
1632 431 128 113 473 143 -17 -43 208 124 -51 173 327 -62 -336 94 116 -162 -306 -68 -67 129 -529 -502
1654 -502 128 118 -51 -505 11 337 -180 -378 -80 352 -32 -572 -177 606 439 -478 -403 273 452 -72 -552
1675 -552 333 548 148 -499 94 554 39 -714 -427 910 606 -754 -296 263 690 -373 -856 101 467
1694 467 -330 -968 -166 811 203 -872 -637 531 487 -674 -561 573 741 -239 -773 367 816 268 -797
1713 -797 39 794 123 -700 -366 465 630 -517 -705 301 571 -217 -602 144 440 -336 -962 -175 474
1732 474 -123 -758 -300 300 426 -383 -475 218 454 -86 -230 127 555 -7 -147 120 456 -158 -689 184
1752 184 414 83 -184 129 161 -207 -401 -121 643 -61 -684 -15 424 38 -870 -243 305 240 -583 -601 567
1773 567 393 -393 -949 214 978 -336 -1003 273 1070 150 -866 -215 1063 566 -641 -870 939 783
$$ packed form
1632D31l03j5L60l30j60k6K51q4j75K24J54l89k74M30K2k78j44K38JJ96o58K7
1654e02O30j0j69m54N16L26n17j98K98M32l84n40L95P83j67r17P5O76J79n24m80
1675e52Q85K15m00o47N93M60n15p53K87J337l04j360M58N59M27j063m83R57L66
1694D67p97o38Q02R77o08j075K35J168m4j161J13J134J68r80n34J140M49n48j065
1713g97Q36P55o71q23L34Q31J65j147j88J006K70p88l85P46K96p76o26P87O49
1732D74n97o35M58O00J26q09r2O93K36n40j44L57M28n62j40K67L36o14n31Q73
1752A84K30l31k67L13L2l68j94K80P64p04o23O69M39l86r08O27N48o5q23j8J168
1773E67j74p86n56J163P64j314o67J276P97r20j016O51J278m97j207k29J809j56
$$ plain form
1791 783 -678 -967 826 1065 -396 -1404 -32 1485 111 -1508 -518 1067 658 -1171 -1184 749 1362
1808 1362 -1007 -1574 330 1466 44 -1537 -294 1356 774 -1430 -817 1214 1359 -1051 -887 913
1824 913 1315 -352 -1539 -59 1814 298 -1521 -409 1280 744 -951 -1094 933 1219 -713 -1110
1840 -1110 364 1216 -105 -1297 88 1218 349 -1035 -516 714 620 -755 -889 811 598 -299 -795
1857 -795 502 700 -162 -391 322 605 277 -183 120 390 53 -293 240 634 -13 -797 211 529 -186
1876 -186 -856 42 704 86 -643 -68 892 372 -952 -517 1091 751 -763 -886 865 1292 -546 -1169
1894 -1169 665 1500 -8 -1696 -67 1862 519 -1679 -1025 1636 1295 -1419 -1541 1025 1937 -892
1910 -892 -2404 390 2145 -251 -2256 -596 1944 790 -1942 -1518 1657 1729 -1382 -2247 1175 2189
$$ packed form
1791G83j461k89J793K39j461j008J372J517j374j619R90J585m09j829j3J933O13
1808A362k369n67J904J136j422j581J243J650n82k204O13K031J45k410J64J800
1824I13M02j667j187J480J873j516j819J112J689n36j695j43K027K86j932l97
1840a110J474Q52j321j192J385J130q69j384N19J230r4j375j34J700k13q97m96
1857g95J297J98q62k29P13K83l28m60L03K70l37l46N33L94o47p84J008L18p15
1876a86o70Q98O62o18p29N75R60n20j324M35J608l40j514j23J751M27j838o23
1894a169J834Q35j508j688J629J929j343k198O54K661l41k714j22K566R12k829
1910h92j512K794J755k396k005J660K540j154k732M24L175P2l111q65L422J014
$$ plain form
1926 2189 -388 -2499 -94 2536 497 -2254 -753 2284 1636 -1967 -1921 1549 2019 -1043 -2380 394
1942 394 2865 -64 -2537 -574 2191 958 -2359 -1243 1798 1527 -1563 -1566 969 2015 -528 -2097
1958 -2097 129 1909 125 -1991 -303 1691 563 -1358 -970 903 1163 -632 -1080 705 1309 -350
1974 -350 -465 179 1080 69 -1071 37 592 -29 -784 -36 762 189 -1034 -267 841 133 -718 -91
1992 -91 511 -134 -670 -328 915 128 -1000 -308 637 541 -1062 -861 1106 1066 -974 -1289 889 1808 -482
2011 -482 -1662 185 1948 429 -1980 -783 2134 1195 -1923 -1311 1700 2000 -1222 -2533 1035 2485
2027 2485 -393 -2574 -295 2783 895 -2657 -1444 2518 1791 -2068 -2439 1467 2608 -1272 -2818
2042 -2818 705 3116 211 -3073 -575 3140 1472 -2598 -1938 2206 2502 -1804 -2778 938 2749 -775
$$ packed form
1926B189k577k111K405K630k039k751J501L037o48l603M6L470M70l062j337K774
1942C94K471k929k473J963K765j233l317J116L041k71l090lK535J046k543j569
1958b097K226J780j784k116J688J994j128j921L88J873K60j795m48J785O04j659
1974c50j15O44R01j011j140J108N55o21p55P48P98n73j223P67J108p08q51O27
1992i1O02o45n36L42J243p87j128O92R45r6j603K01J967m0k040l15K178R19k290
2011d82j180J847J763j519k409J197K917r39l118O12L011L00l222j311L568J450
2027B485k878k181K279L078j888l552J213L962p27l859l71L906J141l880j546
2042b818L523K411k905l284K498L715j668m070O60M144K96m306r74L716J811l524
$$ plain form
2058 -775 -2895 -268 2850 641 -2784 -1476 2393 1694 -1821 -1976 1507 2205 -1111 -2617 381 2280
2074 2280 -29 -2280 -538 2014 1028 -1821 -1410 1360 1442 -918 -1372 674 1696 -209 -1483 157
2090 157 1294 320 -1007 -574 996 97 -762 -647 793 420 -748 -384 364 314 -470 -277 662 -30 -668
2109 -668 -344 613 222 -724 -211 712 592 -841 -589 1024 911 -1042 -1050 846 1449 -615 -1591 475 1910
2128 1910 -165 -2160 -240 1939 385 -1981 -1638 1600 1604 -1499 -2443 939 2111 -569 -2767 -175
2144 -175 2642 419 -2422 -1177 2449 1673 -2205 -2063 1917 2343 -906 -2572 864 3085 -203 -2869
2160 -2869 -357 3014 1034 -2524 -1756 2299 2341 -1761 -2282 1455 3017 -772 -2862 -214 3119 500
2176 500 -2526 -1058 2191 1645 -2248 -2105 1616 1997 -903 -2350 549 2224 13 -2157 -352 2043
$$ packed form
2058g75k120K627L118k209l425J308L869o99l515j55L483O98l316j506K998J899
2074B280k309k251J742K552r86k849M11K770Q2k360m54K046J022j905j274J640
2090A57J137r74j327M33J570q99q59J15J440l73j168L64P48n0p84J93R39o92o38
2109f68L24R57l91r46N13R23j20j433K52J613j13j953qJ896O03k064r76K066J435
2128A910k075j995J920K179j554k366L43L238Ml103r44L382J172k680k198K592
2144a75K817k223k841J245L626p76l878J42L980M26l249j666L436K221l288k666
2160b869K512L371j980l558P68M055M2m102n21L737J562l789k090K648L333k619
2176E00l026J468L249n46l893J43L721L81k900j447K899J675k211k170J805K395
$$ plain form
2192 2043 738 -1549 -1087 1653 1451 -826 -1447 726 1339 -65 -1337 188 1370 66 -1064 -389
2208 -389 823 327 -677 -590 562 626 -423 -637 82 204 102 -60 321 228 -379 274 588 383 -377 114
2228 114 661 260 -545 -81 907 588 -746 -210 1136 1049 -406 -1031 914 1485 -544 -1311 -90 1440
2246 1440 209 -1687 -823 1530 1294 -1511 -1364 718 1755 -984 -1953 527 2062 141 -2287 -390
2262 -390 2092 910 -2338 -1344 1708 1570 -1055 -1922 891 2486 -398 -2195 179 2282 555 -2074
2278 -2074 -1327 1928 1839 -1520 -1938 1078 2161 -884 -2057 256 2167 212 -2353 -714 1748 984
2294 984 -1562 -1383 1690 1526 -1028 -1613 504 1571 47 -1761 -461 1940 523 -1191 -992 995
2310 995 1081 -687 -1272 616 989 -308 -1112 99 859 261 -914 -386 455 296 -441 -334 255 393 -275
$$ packed form
2192B043j305k287M62K740k02k277o21K173O13j404j272J525J182j304j130O75
2208c89J212m96j004Q7J152O4j049k14P19J22j02j62L81r3o07O53L14k05p60M91
2228A14N47m01q05M64R88l19j334N36J346q7j455o25J945N71k029p67J221J530
2246A440j231j896Q64K353k36k805J47K082J037k739r69K480J535j921k428J897
2262c90K482j182l248R94L052j38k625q67K813J595k884j797K374K103j727k629
2278b074P47L255q9l359m18L016J083l045j173K313J911j955k565J639K462p64
2294I84k546J79L073j64k554n85K117J067j524j808J300K401j417j714J99J987
2310I95Q6j768n85J888L73j297q04J211P60n98j175N28Q41j59p37J07N89J38o68
$$ plain form
2329 -275 -606 -50 281 -13 -239 -313 55 -83 127 177 50 -415 -29 629 -296 -478 339 347 -64 -384 -239
2350 -239 676 565 -676 -586 535 726 -351 -810 337 942 63 -1333 -262 1371 312 -1206 -942
2367 -942 935 1050 -1121 -1315 455 1333 -245 -1513 -175 1556 443 -1031 -808 1088 1042 -1205 -1594
2384 -1594 701 1724 -453 -1461 168 1384 -103 -1511 -473 1289 971 -1075 -1249 759 1048 -766
2400 -766 -1606 75 1191 -24 -1457 -207 1190 532 -979 -700 689 1140 -602 -859 430 1183 -48
2417 -48 -1145 48 1012 208 -927 -183 652 452 -523 -372 379 724 213 -381 -76 461 164 -464 -172
2436 -172 364 217 -150 -341 286 142 -282 99 99 302 163 -194 -93 280 23 170 208 -210 -45 489 290
2457 290 -110 -119 192 268 -153 -512 -181 216 301 -749 -207 887 199 -433 -525 226 676 -155 -540 -54 602
$$ packed form
2329b75l31N56L31k94k26p4L68j38K10N0j27m65L86O58r25j82Q17Qm11l20J45
2350b39R15j11j241R0J121J91j077m59J147O05q79j396J071J633j059j518K64
2367i42J877J15k171j94J770Q78j578j268J338J731j113j474K23J896m6k247l89
2384a594K295J023k177j008J629J216j487j408J038J762l18k046j74K008K89j814
2400g66q40J681J116j215j433J250J397o58j511K79J389M51j742k57J289P53j231
2417d8j097J193R64q04j135P44Q35k00r75J51P51L45n11n94L05N37k97o28K92
2436a72N36j47l67j91O27j44m24L81%K03j39l57J01L73k57J47L8m18J65N34j99
2457B90m00rL11P6m21l59L31L97Q5j050N42J094o88o32r2P51M50q31l85M86O56
$$ plain form
2478 602 102 -565 -25 597 60 -498 -696 478 631 -336 -805 -86 779 -192 -759 -273 762 539 -747
2497 -747 -613 330 901 -472 -867 471 897 -180 -803 -269 794 538 -753 -419 475 573 -568 -812
2515 -812 496 732 -411 -838 12 634 488 -879 -304 623 434 -493 -756 82 354 -170 -578 -26 578
2534 578 -13 -340 -155 469 122 -185 -8 361 305 -119 -404 94 156 -59 -339 -67 233 -130 -395 98 367
2555 367 60 -82 -183 -90 -164 162 -159 -216 71 -100 116 -85 -32 323 233 235 -325 -217 57 20 137 -127 -77
2578 -77 -10 -219 -298 154 248 -22 -382 -207 242 170 -195 -310 137 393 -56 67 131 366 150 -367 39 125
2600 125 201 -116 -182 235 371 -32 -431 57 398 161 -382 -323 307 322 -65 -21 175 295 -296 -85 -226 244
2622 244 411 -200 -333 67 191 -220 -202 66 358 -234 -116 73 320 11 -345 109 27 -133 -214 249 6
$$ packed form
2478F02n00o67N40O22n37n58j98J174J53r67m69P19Q65r71n67M86J035k23j286
2497g47J34R43N71j373l95J338M26j077o23N34J063k56j291L34Q94R8j141k44
2515h12J308K36j143m27Q50O22j46j367N75R27j89r27k63Q38K72n24m08N52O04
2534E78n91l27J85O24l47l07J77L69n6m24k85M98O2k15k80K72L00l63k65M93K69
2555C67l07j42j01R3p4L26l21n7K87j71K16k01N3L55r0Kn60J08K74l7J17k64N0
2578g7O7k09p9M52R4k70l60J75M49p2l65j15M47K56m49J23O4K35k16n17M06Q6
2600A25P6l17o6M17J36m03l99M88L41k37n43N9O30J5l87M4J96J20n91K11j41M70
2622B44J67o11j33M00J24m11J8K68K92n92J18J89K47l09l56M54q2j60q1M63k43
$$ plain form
2643 6 412 -209 -98 49 226 -100 -224 -36 99 -425 -232 -98 114 180 -122 39 94 67 -49 -205 -91 -32
2665 -32 75 -92 70 -7 89 16 -117 -58 -8 19 -94 296 63 -56 -28 -104 177 145 26 -129 -253 85 -17
2688 -17 -103 -13 158 -20 -58 -30 -119 299 -11 -47 -289 -85 52 -243 -283 -52 107 117 -321 20 -53 182 -23
2711 -23 -126 63 271 213 -2 -86 66 448 -3 -120 -38 -98 -146 190 -5 -12 -286 -32 37 54 107 157 -207 204
2735 204 1 -102 -192 -70 39 65 -194 -161 176 158 10 -265 -181 79 137 49 108 -82 -142 -260 -140 136 130 156
2759 156 -310 -189 94 90 72 -110 174 -260 -1 -40 239 333 230 -137 -152 -117 -31 -120 51 -44 1 -27 -36 -91 102
2784 102 167 -79 49 -94 -130 157 -129 -89 241 -55 -76 168 4 -34 -92 12 123 3 -123 25 187 -22
2806 -22 -40 -38 200 53 117 80 48 149 182 19 26 166 -28 4 36 87 -128 -61 39 349 165 138 34 -21 -119 149
$$ packed form
2643FM06o21J11J47J77l26j24J88J35n24J93J34K12O6l02J61N5k7j16j56J14N9
2665c2J07j67J62p7R6p3j33N9N0K7j13L90k33j19K8p6K81l2j19j55j24L38j02
2688a7q6R0J71j78l8K8q9M18l10l6k42K04J37k95m0K31J59J0m38L41p3K35k05
2711b3j03J89K08n8k15q4J52L82m51j17Q2o0m8L36j95pk74K54O9J7N3N0l64M11
2735B04k03j03r0J22J09K6k59L3L37j8j48k75Q4K60N8q8N9j90o0j18J20K76oK6
2759A56m66J21K83mj8j82K84m34K59l9K79R4j03l67j5L5Q6q9J71r5M5k8rn5J93
2784A02O5k46J28j43l6K87k86M0L30k96k1K44j64l8n8J04J11j20j26J48J62k09
2806b2j8KK38j47O4l7l2J01L3j63PJ40j94L2L2N1k15O7J00L10j84k7j04n5r8K68
$$ plain form
2832 149 -31 -156 19 163 1 -25 -164 172 -154 -107 -7 64 -147 122 250 -33 -25 -163 -187 -165 -2 -22 240
2855 240 -87 158 123 101 62 -1 -41 93 -101 -3 29 -145 56 -184 -122 45 177 -143 -122 197 -18 125 302
2878 302 91 -27 -130 -21 185 -205 323 -65 71 60 -145 274 -40 227 -203 280 156 14 -134 -253
2898 -253 -10 79 -102 153 128 133 0 68 -75 -65 -97 31 -123 257 254 -155 106 156 -74 -115 55 67 211 -97
2922 -97 -145 116 -172 -70 -21 -367 26 -147 -46 -63 -200 -17 235 -40 -31 147 -79 -130 88 147 -46 -238 -293
2945 -293 -32 105 174 -159 -147 -44 -215 162 210 69 -100 -120 29 -13 25 -4 55 -99 48 156 202 226 -75
2968 -75 133 -87 390 55 -79 -348 126 -141 -16 -27 -51 87 -44 -40 -121 137 11 -95 18 -24 249 -40
2990 -40 -156 -132 74 -158 32 -105 202 277 21 69 8 -135 -53 -321 -25 -156 -67 -70 142 223 -163 103 172 -76
$$ packed form
2832A49j80j25J75J44j62k6j39L36l26M7J00P1k11K69J28k83Qj38k4K2J63k0K62
2855B40l27K45l5k2l9o3m0J34j94R8L2j74K01k40O2J67J32l20K1L19k15J43J77
2878C02k11j18j03J09K06l90N28l88J36j1k05M19l14K67m30M83j24j42j48j19
2898b53K43Q9j81K55k5Nj33O8j43J0l2J28j54L80lm09K61N0k30m1J70J2J44l08
2922i7m8K61k88J02M9l46L93j73J01j7j37J83K52k75RJ78k26n1K18N9j93j92n5
2945b93K61J37O9l33J2J03j71L77M8j41j69k0J49m2L8k9N9j54J47J08M6K4l01
2968g5K08k20M77l35j34k69M74k67J25j1k4J38j31Mq1K58j26j06J13m2K73k89
2990d0j16K4K06k32J90j37L07P5k56M8o1j43Q2k68K96j31Q9lK12Q1l86K66O9k48
$$ plain form
3014 -76 -90 134 131 286 -109 80 -195 453 229 -11 150 121 2 -231 -139 316 -46 77 -38 159 161 -29 -31
3037 -31 -33 13 0 27 136 128 85 96 -111 22 -113 -319 -200 10 66 -40 177 35 -5 -80 -47 145 -68 169 222
3062 222 -48 318 203 58 -230 42 51 -82 25 -164 -83 63 -178 82 -75 -25 -82 156 -54 -15 16 -248
3084 -248 0 -53 -222 -231 86 36 148 84 -61 149 104 -63 70 9 117 -108 -130 8 219 35 98 -36 123
3107 123 -146 -154 -166 103 62 140 150 136 -159 49 -162 208 154 6 154 42 -64 50 -67 154 171 -96 37
3130 37 20 155 310 -141 -294 61 61 145 117 33 240 186 46 -588 19 -22 -68 41 5 67 -75 -157 -13 139
3154 139 -183 -117 174 -32 -19 -44 -270 318 -68 -34 -322 -9 32 -26 -45 121 -81 -226 23 16 232 -10 150
3177 150 361 208 -13 -257 22 132 -118 -243 -32 -21 -101 -190 -29 -56 148 -12 -63 81 38 126 -170 11
$$ packed form
3014g6j4K24lJ55l95J89k75O48k24k40J61k9j19k33R2M55l62J23j15J97Kj90k
3037c1kM6j3K7J09qm3J1k07J33j35k06J19K10N6j06K17j42m0p5L3J92k13K37N3
3062B22k70L66j15j45k88K72Rj33J07j89Q1J46k41K60j57N0n7K38k10L9L1k64
3084b48K48n3j69rL17n0J12o4j45K10m5j67J33o1J08k25k2J38K11j84O3j34J59
3107A23k69qj2K69m1P8J0j4k95K08k11L70n4j48J48j12j06J14j17K21J7k67J33
3130C7j7J35J55m51j53L55%Q4k8q4K07n4j40o34O07m1m6J09l6O2j42q2J44J52
3154A39l22O6K91k06J3k5k26N88l86L4k88L13M1n8j9J66k02j45K49pK16k42J60
3177A50K11j53k21k44K79J10k50j25K11J1q0q9J61k7K04j60n1J44m3Q8k96J81
$$ plain form
3199 11 -7 -259 -92 -58 96 -81 -353 39 -41 196 176 73 -218 192 123 99 7 -79 88 -34 -96 86 -53
3222 -53 -46 35 232 -101 -338 137 397 211 -20 96 -178 1 -15 3 -156 -15 258 149 -276 171 188 -95
3244 -95 17 -174 56 -38 -102 177 -20 -92 -148 -32 -59 -11 -25 -23 -71 -158 -12 -130 -9 200 -2 -37 27 -106 -117
3269 -117 -98 15 -30 17 8 -56 26 -14 -18 148 165 -276 -10 86 -69 59 29 -138 218 5 53 186 50 192 -108
3294 -108 -82 195 20 -80 -111 -131 258 32 -157 -52 -65 -191 -163 116 73 71 -145 -3 13 -56 263 141 64 140
3318 140 217 43 -61 -160 -173 161 -48 159 -21 -173 -3 -65 147 -194 -74 349 -36 258 132 -435 43
3339 43 -152 127 37 35 178 -139 197 62 -200 260 62 -235 -215 -89 191 157 -211 3 187 65 -219 -225 -15
3362 -15 27 29 -245 73 -32 -67 -19 -39 -104 -38 -367 68 31 -244 14 -166 -71 -66 0 -151 -4 -132 -9 -194 -197
$$ packed form
3199A1j8k52J67L4J54j77k72L92q0K37k0j03k91M10o9k4r2q6J67j22o2J82j39
3222e3PQ1J97l33k37M75K60j86k31J16k74J79j6J8j59J41K73j09m25M47J7k83
3244i5J12j91K30r4o4K79j97p2n6J16k7M8j4Km8q7J46j18J21K09k02l5O4j33j1
3269a17J9J13m5M7ro4Q2m0mJ66J7m41K66R6j55J28l0j67L56k13M8J33j36J42l00
3294a08K6K77j75j00l1k0L89k26j89J05j3j26K8K79m3kk16J42J6o9L19j22p7P6
3318A40P7j74j04r9j3L34k09K07j80j52J70o2K12l41J20M23l85K94j26n67M78
3339D3j95K79r0kJ43l17L36j35k62M60j98k97K0J26K80l4l68K14J84j22k84oK10
3362a5M2Kk74L18j05l5M8k0o5O6l29M35l7k75K58j80R5NO6j51J47j28J23j85l
$$ plain form
3387 -197 -105 -130 -43 78 227 49 -60 -73 -76 -2 -74 -121 -79 151 -11 268 -73 -151 -254 -81 72 -13 96 196
3411 196 20 71 -33 3 -43 -38 -171 12 -81 2 -100 -122 -120 133 -102 -209 -295 233 219 43 -153 283 -63 50
3435 50 -19 14 36 119 -120 -168 -160 193 -19 -194 181 -140 -51 -23 108 3 83 -118 -79 -10 36 -131 63 14 -122
3460 -122 -25 116 -205 71 -49 -13 293 -69 52 166 58 133 108 -18 78 -18 -209 -42 -232 196 -64 -30
3482 -30 -133 -46 104 -151 257 94 -75 -24 27 96 -153 -81 -61 52 -88 149 45 -267 135 -66 49 198
3504 198 260 -41 177 94 -195 -201 270 -91 -23 95 28 104 -457 -9 -12 150 183 32 211 26 -108 177 119 246
3528 246 126 -375 -57 -189 -233 -155 -109 11 197 113 23 45 -105 -161 -60 -154 -34 145 -108 -48 81 109 -66
3551 -66 211 -24 -9 68 -63 -84 -4 -214 253 -119 111 153 -56 196 -97 115 34 -391 17 18 -173 32 -34
$$ packed form
3387a97R2k5Q7J21J49j78j09j3lP4p2m7M2K30j62K79l41p8j03J73J53q5J09J00
3411A96j76N1j04L6m6Nj33J83r3Q3j02k2KK53k35j07q6N28j4j76j96M36l46J13
3435E0o9L3K2Q3k39m8QL53k12j75L75l21Q9K8J31j05Q0k01L9O9M6j67J94m9j36
3460a22R7J41l21K76j20L6L06l62J21J14j08P5k5j26R6r6j91J67j90M28k60L4
3482c0j03Q7J50k55M08j63j69N1N1O9k49P2K0J13j40K37j04l12M02k01J15J49
3504A98O2l01K18q3k89oM71l61O8J18o7P6n61M48lJ62L3j51J79j85j34K85n8J27
3528B46j20n01L18j32m4P8M6J20J86q4r0K2j50n6J01r4J20J79k53O0J29K8j75
3551f6K77k35J5P7j31k1Q0k10M67l72K30M2k09K52k93K12q1m25M08Jj91K05o6
$$ plain form
3574 -34 216 106 269 18 48 -104 -134 -16 27 210 -35 48 -73 210 -78 -174 -374 79 -154 -80 -14 -172 31
3597 31 293 -137 163 236 117 -120 178 227 -156 76 -16 -93 10 8 -102 197 -96 -222 -307 -147 -10 -233 -51
3620 -51 49 430 56 -4 -35 144 255 -161 -120 256 -87 -75 -134 260 4 -181 -250 -58 -23 -72 -75 22 280 141
3644 141 29 -59 8 88 -264 -83 -124 96 -35 -35 -75 71 -43 54 101 313 -114 -119 116 193 -16 -124 101 37
3668 37 -44 -46 110 66 -262 167 -70 -257 -38 29 -83 51 147 53 121 -113 -63 -277 -208 -58 124 74 -162 -6
3692 -6 23 -44 80 -10 119 199 12 -292 -227 100 -309 -247 -25 -13 -296 12 299 265 218 133 -351 212 53 -58
3716 -58 139 -39 -36 -107 -85 -298 45 46 3 58 265 43 -121 86 117 -154 -97 -258 81 -113 101 169 -105 29
3740 29 -121 -191 -56 -173 -87 -59 -127 -45 -139 -130 -46 -54 -89 -34 113 142 -3 5 -228 33 76 23 204 -73 9 258 -31
$$ packed form
3574c4K50j10J63k51L0j52l0J18M3J83k45Q3j21K83k88r6k00M53k33P4O6j58K03
3597C1K62m30L00P3j19k37K98M9l83K32r2p7J03kj10K99k93j26q5J60J37k23J82
3620e1J00L81l74o0l1J79J11m16M1L76l43J2n9L94k56j85o9J92L5m9lR7K58j39
3644A41j12q8O7Q0l52J81m1K20j31%m0J46j14R7M7K12m27nK35P7k09j08K25o4
3668C7q1kJ56m4l28M29k37j87K19O7j12J34R6r4O8k34N0k14O9J50J82n0k36J56
3692fK9o7J24r0J29Q0j87l04O5L27m09O2K22J2k83L08K87l4m7q5m84N63j59j11
3716e8J97j78Lp1K2k13L43Jm3N5K07k22j64K07L1k71N7j61L39j94K14O8k74J34
3740B9j50p0J35j17Q6K8o8Q2r4RQ4ql5N5J47K9j45Qk33K61M3n3J81k77Q2K49k89
$$ plain form
3767 -31 101 26 -133 -151 19 -98 160 117 -207 -212 167 -228 -224 324 212 107 22 -313 -9 -10 40 25 183 183 93
3792 93 -482 124 392 -129 49 309 331 -26 -44 34 52 -63 133 -112 321 91 -116 -270 101 439 321 -359
3814 -359 64 -101 -190 -76 -224 -38 101 67 43 114 -42 -218 -100 412 90 -316 -11 29 40 -117 74 -167
3836 -167 41 272 -27 -159 46 -328 -42 62 -27 88 -9 -102 64 -17 -11 -28 -81 -31 -265 -94 -112 270 -176
3859 -176 -149 235 74 23 -114 -166 93 57 82 -35 -67 153 -165 -241 168 330 -74 -304 -160 -15 44 -379 -128
3882 -128 343 -142 -174 -154 390 -50 -132 -62 218 495 -139 -351 77 279 267 -318 37 441 -31 -114 -135 358
3904 358 79 63 -188 365 347 -115 -431 -321 376 243 -480 -148 347 184 -142 -80 364 469 -164 -305 13
3925 13 173 8 -156 -160 142 254 -303 -235 63 -86 -175 -252 26 137 -286 -257 205 231 -24 -80 -65 144 146 72
$$ packed form
3767c1J32p5j59j8J70j17K58m3l24nL79l95MN48j12j05q5l35L04jN0j5J58%r0
3792I3n75O06K68n21J78K60K2l57j8P8J8j15J96k45M33k30k07j54L71L38j18o80
3814c59M23j65q9J14j48J86J39l4k4P1j56j76J18N12l22m06L05M0J1j57J91k41
3836a67K08K31k99j32K05l74K86J04q9J15r7r3J66q1Oj7n3N0k34J71j8L82m46
3859a76K7L84j61n1j37n2K59l6K5j17l2K20l18p6M09J62m04k30J44J45N9m23K51
3882a28M71m85l2K0N44m40q2P0K80K77o34k12M28K02j2n85L55M04m72q3k1M93
3904C58k79j6k51N53j8m62l16J10O97j33p23L32M95j63l26O2M44J05o33j41L18
3925A3J60j65j64mL02J12n57O8K98j49q9p7K78J11m23K9M62K6k55n6J5K09Kp4
$$ plain form
3949 72 -50 54 98 -292 -229 141 9 -112 -101 -21 121 29 -11 327 57 -331 -86 8 -46 -414 -248 55 -124
3972 -124 -38 -249 60 406 348 -401 117 309 288 -509 -66 418 41 -304 -381 415 197 -448 -291 149 401
3993 401 -339 -214 -8 393 153 -398 -287 383 299 -478 -390 256 736 -323 -373 210 550 -1 -243 51 755
4014 755 183 -526 -315 323 69 -234 -444 259 438 -309 -603 212 389 -86 -754 -89 606 84 -599 -52
4034 -52 290 144 -293 -162 332 312 -219 -520 118 543 98 -407 85 159 208 -326 -308 -89 352 -194 -132 306
4056 306 275 -1 -255 171 257 -132 -438 97 214 -275 -212 6 401 250 -384 7 326 224 -409 -30 176
4077 176 430 -145 -124 146 -92 -291 -291 208 227 -259 -300 -185 342 41 -277 -98 285 159 -173 66 405 130
4099 130 -309 -282 58 -51 -389 -77 260 444 -318 -313 145 468 -132 -536 -147 546 355 -235 -247 745 306
$$ packed form
3949G2j22J04M4l90O3L70j32j21J1Q0J42r2m0L38k70l88K45R4n4l68J66L03j79
3972a24Q6k11L09L46n8p49N18J92k1p97M43M84l77l45p7P96k18o45J57M40K52
3993D01p40J25K06M01k40n51J11O70q4p77Q8O46M80j059n0N83L40n51k42K94P04
4014G55n72p09K11O38k54l03k10P03J79p47k94Q15J77m75o68O65O95n22o83N47
4034e2L42j46m37J31M94k0n31l01O38M25m45n05M92P4M9n34J8K19M41n46O2M38
4056C06l1k76k54M26Q6l89l06N35J17m89O3K18L95j51o34L91L19j02o33L79K06
4077A76K54n75K1K70k38j99%M99J9m86m1J15N27l01l18J79L83j26l32K39L39k75
4099A30m39K7L40j09l38L12L37J84p62NM58L23o00m04L89O93j91n90j2R92m39
$$ plain form
4120 306 -433 -487 250 563 -468 -507 153 418 228 -630 -75 523 250 -588 -375 66 198 -381 -382 465 569
4141 569 152 -604 -112 481 195 -517 -301 571 299 -389 -403 374 560 -146 -643 288 623 -249 -502 -59
4161 -59 416 81 -329 -232 546 127 -454 -238 306 381 -406 -222 15 490 42 -438 -101 285 397 -409 -179
4182 -179 303 371 -121 -189 370 273 -230 -113 108 -15 -102 -201 -72 362 -67 -96 119 155 34 -236 -168 142 -239
4205 -239 -225 216 418 140 -342 -208 236 221 -219 111 90 38 19 -304 520 230 -20 -313 240 300 -39 -303
4227 -303 111 369 245 -430 -41 545 156 -537 -354 281 155 -278 -491 347 676 72 -485 -172 454 96
4247 96 -659 -187 369 473 -568 -484 314 556 -18 -524 133 310 85 -675 -271 700 354 -636 -375 358
4267 358 273 -271 -393 187 452 28 -388 132 550 38 -282 -160 509 236 -224 -294 91 372 -159 -164 216
$$ packed form
4120C06p39n4P37L13j031l9O60K65j90q58N55N98k73q38K13M41J32n79jQ47J04
4141E69m17p56M92N93k86p12K16Q72k72o88j4P77J86p06m97R31L35q72k53M43
4161e9M75l35m10R7P78m19n81K16N44P5p87J84K37M75m48m80L37L86J12q06K30
4182a79M82O8m92o8N59r7n03J17K21j23q7r9J29M34m29k9K15L6j21k70O8L10l81
4205b39J4M41K02k78m82J34M44j5m40L30k1n2j9l23Q24k90k50k93N53O0l39k64
4227c03M14K58j24o75L89N86l89o93J83O35j26m33k13Q38L29o04n57L13O26l58
4247I6p55M72N56J04j041Q4P98K42n74n06O57J77k25p60M04R71l46r90K61P33
4267C58q5n44j22N80K65m24m16N20M18n12l20J22O69k73m60p0L85K81n31nL80
$$ plain form
4288 216 500 -25 -86 219 301 272 -338 -18 212 427 -238 -155 -90 36 179 -97 24 133 -44 -190 237 100
4310 100 -236 -73 -98 45 540 -132 46 182 80 -29 42 89 -367 -225 -71 -159 -253 -171 106 280 169 -287
4332 -287 -128 243 -36 -92 -274 189 96 -279 -358 -69 282 223 -485 -267 484 238 -267 -220 323 421 -58 -326
4354 -326 439 347 -151 -318 118 574 -176 -655 -78 320 253 -465 -355 206 260 -236 -312 120 648 140 -442
4375 -442 -68 236 291 -222 -104 357 302 -518 -254 -39 393 -60 -277 -68 448 -90 -431 270 431 295 -250
4396 -250 -116 111 99 32 -272 -53 217 -134 -407 -37 232 -55 -5 139 112 290 -284 -115 242 284 152 -347
4418 -347 52 81 154 -326 -75 -100 26 187 -3 211 208 -14 149 -72 93 235 179 79 -100 159 -190 175
4440 175 -4 -81 79 117 47 -344 79 139 248 -337 -78 347 272 9 213 108 323 -122 -85 -95 417 94
$$ packed form
4288B16K84n25o1L05Q2k9o10L20K30K15o65Q3O5J26J43k76J21J09j77j46M27j37
4310A00l36J63k5J43M95o72J78J36j02j09P1M7m56J42J54q8r4Q2K77J74j11m56
4332b87J59L71k79n6j82M63r3l75p9K89L51n9p08K18P51k46n05M7N43R8m79k68
4354c26P65r2m98j67M36M56p50m79N77L98o7p18J10N61N4m96p6M32N28n08n82
4375d42L74L04N5n13J18M61n5q20K64K15M32m53k17K09N16n38l41P01J61j36n45
4396b50J34K27j2o7l04K19K70l51k73L70K69k87N0J44k7J78n74J69L57M2j32m99
4418c47L99K9P3m80K51k5J26J61j90K14lk22J63k21J65J42n6j00j79K59l49L65
4440A75j79p7J60L8p0l91M23O0J09n85K59M25p5k63K04j05K15m45L7j0N12l23
$$ plain form
4462 94 -400 -140 22 164 -343 105 252 308 -313 -438 184 200 -12 -284 -160 11 208 -389 -393 221 221 -199
4484 -199 -335 178 404 -25 -363 58 192 -144 -483 -182 301 339 -225 -353 189 67 129 -277 62 205 -93
4505 -93 -169 -62 348 -206 -288 -175 61 260 -64 -139 105 230 -31 -99 -74 243 312 -168 -163 150 101 196 -51 170
4529 170 225 -155 211 -171 173 -83 -100 -257 -234 208 -29 66 7 -15 48 129 -271 -170 -27 117 87 10 177
4552 177 68 -66 -8 -280 166 315 -21 -243 141 99 -55 -129 167 13 -83 59 -269 154 168 -90 -229 263
4574 263 200 -30 -369 -132 403 5 -170 23 32 -198 -116 -206 338 139 41 -66 58 -46 212 -115 113 131
4596 131 42 -168 -386 -67 135 -133 -261 183 78 72 -406 -125 101 74 -101 -249 -98 -27 -272 -112 44 153
4618 153 -192 -270 92 9 183 -164 165 275 217 -98 -254 24 -176 -90 13 82 28 218 -147 -182 313 277 -59
$$ packed form
4462I4m94K60J62J42n07M48J47N6o21j25O22J6k12k72J24J71J97n97mO14%m20
4484a99j36N13K26m29l38M21J34l36l39L01M83L8n64j28N42j22O2m06L39J43k98
4505i3p6J07M10n54q2J13K36J99l24p5K44J25k61o8K5L17O9m80NL13m9R5k47K21
4529A70N5l80L66l82L44k56j7j57K3M42k37R5n9k2O3Q1m00J01J43J44l0p7J67
4552A77j09j34N8k72M46J49l36k22L84m2j54p4K96j54r6J42l28M23J4k58j39M92
4574B63o3k30l39K37N35l98j75J93Rk30Q2r0N44j99r8j07J24j04K58l27K28J8
4596A31q9k10k18L19K02k68j28M44j05om78K81K26k7j75j48J51P1k45J60J56J09
4618A53l45p8L62q3J74l47L29J10n8l15j56K78k00Q6J03O9n4J90l65l5M95l6l36
$$ plain form
4641 -59 -142 103 370 355 178 -102 149 -62 214 -8 243 77 -153 74 224 166 -91 -80 35 1 -102 -55
4663 -55 138 -102 65 -111 -357 -176 -70 -152 66 19 48 72 -54 6 -277 -37 55 -7 -122 90 197 26 -109
4686 -109 -34 143 -10 144 -177 18 19 -185 -200 -311 -59 -92 269 -47 -95 79 -136 -237 221 105 -72 -274
4708 -274 2 -225 -26 -138 -152 272 286 -8 71 -28 314 25 -168 -104 183 -41 85 -285 68 -135 -45 -17
4730 -17 27 189 83 -374 -14 -42 -8 -69 162 127 61 -41 -3 -119 183 203 39 63 134 236 -10 -45 37 -289
4754 -289 -209 -60 -157 44 142 -69 243 106 18 181 29 -170 -22 198 -7 30 -147 240 119 -30 -99 244
4776 244 -139 105 -106 -16 -37 336 163 -248 8 -134 -45 133 3 -19 28 234 46 -162 -105 29 -128 -189
4798 -189 92 93 -248 166 8 -283 101 9 -205 -13 -235 -108 -167 -243 208 -174 -55 -21 3 -119 7 96 -48
$$ packed form
4641e9q3K45K67j5j77k80K51k11K76k22K51j66k30K27J50n8k57J1J15l4j03M7
4663e5J93k40J67j76k46J81J06q2K18m7K9K4j26O0k83K40R2o2j15K12J07j71j35
4686a09P5J77j53J54l21J95Jk04j5j11K52l3L61l16m8J74k15j01M58j16j77k02
4708b74K76k27J99j12j4M24J4k94P9r9L42k89j93O4K87k24J26l70L53k03R0K8
4730a7M4J62j06m57L60k8L4o1K31l5o6j02L8j16L02K0j64K4P1J02k46l5Q2l26
4754b89Q0J49r7K01R8k11L12j37q8J63j52j99J48K20k05L7j77L87j21j49o9L43
4776B44l83K44k11R0k1L73j73m11K56j42Q9J78j30k2M7K06j88k08N7J34j57o1
4798a89K81Jl41M14j58k91L84r2k14J92k22J27n9p6M51l82J19L4K4j22J26Q9j44
$$ plain form
4821 -48 137 46 221 -88 -145 -57 -93 -210 71 88 -328 -199 35 -39 46 -120 70 107 271 81 81 -207 -32 90
4845 90 96 91 29 167 -18 101 3 -51 217 83 99 7 -123 -359 119 -13 -123 93 84 -145 -139 218 138 -185 -62
4870 -62 -66 -87 -235 -55 -76 -150 25 57 -286 -39 94 -105 131 -105 -67 -95 102 221 -137 267 66 44 -56
4893 -56 96 71 115 136 72 -341 -189 147 -25 -68 15 132 -212 -32 -46 176 -97 152 -131 139 237 25 187
4916 187 -121 -93 115 186 -237 -317 367 -89 -206 -157 -106 193 -78 215 -11 -40 -207 78 -32 24 -10 -143 -37
4939 -37 102 7 -62 49 27 -80 -169 109 -29 102 146 261 -60 -127 -85 -30 -219 95 -109 -118 79 -173 -82 47
4963 47 -81 133 28 180 106 -20 -71 -30 -61 -101 100 93 -239 -249 -9 15 70 101 276 181 -176 -174 150 -55 -31
4988 -31 -19 -22 0 107 15 35 23 107 329 -105 -30 -28 -181 -34 -203 65 49 72 -14 207 269 -82 194 -74 -187
$$ packed form
4821d8J85r1J75l09n7Q8l6j17K81J7m16J29K34p4Q5j66J90L7J64j90%k88J75J22
4845I0Ono2J38j85J19r8n4K68j34J6r2j30k36M78j32j10K16rk29OL57q0l23J23
4870f2mk1j48J80k1p4J75L2l43K47J33j99K36k36L8k8J97J19l58M04k01k2j00
4893e6J52k5M4K1o4m13J52L36j72m3Q3J17l44J80j4K22k73K49k83K70R8k12J62
4916A87l08K8K08P1m23q0O84m56j17M9N1K99k71K93k26k9j67K85j10N6l4j33J06
4939c7J39r5o9J11k2j07q9K78j38J31M4J15l21o7M2N5j89L14k04rJ97k52R1J29
4963D7j28K14j05J52p4j26n1M1l1m0K01pl32j0K40K4N5L1J75r5l57KL24k05K4
4988c1J2lK2J07r2K0j2Q4K22m34P5Kj53J47j69K68j6K3q6K21O2l51K76k68j13
$$ plain form
5013 -187 43 192 52 68 42 163 -140 -172 -38 -64 -43 147 162 -116 2 108 35 -104 -13 -106 214 195 198 135
5037 135 67 176 -173 35 -15 -55 132 124 126 45 -3 -20 76 -101 -1 37 72 -59 -52 -49 -78 62 -84 -53 -292 -17
5063 -17 -77 -167 26 -7 54 -147 6 50 -96 -227 129 186 -48 82 -29 98 56 -45 116 -128 -20 -310 -46
5086 -46 -100 -304 42 -59 27 -254 -51 45 -116 -53 150 -166 99 104 139 106 156 -124 -53 -83 -76 -138 -201 76 75 -192
5112 -192 -37 -211 -18 124 200 -22 -127 -81 -3 -136 199 -136 -236 211 58 -74 -94 141 134 -240 -38 -53
5134 -53 257 378 -21 122 -192 -132 58 -34 122 -200 86 -84 1 154 -81 -98 -62 238 -51 -136 -375 99
5156 99 4 99 137 -123 -30 78 89 98 150 106 -272 40 85 38 13 9 93 83 169 6 58 -73 -129 99 62 84 -172
5183 -172 45 -144 217 -114 123 -58 55 146 97 -100 -107 -263 115 -35 327 230 -165 104 -288 70 87 37
$$ packed form
5013a87K30J49j40J6k6J21l03l2J34k6K1J90J5k78J18J06p3j39R1r3L20j9Lo3
5037A35o8J09l49K08n0m0J87qKq1m8j7R6j77J00L8L5j31PLk9J40j46L1k39K75
5063a7o0r0J93l3O1k01J53M4j46j31L56N7k34J30j11J27m2j01J61k44J08k90K64
5086d6n4k04L46j01Q6k81K03R6j61O3K03l16K65NL5l3N0k80P1l0Po2o3K77jk67
5112a92J55j74J93J42P6k22j05M6P8j33L35l35j00M47j53j32k0K35pl74K02j5
5134e3L10J21l99J43l14O0J90r2J56l22K86j70Q5J53k35j7L6L00k89q5k39M74
5156I9r5R5L8k60R3J08J1RN2m4l78L12M5m7k5mQ4j0Q6j63N2j31n6K28l7K2k56
5183a72K17j89L61l31K37j81J13R1m9j97pj56L78j50L62r7l95K69l92L58J7n0
$$ plain form
5205 37 -36 -2 130 -94 -64 -96 88 121 12 -140 191 -84 -39 74 -39 -148 190 135 4 145 -268 21 119
5228 119 -14 269 227 -46 -58 73 -64 -82 79 142 -128 29 -306 -25 56 -22 -108 -123 -140 -57 -24 13 108 -94
5252 -94 -204 92 182 135 19 124 314 56 -163 -48 221 -5 33 38 94 -133 -103 146 122 -98 -83 -85 -234 -111
5276 -111 72 -214 -73 -149 35 154 -71 99 -185 46 202 232 -268 212 338 123 -141 168 219 -82 113
5297 113 -33 135 -5 72 -87 93 -114 -17 61 95 57 171 -231 -21 53 -195 318 -6 34 -28 -118 -189 103
5320 103 -98 79 -189 97 100 -272 -137 61 222 94 -202 44 -111 -167 7 112 -98 31 -152 162 102
5341 102 -162 197 38 -239 184 86 95 -94 93 -27 -193 -67 235 -46 -108 125 76 54 -117 98 340 277
5363 277 -36 30 109 -97 80 -192 103 -168 169 213 68 -242 -128 120 -162 67 -138 -4 35 -401 -159
$$ packed form
5205C7p3L4J32k24L0l2J84L3j09j52L31k75M5J13j13j09L38n5j31J41m13K89R8
5228A19j33K83m2k73j2J31j37j8J61O3k70J57l35K81Q1p8q6j5j7Q3L3L7R5k02
5252i4j10K96R0m7j16J05J90k58k19J15K69k26L8NN6k27L0K49k4k20J5kj49J23
5276a11J83k86J41p6J84J19k25J70k84K31J56L0n00M80J26k15k64L09N1l01J95
5297A13j46J68j40P7j59J80k07R7P8L4l8J14m02K10P4k48N13l24M0o2r0p1K92
5320A03k01J77k68K86Ll72J35J98J61j28k96K46j55n6J74J05k10J29j83L14o0
5341A02k64L59j59k77M23r8Rj89J87j20j66J26L02k81o2K33m9k2j71K15K42o3
5363B77l13O6P9k06J77k72K95k71L37M4j45l10J14K48k82K29k05J34L9m36K42
$$ plain form
5384 -159 -99 98 137 -132 -114 156 -37 -44 -69 -87 -11 8 117 76 154 -18 -24 -199 145 -196 129 -3 22 42 264
5409 264 249 -77 -38 93 22 382 138 98 5 161 -92 -178 38 202 73 172 43 113 255 -61 -14 -26 -153
5432 -153 -323 -73 -65 52 61 192 -125 12 -31 -27 36 67 143 168 179 -119 -93 -270 -59 99 -231 241 -117 -138 -306
5457 -306 33 19 56 -64 10 267 185 190 72 141 -269 3 -85 75 129 215 -12 18 123 175 66 -62 210 -76
5481 -76 -203 246 -126 -17 140 -86 -138 -141 180 3 -1 7 191 46 -83 92 -23 17 132 -242 142 -194 23
5504 23 236 -101 162 169 -145 42 118 247 -50 -13 -18 94 20 -3 59 208 -230 -65 72 -178 115 215 276 213
5528 213 -5 116 63 -317 -88 -11 -122 -167 -25 -293 21 -48 73 -308 -101 -187 -186 86 58 -58 175 52 -153
5551 -153 29 129 14 -112 -151 -23 246 41 31 16 211 -131 -2 -90 84 147 35 -137 99 133 126 -75 -169
$$ packed form
5384a59O0J97L9k69J8K70j93pk5j8P6J9J09m1P8j72oj75L44l41L25j32K5K0K22
5409B64j5l26L9J31p1L60k44m0r3J56k53q6K16J64j29R9j29P0J42l16M7j2j27
5432a53j70K50QJ17RJ31l17J37m3MO3L1P6K5J1k98K6j77K11J58l30M72l58k1j68
5457c06L39j4L7j20P4K57q2Nj18O9m10K72q8J60N4Q6k27L0J05N2j09j28K72k86
5481g6j27M49l72J09J57k26n2lL21j77mQJ84j45j29J75j15M0J15l74L84l36K17
5504B3K13l37K63Pl14J87P6J29k97L7nJ12p4k3O2J49m38J65J37k50K93J00O1o3
5528B13k18J21n3l80K29P7j11m5J42k68L14o9J21l81K07q6JK72k8j16K33j23k05
5551a53J82J00j15j26l9J28K69k05j0j5J95l42J29q8J74O3j12j72K36L4pk01r4
$$ plain form
5574 -169 -17 146 113 -237 241 -402 -75 -279 197 -238 -183 71 140 -50 -125 46 -70 86 -42 -167 -26
5595 -26 -11 205 10 -193 140 72 60 20 315 86 146 -157 206 -46 -116 179 -272 -116 -2 -303 -24 -59 95
5618 95 197 204 150 -130 97 -85 -90 227 -165 -173 -175 -251 -29 -145 69 126 163 -249 -83 69 163 35 -11 132 47
5643 47 230 70 5 299 -19 27 -42 -72 127 -94 -199 -100 150 -28 34 -41 106 -147 -148 21 43 82 52 17 201
5668 201 137 -97 -167 -80 -87 67 76 -86 -105 73 -35 64 311 -164 -211 -26 28 77 -142 -140 -155 116 270 -61 -133
5693 -133 0 -176 -28 130 192 172 125 22 -147 -51 51 48 23 -90 -137 -41 51 63 -235 -149 239 57 143 -145
5717 -145 -151 -61 -50 112 -183 -137 25 -166 -175 173 -247 -149 27 -112 77 -100 12 84 130 78 -3 -116 -103 150
5741 150 -215 277 -12 -4 -71 355 62 -178 -133 230 86 -16 -89 215 173 -53 20 -172 82 -123 -142 -4 48
$$ packed form
5574a69J52J63l3l50M78o43L27k04M76m35N5K54O9j90p5J71j16J56j28j25J41
5595b6J5K16j95k03L33o8j2m0K95k29O0l03L63k52p0K95m51J56J14l01K79l5J54
5618I5J02Pn4k80K27j82nL17l92qkp6K22j16K14N7L7m12J66J52R4j28m6J43q5
5643D7J83j60o5K94l18M6o9l0J99k21j05R9K50j78O2p5J47k53jJ69K2L9l0l5J84
5668B01o4k34p0Q7pJ54Rj62j9J78j08R9K47m75m7J85N4M9k19Kj5K71J54l31p2
5693a33J33j76J48J58O2k0m7j03j69R6J02lk5j13m7R6R2J2k98Q6L88j82Q6k88
5717a45oR0J1J62k95M6J62j91rL48m20R8J76j39J89j77J12P2M6n2q1j13J3K53
5741A50l65M92k89Qo7M26k93k40M5L63j44j02p3L04m2k26P3j92K54k05j9J38N2
$$ plain form
5764 48 115 312 112 50 165 -189 -55 -72 -191 68 -289 -137 128 211 -63 -237 37 -171 -25 54 5 90 -3
5787 -3 -161 85 -87 149 -127 108 268 44 -17 -85 -138 114 -53 49 -36 214 -86 -134 -23 -264 -3 -72 55
5810 55 -145 30 -86 57 162 -90 -75 197 159 95 -218 -318 78 5 222 152 126 139 -136 175 222 6 115
5833 115 -42 233 -55 258 -11 80 182 87 -255 61 3 -51 52 50 -64 248 -64 -153 205 32 -207 -235 21
5856 21 40 -110 -79 -27 -77 -162 -118 -260 75 56 325 -81 -75 115 -137 25 -54 318 -185 -87 -8 95 -38 -29 -254
5881 -254 -16 35 -120 -129 -41 90 -78 -21 58 104 -67 -6 118 71 -91 -89 -21 166 -17 34 -77 229 397 -12
5905 -12 -10 -51 202 -112 -34 -169 216 116 -131 -118 134 210 45 -188 -2 -151 -109 -277 -182 -67 -117 26 -94
5928 -94 3 -106 -91 -31 -13 79 -213 -217 -47 -162 -179 222 158 -88 -83 -2 -6 95 290 52 9 -62 -308 65 161 30
$$ packed form
5764D8O7J97k00o2J15l54J34j7j19K59l57J52K65Q3k74j74K74k08J46P9m9Q5r3
5787cj58K46j72K36k76K35J60k24o1o8n3K52j67J02q5K50l00m8J11k41K61o9J27
5810E5k00J75j16J43J05k52J5K72l8o4l13j00L96p3K17p0k6J3k75L11M7k16J09
5833A15j57K75k88L13k69R1J02r5l42L16n8n4J03kj14L12l12q9L58j73k39k8K56
5856B1J9j50L1N2n0q5M4j42L35j9K69m06OJ90k52J62p9L72n03R8P9J03j33Rk25
5881b54K38N1j55rQ8J31j68N7P9M6j71O1J24m7j62KO8J87j83N1j11L06J68m09
5905a2Km1K53l14P8j35L85j00k47J3K52P6j65k33J86j49M2j68R5J15n0J43j20
5928i4R7j09J5O0J8R2k92mJ70j15j7M01o4k46NQ1mJ01J95k38m3p1k46L73R6j31
$$ plain form
5954 30 138 -104 11 201 -151 -178 -65 253 108 -29 -141 20 232 3 -95 -52 -34 217 291 55 -128 61
5976 61 -207 8 155 37 -153 -27 48 -8 143 15 433 41 19 -222 -111 -18 188 -176 -51 193 261 25
5998 25 0 2 89 -118 -100 -297 25 173 -186 -250 244 -168 -67 110 -70 199 88 -255 -22 -5 128 49 -134
6021 -134 -1 139 -184 -52 249 -79 3 -212 197 -34 -67 -237 -61 125 196 -163 95 19 139 8 13 -71
6043 -71 -110 -21 -62 -171 128 138 -18 99 -12 31 -126 309 166 -201 33 -131 111 72 6 -308 -8 41 -75
6066 -75 55 -69 220 -7 34 -144 -133 -433 69 72 105 144 -237 105 -4 -47 -276 118 114 5 -266 -196 78 13
6090 13 -21 -286 -186 94 69 -78 -81 -129 -156 -65 20 402 22 -261 -112 375 -224 -30 -321 -11 212 14 -191
6113 -191 184 284 -139 -202 -218 310 167 -122 57 -50 54 -210 -353 64 148 38 1 -88 404 -120 -362 164
$$ packed form
5954C0J08k42J15J90l52k7J13L18j45j37j12J61K12k29r8M3J8K51P4k36j83J89
5976F1k68K15J47j18j90J26P5n6J51j28M18l92k2k41J11R3K06l64J25K44O8k36
5998B5k5KQ7k07J8j97L22J48l59o4M94m12J01J77j80K69j11l43K33J7J33p9j83
6021a34J33J40l23J32L01l28Q2k15M09k31l3j70J76J86P1l59K58p6J20j31Nq4
6043g1l9Q9m1j09K99J0j56J17j11M3j57M35j43l67K34j64K42l9o6l14L00M9j16
6066g5J30j24K89k27M1j78J1l00N02LL3L9l81L42j09m3k29L94mj09k71P0K74o5
6090A3l4k65J00K80k5j47lm8k7R1Q5L82l80k83J49M87n99J94k91L10K23j98k05
6113a91L75J00m23o3j6N28j43k89J79j07J04k64j43M17Q4j10l7q9M92n24k42N26
$$ plain form
6135 164 500 -137 -345 -99 -104 10 -117 46 -4 175 -72 -199 12 41 -61 -188 61 184 39 -56 156 185
6157 185 146 -105 -165 99 -9 -164 141 52 251 107 -75 31 3 -79 -141 -139 158 -62 -203 83 -18 186 -225
6180 -225 -279 247 131 -126 97 -21 -167 -124 -151 223 236 -108 -456 -6 -173 -311 -231 -275 26 229 -29 -119
6202 -119 23 240 -83 -47 13 357 -428 -99 -146 214 27 31 7 127 179 -122 -122 174 219 -21 -154 32 -3 -110
6226 -110 65 291 397 130 -199 270 11 136 -68 -313 437 139 173 -310 8 100 96 -287 213 11 109 -201
6248 -201 69 141 -14 -395 -186 24 227 -90 -283 201 159 -49 -148 -28 159 -133 -461 -60 121 112 -212 -302
6270 -302 89 27 -90 -186 -104 -118 -161 92 71 -37 7 -57 1 265 208 37 124 63 174 92 140 494 -9 -136 203
6295 203 239 39 -27 18 70 120 -225 17 212 -58 -173 -64 -16 368 50 -301 -59 185 -25 -124 -157 234 -17
$$ packed form
6135A64L36o37k08K46nJ14j27J63n0J79k47j27K11K9j02j27K49J23j45r5K12K9
6157A85l9k51o0K64j08j55L05q9J99j44j82J06k8q2o2KK97k20j41K86j01K04m11
6180b25n4N26j16k57K23j18j46M3k7L74J3l44l48M50j67j38Q0m4L01K03k58r0
6202a19J42K17l23L6O0L44p85L29m7L60j87Mk4J20N2l01%K96M5k40j33J86l5j07
6226a10J75K26J06k67l29M69k59J25k04k45P50k98L4m83L18R2ml83N00k02R8l10
6248b01K70P2j55l81K09K10K03l17j93M84m2k08r9J20J87k92l28M01J81rl24r0
6270c02L91o2j17r6Q2j4m3K53k1j08M4o4N8K64n7j71Q7o1J11q2M8L54n03j27L39
6295B03L6k00o6M5N2N0l45K42J95k70j15J09M8L84l18l51K42K44k10r9l3L91k51
$$ plain form
6318 -17 -132 -47 227 -108 -528 -118 9 109 197 -199 -250 254 187 -52 -328 327 -67 -15 -248 21 112 -50
6340 -50 -89 128 242 132 -48 182 175 -216 -150 49 345 5 -212 -90 65 280 -24 -102 29 92 -20 -96 -73
6363 -73 120 116 -121 -92 187 197 -14 24 -33 230 -240 -528 -113 -14 -26 48 164 291 -137 29 99 85 225 104
6387 104 -152 -50 -10 310 -129 71 -128 71 -60 62 175 3 71 -85 128 -110 -204 251 -108 -1 -63
6408 -63 56 -187 -42 5 -153 184 -116 -340 -149 5 40 2 -231 16 -6 -293 34 -181 -113 -28 -236 -14
6430 -14 -168 -206 29 105 150 92 -53 -12 63 -57 -5 -202 86 205 111 43 19 -40 -287 -194 -53 171 -106 -238
6454 -238 -112 228 146 -166 -87 -15 155 19 -41 -103 286 73 -118 242 205 -132 -88 -9 110 42 -123 40 -5
6477 -5 142 -106 25 -63 109 72 -128 -97 140 84 27 80 55 44 154 -63 -14 293 14 -118 -169 -170 -160 -130 -64 32
$$ packed form
6318a7j15Q5K74l35m20M10J27J00Q8l96n1N04o7k39k76O55l94N2k33K69R1j62
6340e0l9K17J14j10j80K30pl91O6J99K96l40k17J22J55K15l04p8J31O3j12p6K3
6363g3J93mk37K9K79J0k11L8n7K63m70k88M15R9j2P4J16J27m28J66P0j4J40j21
6387A04k56J02M0L20m39K00j99J99j31J22J13j72O8j56K13k38r4M55l59J07o2
6408f3J19k43J45M7j58L37l00k24J91J54L5l8k33K47k2k87L27k15O8Q5k08K22
6430a4j54l8K35P6M5n8j45M1P5j20N2j97K88J19r4o8k4n9k47R3J41K24k77j32
6454b38J26L40q2l12P9P2J70j36o0o2L89k13j91L60l7l37M4P9J19o8j65J63m5
6477eJ47k48J31q8J72l7k00L1K37n6n7N3k5j1J10k17M9L07k79j32n1jJ0L0O6R6
$$ plain form
6503 32 -9 -66 -382 -28 110 38 4 -84 -80 -28 -175 -29 151 192 -278 154 -15 -157 -238 76 53 -257 -147 338
6527 338 -168 -52 153 -91 -90 13 -50 14 279 -108 -97 -309 47 40 104 -171 -135 -55 -64 -81 122 44 -72 -420 220
6552 220 45 -156 -187 -284 -68 -134 -3 -93 317 24 -177 26 -153 -21 -187 118 -43 343 81 109 -46 -53
6574 -53 114 -26 -118 47 -75 -258 69 -354 192 -96 -76 27 36 -29 -137 -30 159 80 3 18 -112 142 -76
6597 -76 -184 131 356 -82 33 -70 75 -10 -297 14 -42 129 -28 15 -126 -163 76 -145 289 343 27 -50
6619 -50 -100 -54 48 74 -73 104 -151 179 -234 -31 -181 72 -124 -157 258 123 64 23 61 -30 -68 -263 -217 -167
6643 -167 245 242 120 58 -41 132 373 -34 -52 58 30 -116 -120 -296 22 118 -2 -256 131 181 -36 -106 176 84
6667 84 -215 -127 306 118 242 -103 -107 108 -251 -166 -330 70 190 66 264 135 180 145 -53 -270 21 125
$$ packed form
6503C2m1n7l16L54J38p2l4q8MN2j47J46J80M1m70M32j69j42q1L14k3l10J10M85
6527C38n06J16K05k44JJ03o3O4K65l87J1k12L56pO4k75L6Q0rj7K03p8j16l48O40
6552B20j75k01l1r7K16o6J31r0M10k93k01K03j79J32j66L05j61L86k62K8j55p
6574e3J67j40r2J65j22j83L27m23N46k88K0J03Ro5j08J07J89p9p7J5j30K54k18
6597g6j08L15K25m38J15j03J45q5k87L11n6J71j57M3j41l7K39k21M34N4l16p7
6619e0n0M6J02K6j47J77k55L30m13K03j50K53j96l3M15j35n9m1L8r1l8j95M6N0
6643a67M12lj22o2r9J73K41m07j8J10k8j46mj76L18R6j20k54L87N0k17p0K82r2
6667H4k99Q8M33j88J24l45mK15l59Q5j64M00J20j24J98j29M5l5j98k17K91J04
$$ plain form
6689 125 -121 150 134 267 -121 -132 -10 -109 181 -85 -133 -210 -19 -15 42 219 177 39 6 -29 -54 -73 -63 -50 -29
6714 -29 -24 206 17 -62 -165 -5 -53 -95 27 -400 3 -157 69 -129 252 50 -119 152 -319 374 18 -185
6736 -185 152 -4 85 -197 36 -132 301 -119 -44 75 -62 -44 51 1 -49 168 161 4 36 147 192 73 194
6759 194 82 97 176 40 110 -38 -156 -191 -127 102 15 -311 -24 -155 -135 193 -53 460 -176 -258 61 -165 -118
6782 -118 -15 -192 75 225 -98 66 40 -122 149 -216 17 133 -45 54 -293 28 293 71 -129 23 -13
6803 -13 -135 -168 -21 32 -21 -37 207 406 77 -209 176 55 38 -146 -77 -19 96 -14 48 11 -298 -11 -28 -133
6827 -133 81 -26 -48 274 -23 -247 -23 -69 -129 -18 -29 214 -41 29 -225 -47 -233 -276 80 -123 -190 -236 -120
6850 -120 3 126 276 -112 45 198 132 -13 15 95 -63 -102 -152 38 333 -106 -153 80 147 -10 -8 -166 30
$$ packed form
6689A25k46K71j6J33l88j1J22r9K90k66m8p7J91MN7J77m2j38l3l5k5j9J0J3K1
6714b9NK30j89p9j03J60m8m2J22m27M03j60K26j98L81k02j69K71m71O93l56k03
6736a85L37j56Q9k82K33j68M33m20P5J19j37J8R5n0n0K17pj57L2J11M5j19J21
6759A94j12J5P9j36P0j48j18l5O4K29q7l26K87j31K0L28k46N13o36q2L19k26M7
6782a18J03j77K67J50l23J64k6j62K71l65K33J16j78R9l47L21K65k22k00J52l6
6803a3j22l3J47N3n3j6K44J99l29k86L85j21j7j84O9N8J15j10O2l7l09K87j7j05
6827a33K14j07k2L22k97k24K24m6o0J11j1K43k55P0k54J78j86m3L56k03o7m6J16
6850a20J23J23J50l88J57J53o6j45K8Q0j58l9n0J90K95m39m7K33O7j57Kj58J96
$$ plain form
6873 30 -76 -64 220 -15 120 -122 -162 116 -93 -101 -145 -208 -141 -146 -267 -63 0 93 -132 123 -68 -114 4 -79 214
6898 214 111 -67 115 -22 27 -252 90 -74 441 -245 56 117 -108 162 -95 208 3 137 -143 -3 163
6919 163 -26 -194 -213 -65 26 131 57 68 3 -78 87 -154 58 88 110 153 -176 32 49 -15 -151 110 68 146
6943 146 -66 -197 -250 179 -200 -153 60 -17 224 309 12 -51 119 44 45 89 -22 244 24 -65 -39 -125 104 -17
6967 -17 -186 99 -93 -203 29 -4 54 4 -54 36 95 -56 35 48 -178 -80 68 -167 -19 -85 39 93 77 101 -7
6992 -7 -76 -165 207 -120 -14 57 -215 37 5 92 -63 71 44 -95 -2 -206 151 -103 107 15 120 -69 100
7015 100 98 -26 121 -144 -90 -33 -82 -140 8 67 217 -70 202 -27 61 -85 37 -31 193 -82 88 -62 -214
7038 -214 -28 -101 235 101 135 -196 -190 -40 367 -174 118 26 -1 -127 30 -73 -225 -124 304 -54 21 -203
$$ packed form
6873C0j06J2K84k35J35k42m0K78k09qm4o3O7nj21K04O3R3k25K55j91m6J18q3K93
6898B14j03j78J82j37M9k79L42j64N15o86L01O1k25K70k57L03k05J34k80J40J66
6919A63j89j68j9J48R1J05p4J1o5q1J65k41K12L0K2M3l29K08J7o4j36K61m2P8
6943A46k12j31n3M29l79M7K13p7K41Q5k97o3J70p5JM4j11K66k20q9K6q6K29j21
6967a7j69K85j92j10K32l3N8n0n8R0N9j51R1J3k26R8J48k35J48o6J24N4j6K4j08
6992go9q9L72l27J06P1k72K52l2Q7j55J34k7j39R3k04L57k54K10r2J05j89J69
7015A00kj24J47k65N4N7m9n8J48N9J50k87K72k29Q8j46J22o8K24k75J70j50j52
7038b14J86p3L36j34L4l31OJ50M07n41K92r2k7j26J57j03j52J01M28l58P5k24
$$ plain form
7060 -203 -261 -42 112 16 -218 124 96 198 -113 89 -90 -148 207 53 -81 -93 -235 123 -7 -203 -211 50
7082 50 28 239 162 66 2 -52 -33 51 99 220 92 134 7 54 -70 -47 25 -14 55 159 62 15 -76 72 -11 6 -15
7109 -15 84 141 -141 1 -71 26 40 -29 25 -295 105 -93 75 -165 -15 -67 -94 -60 -277 95 200 174 -52 -183
7133 -183 64 -196 70 -150 -120 -164 -9 38 234 -55 2 158 144 -53 114 -11 102 106 228 118 -12 111
7155 111 -40 116 76 149 180 -34 -103 -182 90 -99 101 -144 -368 -174 97 -151 156 230 -108 -81 193 121 -247
7178 -247 15 -221 137 28 -102 -181 -129 -218 56 320 142 -2 -15 -70 -86 74 111 111 59 35 264 151 8 -141
7202 -141 56 63 150 -103 -223 -211 -145 35 105 -40 -102 -93 14 217 125 195 18 -26 137 219 -28 -200 -107 191 -189
7227 -189 73 165 168 123 57 182 -53 71 -74 -195 -97 199 235 -237 153 -111 96 366 -165 -201 -24 -31 131
$$ packed form
7060b03n8K19J54r6k34L42k8J02l11K02j79n8L55j54j34j2j42L58j30j96qK61
7082E0k2K11p7r6o4n4J9Q4M8J21j28M2j27M7j24K3P2l9O9J04r7m7r1J48q3J7k1
7109a5R9N7k82J42p2R7J4o9N4l20M00j98J68k40J50n2k7L4k17L72J05k6k26j31
7133a83K47k60K66k20L0m4J55M7J96k89N7J56j4j97J67j25J13MJ22j10j30J23
7155A11j51J56m0P3L1k14o9p9K72j89K00k45k24J94K71k48L07P4l38K7K74p2l68
7178b47K62k36L58j09j30p9N2q9K74K64j78j44j3n5j6J60L7%n2k4K29j13j43j49
7202a41J97PQ7k53j20J2O6J80P0j45o2RJ07K03r2P0j77m4J63Q2k47j72R3K98l80
7227a89K62R2Lm5o6J25k35J24j45j21R8K96L6m72L90k64K07K70n31l6J77pJ62
$$ plain form
7250 131 -120 363 -142 150 -81 -58 -153 114 9 -100 -210 -76 52 -143 71 -33 -114 -94 175 -247 -184 -75
7272 -75 -56 -193 31 39 14 23 -65 186 -56 -64 3 -236 -300 -93 188 -32 17 47 202 -168 -345 203 -46 -21 -98
7297 -98 -322 -245 -113 -53 -88 -27 80 12 -9 -112 3 8 -163 5 149 -13 47 56 -33 -5 34 178 -33 78 86 74
7323 74 119 161 93 -93 5 239 -108 232 40 377 126 -60 14 254 2 167 131 -28 173 -13 -110 38 244
7346 244 92 81 118 179 -128 43 0 33 99 83 -11 78 -6 -43 220 10 257 -33 58 -72 180 112 -26 -19 -109
7371 -109 30 -80 -121 -10 -21 33 324 17 106 28 -16 -176 -147 51 -97 45 -26 -8 -151 177 -166 144 44
7394 44 213 -2 -140 -191 63 138 118 -324 -160 7 -105 239 26 -242 -5 18 177 -189 -103 36 -97 -254
7416 -254 65 88 68 -23 221 41 -109 -157 83 73 -97 -96 226 -80 -148 242 -198 -67 80 -121 -147 -16 -276
$$ packed form
7250A31k51M83n05K92k31K3r5K67j05j09j10J34J28j95K14j04q1K0K69m22O3J09
7272g5J9j37K24Qk5Rq8K51k42qO7k39o4K07K81k20M9L0J55l70j77N48k49K5p7
7297i8k24P7J32O0l5O1J07o8k1j03J15Nj71J68J44j62O0Rq9K8L9J44k11J11Qj2
7323G4M5M2o8j86R8K34l47L40j92L37k51j86P4K40k52J65l6j59K01j86r7J48K06
7346B44j52j1L7O1l07J71m3L3O6j6r4Q9q4l7K63k10K47k90R1j30K52o8j38Pr0
7371a09J39j10m1J11j1N4K91l07Q9p8m4j60K9J98j48J42p1J8j43L28l43L10j00
7394D4J69k15j38n1K54P5k0m42J64J67j12L44k13k68K37K3J59l66Q6J39j33j57
7416b54L19K3k0r1K44j80j50m8K40j0j70JL22l06o8L90m40J31J47k01k6J31k60
$$ plain form
7439 -276 -131 -27 -49 -122 40 100 46 -102 -94 -72 -60 159 288 -167 -263 -53 -19 99 158 -137 -227 65 66 101 -68
7464 -68 -59 -265 177 240 125 75 -30 163 -18 260 144 -108 27 143 25 42 82 256 -144 -144 152 -49 -74
7487 -74 38 -17 -116 161 204 63 80 -143 82 -1 285 -34 -82 -111 -311 -49 -51 58 -35 -63 -254 -79 -125 -91 279
7512 279 14 23 33 243 58 -3 -165 -140 -146 56 48 -58 62 -148 224 -276 -216 145 -126 223 -40 -97 -194 234
7536 234 3 -169 177 66 -118 39 208 304 28 -296 -109 237 2 -186 19 75 -125 151 92 -127 347
7557 347 238 -137 -55 -44 172 -213 25 207 -128 -24 -244 -75 -244 55 6 -198 -53 -12 -250 -18 112
7578 112 -302 -80 227 -4 -198 41 -58 154 176 28 65 -157 96 -61 143 19 56 -63 -49 -316 139 -66
7600 -66 99 -68 125 24 -158 -140 100 146 -69 217 -170 -249 -21 -126 -63 92 14 -72 -144 7 107 -32 117
$$ packed form
7439b76J45J04k2p3J62O0n4j48QK2J2K19J29m55r6K10L4J18N9k95r0K92JL5j69
7464f8Rk06M42O3j15n0j05J93j81K78j16k52J35J16j18J7M0J74m00%K96k01k5
7487g4J12n5r9K77M3j41J7k23K25q3K86l19m8k9k00K62kJ09r3k8j91J75m6L4L70
7512B79k65RJ0K10j85o1j62K5oK02qj06J20k10L72n00O0L61k71L49k63n7r7M28
7536B34k31j72L46j11j84J57J69R6k76l24J87L46k35j88K05N6k00K76n9k19M74
7557C47j09l75Q2J1K16l85K38J82l35J04k20J69j69K99m9k04J45M1k38K32J30
7578A12m14K22L07k31j94K39r9K12K2j48L7k22K53j57K04j24L7j19J4k67M55k05
7600f6J65j67J93j01j82J8K40M6k15K86l87p9K28j05O3J55p8q6p2J51J00j39J49
$$ plain form
7623 117 316 311 -37 -67 -4 -36 -173 -94 57 64 -126 -78 -121 129 25 -49 -36 -11 -84 -120 179 -65 -34 -112 42 -33
7649 -33 131 -107 -237 192 227 -17 -189 -59 -147 26 40 110 295 -200 10 -55 -292 149 218 -30 125 51 -117
7672 -117 117 314 54 173 -178 283 -30 61 130 -31 -6 -30 -50 -67 -5 -230 -11 -28 11 -13 -153 107 -204
7695 -204 -113 -47 -254 21 64 166 -82 72 271 -107 -136 -42 225 -113 -206 115 -6 -193 53 3 -176 -81 111
7718 111 -157 171 -30 12 75 -107 21 13 88 45 219 34 35 64 243 -16 -32 129 81 265 13 -55 44 -6 79
7743 79 -156 183 78 -47 42 82 84 210 -339 189 83 18 -50 -9 -156 148 346 -147 -45 -350 28 77 369
7766 369 21 -78 16 189 127 79 271 -33 46 -64 -247 -188 26 -8 149 -10 61 -97 -282 -86 -200 291 102
7789 102 -42 -47 -181 142 -101 115 -47 -143 -214 55 127 91 -89 -58 -163 47 -39 -322 -3 137 477 -237 -42
$$ packed form
7623A17J99nl48l0O3l2j37P9J51Pj90M8m3K50j04p4J3K5p3l6K99k44L1p8J54p5
7649c3J64k38j30M29L5k44j72J30q8J73J4P0J85m95K10o5k37M41O9k48J55p4j68
7672a17K34J97k60J19l51M61l13R1O9j61K5k4k0j7O2k25K19j7L9k4j40K60l11
7695b04R1O6k07K75M3J02k48J54J99l78k9R4K67l38r3L21j21j87K46n0j79R5J92
7718A11k68L28k01M2O3j82J28qP5m3J74j85JK9J79k59j6J61m8J84k52o8R9n0Q5
7743G9k35L39j05j25Q9M0KJ26n49N28j06o5o8M1j47L04J98m93J02l05L78M9K92
7766C69l48r9R4J73o2m8J92l04P9j10j83N9K14l4J57j59P1j58j85J96j14M91j89
7789A02j44nj34L23k43K16j62r6p1K69P2l6j80L1j05K10q6k83L19J40L40p14J95
$$ plain form
7812 -42 25 -254 216 -63 62 107 -152 79 -24 34 53 143 -141 111 -54 -71 -41 -171 246 79 208 92 -8
7835 -8 -23 133 72 39 -380 116 -388 205 343 -95 -77 -20 230 2 -261 94 3 76 219 -83 52 0 -103
7858 -103 275 -277 -89 36 -283 42 -163 -16 51 92 -265 215 25 -28 296 47 78 67 -176 216 229 196
7880 196 -277 234 191 -82 -49 30 -55 -152 -2 23 -107 -156 158 -22 -13 291 16 59 -8 49 -218 104 187 -106
7904 -106 171 -317 -49 336 -95 -29 116 -205 -13 -95 126 -94 204 20 -165 -76 -46 47 170 228 437 2
7926 2 -103 -79 -43 159 -78 -32 10 -141 -44 -25 183 -7 56 -224 -99 -88 25 96 82 305 -170 -193 149 114 196
7951 196 -135 -132 -54 -159 288 139 54 132 332 2 -4 -27 -63 66 -159 -64 -34 -161 -40 -63 29 -71 -73 -77 -94 -125
7977 -125 -255 -106 226 66 -239 -5 151 -277 153 -171 41 -51 7 -93 256 54 -219 -140 -87 101 -217
$$ packed form
7812d2O7k79M70k79J25M5k59K31j03N8J9R0k84K52j65j7L0j30M17j67J29j16j00
7835hj5J56o1l3m19M96n04N93J38m38J8N7K50k28k63L55r1P3J43l02J35n2j03
7858a03L78n52J88J25l19L25k05J47O7M1l57M80j90n3L24k49L1j1k43L92J3l3
7880A96m73N11m3k73L3P9q5r7J50K5j30m9L14j80RL04k75M3o7N7k67L22Q3k93
7904a06K77m88K68L85m31O6J45l21J92q2K21k20K98j84j85Q9L0R3J23N8K09m35
7926Bj05K4L6K02k37M6M2j51R7J9K08j90O3k80J25J1J13P1j4K23m75k3L42l5Q2
7951A96l31LP8j05M47j49q5P8K00l30ok3l6J29k25R5L0j27J21k3R2j00kmj7l1
7977a25j30J49L32j60l05K34J56m28M30l24K12r2N8j00L49k02k73P9N3J88l18
$$ plain form
7998 -217 172 -99 145 -72 -93 -104 152 -21 -117 -92 91 154 158 -124 46 219 -256 -10 -100 -67 56 -77 141
8021 141 -70 49 -74 -140 195 191 -114 1 59 -120 -34 98 63 98 -45 -68 11 -197 3 -142 -8 206 -55
8044 -55 -188 1 54 101 7 39 -268 -11 77 87 -305 -33 -38 -62 135 -9 -180 83 53 -16 44 263 -167 61
8068 61 -196 -137 -205 -22 -16 -143 95 -146 70 -98 -173 179 124 176 -178 -69 -301 -53 2 47 -364 50 50 -202
8092 -202 2 -39 -16 171 28 46 4 81 76 16 -34 -23 157 -118 133 -31 80 15 97 -52 -61 -178 -130 89 -5
8117 -5 -222 -38 -143 -125 74 55 153 27 135 50 28 82 -153 61 -19 -17 -46 102 52 56 -123 4 112 -121 -65
8142 -65 424 4 168 -148 -122 42 91 -36 -242 39 40 -120 113 -40 17 17 4 59 9 -158 49 43 136 -223 -249
8167 -249 251 176 152 -39 -32 236 31 47 200 -122 28 214 33 61 476 169 -137 -96 52 16 -142 -207 221
$$ packed form
7998b17L89k71K44k17k1j1K56j73r6K5J83O3Mk82J70J73m75K46r0L3J23j33K18
8021A41k11J19j23o6L35ml05J15N8j79Q6J32l5L5j43k3P9k08K00j45J34K14k61
8044e5j33J89N3M7r4L2l07K57Q8J0l92K72nk4J97j44j71K63l0o9O0K19m30K28
8068F1k57N9o8J83Oj27K38k41K16j68p5L52n5N2l54J09k32K48N5M5m11M14%k52
8092b02K04m1K3J87j43J8m2P7no0n0J1J80k75K51j64J11o5Q2j49rj17M8K19r4
8117ek17J84j05J8J99j9R8j26J08q5k2N4k35K14q0Kk9J48n0Mj79J27J08k33N6
8142f5M89m20J64l16K6J64M9j27k06K81Jj60K33j53N7%j3N5n0j67K07oR3l59k6
8167b49N00p5k4j91PK68k05J6J53l22J50J86j81K8M15l07l06M1J48l6j58o5M28
$$ plain form
8190 221 -64
$$ packed form
8190B21k85
8191f4
$$ Imaginary data points
##PAGE= N=2
##DATA TABLE= (X++(I..I)), XYDATA
$$ plain form
0 0 0 0 0 0 0 0 0 0 0 0 0 0 0 0 0 0 8 -8 8 -8 8 -8 16 -16 16 -21 24 -27 32 -37 41 -48 53 -61 68 -77 86 -97
38 -97 108 -118 134 -149 165 -182 200 -222 243 -268 297 -326 359 -397 438 -483 534 -592 658 -734
58 -734 825 -931 1063 -1222 1428 -1702 2086 -2661 3622 -5506 10580 -53759 -134557 20872
72 20872 93691 7569 -74259 -29630 52375 59776 -23949 -47688 29353 56356 -16499 -32303
84 -32303 29233 36286 -22033 -30990 21219 47127 -3236 -54234 -15429 59065 31506 -62032 -60944
97 -60944 30111 48953 -30101 -73130 -20918 34068 12055 -43627 -42738 9462 25996 -9402 -22751
110 -22751 3989 13095 -1756 778 13424 6319 -8426 -3669 15231 17948 -4741 -18512 1781
123 1781 24099 10751 -14277 -11982 6155 11831 3666 -9790 -17523 -10927 3693 4421 -16127 -33312
$$ packed form
0@%%%%%%%%%%%%%%%%Qj6J6j6J6j6K4l2L2l7M5n1N9o9P8q9J01j14J29j45J63j83
38i7K05k26K52k83L14l47L82m22M65n11N65o23O85p56Q35r21J017j126J250j392
58g34J559j756J994k285K650l130L788m747O283r128J6086o4339q0798J55429
72B0872P2819q6122q1828M4629Q2005P401q3725k3739P7041K7003p2855j5804
84c2303O1536P053n8319q957N2209K5908n0363n0998L8805P4494k7559r3538J088
97f0944R1055J8842p9054m3029N2212N4986k2013n5682Q89N2200J6534l5398j3349
110b2751K6740R106j4851K534J2646p105j4745M757J8900K717k2689j3771K0293
123A781K2318j3348k5028K295J8137N676q165j3456p733O596J4620P28k0548j7185
$$ plain form
137 -33312 -18698 11274 9273 -26543 -37546 888 29912 2472 -33341 -13986 28063 23573
149 23573 -14743 -18408 16372 26321 -4540 -15721 13925 26806 -3947 -20263 13250 36937
161 36937 2578 -33272 -3700 43308 20425 -39250 -34757 26591 37182 -25296 -56621 -5673
173 -5673 40059 1090 -53141 -28825 29876 21135 -32613 -32995 19233 29884 -15084 -30615 12513
186 12513 36517 -4514 -33771 4428 43703 11417 -35331 -10916 43240 33314 -24013 -29207
198 -29207 25872 45869 -3418 -38075 -1713 37919 11405 -32623 -21455 17778 14742 -20614
210 -20614 -25429 4674 14213 -11065 -22565 2281 17291 -4474 -20973 639 21344 5438
222 5438 -17665 -7489 18885 17766 -7370 -13429 9704 22933 6443 -8655 916 15794 12841
$$ packed form
137c3312J4614K9972k001l5816j1003L8434K9024k7440l5813J9355M2049m490
149B3573l8316l665L4780R949l0861j1181K9646J2881l0753j6316L3513K3687
161C6937l4359l5850K9572M7008k2883n9675M493O1348J0591o2478l1325N0948
173e673M5732l8969n4231K4316N8701q741n3748l82N2228J0651m4968j5531M3128
186A2513K4004m1031k9257L8199L9275l2286m6748K4415N4156r926n7327n194
198b9207N5079J9997m9287l4657L6362L9632k6514m4028J1168L9233l036l5356
210b0614m815L0103R539k5278j1500K4846J5010k1765j6499K1612K0705j5906
222E438k3103J0176K6374j119k5136o059K3133J3229j6490j5098R571J4878k953
$$ plain form
235 12841 1238 -1536 3073 5734 3365 -735 -3623 -4797 -3228 54 -2031 -9021 -9151 -810 1321
250 1321 -6420 -8876 -857 2287 -3501 -5823 1628 5304 -2522 -7559 3461 13052 2386 -11559
264 -11559 221 20521 13433 -9627 -7806 17825 23695 -1930 -16147 5165 24008 5814 -19629
277 -19629 -9239 16631 10306 -17284 -17393 7744 11910 -12353 -21026 2501 15628 -6594 -23882
290 -23882 -3451 19910 3410 -23752 -11805 19862 16090 -15859 -19345 12895 26270 -1543
302 -1543 -20454 2953 27779 11491 -15872 -6130 20695 16588 -10311 -12695 11010 15791 -7268
315 -7268 -17405 1873 14477 -3336 -19959 -5772 13057 3104 -18779 -13302 9224 9316 -11700
328 -11700 -16827 2490 12392 -1550 -14483 -3053 11839 6305 -6700 -3807 9247 9761 38
$$ packed form
235A2841j1603k774M609K661k369m100k888j174J569L282k085o990j30Q341K131
250A321p741k456Q019L144n788k322P451L676p826n037J1020R591j0666j3945
264a1559J1780K0300p088k3060J821K5631N870k5625j4217K1312J8843j8194k5443
277a9629J0390K5870o325k7590j09K5137M166k4263q673K3527J3127k2222j7288
290b3882K0431K3361j6500k7162J1947L1667l772l1949l486L2240J3375k7813
302a543j8911K3407K4826j6288k7363R742K6825m107k6899k384K3705M781k3059
315g268j0137J9278J2604j7813j6623J4187J8829r953k1883N477K2526R2k1016
328a1700n127J9317R902j3942j2933J1430J4892n534j3005K893J3054N14r723
$$ plain form
341 38 -1666 6806 9192 2028 -1431 4122 6508 1094 -3367 35 4162 621 -4450 -3355 298 -281
357 -281 -3346 -4644 -3907 -2472 -1475 -2383 -4309 -5191 -2141 1415 -328 -5207 -3884 3341 5731 -1346
373 -1346 -4409 3277 9266 4179 -3015 1011 9478 7352 -2128 -1876 7425 7534 -2309 -5321 3830 7717
389 7717 -2311 -9407 -869 7611 -277 -11796 -6775 6312 3691 -10992 -11809 2929 7534 -5494
403 -5494 -13269 -1266 9546 1475 -10242 -3693 9891 7316 -5602 -4678 9001 10904 -1950 -6059
417 -6059 5985 12463 1299 -7537 889 11544 4344 -8874 -4902 7856 6552 -7190 -9538 1936
431 1936 6649 -3805 -11301 -3436 5263 -348 -9550 -5848 3307 2138 -5870 -5145 2849 4820 -1831
446 -1831 -4150 2569 6929 1885 -2767 1906 7443 4611 -1304 -421 5461 5333 359 -1884 1922 3971
$$ packed form
341C8j704Q472K386p164l459N553K386n414m461L402M127l541n071J095L653n79
357b81l065j298P37J435R97r08j926q82L050L556j743m879J323P225K390p077
373a346l063P686N989n087p194M026Q467k126r480K52R301J09r843l012R151L887
389G717j0028p096Q538Q480p888j1519N021J3087k621j4683q17J4738M605j3028
403e494p775J2003J0812q071j1717O549J3584k575j2918R24J3679J903j2854m109
417f059J2044O478j1164q836Q426J0655p200j3218L972J2758j304j3742k348J1474
431A936M713j0454p496P865Q699n611r202L702R155j169q008P25P994J971o651
446a831k319O719M360n044m652M673N537k832n915Q83N882j28m974k243L806K049
$$ plain form
462 3971 586 -2788 -1585 861 -744 -2780 -2893 -2103 -2295 -2760 -3049 -2916 -2883 -2562 -1757 -1623 -1919 -1679
480 -1679 -181 84 -449 -268 1867 1695 488 776 3329 3767 1484 391 3193 5471 2255 -1019 919
497 919 4599 2726 -2424 -2493 2254 2938 -2439 -4818 -776 2189 -1809 -5736 -2987 1511 -304 -5038
513 -5038 -3986 1146 1421 -3185 -4223 1473 3686 -547 -3570 1253 6035 2343 -2360 69 6008
528 6008 4892 -827 -1650 4031 5734 129 -3288 936 4143 603 -3903 -2071 2083 641 -4092
543 -4092 -4211 427 516 -3459 -5032 -1025 1358 -2198 -4519 -1521 2057 486 -3183 -1713 2688 3020
559 3020 -418 -817 2584 4254 1971 155 2270 3900 2563 353 893 2571 2177 292 -208 982
575 982 1045 -958 -1576 -1024 -519 -1415 -2443 -1813 -1386 -1700 -2518 -2674 -1876 -1457 -1643 -1920 -1483 -588 -42 -76
$$ packed form
462C971l385l374J203K446j605k036j13P90j92m65k89J33L3L21Q05J34k96K40
480a679J498K65n33J81K135j72j207K88K553M38k283j093K802K278l216l274J938
497I19L680j873n150o9M747O84n377k379M042K965l998l927K749M498j815m734
513e038J052N132K75m606j038N696K213m233l023M823M782l692m703K429N939
528F008j116n719q23N681J703n605l417M224L207l540m506J832M154j442m733
543d092j19M638Q9l975j573M007K383l556k321K998L578j571l669J470M401L32
559C020l438l99L401J670k283j816K115J630j337k210N40J678l94j885n00J190
575I82O3k003o18N52N05q96j028O30M27l14q18j56P98M19j86k77M37Q95N46l4
$$ plain form
595 -76 -206 121 900 1358 1335 641 1371 1954 1981 1013 580 1135 1598 803 -76 258 770 34 -1116 -866 -221
616 -221 -573 -1748 -2344 -1052 -836 -2395 -3127 -1676 -752 -1279 -2472 -1769 14 -44 -1267 -1094 618 1726
634 1726 425 -180 1252 2258 1592 440 658 1973 1840 358 -249 1236 1361 91 -1052 71 374
651 374 -653 -1688 -1695 -801 -1319 -2692 -2736 -1601 -1157 -2259 -2617 -1763 -692 -873 -1751 -1091 21 419 -219
670 -219 -186 924 1260 892 494 1298 1745 1428 685 1290 1491 1410 676 428 865 1023 52 -441 -139 -117 -390
691 -390 -1174 -1301 -1056 -973 -1549 -1802 -1544 -1093 -1154 -1625 -1234 -709 -259 -447 -146 481 606 566 767 860 996 1291
713 1291 1119 1195 1461 1323 984 1030 1273 910 630 730 232 27 45 35 -476 -715 -750 -874 -795 -895 -1502 -1188
735 -1188 -720 -1348 -1206 -741 -338 -124 -163 186 617 1005 648 709 696 1327 1219 991 1398 1522 1402 890 961
$$ packed form
595g6j30L27P79M58k3o94P30N83K7r68m33N55M63p95q79L34N12p36j150K50O45
616b21l52j175n96J292K16j559p32J451R24n27j193P03J783n8j223J73J712J108
634A726j301o05J432J006o66j152K18J315j33j482o07J485J25j270j143J123L03
651C74j027j035pQ94n18j373m4J135M44j102l58Q54J071j81q78O60J112L98o38
670b19L3J110L36l68l98Q04M47l17p43O05K01q1p34k48M37J58r71m93L02K2k73
691c90p84j27K45Q3n76k53K58M51o1m71L91N25M50j88L01O27J25m0K01R3J36K95
713A291j72P6K66j38l39M6K43l63k80J00m98k05J8j0n11k39l5j24P9j00o07L14
735a188M68o28J42M65M03K14l9L49M31L88l57O1j3O31j08k28M07J24j20n12P1
$$ plain form
756 961 1368 1161 588 511 567 592 266 -632 -764 -425 -249 -1158 -1185 -552 -842 -1223 -1303 -1136 -387 -716 -1071 -395
778 -395 254 346 -92 -25 849 1238 572 812 1161 1557 785 806 1002 1589 1377 272 553 1017 635 59 -145
799 -145 40 263 -505 -712 -674 -509 -827 -1076 -1403 -729 -941 -834 -846 -772 -200 -340 -404 89 176 136 208 444 1086
822 1086 708 857 816 928 863 1260 563 1186 717 733 637 137 558 -132 299 -350 -474 -772 -621 -739 -852
843 -852 -1001 -842 -929 -959 -844 -810 -310 -353 -436 -250 -70 225 94 28 275 807 529 632 814 1028 697 987
865 987 1226 871 836 488 271 404 463 25 -132 6 -249 -281 -541 -663 -562 -701 -700 -671 -1083 -750 -612 -647 -247
888 -247 -615 -651 152 -125 201 318 115 436 612 643 752 914 1078 822 921 769 513 617 645 684 223 17
910 17 49 61 -257 -350 -736 -404 -529 -731 -971 -606 -382 -685 -823 -540 -567 -418 -170 -282 -90 -268 1 252
$$ packed form
756I61M07k07n73p7N6K5l26q98j32L39J76r09k7O33k90l81q0J67P49l29l55O76
778c95O49R2m38O7Q74L89o66K40L49L96p72K1J96N87k12j105K81M64l82n76k04
799a45J85K23p68k07L8J65l18k49l27O74k12J07j2P4N72j40o4M93Q7m0P2K36O42
822A086l78J49m1J12o5L97o97O23m69J6r6n00M21o90M31o49j24k98J51j18j13
843h52j49J59q7l0J15L4N00m3q3J86J80K95j31o6K47N32k78J03J82K14l31K90
865I87K39l55l5l48k17J33N9m38j57J38k55l2k60j22J01j39JK9m12L33J38l5M00
888b47l68l6Q03k77L26J17k03L21J76L1J09J62J64k56R9j52k56J04K8L9m61k06
910A7L2J2l18r3l86L32j25k02k40L65K24l03j38K83k7J49K48j12J92j78K69K51
$$ plain form
932 252 476 806 305 700 776 928 638 806 930 891 819 288 440 141 -53 -319 11 134 -169 -503 -335
953 -335 -245 -549 -1000 -899 -449 -551 -787 -891 53 -148 -453 -584 -303 437 -284 -316 526 689 450 157 290
974 290 1017 1006 158 232 731 984 -59 -85 560 703 -126 -808 -28 294 -316 -967 -963 -33 -32 -1242 -1157 -363
996 -363 79 -958 -1486 -572 150 -526 -1061 -313 616 171 -277 -426 893 739 -210 -282 611 901 225 -263
1016 -263 614 1053 517 -477 -268 198 369 -689 -1021 -205 -40 -898 -1319 -443 -182 -638 -1192 -926 -117 -547
1036 -547 -983 -974 -8 -328 -644 -307 44 522 335 -178 499 570 560 251 462 586 359 341 255 352 239 -216
1058 -216 52 39 -249 -441 -365 -234 -637 -579 -736 -90 -519 -850 -932 -392 -715 -693 -623 34 257 -551 -551 372 682
1081 682 44 -167 395 927 244 62 265 1099 462 46 175 782 915 -233 -455 174 538 -378 -613 -215
$$ packed form
932B52K24L30n01L95P6J52k90J68J24l9p2n31J52k99j94k66L30J23l03l34J68
953c35R0l04m51J01M50j02k36j04R44k01l05j31K81P40p21l2Q42J63k39k93J33
974B90P27j1q48P4M99K53j043k6O45J43q29o82P80L22o10o51MR30Jj210Q5P94
996c63M42j037n28R14P22o76n35P48R29m45m48j49J319j54r49p2Q93K90o76m88
1016b63Q77M39n36r94K09M66J71j058l32Q16J65q58m21Q76K61m56n54K66Q09m30
1036e47m36RR66l20l16L37L51M78j87n13O77P1j0l09K11J24k27j8q6R7j13m55
1058b16K68j3k88j92P6J31m03N8j57O46m29l31q2N40l23K2P0O57K23q08%R23L10
1081F82o38k11N62N32o83j82K03Q34o37m16J29O07J33j148k22O29L64r16k35L98
$$ plain form
1101 -215 606 -214 -1240 -805 -33 -148 -998 -962 39 244 -742 -815 156 874 -18 -750 30 940 524 -491
1121 -491 -218 878 1037 -98 24 633 1292 625 -333 509 756 431 -409 -289 683 254 -523 -864 -71
1140 -71 614 -695 -629 -212 -55 -155 -961 -635 248 16 -617 -455 297 507 262 -79 475 753 217 208 540
1161 540 664 348 193 96 567 409 397 -76 102 263 -15 20 -163 -226 -45 -534 -468 -381 -349 -333 -362 -480 -375
1184 -375 -382 -148 -92 -172 306 310 28 -202 71 717 503 -95 345 616 688 304 -71 285 623 249 -391 62
1206 62 637 555 -113 -330 315 445 -307 -697 -254 67 -149 -542 -535 -106 49 -651 -715 -14 496 -71 -617 68
1228 68 463 104 -360 26 632 301 67 365 638 411 326 -72 350 356 133 -286 89 265 191 -297 -330 -117
1250 -117 -140 -536 -423 -147 -164 -311 -370 -303 -150 -170 -456 -142 48 60 -38 -53 195 138 104 193 241 152 387 302 248
$$ packed form
1101b15Q21q20j026M35P72j15q50L6J001K05r86p3R71P18q92p32P80R10m16j015
1121d91K73J096J59j135J22O09O59o67r58Q42K47l25q40J20R72m29p77l41P93
1140g1O85j309O6M17J57j00q06L26Q83k32o33J62P52K10k45l41N54K78n36rL32
1161E40J24l16j55r7M71j58j2m73J78J61k78L5j83o3J81m89O6Q7L2J6k9j18J05
1184c75pK34N6q0M78Mk82k30K73O46k14n98M40K71P2l84l75L56L38l74o40M53
1206F2N75q2o68k17O45J30p52l90M43L21k16l93PM29J55p00o4P01N10n67n46O85
1228F8L95l59m64L86O06l31k34K98K73k27q5l98M22Ok23m19L75J76p4m88l3K13
1250a17k3l96J13K76j7j47n9O7J53k0k86L14J90J2r8j5K48n7l4Q9M8q9K35q5n4
$$ plain form
1275 248 695 382 202 413 614 40 244 -1 -466 -25 201 -119 -257 -509 -117 -16 -250 -538 -359 -179
1295 -179 -159 -366 -419 98 -159 -22 3 -80 523 -54 26 571 257 323 329 324 592 443 232 48 199 228 144 161
1319 161 200 80 -24 -452 85 -6 -155 -270 -204 -181 -34 -352 -452 -44 -125 -77 -80 -158 -101 -143 -100 80 68 380
1343 380 3 279 170 420 -22 312 593 260 -55 219 338 -26 -164 88 64 90 61 -299 -319 -190 -587
1364 -587 -338 -218 53 -123 -592 -320 47 -187 -277 30 -91 -197 71 -11 257 174 -75 90 466 425 229
1385 229 -137 165 329 299 269 190 486 289 -153 -37 171 93 -268 -268 -65 195 136 -482 -117 -278 -280 -331 -158
1408 -158 -173 154 -240 -211 -41 176 18 -11 -208 81 -33 224 556 195 359 408 234 -57 -53 181 335 125
1430 125 108 -95 -121 278 -234 -101 41 -33 -149 -486 -228 -107 -188 5 -127 16 -154 -49 -194 70 204
$$ packed form
1275B48M47l13j80K11K01n74K04k45m65M41K26l20j38k52L92J01k34k88J79J80
1295a79K0k07n3N17k57J37K5q3O03n77Q0N45l14O6OnK68j49k11j84J51K9q4J7
1319A61L9j20j04m28N37r1j49j15O6K3J47l18j00M08q1M8lp8N7m2M3J80j2L12
1343C80l77K76j09K50m42L34K81l33l15K74J19l64j38K52k4K6k9l60k0J29l97
1364e87K49J20K71j76m69K72L67k34r0L07j21j06K68q2K68q3k49J65L76m1j96
1385B29l66L02J64l0l0p9K96j97m42J16K08p8l61%K03K60n9o18L65j61kn1J73
1408a58j5L27l94K9J70K17j58k9j97K89j14K57L32l61J64M9j74k91MK34J54k10
1430A25j7k03k6L99n12J33J42p4j16l37K58J21q1J93j32J43j70J05j45K64J34
$$ plain form
1451 204 -47 -20 22 369 648 178 314 395 326 233 258 411 381 -143 50 -233 272 7 -132 -141 269 -60 21
1474 21 -326 -339 -58 88 -374 -442 -139 -153 -24 -125 234 -190 -220 -591 11 80 -95 -49 137 70 155 -301 -114
1497 -114 244 194 107 -32 344 262 -108 -188 -311 127 41 -168 -239 -345 85 -341 -182 -65 138 -58 -417 -188
1519 -188 63 -169 1 126 107 145 35 30 77 45 -72 -22 119 81 137 101 102 104 255 110 65 173 -241 -218 -45
1544 -45 188 -34 -244 -140 -143 -56 -349 -272 -237 -151 -270 -437 -308 -208 -340 -468 29 111 -193 -219 -113 218 163
1567 163 -89 148 141 249 94 -152 123 302 11 -295 274 247 92 -352 93 111 65 -184 -365 265 158 -380
1589 -380 -401 47 237 -567 -389 -342 23 7 -245 -33 294 285 -339 -151 249 629 -255 -189 508 353 333 44
1611 44 353 475 336 -105 111 499 28 -174 -264 40 104 -160 -452 -59 224 -348 -329 -247 142 -193 -273 -83
$$ packed form
1451B04k51K7M2L47K79m70J36Q1o9r3K5J53l0n24J93k83N05k65j39rM10l29Q1
1474B1l47j3K81J46m62o8L03j4J29j01L59m24l0l71O02O9j75M6J86o7Q5m56J87
1497a14L58n0q7j39L76q2l70q0j23M38q6k09p1j06M30m26J59J17K03j96l59K29
1519a88K51k32J70J25j9L8j10nM7l2j17N0J41l8N6l6JKJ51j45m5J08m14K3J73
1544d5K33k22k10J04lQ7k93P7L5Q6j19j67J29J00j32j28M97Q2l04k6J06L31n5
1567A63k52K37pJ08j55k46K75J79k91l06N69k7j55m44M45J8m6k49j81O30j07n38
1589c80k1M48J90q04J78M7L65j6k52K12L27ro24J88M00L80q84O6O97j55k0k89
1611D4L09J22j39m41K16L88m71k02r0L04O4k64k92L93K83n72J9Q2L89l35q0J90
$$ plain form
1633 -83 97 81 -206 -109 139 187 -142 205 152 33 218 -38 281 298 142 -110 111 283 27 -97 373 418
1655 418 -449 -239 190 258 -259 -361 67 161 -253 -578 -206 219 -266 -624 -451 190 248 -432 -372 373 364 -518
1677 -518 -442 294 594 415 -609 95 659 447 -474 -327 610 603 -112 -555 331 415 -108 -753 -37 789 -85
1698 -85 -1089 -188 921 379 -673 -449 709 812 -370 -1175 22 877 141 -926 -249 733 283 -712
1716 -712 -199 665 500 -344 -169 408 759 -124 -439 425 540 -16 -675 -309 559 227 -564 -326 406 232
1736 232 -285 -511 26 232 -256 -356 -25 38 -313 -418 -16 460 -473 -120 14 194 -228 -205 153 335 44
1757 44 -241 141 512 256 -537 123 840 85 -387 48 679 201 -427 -221 532 284 -735 -596 284 960
1777 960 -462 -971 -123 885 137 -999 -145 934 642 -1024 -690 1004 916 -527 -1425 616 1520 -104
$$ packed form
1633h3J80j6k87R7K48M8l29L47n3j19J85k56L19J7j56k52K21J72k56j24M70M5
1655D18q67K10M29O8n17j02M28R4m14l25L72M25m85l58J73O41N8o80O0P45rq82
1677e18P6P36L00j79j024P04N64k12r21J47R37pp15m43Q86Q4n23o45P16Q26q74
1698h5j004R01J109n42j052K24J158J03j182q05J197Q55p36j067O77R82m50r95
1716g12N13Q64j65q44J75N77L51q83l15Q64J15n56o59L66Q68l32p91K38P32j74
1736B32n17k26N37K06m88j00L31O3l51j05M02M76r33L53J34J80m22K3L58J82k91
1757D4k85L82L71k56p93O60P17p55m72M35O31m78o28K06P53k48j019J39Q80O76
1777I60j422n09Q48J008p48j136Q54J079k92j666L34J694q8j443q98K041R04j624
$$ plain form
1795 -104 -1121 237 1461 137 -1201 -565 1702 1001 -981 -649 1276 1451 -799 -1184 488 1525
1811 1525 -206 -1467 -54 1485 457 -1627 -941 1195 696 -1065 -1267 802 1551 -545 -1285 137
1827 137 1691 120 -1588 -155 1451 769 -1250 -783 949 1121 -1009 -950 681 1251 -257 -868 206
1844 206 1247 -23 -927 -329 684 536 -912 -606 534 378 -634 -803 269 833 -272 -566 -40
1861 -40 509 -78 -543 124 469 -12 -547 337 428 2 -340 42 386 108 -497 10 785 50 -730 61 556
1882 556 175 -747 -616 844 734 -797 -1140 758 879 -594 -1207 273 1443 -238 -1660 101 1658
1899 1658 426 -1719 -689 1458 887 -1624 -1371 1241 1835 -764 -1778 640 2111 -38 -2134 -264
1915 -264 2201 622 -2052 -1192 1808 1490 -1561 -2219 1023 2303 -797 -2647 75 2291 276 -2425
$$ packed form
1795a04j017J358J224j324j338O36K267p01j982L32J925J75k250l85J672J037
1811A525j731j261J413J539j028k084O86K136m99j761k02K069P49k096p40J422
1827A37J554j571j708J433J606o82k019M67J732J72k130N9J631N70j508o11J074
1844B06J041j270r04N98J013j48j448L06J140j56j012j69J072N64j105k94N26
1861d0N49n87m65O67L45m81n35Q84R1m26l42L82L44k78o05N07P75p35p80P91M95
1882E56l81r22J31J460j10j531l43J898J21j473o13J480J170j681j422J761J557
1899A658j232k145J030K147n71k511K53K612N94k599j014K418J471k149k096J870
1915b64K465j579k674Q60L000l18l051o58L242J280l100j850K722K216k015k701
$$ plain form
1931 -2425 -769 2348 1232 -2125 -1773 1681 1868 -1442 -1929 766 2375 -133 -2525 -93 2493 643
1947 643 -2375 -851 2279 1362 -1397 -1596 1311 1893 -1017 -2182 443 1920 -357 -2059 -320 1590
1963 1590 596 -1552 -874 1166 1029 -901 -976 677 1005 -404 -1143 461 1352 130 -791 284 946
1980 946 371 -573 65 588 282 -447 -134 874 264 -743 -264 471 24 -945 46 958 47 -746 -350
1999 -350 782 533 -1332 -955 1204 1082 -996 -1497 802 1401 -498 -1919 453 1686 101 -1934
2015 -1934 -619 2092 980 -1753 -1273 1968 1814 -1453 -2488 1188 2261 -705 -2875 -116 2627
2030 2627 405 -2575 -1247 2636 1633 -2241 -2096 1562 2462 -1417 -2992 693 2905 -99 -3145
2045 -3145 -602 2794 1273 -2807 -1962 2134 2191 -1777 -2505 1767 3087 -813 -2956 289 2981 479
$$ packed form
1931b425J656L117j116l357L52L454J87l310m87K695J609k508k392K432K586j850
1947F43l018J524L130r17k759j99K907N82k910j165K625J477k277j702J739J910
1963A590r94k148O78K040j37j930p5J653L28j409p39J604Q91j222r21J075O62
1980I46n75r44O38N23l06p29L13J008o10j007M79P35m47r69R91R12r11p93L96
1999c50J132k49j865L77K159j22k078n01K299N99j899j421K372J233j585k035
2015a934J315K711j112k733M80L241j54l267j035L676J073k966k170K759K743
2030B627k222k980J328L883j003l874J45L658R00l879j575L685K212l004l046
2045c145K543L396j521m080Q45M096N7l968p28M272J320l900k143L245K692k502
$$ plain form
2061 479 -2818 -882 2530 1417 -2188 -2046 1585 2259 -1422 -2536 572 2555 -107 -2529 -503 2054
2077 2054 440 -1960 -1279 1489 1273 -1179 -1653 601 1702 -591 -1527 -191 1283 -71 -1217 -562
2093 -562 1064 301 -971 -375 601 384 -752 -265 570 321 -372 -264 398 16 -677 -315 535 16 -901
2112 -901 -200 803 548 -909 -453 1185 974 -936 -886 932 1162 -691 -1669 553 1737 -202 -1706
2129 -1706 -188 2074 681 -1776 -1104 1814 1485 -1616 -1985 1272 2279 -837 -2546 194 2586 -66
2145 -66 -2473 -771 2699 1000 -2455 -1847 1792 2078 -1815 -2750 978 2680 -516 -3035 -253 2925
2161 2925 791 -2722 -1132 2582 2053 -1802 -2405 1588 2796 -967 -2485 456 2992 188 -2724
2176 -2724 -603 2717 1413 -2282 -1790 1898 2128 -1345 -2232 609 2309 -196 -2034 -347 2086 403
$$ packed form
2061D79l297J936L412j113l605J42L631O74l681j114L108J983k662k422K026K557
2077B054j614k400O81K768k16k452m74K254J101k293r36J336J474j354j146O55
2093e62J626p63j272N96R76k17j136M87Q35k49o93J08O62l82o93L62Q50n19r17
2112i01P01J003k55j457M56J638k11j910N0J818K30j853r78K222J184j939j504
2129a706J518K262j393k457O72K918l29l101l69L257J007l116j709K740K392k652
2145f6k407J702L470j699l455O08L639K86l893r35L728J702l196k519K782L178
2161B925k134l513J590L714n29l855o03L993J208l763j518K941K536k804k912
2176b724K121L320j304l695M92L688K30l473q87K841J700k505j838J687K433j683
$$ plain form
2192 403 -1950 -840 1417 1319 -1035 -1598 996 1537 -532 -1505 199 1408 277 -1279 -230 836
2208 836 427 -824 -559 417 550 -483 -722 85 534 7 -182 203 121 -65 -39 333 151 -320 -110 560
2228 560 321 -496 -290 571 435 -783 -629 1255 731 -773 -873 860 1331 -300 -1392 141 1684
2245 1684 271 -1517 -508 1469 968 -1608 -1042 1266 1566 -978 -1914 548 2254 -313 -2175 -95
2261 -95 2359 699 -1945 -1079 1725 1738 -1612 -2191 1165 2318 -801 -2655 -293 2312 408 -2451
2277 -2451 -761 2174 1470 -1591 -1594 1200 2069 -696 -2367 573 2304 145 -2319 -615 1876 956
2293 956 -1922 -1494 1200 1623 -1044 -1606 687 1645 -291 -1764 -417 1730 403 -1372 -823 1390
2309 1390 900 -884 -1026 567 880 -276 -1156 -77 1032 -19 -549 -327 713 503 -631 -739 280
$$ packed form
2192D03k353J110K257r8k354n63K594N41k069r73J704J209j131j556J049J066
2208H36m09j251K65R76J33j033k39Q07M49n27j89L85q2j86K6L72j82m71K10O70
2228E60k39q17K06Q61j36j218J54J884n24j504j00J733M71j631j092J533J543
2245A684j413j788J009J977n01k576N66K308L00k544r36K462J706k567j862K080
2261i5K454j660k644Q66K804J3l350n79L356J153l119j854K362K605j904k859
2277b451J690K935p04l061lK794Q69k765j671K940J731k159k464J704K491r20
2293I56k878M28K694M23k667n62K293R58j936j473J347K147j327j775N49K213
2309A390m90j784j42J593L13j156q80J079J109j051n30K22J040k10j134j08J019
$$ plain form
2326 280 397 -67 -486 124 437 -96 -370 -88 74 173 -75 -24 -488 -94 150 441 -111 -488 -11 517 -2
2347 -2 -715 -192 507 174 -525 -640 496 730 -586 -518 272 1010 -31 -1278 -198 1129 381 -1122 -647
2366 -647 814 794 -895 -1009 736 1549 -337 -1189 -140 1501 89 -1596 -771 1233 671 -1186 -1036
2383 -1036 840 1247 -573 -1353 197 1465 48 -1369 -530 1588 375 -986 -856 828 1127 -880
2399 -880 -1260 435 1377 -170 -1406 -257 1387 451 -1057 -562 987 639 -780 -868 411 954 -256
2416 -256 -1075 -211 1005 -147 -660 -396 896 307 -576 -415 785 646 -141 -573 -42 616 43 -798 -22
2435 -22 252 480 76 -227 247 145 -69 -143 0 60 -15 -194 -165 -37 -200 340 198 110 -88 212 167 -52
2457 -52 -393 210 347 -107 -429 167 230 249 -510 -50 499 170 -489 -433 424 569 -167 -967 83 578 183
$$ packed form
2326B80J17m64m19O10L13n33k74K82J62R9k48N1m64L94K44K91n52l77M77N28n19
2347bp13N23O99l33o99j15J136K34j316O8P90P38j041j247J080J327p48j503M75
2366f47J461k0j689j14J745Q13j886q52J049J641j412j685Q25K004n62j857J50
2383a036J876M07j820p80J550J268j417j417Q39K118j213j361J30J684K99k007
2399h80l80J695R42j547j236J149J644r36j508M95J549l48j419q8J279N43j210
2416b56q19Q64J216j152n13K64J292n89q83J61J200j39p87m32N31O58n73q41P76
2435b2K74K28m04l03M74j02k14p4J43O0p5j79K9J28j63N40j42q8j98L00m5k19
2457e2l41O03J37m54l22N96O3J9p59M60N49l29o59N6Q57J45p36q00J050M95l95
$$ plain form
2478 183 -734 -52 542 315 -621 -511 504 763 -206 -976 336 685 140 -915 -229 784 657 -686
2496 -686 -292 712 582 -468 -669 188 695 -118 -705 8 780 256 -955 -376 597 591 -477 -876 200
2515 200 426 53 -799 -139 585 6 -349 -277 552 506 -369 -397 372 668 -288 -418 282 473 86 -377 -111
2536 -111 423 15 -121 -318 163 536 -67 -47 339 132 -131 -291 178 91 -127 -277 -372 120 35 -342 -289 81
2558 81 57 -31 110 -21 -161 -187 66 -270 38 81 -78 -7 82 -152 49 43 -85 -154 76 204 -49 -335 -138
2581 -138 248 189 -349 8 251 123 -450 -337 -6 1 -5 -324 -110 227 -11 -315 -47 203 189 -188 -388 117
2603 117 213 -282 -550 109 278 171 -261 -43 360 93 -315 -301 47 103 -331 -250 -30 397 -48 -205 -92
2624 -92 136 325 -54 -92 26 88 -77 -409 141 258 -58 -240 150 273 -110 -74 157 276 207 -339 -331 29
$$ packed form
2478A83r17O82N94k27r36J10J015K59r69p70J312L49n45j055O86J013j27j343
2496f86L94J004j30j050k01Q57N07q13n87P13P72n24j211N79R73oj068l99J076
2515B00K26l73q52O60P24n79l55P2Q29m6q75k8P69K96r56j30P00J91l87m63K66
2536a11N34m08j36j97M81L73o03K0L86k07k63j60M69q7k18j50r5M92q5l77N3L70
2558H1k4q8J41j31j40k6K53l36L08M3j59P1Q9k34K01oj28o9K30J28k53k86J97
2581a38L86n9n38L57K43j28n73J13L31Pol19K14L37k38l04K68K50j4l77k00N05
2603A17R6m95k68O59J69j07m32K18M03k67m08J4L48N6m34Q1K20M27m45j57J13
2624i2K28J89l79l8J18O2j65l32N50J17l16j82L90J23l83L6K31J19o9n46QL60
$$ plain form
2646 29 230 8 -226 288 141 34 -76 -78 -43 283 61 -45 64 155 176 101 -43 240 64 -145 -156 -154 -68 382
2670 382 56 116 64 -212 88 -115 -18 -76 -29 27 282 -24 -156 82 -108 145 5 -72 -229 100 -48 105
2692 105 -169 156 -90 11 -19 177 27 194 -17 -79 154 -207 228 81 20 -114 -96 262 148 -66 316
2713 316 44 129 -145 -44 257 -101 -153 204 -43 148 -31 72 51 57 -144 49 167 -3 83 90 -54 -215 -17
2736 -17 -125 -8 168 48 282 39 57 -151 -141 -25 209 -43 63 -33 -118 -3 109 -99 -136 -19 240 -60
2758 -60 -248 318 15 63 213 -91 -123 81 135 -148 -146 221 183 38 35 61 92 -127 108 85 119 137 -4 63 -40
2783 -40 -24 164 259 243 -2 -106 108 -228 210 -217 -63 -29 95 -12 -48 151 170 -25 72 -88 145 119 -77
2806 -77 41 -3 49 23 223 -300 -25 9 241 153 -63 248 -139 91 151 -120 94 19 -205 -39 88 -78 192
$$ packed form
2646B9K01k22k34N14j47j07j10kL5L26k22j06J09R1K1p5j44K83j76k09j1KQ6M50
2670C82l26O0n2k76L00k03R7n8M7N6K55l06j32K38j90K53j40p7j57L29j48J53
2692A05k74L25k46J01l0J96j50J67k11o2K33l61M35j47o1j34J8L58j14k14L82
2713C16k72Q5k74J01L01l58n2L57k47J91j79J03k1Ok01J93J18j70Q6Pj44j61J98
2736a7j08J17J76j20K34k43J8k08J0J16K34k52J06r6q5J15J12k08l7J17K59l00
2758f0j88N66l03M8J50l04l2K04N4k83KL67l8j45lK6L1k19K35k3L4J8j41O7j03
2783d0J6J88R5j6k45j04K14l36M38m27J54L4J24j07l6J99J9j95R7j60K33k6j96
2806g7J18m4N2k6K00n23K75L4K32q8k16L11l87K30O0k71K14p5k24J66J27j66K70
$$ plain form
2829 192 77 -29 -158 81 272 106 -224 -250 127 -32 217 11 -162 -78 -275 28 -57 -5 -63 -46 -129 210
2851 210 22 -78 46 -101 175 -43 28 -11 -72 -168 158 223 -129 287 -213 238 187 76 -283 -86 352 48
2873 48 -127 -205 -68 -185 -158 212 189 112 -19 33 -14 126 94 -401 83 17 -61 -3 -53 -59 131 -224 -211 -111 -34
2898 -34 -253 -78 147 51 -106 -7 -82 40 256 -36 45 -21 75 60 267 169 133 -134 278 121 -164 70 -103
2921 -103 -18 281 -23 59 -64 -35 -202 -21 106 -2 -67 86 -162 -130 -106 73 -110 -162 -225 196 128 126 107 -261
2945 -261 94 127 -15 304 168 206 135 -80 142 67 -202 58 -7 10 204 -29 -287 12 406 -47 164 94
2967 94 62 104 26 8 -69 -55 -206 152 31 -245 -180 -123 -231 78 -48 94 389 -100 136 19 -25 38 -49 -29
2991 -29 -114 211 97 106 29 -467 -204 246 16 -96 161 -110 179 -11 62 32 26 14 -79 -26 145 -111 -198 -119 53
$$ packed form
2829A92j15j06j29K39J91j66l30k6L77j59K49k06j73Q4j97L03q5N2n8J7q3L39
2851B10j88j00J24j47K76k18P1l9o1r6L26O5l52M16n00M51n1j11l59J97M38l04
2873D8j75p8J37j17K7L70k3p7j31N2m7J40l2m95M84o6p8N8n0oJ90l55J3J00P7
2898c4k19J75K25r6j57R9p5J22K16k92Q1o6R6j5K07r8l6k67M12j57k85K34j73
2921a03Q5K99l04Q2j23K9j67J81J27j08o5J53k48L2K4J79j83n2o3M21o8kj9l68
2945b61L55L3j42L19j36L8p1k15K22p5k69K60o5J7J94k33k58K99L94m53K11p0
2967I4l2M2p8j8p7J4j51L58j21k76O5N7j08L09j26J42K95m89K36j17m4O3q7K0
2991b9q5L25j14Rp7m96K63M50k30j12K57k71K89j90P3l0oj2r3N3J71k56q7P9J72
$$ plain form
3016 53 29 -115 -107 122 97 79 -151 -188 -228 81 -90 -99 -50 70 63 175 -67 56 167 -33 -183 -1 243 -34
3040 -34 67 -1 -10 92 -101 -158 30 20 90 105 79 2 2 134 -63 120 -21 77 122 -91 49 -114 -2 -141 -64
3065 -64 -102 86 84 179 199 -107 214 113 -311 -384 83 20 150 -54 419 327 88 54 -148 240 58 -3 -159 89
3089 89 15 -163 -188 84 -42 46 -96 -190 87 95 -56 36 200 77 118 0 -207 123 -33 -177 -49 145 106
3112 106 -177 172 54 -92 -254 -247 293 79 186 -45 170 -27 -42 69 -225 94 80 -347 53 51 14 -28 144
3135 144 4 132 46 187 -110 -107 -118 -152 163 120 -286 46 147 -129 1 217 134 -369 173 -35 71 84 -33
3158 -33 -193 -41 229 89 171 75 -198 106 -10 -257 289 -139 -280 -139 -63 223 -86 -29 -198 44 161 -26
3180 -26 -146 150 -78 -217 188 97 -31 112 -241 3 66 -84 97 -136 -75 -185 -29 -250 95 -55 -167
$$ packed form
3016E3k4j44QK29k5j8k30l7m0L09j71rM9J20pJ12k42J23J11k00j50J82K44k77
3040c4J01o8rJ02j93n7J88j0P0J5k6p7%J32j97J83j41R8M5k13J40j63J12j39P7
3065f4l8J88kR5K0l06L21j01m24p3M67o3J30k04M73r2k39l4k02L88j82o1j56K48
3089H9p4j78k5K72j26Q8j42r4K77Qj51R2J64j23M1j18k07L30j56j44J28J94l9
3112A06k83L49j18j46j62PN40k14J07k31K15j97j5J11k94L19j4m27M00kl7m2J72
3135A44j40J28q6J41k97Lj1l4L15m3m06L32J01k76J30K16q3n03N42k08J06J3j17
3158c3j60J52K70j40Q2r6k73L04j16k47N46m28j41J41P6K86l09N7j69K42J17j87
3180b6j20K96k28j39M05r1j28J43l53K44O3j50J81k33O1j10J56k21L45j50j12
$$ plain form
3201 -167 -32 -243 57 -104 144 184 13 -171 -229 68 126 70 64 182 89 -64 -73 -351 53 -40 43 -263 272 29
3225 29 158 27 -103 -30 2 -148 -184 4 96 -196 -79 131 139 -186 44 43 71 300 -201 -150 -49 154 -102 213
3249 213 -103 74 -16 -213 48 -3 83 -108 76 -113 68 -120 -282 -103 27 -196 -25 192 -34 -65 -138 -144
3271 -144 -46 -49 20 9 6 -5 -76 65 120 -82 -79 34 -16 149 90 196 -129 115 -138 49 65 32 -85 282 -1
3296 -1 -26 551 -83 17 -64 -114 144 141 -174 -32 -7 -130 279 88 -42 27 53 66 -186 -91 85 -259 -61 227
3320 227 387 23 119 -92 -13 74 45 -103 5 72 -51 31 218 -52 -75 -75 -14 247 -23 -67 -73 106 -208 -12
3344 -12 181 -116 -442 -182 -141 104 -70 142 -254 -125 68 40 98 -103 38 -10 132 22 225 -67 26 206
3366 206 -145 -99 56 92 -64 -137 -51 70 238 -54 -478 138 -189 169 64 -203 -192 53 -119 29 10 87
$$ packed form
3201a67J35k11L00j61K48M0j71j84n8K97N8n6oJ18r3j53rk78M04r3Q3l06N35k43
3225B9J29j31j30P3L2j50l6J88R2k92J17K10Ql25K30jK8K29n01N1J01K03k56L15
3249B13l16J77r0j97K61n1Q6j91J84j89J81j88j62J79J30k23J71K17k26l1p3o
3271a44R8lO9j1lj1p1J41N5k02LJ13n0J65n9J06l25K44k53J87J6l3j17L67k83
3296ak5N77o34J00q1n0K58ll15J42K5j23M09j91j30O9K6J3k52R5J76l44J98K88
3320B27J60l64R6k11P9Q7k9j48J08O7j23Q2J87k70k3%O1K61k70m4oJ79l14J96
3344a2J93k97l26K60M1K45j74K12l96J29J93k8N8k01J41m8J42j10K03k92R3J80
3366B06l51M6J55L6j56p3Q6J21J68k92m24O16l27L58j05k67J1K45j72J48j9P7
$$ plain form
3388 87 -172 -103 -4 38 132 -378 -380 420 63 -33 -95 244 132 -46 207 -32 187 199 -68 125 137 -77 133 -248
3412 -248 3 -5 -12 -114 -390 156 -74 -181 -172 96 -83 -309 203 -35 70 30 76 108 -35 -179 271 -252 96
3435 96 -37 -188 -61 9 -131 174 45 45 -163 -152 -177 7 84 -20 212 -78 97 68 -47 237 43 114 -2
$$ packed form
3388H7k59O9R9M2R4n10kQ00l57r6o2L39j12j78K53k39K19J2k67J93J2k14K10l81
3412b48K51qpj02k76N46k30j07RK68j79k26N12k38J05m0M6L2j43j44M50n23L48
3435I6j33j51J27P0j40L05j29%k08J1k5J84P7j04K32k90J75k9j15K84j94P1j16
$$ [...]
8191d8
##END NTUPLES=NMR FID
##END=
