##TITLE=1H_SAM_33.245_1
 DMSO, 8 sc, 
 24.08.2021
##JCAMPDX= 6.0         $$ Bruker NMR JCAMP-DX V2.0
##DATA TYPE= NMR FID
##DATA CLASS= NTUPLES
##ORIGIN= UXNMR, Bruker Analytische Messtechnik GmbH
##OWNER= root
$$ XWIN-NMR		Version 3.5
$$ Tue Aug 24 13:10:09 2021 Russian Standard Time (UT+4h)  she@DPX200
##.OBSERVE FREQUENCY= 200.131506
##.OBSERVE NUCLEUS= ^1H
##.DELAY= (6, 6)
##.ACQUISITION MODE= SIMULTANEOUS
##.ACQUISITION SCHEME= undefined
##.AVERAGES= 108
##.DIGITISER RES= 18
##SPECTROMETER/DATA SYSTEM= spect
##.PULSE SEQUENCE= zg30
##.SOLVENT NAME= D2O
##.SHIFT REFERENCE= (INTERNAL, D2O, 0, 15.7039)
##AUDIT TRAIL= $$ (NUMBER, WHEN, WHO, WHERE, WHAT)
$$ ##TITLE= Audit trail, XWIN-NMR		Version 3.5
$$ ##JCAMPDX= 5.01
$$ ##ORIGIN= Bruker BioSpin GmbH
$$ ##OWNER= she
$$ F:/spectra/data/she/nmr/H-F/1/audita.txt
$$ ##AUDIT TRAIL=  $$ (NUMBER, WHEN, WHO, WHERE, WHAT)
(   1,<2021-08-24 13:08:23.53 +0400>,<she>,<DPX200>,
      <created by zg, POWCHK disabled, PULCHK disabled
       configuration hash MD5:
       00 E9 B6 7A A2 85 ED C7 34 08 36 98 17 FE 4E 26
       data hash MD5: 16K
       9C ED 82 03 0A 39 94 30 95 F4 4E 5A EF 6A 9F 97>)
$$ ##END=
$$ 
$$ hash MD5
$$ 2D D5 D8 D0 1E E3 77 2D 6B 15 9A FE 20 C5 C4 CC
##$RELAX= 
##$RELAX= 
##$RELAX= 
##$RELAX= 
##$RELAX= 
##$RELAX= 
$$ Bruker specific parameters
$$ --------------------------
##$DU= <F:/spectra>
##$EXPNO= 1
##$NAME= <H-F>
##$PROCNO= 1
##$TYPE= <nmr>
##$USER= <she>
##$AMP= (0..31)
100 100 100 100 100 100 100 100 100 100 100 100 100 100 100 100 100 100 
100 100 100 100 100 100 100 100 100 100 100 100 100 100 
##$AQSEQ= 0
##$AQ_mod= 1
##$AUNM= <au_zg>
##$AUTOPOS= <>
##$BF1= 200.13
##$BF2= 200.13
##$BF3= 200.13
##$BF4= 200.13
##$BF5= 200.13
##$BF6= 200.13
##$BF7= 200.13
##$BF8= 200.13
##$BYTORDA= 1
##$CFDGTYP= 0
##$CFRGTYP= 5
##$CHEMSTR= <none>
##$CNST= (0..31)
1 1 145 1 1 1 1 1 1 1 1 1 1 1 1 1 1 1 1 1 1 1 1 1 1 1 1 1 1 1 1 1 
##$CPDPRG= <>
##$CPDPRG1= <>
##$CPDPRG2= <>
##$CPDPRG3= <>
##$CPDPRG4= <mlev>
##$CPDPRG5= <mlev>
##$CPDPRG6= <mlev>
##$CPDPRG7= <mlev>
##$CPDPRG8= <mlev>
##$CPDPRGB= <>
##$CPDPRGT= <>
##$D= (0..31)
0 1.2 0 0 0 0 0 0 0 0.06 0 0.03 0 0 0 0 0.0002 0 0 0 0 0 0 0 0 0 0 0 0 
0 0 0 
##$DATE= 1629796102
##$DBL= (0..7)
120 120 120 120 120 120 120 120 
##$DBP= (0..7)
150 150 150 150 150 150 150 150 
##$DBP07= 0
##$DBPNAM0= <>
##$DBPNAM1= <>
##$DBPNAM2= <>
##$DBPNAM3= <>
##$DBPNAM4= <>
##$DBPNAM5= <>
##$DBPNAM6= <>
##$DBPNAM7= <>
##$DBPOAL= (0..7)
0.5 0.5 0.5 0.5 0.5 0.5 0.5 0.5 
##$DBPOFFS= (0..7)
0 0 0 0 0 0 0 0 
##$DE= 6
##$DECBNUC= <off>
##$DECIM= 32
##$DECNUC= <off>
##$DECSTAT= 4
##$DIGMOD= 1
##$DIGTYP= 9
##$DL= (0..7)
0 120 120 120 120 120 120 120 
##$DP= (0..7)
150 150 150 150 150 150 150 150 
##$DP07= 0
##$DPNAME0= <>
##$DPNAME1= <>
##$DPNAME2= <>
##$DPNAME3= <>
##$DPNAME4= <>
##$DPNAME5= <>
##$DPNAME6= <>
##$DPNAME7= <>
##$DPOAL= (0..7)
0.5 0.5 0.5 0.5 0.5 0.5 0.5 0.5 
##$DPOFFS= (0..7)
0 0 0 0 0 0 0 0 
##$DQDMODE= 0
##$DR= 18
##$DS= 0
##$DSLIST= <SSSSSSSSSSSSSSS>
$$ [...]
##$SUBNAM2= <"">
##$SUBNAM3= <"">
##$SUBNAM4= <"">
##$SUBNAM5= <"">
##$SUBNAM6= <"">
##$SUBNAM7= <"">
##$SUBNAM8= <"">
##$SUBNAM9= <"">
##$SW= 20.0188882624521
##$SWIBOX= (0..15)
0 0 2 0 0 0 0 0 0 0 0 0 0 0 0 0 
##$SW_h= 4006.41025641026
##$TD= 16384
##$TD0= 1
##$TE= 0
##$TE2= 300
##$TE3= 300
##$TEG= 300
##$TL= (0..7)
0 120 120 120 120 120 120 120 
##$TP= (0..7)
150 150 150 150 150 150 150 150 
##$TP07= 0
##$TPNAME0= <>
##$TPNAME1= <>
##$TPNAME2= <>
##$TPNAME3= <>
##$TPNAME4= <>
##$TPNAME5= <>
##$TPNAME6= <>
##$TPNAME7= <>
##$TPOAL= (0..7)
0.5 0.5 0.5 0.5 0.5 0.5 0.5 0.5 
##$TPOFFS= (0..7)
0 0 0 0 0 0 0 0 
##$TUNHIN= 0
##$TUNHOUT= 0
##$TUNXOUT= 0
##$USERA1= <user>
##$USERA2= <user>
##$USERA3= <user>
##$USERA4= <user>
##$USERA5= <user>
##$V9= 5
##$VALIST= <valist>
##$VCLIST= <CCCCCCCCCCCCCCC>
##$VD= 0
##$VDLIST= <DDDDDDDDDDDDDDD>
##$VPLIST= <PPPPPPPPPPPPPPP>
##$VTLIST= <TTTTTTTTTTTTTTT>
##$WBST= 1024
##$WBSW= 4
##$XGAIN= (0..3)
0 0 0 0 
##$XL= 0
##$YL= 0
##$YMAX_a= 1271998
##$YMIN_a= -2301467
##$ZGOPTNS= <>
##$ZL1= 120
##$ZL2= 120
##$ZL3= 120
##$ZL4= 120
##$ABSF1= 10
##$ABSF2= 0
##$ABSG= 5
##$ABSL= 3
##$ALPHA= 0
##$AQORDER= 0
##$ASSFAC= 0
##$ASSFACI= 0
##$ASSFACX= 0
##$ASSWID= 0
##$AUNMP= <proc_1d>
##$AZFE= 0.1
##$AZFW= 0.1
##$BCFW= 1
##$BC_mod= 2
##$BYTORDP= 1
##$COROFFS= 0
##$CY= 11.3945322036743
##$DATMOD= 1
##$DC= 2
##$DFILT= <>
##$DTYPP= 0
##$F1P= 2.36226072786647
##$F2P= -0.459571619588291
##$FCOR= 0.5
##$FTSIZE= 0
##$FT_mod= 4
##$GAMMA= 1
##$GB= 0.15
##$INTBC= 1
##$INTSCL= 1
##$ISEN= 128
##$LB= 0.24
##$LEV0= 0
##$LPBIN= 0
##$MAXI= 10000
##$MC2= 0
##$MEAN= 0
##$ME_mod= 0
##$MI= 1.114404
##$NCOEF= 0
##$NC_proc= 0
##$NLEV= 6
##$NOISF1= 3.799351
##$NOISF2= 2.8
##$NSP= 1
##$NTH_PI= 0
##$NZP= 0
##$OFFSET= 15.70392
##$PC= 1
##$PHC0= -13367.23
##$PHC1= 24.00099
##$PH_mod= 1
##$PKNL= yes
##$PPARMOD= 0
##$PSCAL= 0
##$PSIGN= 0
##$REVERSE= no
##$SF= 200.130013532006
##$SI= 16384
##$SIGF1= 3
##$SIGF2= 2
##$SINO= 400
##$SIOLD= 16384
##$SREGLST= <1H.CDCl3>
##$SSB= 0
##$STSI= 0
##$STSR= 0
##$SW_p= 3612.71676300578
##$SYMM= 0
##$S_DEV= 0
##$TDeff= 0
##$TDoff= 0
##$TI= <>
##$TILT= no
##$TM1= 0
##$TM2= 0
##$TOPLEV= 0
##$USERP1= <user>
##$USERP2= <user>
##$USERP3= <user>
##$USERP4= <user>
##$USERP5= <user>
##$WDW= 1
##$XDIM= 8192
##$YMAX_p= 0
##$YMIN_p= 0
$$ End of Bruker specific parameters
$$ ---------------------------------
##NTUPLES= NMR FID
##VAR_NAME=  TIME,          FID/REAL,        FID/IMAG
##SYMBOL=    X,             R,               I
##VAR_TYPE=  INDEPENDENT,   DEPENDENT,       DEPENDENT
##VAR_FORM=  AFFN,          ASDF,            ASDF
##VAR_DIM=   8192,          8192,            8192
##UNITS=     SECONDS,       ARBITRARY UNITS, ARBITRARY UNITS
##FACTOR=    0.0002496,     1,               1
##FIRST=     0,             0,               0
##LAST=      2.0444736,     0,               0
##MIN=       0,             -2301467,        0
##MAX=       2.0444736,     1271998,         0
$$ Real data points
##PAGE= N=1
##DATA TABLE= (X++(R..R)), XYDATA
$$ [...]
3204a443K570j674P44k086J858j320p4K063r99P8J365j60m11J491n283N106k695
3221h70J314r38M42q94P73n3J415L3l792Q90q31L423k555k01J535J98J959j909
3239f1k465J294J570m7J58l773K357O35R04L82j482j519K847j25j061n59J429
3256D84Q96j136r02J54n9K62J247j04j631P59l70P99Q50j879J377p39j571Q41
3274g22J437J78j323K25K29L39j56N25j91O79j337M86p43n21Q05J403Q61j378
3292G96o60P56q82o02R40J053l96j97J38P85n84n42o16K39k04r95l09O95J823
3311A238k417J902J058p20n93j143O4j57J646m74j370J765p3j060j88K053L91
3328A922k275J280j237O64L61N71j935p16J293K060k765j62J45R0J501j196L81
$$ y = [-1443, 1127, -547, 197, -1889, -31, -1351, -1425, 638, -361, -283, 1082, 922, 511, 2002, -3281, 1825, -870, 444, -494, -52, -946, -173, -226, 1189, 1222, -2570, -1680, -2511, 912, -1643, -1844, -309, -111, 1848, -61, -2526, -1232, 338, 291, 449, -3324, -967, -332, 572, 954, -528, -2047, 800, 675, -386, -945, 484, 1380, 244, -658, -504, -563, -301, 946, 842, -789, -30, -400, 399, 1249, -630, 747, 8, -1563, -722, 715, 893, -430, -205, 24, 363, 207, 732, 541, 1220, -117, 369, -374, -895, -90, 1313, 2174, 796, 136, 892, 10, -592, 348, 1401, 1005, 808, 946, 1731, 1147, 605, -11, 228, 24, -971, -1280, -585, 1238, -1179, 723, 1781, 1061, 468, -675, -611, -768, 878, 404, -966, 799, 726, -334, -522, 1531, 1922, -353, 927, -310, 354, 715, 1286, -649, -1365, -72, 1988, -777, -939, -794, -704, 797, -399, -18]
3345a8q47J038J216k377J570j436N38L10p24L76o82K393k78j616O97j573P35J763
3363A085o53j880O24J166j178K784j668n59L39j389P51m05L82P25P02J177k755
3380g52O31j251K85Q6R00J47p77K595j945k43m77m98K524j032j026K78R51j411
3398a015K564l122J659p43j198K539M92l054J983j12J81j443J668j62r16L067
3414B388k764M36n63j8J786k46o92j275RP87J130k3r38J073l463L258k151J008
3432b58Q69R71k387M70J782j995L68o56Jq32K660O20K65k034n13J126J847j987
3450C17j46K01J728k643K063j15k309j984J531K261j957Q93k26N63J948k765q3
3467g23J191p20n72M93M46j2q45O58r3m79k540K890r67R70r20l72K819K12m49
$$ y = [-18, -865, 173, 1389, -988, 582, -854, -316, -6, -730, -354, -1036, 1357, 1079, -537, 160, -1413, -678, 1085, 432, -1448, -824, 342, -836, 1948, 280, -279, 60, -1329, -578, -983, -601, 124, 826, 2003, -752, -121, -1372, -1087, -1001, -101, 46, -731, 1864, -81, -324, -801, -1299, 1225, 193, -833, -555, 396, -1015, 1549, -1573, 86, -657, -1855, 684, 1176, -1878, 105, -7, 174, -1269, 399, 237, -679, 2388, -376, 60, -503, -521, 1265, 1019, 327, -948, -939, -152, 978, 955, 17, 1090, -2373, 885, -1266, -258, 611, 1582, -805, -335, 1447, -548, -180, -836, -835, -1667, 993, 1613, 1878, -156, -669, 457, 2304, 317, 171, 372, 2100, -543, 1520, 1405, -904, -2888, -1357, 904, -1053, -160, -386, 177, 2125, -640, -723, 468, -252, -824, -331, 115, 103, -742, -84, -177, -656, -3196, -306, -1273, -303, -1223, -1595, 1224, 1436, 987]
3486I87j288N82j696K139R67j845P80N19j00l070K728N42k283J122R65j228J187
3503A008l069P89N30J85P58j062j36J599R76j641o82p28O39L840l351J970k54
3520A371k839K906k312m23L060l221J002M38k60j219J598P72p33K09p50P79L00
3537F78m05O64k523K659M95j820l2Q27k721K100m18k37p17J288L88k197J935Q88
3555H52j323K655l141J880R1j793j431J864q87j01L66M740m774Q94R79j956L55
3572g30j888K800o11K10j321J603l03J373n90l175K425N85j085J52J190J070p71
3589I34o06k587J464J877k69k254K740K62P9k020m56K708j359j90N62pq41N53
3607E90p17k87o81J086K411j699J109l173j057M436l083Q44j095J237K05O25L69
$$ y = [987, -301, 281, -1415, 724, 1691, -154, 626, 1145, 1045, -2025, 703, 1245, -1038, 84, 1049, -179, 1008, -2061, -1272, -742, -557, 201, -861, -997, 602, 1578, -63, -745, -1473, -834, 3006, -345, 1625, 1371, -1468, 1438, -874, -1297, 1763, -1458, -456, -18, -278, -1497, 101, 873, 140, 349, -401, 378, 678, 273, 937, -1586, 1073, 1568, -252, -284, 543, -2178, -78, -496, -733, -1450, -162, 226, -1971, -36, 852, -471, 2184, -957, 923, 1014, -779, -2210, -346, -1233, -1334, -968, 3772, -1002, -108, 871, -1085, -730, -2618, 182, -429, -219, -1540, 63, -240, 1133, 543, -2632, -207, 378, -707, -555, 635, 1705, 934, 328, -2259, -795, 1082, 813, -1441, 1299, 1561, 1640, -380, -836, 1872, 513, 323, 885, 878, 37, 590, -127, -414, -1095, -9, 2402, 703, 1812, -1361, -2418, 2018, -1065, -221, -1316, -79, 126, 751, 1120]
3624A120k938J108R28K103j753j542J423J262k786O24K110m409N464l145N87j504
3640a348Q04J607j076k37J224P87k412J287L74j662J626J977l996K192J434j131
3656A450k923R60R32j317J675k758L413j523j231J168o11Q19J195k787L53J334
3672A49j799N81O10L96p36J986j838r18Q44Q34K84p11N14K64l00j140K333j252
3690A01j234j75J64N97j105j03J562J51J911j27k166J611j529J612j093J798n277
3707c302K515K202J60j317R42L55q11l235J035J852J575l567J231j966L649J98
3723A516j34j630Q91j295J586j70K04j659o96K243p8N01L25m41j323j219j293
3740b672M189l395k23L233J21j922q40P12k94J326N77k740L037r4k28R5Q57l325
$$ y = [1120, -1818, -710, 218, 2321, 568, -974, 449, 1711, -1075, -451, 1659, -2750, 2714, -431, 156, -1348, -544, 1063, -13, -250, 974, 1761, -651, 636, 1010, -652, 974, 2951, -1045, 1147, 2581, 1450, -1473, -513, 419, -898, 777, -1981, 1432, -91, -1322, -154, -765, 54, 1249, -1538, -1185, 149, -1650, -1069, -459, -63, -799, 1187, -651, -1569, -725, 109, 393, -318, 196, 460, 160, -980, 1353, 101, -1133, -1308, -1144, -547, -1652, -1755, -193, -42, 1869, 1742, -424, 1187, -342, 1270, 177, 1975, -3302, -787, 1415, 1575, 258, 1200, 1555, 744, -2491, -1456, 396, 1971, -1596, -365, -2331, 1318, 1516, 1382, -248, 643, -652, 934, 764, 968, -691, -1387, 856, 778, 1279, 1604, 1163, -160, -1379, -2672, 1517, -1878, -2101, 1132, 1253, -669, -1509, -797, -1091, 235, 812, -1928, 1109, 1015, 787, 882, 1739, -1586]
3758a586K217R86k732L669m946K748K286l93j974J996J815m086o58P76q55K677
3774A940j613L7j546L14K242j507L509l341J540j527O69l97O21j036J257j91j588
3791f17J860k309K278j788j111n3M005l508L255k959J126J896j287Q12k48r71
3807C81J021k414R12K217k199K376l885K378O92j81l43j687J195l490M810m207
3823b424K216J555j835M87J116j561m19O33Q91j786Q58J610r99Q93r45j761J207
3840b64L54L89q97J3k21J313j837J678n08J091o71M8K22m73N69l148L047R19j255
3859C69J899J98l347J429J351j083o45R22m96j047N48r6k163R22R02K68k092J997
3877a64L34j526K066O20j709L93J966j762k02J872k033O17j295P97j325m42K259
$$ y = [-1586, 631, 1617, -1115, 2554, -2392, 356, 2642, 2249, 275, 2271, 4086, 0, -658, 118, -737, 1940, 327, 364, -1182, -868, 1374, -133, 3376, 35, 1575, 48, 717, 320, 941, -95, 1162, 971, -617, 1243, -1066, 1212, -576, -1687, -1740, 2265, -1243, 2012, -947, 179, 2075, 788, 1600, 1352, 381, 1402, -1012, -100, 2117, -82, 2294, -1591, 787, 1479, 1298, 955, -732, 463, -3027, 1783, -2424, -208, 1347, -488, -1, 1115, -446, -865, -232, 659, -1127, -269, 1341, 342, 1235, 290, -1471, -264, 90, 479, -418, -405, -626, 687, -1150, 528, 20, 1111, 440, 488, 710, 237, 806, -2342, 705, 1624, 369, 2268, 2466, -881, 548, 1899, 816, 171, 1093, 597, -450, 98, 2, -2161, -1239, -337, -69, -2161, -164, 170, -1356, 710, 1330, -379, 14, 1980, 218, 16, 1888, -145, 472, -823, -26, -1351, -1793, 466]
3894D66o8j711k17Q50J661q65l36j351l7J868r00l38o5J215N76L94k037K389j869
3913c75P13j006Q09K16k029J734K29q94k52M98P59K06l25M9P37j314L71J742k097
3932b29o65R77J003r18k208Q80J008q0J433j913P60j746R76J858r40n8L61j177
3950f78o06L386j683o41K235k511q29J367J504l56j565J999j206j232L098j405
3966H77k834K934k478J362k77j438M90J651q1j140K042j153j81m32k40Q38p74
3983h34M84J005j668J435K45j935K685j459k30mM9J52k111K383L30j588K926j549
4001C16k803L288j795J231K45k716J096J434q32J410o95L78p49O73j294m75K616
4018A328j734K407j726o38k53J567k510J386j207L18K099n06J72k824K381j685
$$ y = [466, 398, -1313, -1530, -680, 981, 116, -220, -1571, -1608, 260, -640, -978, -1043, 172, 748, 1142, -895, 1494, -375, 338, -668, 141, 357, -1672, 62, 291, -603, -855, -357, 402, 608, 283, 332, 1069, -245, 126, 1868, -229, -894, 83, 1086, 168, -2040, -1160, -152, -232, 1201, -712, 48, -1698, -722, 1136, 196, 138, 499, -678, -1284, 2102, 419, -222, 2013, -498, -1327, 40, 1544, 1188, -377, 1622, 416, -816, 2282, 877, -1957, 977, -1501, -139, -416, -1854, -1364, 287, 206, -934, 1108, -45, -226, -658, -898, -60, -834, -350, 655, -1013, 422, 667, -1268, 1417, -42, -272, -276, -227, -75, -2186, 197, 527, -1061, 1865, 316, -2487, 801, -994, 237, 482, -2234, -1138, 296, -536, 874, 179, 557, -192, 481, -813, -1288, 1328, -406, 2001, 275, -363, -616, 951, -1559, -173, -1380, -1062, 1037, 531, 703, -2121, 260, -1425]
4034a425K158j643L04P11k051Q03O4J031J031M17m17j708J303n63m2R94k108J513
4052C72J17J264k428J83Q84p56j028M61L663l101J246n5j760O50j759J931P98
4069F82k455n14K344r06M01K56J432j804r83M08K236n62k331J377J138p43J399
4086A375j045j129O26j36k95O54j253J271J006j468J4K24j635P12L94l0Q01L27
4104D13r22J529j498K10k193K362j576L316j695R75p80j520J727j312M46R80j393
4121i31L07J219k02q66n39K028m54N7j70o85j6P10j138J633k111R94J102J72j707
4140e97j41J751j394L31K53j912L885j262r26j259Q40o5J308j306j412K838N4
4157I86j971J87K005k816J051Q60J186l265K087j364K73J476n21J610l383J504
$$ y = [-1425, 733, -910, -606, 105, -1946, -1143, -1079, -48, 983, 1400, 983, -725, 578, 15, -27, 967, -1141, 372, 489, 1753, -675, -492, 392, -364, -1392, -931, 2732, -369, 877, 822, -938, -288, -2047, -116, 682, -1773, -2287, 57, -849, -448, -192, 1240, -564, -1547, -1139, 1097, 535, -1796, -419, 719, -24, 1375, 330, -799, -173, -309, -604, 50, -1203, 68, 1074, -394, -380, -156, -1791, -1079, -685, -715, 86, 413, -509, 1020, -478, -268, -2461, -99, -1675, 1641, -54, 921, 141, -1379, 348, -964, -518, 462, -931, -624, 595, 393, -473, -1012, 1016, 562, 619, 449, -236, -252, 458, -680, 953, -1158, -164, 938, 1110, -597, -738, 1013, -381, -50, 203, -1709, 2176, 914, -12, -1271, -431, -496, 812, -494, -1906, 932, 986, -985, -798, 1207, -1609, -558, 302, 1488, -1777, 310, -1054, -781, 695, 174, 1784, -1599, -95]
4173i5M66J158j031j259R88j055J7n07K340k455J864n23N29n40P30j99j474N82
4191d64K092j286K03j452k317M522j768j165K875R81j539j412J130l16n80m4R34
4208C94J530l231K51K134r81K58J873j072j057k366K227J063k283K529q98j179
4224h08J707L13q70L4M44j883K133j968n89K613k472J823Q74p71O1r95L99j394
4242a349J471l09k77J606q24l59J821k606p00J802j439P11j70P59k052K154j31
4259A08N00j302N71K48K21k263K217O81k661J555O22j083o26M42J22J33j311K869
4277A043q18j83n09o38J229N75J05j222P59j719K782k826l65J534K44J72o18m39
4295h94R15q08J626J86j117r40K66Q60j159n1p64J626j99J105q77L41m77j60K721
$$ y = [-95, 371, 1529, 498, -761, 227, -828, -811, -1318, 1022, -1433, 431, -92, 437, -103, 627, 428, -1046, -464, 1628, 342, 545, -907, -3224, 1298, -470, -1635, 1240, 2221, 682, -730, 400, 84, -496, -540, 394, 1924, -1307, -1056, 1078, 97, 355, 2228, 1156, 99, -2267, -40, 1023, -1260, 1269, 371, -808, 899, 1212, 342, 376, 820, -1063, 1070, -898, -1487, 1126, -1346, 477, 1351, 580, 641, -354, 45, -1349, 122, -187, -464, 1142, 318, -41, 1780, -826, -1526, 276, -1163, -452, -622, 137, -1915, 239, 108, 608, -694, -123, 125, 346, -1917, 300, 981, -1680, -125, 497, -586, -1212, -770, -648, -515, -1826, 1043, 225, 42, -467, -1105, 124, 699, 804, -418, 341, -1378, 1404, -1422, -1787, -253, -9, 163, -455, -894, 21, -787, 839, 1025, -92, -1032, -766, 94, -1065, -1116, -1880, -254, -453, 652, -225, 116, -361, -521, 2200]
4314B200j081l53r8k953K760j899J810k58J003k153J94K619k705j30J118K274
4330B348l400m36J788n00P57r42P35q78J140N1j719J635n71P67r77o42N75J203
4348I34p44j54j17J636k041J148k89j429J925k265M463k431l55k344J833o86J532
4365F16k6J5J117j229K64J7p51J412p28j091J257j451m02K154k052M35J87P46
4383D90q45Q0j73Q81J607j365j773Q60J870k886J228J301j656j452K182j465Q40
4400b76k11K28J287k535N33J117J35l50K7O45L95j402M37n92k94Q14L13o36P62
4419C97n80J151k442m70R28J03j265K535J187j154o88J118j398k13p84J364Q18
4436F07J15j852J881o79j193O65l98P51L14K286m076Q71L307n47p3m426K714R54
$$ y = [2200, 1119, 766, 668, -2285, 475, -1424, 386, 128, 1131, -1022, -828, 1791, -914, -1044, 74, 2348, -1052, -1488, 300, -200, 557, -385, 350, -528, 612, 663, -1056, 579, 8, 775, -202, -844, -269, 934, 190, 36, -81, 1555, -486, 662, 373, -1056, 869, -1396, 3067, 636, 281, -2063, -230, -916, 616, 590, 605, 1722, 493, 757, 774, 23, 1435, 707, -384, 873, -578, -980, 1174, -878, -443, -256, 490, -355, -275, -448, 433, 2040, 675, -1098, -238, 1632, -1254, -26, 1275, -381, -1833, 349, -1116, -276, -487, -259, 1028, -1507, -974, 143, 278, -72, -45, 600, 995, -407, 30, -562, -856, -42, 271, -365, 397, -183, 968, -1474, -1944, -1016, -913, -2178, 357, 1544, 390, -298, 820, -578, -791, -1575, -211, 607, 722, -1130, 751, 72, -1121, -456, -854, -103, 211, 2497, -1579, -708, 2599, 2052, 1979, -2447, 267, 1221]
4454A221j6l18P23m122K994N41n01O38K13k341o72K777n09j509M87j115J853p02
4472c58m28P39J164j155q91J415q13n68O31r6J171o34k442K801o04J099k825O61
4490a133j93O4J383J854k749K133j591J403j072o13J31L87J82k0Q32k520R22k03
4508h03K865j437j15m42J573k919J791J889k840Q13p98q82J845j017r77L35j29
4525a248M16K126j517k23J769j735L41L57K5k17J397r01j68j62j105p97j58K291
4543D91j341K3J209J279j472L24O09m33q94l18j423J752m51J19J275Q07j185r0
4561B81r5p01Q01J127J061j906l63k37j082J228J375j48o34O73j807K052j743
4578a18J58P00M76j484%J477j377J274m66M33j301Q15j323p08K213J32j32K14
$$ y = [1221, 1205, 887, 1610, -2512, 482, 1023, 522, 1160, 1373, -968, -1640, 1137, 628, -881, -394, -1509, 344, -358, -786, -47, 1117, -38, -929, 486, -327, -895, -264, -360, 811, 177, -2265, 536, -68, 1031, -1794, -1133, -1326, -1262, 121, 1975, -774, 1359, -232, 1171, 99, -514, -383, 4, 186, 166, 998, -1522, -600, -803, 2062, 625, 510, 68, 1641, -1278, 513, 2402, -438, 375, -423, -1305, 540, -477, -1454, -1119, -1248, -832, 1294, -223, -446, 1323, -412, -71, 286, 311, 94, 1491, 590, 422, 260, -845, -1642, -1800, 491, -850, -827, 382, 1661, 189, 513, 1122, 689, -205, -523, -1946, -194, -645, -526, 749, 1556, 371, 281, 186, -515, 286, 1413, 2474, 568, 205, -32, -1114, 114, 1489, 1341, 707, 1380, -427, 1625, -118, 40, 740, 1216, -268, -268, 1209, -168, 1106, 640, 1073, -228, 587, -736, -1444, 769, 901, 769, 983]
4596I83r90M12O04j389Q84j955N94K5J556j202M97P32j911O02m89J933o0p13K03
4615C16R24r59N09o58M58p50j757K691l57k028K343j541R47m05j581Q80J308Q87
4633A227j429J758j088k87R3k030K069J305k125J065m82p52J599k1J05M30j804
4650c67J456q50P67j795R15j219J042o68M32l3K67j02j395J573j402K045j558
4667h92L1J127J078r14J458l306R56j477J507L26N09m20r63R50J386k518J71l0
4685a021J550K89j890K425r07O23l055Q99L96J356Q52n37o24Q53k194J435j057
4702f07l05o61J425k553J593L179r73l070J500p88K017j102m10J87m36k53M58
4719g99J504j373j81J928j642q28J633j339N21P38j422r93M472k523J639k571
$$ y = [983, -7, 405, 1009, -380, 504, -1451, -857, -832, 724, -478, 19, 751, -1160, -558, -1047, 886, 826, 113, 316, 1240, 281, 790, 132, 590, -160, -1917, 774, 417, -1611, 732, -809, 138, -267, -1848, -968, 340, 1227, -202, 1556, 468, 181, 274, -1756, 313, 1618, -507, 558, 76, -676, 923, 902, 1007, 1437, -367, 1089, 239, 1006, -789, 126, -1093, -51, -719, -287, -320, -53, -155, -1550, 23, -1379, 666, -892, -861, 266, 1344, 430, 1888, -1418, -462, -1939, -432, -106, 403, -17, -980, -30, 1356, -1162, -991, -1021, 529, 818, -1072, 1353, 446, 1069, -1986, -1087, -691, 665, 1517, 980, 356, 1209, -985, 450, -607, -912, -1573, -148, -2701, -1108, 2071, 1098, -1972, -472, -1260, 757, -345, -755, -568, -1004, -1257, -799, 705, -668, -849, 1079, -563, -1391, 242, -1097, -576, 162, -1260, -2253, 2219, -304, 1335, -1236]
4735a236J339J421k105J584j806M83K627j158n68q23j86P50j387R5J749Q18L00
4752A897j942r5M90j199r51J020J188j621R45M20M94l120K95J162L139l485K836
4769A473n51P30k316J478j726j03M66m14O54J950j169k297K01K185o6m223L693
4786c5K49o68n76K921l991L271L34n55k159J628K139m32r81j887j801J120L50
4803a073J19K03J502j137k86r35K519J545r84j643J451m78R2L77k222Q48R09j971
4821a164J515l18L65J142l291J32J803j79j043K066j308P40j203n32K159o46Q08
4838A046j001K166k371N62N1m75n57k983K306J589L174n619M645k916q08K529
4854A338j728J464K37p98k455n04M40K916P6J201l330Q20P27j503J603j011Q45
$$ y = [-1236, 103, 1524, -581, 1003, -803, -320, 2307, 1149, 581, -242, -428, 322, -1065, -970, 779, 1597, 1897, -45, -140, 350, -849, -1800, -780, 408, -1213, -268, 152, 646, -2474, -2179, -1017, 2122, -1363, 1473, 922, 1652, -664, 814, -912, -1015, -549, -963, -309, 1641, 472, -1825, -1624, 561, 495, -3728, -35, 214, -454, -1030, 1891, -2100, 1171, 1505, 950, -1209, 419, 2558, 2126, 1145, -742, -2543, -1423, -1073, -954, -751, 751, -386, -672, -1607, 912, 2457, 1473, -170, 1281, 803, 895, 1272, -950, -102, 807, -1164, 351, 33, 398, 1540, -1751, -1619, 184, 5, -1038, 1028, -280, 460, -743, -1275, 884, 238, 1046, 45, 2211, -160, 402, 453, -22, -579, -3562, -1256, 333, 3507, -2112, 2533, -383, -1191, 1338, -390, 1074, 1311, 513, -1942, -2446, -2006, 910, 986, 2187, -1143, -323, 404, -1099, 504, -507, 338]
4871C38j256j343K184K014k80q97j217j6p04O27j414M168M15j340l418J876j990
4888b253K937J072j218j52j141J098o92O48j946J038j097J274J64l95J704j19
4904I22k409N13L141m196K048j730Q03K249J116k151k87j650J003L4L79m11L857
4921C231l988K278j965j232J672j138Q61k191j87K182J997k470J824J044p03l016
4937a801M63j415M195j440j991L658j578p99K055j458j115K909k600l34J715j208
4953g44J377j282Q69J234k884j74Q11K816Q81k818j618J318m18K87J939j690R72
4970H76q66k518K140O13N8P0k491K788k123O02J978n27k67n89J56Kj956K811P79
4989A536j696q68K463N07r24k190J782k283J477O97L79J102l141P83J546k22k31
$$ y = [338, -918, -2261, -77, 1937, 1657, 760, -457, -473, -1177, -550, -1964, 2204, 2619, 1279, -2139, -263, -2253, 684, 1756, 538, 386, -755, 343, -349, 299, -1647, -609, -1706, -432, -268, -663, 1041, 922, -1487, -974, 2167, -2029, 19, -1711, -908, 1341, 2457, 306, 19, -1631, -628, -594, -215, -626, 3231, -757, 1521, -444, -1676, -4, -1142, -281, -2472, -2659, -477, 1520, -950, 874, 1918, 1215, -1801, -1338, -2753, 1442, 2, -1989, 1669, 91, -708, 1347, -111, -1226, 1683, -917, -1251, 464, -744, 633, -649, 220, 1454, -1430, -1604, -793, 2023, 2904, 86, -1532, -214, -632, -345, 1594, -96, 876, 10, -2508, -368, 245, 303, 373, -2118, 670, -1453, -851, 1127, 600, 333, -256, -100, -98, -2054, 757, 1536, -160, -1028, 1435, 1942, 1018, -1172, 610, -1673, -196, 501, 880, 1982, -1159, -376, 1170, 948, 717]
5006G17k88p10R92k584K312k388J53K990k474K754k190R7j662K509P91K41q8j339
5024a67O97L85o81K73Q71p26N35k078N52K780k515Q61J241k451J365j770J24J373
5042F69k412K306r46o04J110J44k32j22R14p07p77M52p93J585J876l148J074o21
5060b32J294j884O78P75O24k694J26K598k482J270J279j200l95R40L98M19l047
5077a533M128o15k507p80J387k089R33k05J474N72j498L4O27N84l655L385j66
5094G6N86m26m76K548j825L90j124K99j503O30J210k046M044k043k171J90J645
5111Dp35M30J821k176P89Nk100L005j351k23J189L3R98n32p58J183n116K460J141
5130F7p86Q39M21j198j153J205Kj509J173o19P79K41K641k940m62r17L060J161
$$ y = [717, 429, -281, 711, -1873, 439, -1949, -1796, 1194, -1280, 1474, -716, -619, -2281, 228, 1019, 1260, 1172, -167, 530, 915, 234, 507, 1378, 652, 1187, -891, -339, 2441, -74, 787, 2028, -423, 942, -828, -704, 669, -1743, 563, -383, -987, 123, 267, 35, -87, 827, 120, -657, -205, -998, 587, 2463, -685, 389, -232, 1062, -822, -144, 631, 1255, -1439, -1313, 1285, -1197, 73, 1352, 152, -243, 697, 1095, 1514, -1533, 2595, 1980, -527, -1307, 80, -2009, -1076, -1281, 193, 765, -733, -699, -72, 512, -3143, 242, 76, 662, 236, -240, 2308, 483, 873, -251, 48, -1455, -825, 385, -1661, 2383, 340, -1831, -1641, 4, -731, -301, 1520, -656, 133, 138, -1962, 1043, -308, -531, 658, 691, 1689, 1157, 399, 1582, -3534, -1074, 67, -719, 120, 541, -657, -1810, -605, -603, -2112, -939, -1558, -779, -538, 2103, -837, -1299, -2216, 844, 2005]
5148B005j855j037K05k577J77K776J118l404K385n89K208j594N97k696K647J670
5164B036k582J610j660k024J401P55L242n454J721L30K961l493n8k85k483M653
5180F70k55j26j703K136Q03l418J230J096k238L037l142r7J081j018J489k007
5196b462J192K950m141K244j987N11J112J061K049m478L927k219K11p41q18K259
5212F70L5k01p53J194l58q31j347j024K367J365K05j094J322k130K56R0j718K970
5230A018m608K327J105j335P79k90p34J552nq78K78j86J959j005L70Pr60J632
5248A026j438K063j286j081K018l867K412J107n30P92k380L7J344J65J498l359
5264a479m33K044O60q92j371J48L418l070p83O60l34L473l664K515r58J243m10
$$ y = [2005, 150, -887, -682, -3259, -3082, -306, 812, -2592, -207, -796, 1412, -182, 415, -2281, 366, 2036, -546, 1064, -596, -2620, -1219, -464, 2778, -2676, -955, -625, 2336, -1157, -1215, -1500, -3983, 670, 415, 289, -1414, 722, 1525, -1893, -663, 433, -1805, 1232, -1910, -2007, -926, -1944, -455, -2462, -1270, 1680, -2461, -217, -2204, -1693, -581, 480, 2529, -1949, 1978, -241, -30, -771, -1589, 670, 705, 504, -249, 945, 587, -244, -1591, -2615, -248, 1117, 1322, 228, 1550, -580, -324, -234, -1952, 1018, -3590, -1263, -158, -1493, -714, -1004, -1738, -186, -191, -1069, -791, -977, 982, -23, 347, 354, -606, 1026, -412, 1651, 365, -716, 1302, -2565, -153, 954, 424, 1216, -1164, -1127, 217, 382, 1880, -1479, -1912, 132, 792, -100, -1471, -1323, 2095, -975, -1758, -1098, -1432, 2041, -1623, 892, -66, 1177, 767]
5281G67J96L66l187M96J319o71l33J291l342K285J989l268N98M822k514k436j139
5298b761L51L232k525N71L251j773J449k260k15N43K257k132J776k357r57J513
5314c7j748K317r99J309k17m93r20l87J628k433L232j589j361K928j908J421N20
5331A263j522J399l069M819m614J321J072j619K556L5j300j342J611k210K898
5346A298j067L468l045k563L185n48k246J991k43K40j329J015j239J172k925K260
5362e76j565K977j211O92l95J503j404j32m05J899l730J013J958j752J311j122
5378i39K982m219J918m792L748K446k356J045Q53k325K368kn2l532J076J967N98
5395G84J348m623M793k569K655N02m053K333l055J74K345J368j421J655k713J007
$$ y = [767, 963, 1329, -1858, -1362, -43, -714, -1047, 244, -3098, -813, 1176, -2092, -1494, 3328, 814, -1622, -2761, -2410, 822, -1703, -1132, 2119, 346, 1795, -465, -680, -137, 2120, -12, 1764, -593, -1550, -37, -1785, 532, -467, 842, 625, 132, -788, -1175, 453, -1980, 1252, -337, -1698, 1230, -678, 743, 1263, -259, 1140, -1929, 2890, -1724, -403, 669, -950, 1606, 1641, 341, -1001, 610, -1600, 1298, 231, 3699, 654, -1909, 1276, 728, -1518, 473, 230, 470, -859, 156, -1083, 89, -2836, -576, -2141, 836, -375, 317, -78, 1425, 21, -111, -516, 1383, -2347, -1334, 624, -1128, 183, -939, 2043, -2176, -258, -5050, -1302, 1144, -1212, -167, 686, -1639, 729, 727, 675, -2857, -1781, 186, 784, 2132, -2491, 2302, -267, 2388, 2890, -1163, 1170, -1885, -1711, 634, 2002, 581, 2236, -477, 530]
5411E30k907M05J850q01K978j804J358k514l54K360kj763j263K775J375m173P54
5428a196R36K092j761M72j443K699m846L991m93K13K45N30k663L100j653M05j170
5445e42Q02o28J098j009r66q9j232K002k65q8l5J619k87r18L78M48j360K053j36
5464H45m31j39j940L849l807j267K193R59m4j466J519r38O60L65L32m27J127j13
5482A277j623K148k219J318J83k708K794n00J05m56J952l412J728j137r90K64
5498a276J817j67j656K099m52l12R65j953j58J798j293j255j66K136n85l69K802
5515A975j303j759K94o40R69L44k113R98J183j397N20J203k515K217k210O5J09
5532b060L786k226J591j596j502L404k486J946k121J534j710J180k640K669J325
$$ y = [530, -2377, -1972, -122, -923, 2055, 251, 1609, -905, -1259, 1101, 1099, -664, -1927, 848, 2223, -1950, -1196, -260, 1832, 71, 543, -900, 1799, -3047, 944, 451, 664, 909, 1439, -1224, 1876, 223, 628, -542, 260, -368, 730, -279, -1245, -1334, -2566, -564, -829, -917, -952, 667, 380, -538, -160, 288, -1072, 981, 845, 414, 275, -1665, 2184, -1623, -2890, -697, 262, 218, -1248, 271, -667, -7, 358, 690, 263, 1390, 1277, -346, 1802, -417, 901, 1084, -1624, 1170, 670, 775, 319, 2271, -1141, 587, -550, -1540, -1276, 541, 374, -1282, 817, 365, 53, 1018, -935, -1093, 705, -588, -1843, -2009, 127, -458, -827, 1975, 672, -1087, -793, -1433, -464, -120, -2233, -1235, -52, -1449, -929, 274, -2241, -24, -2234, -2169, -2060, 1726, -500, 1091, -505, -2007, 1397, -1089, 857, -1264, 270, -1440, -260, -2900, -231, 1094]
5547A094K262l223j55p49m00Q05J864p40j707J317j329O91k864K325L29j245K543
5564H18r37j49j3j104K405j66N78j011j04o16N98p59P07j128K495k89J44j820
5582c51j433K042j837J692j013R1j035K008L618m353j65K074K33j856k041L291
5598I65K59r73j124j09M57M43K70o12M95J288k954J850n37j033J922J205m350
5615b538L875k952J931P34q90m93J216m97j030J348K46k785L284l848L442p04
5631C39N82j00J44Q93k692J627K15p64J64l85L85K410k981p57O98K572j523j656
5649h29l70K322j500p22O32Q6K305j496j682K168n7j228J334P66l867L633o34
5666H61K134k428j613J81q5L183k422P32m6K43k88j644J062r27k14J415j54J0
$$ y = [1094, 3356, 133, -22, -771, -1171, -366, 1498, 758, -949, 368, -961, -270, -3134, -809, -480, -1725, 818, -119, -268, -281, -1385, 1020, 854, 1432, 421, 317, -299, 299, -460, 247, -881, 1614, 1325, 1469, -351, -1784, 258, -1579, 113, -900, -809, -1844, 164, 3782, -571, -736, 1338, 1571, -285, -2326, 965, 1224, 251, -873, -982, -525, -82, 188, -424, 71, 1359, -1595, 255, -282, -1315, 607, 1812, -2538, 1337, -1615, 316, 1050, 160, -333, 883, 386, -644, 704, 950, -1835, 1449, -2399, 1043, 339, 921, 821, 965, 1858, -834, 793, 1008, 244, 408, 23, 408, 2818, -163, -920, -222, 2350, 827, -829, -1199, 1123, -377, -1099, -467, -381, 1924, 428, -1254, 914, 857, -371, 963, 1729, -2138, 1495, 861, 2995, 567, -1046, -865, -950, 2233, -189, 543, 497, 740, 452, -1192, -130, -1057, -1271, 144, -10, 0]
5684@J703k701J800j665J467p44p13Q11J616l48j535l90Ql42J992l25j68l77K126
5703B215k118M50r37j220J356l09Q65n45K16J647k154l45J972j392M87o25R81
5720E44R57j573J277k099o14J476K335k141J567j859n09j341K590l68j046K328
5736A524m065L388j043l6m91K143j058K14j615K162j16k926K271P32K82k188J987
5753A165k48Rl78n91o37K193r50j331n5L02l32O15J90L70k219R61J189J687k920
5772i80J066k39n50J036j689L512l036k6K019r80K437l145M49k45K001j521J44
5789B53m52r77M13J618J69k326R70J826k130o65J357n51R87J086l087J491m03
5806d21n8J962k263O68J618J192k230M03k90J609n182J915L773l986J407o37r39
$$ y = [0, 1703, -998, 802, -863, 604, -140, -853, -42, 1574, 1226, -309, -699, -691, -1033, 959, 634, 466, 89, 2215, 97, 547, -390, -1610, -254, -563, 302, -243, -27, 1620, -534, -879, 1093, -299, 188, -437, 544, 1501, -72, 1205, -894, -1508, -32, 2303, 162, 1729, -130, -639, -1980, 610, 242, -804, 1524, -2541, 847, -196, -232, -723, 1420, 362, 576, -1039, 1123, 1007, -1919, 352, 1084, 1366, -822, 1165, 917, 926, 548, -43, -680, 1513, 563, -768, -823, -521, -853, -238, -48, 322, -1897, -936, 253, 1940, -980, 86, -153, -703, 333, -1356, 2156, -880, -906, 1113, 133, 2570, -575, -126, -371, 1630, 109, 253, -199, -1176, -763, 855, 1024, -1302, -332, 1494, -636, -1301, 56, -495, 492, 1578, -1509, -18, -421, -479, 1483, -780, -112, 1506, 2698, 468, 871, 581, 2190, -2992, -1077, 2696, -1290, 117, -520, -1459]
5823a459p98K069N43p66K414k018N28j710M60R1J176o44K48k482K065J82k307
5840b408L891n61j088l85L00j494J842j758L076l27P2j462p88J157o46j312L474
5857A583k154J392J86j363J540p37j091n7n82O4J376J846j206j088n20L457k828
5874a82J460K32k448Q44j124J37J609N69K07r73l44Q97n74N41q69j870K566j138
5892d60P1J936j203j031J961j735J484j471k7J615k200m45L808l225Q85k94j317
5909a648K673L0O23k077K038l268J776Q87j584p6M62j207J930j411Q05n05k77
5926h29J408M89j445J729j465k576J936J26O11N72J066j979K415m232L552j805
5942d27M60J988j206l48J2l57k5r14J166j45K578l652J560k177K479j61m90j849
$$ y = [-1459, -2257, -188, 355, -411, 2003, -15, 513, -1197, -737, -646, 530, -114, 134, -2348, -283, -101, -2408, 1483, 922, -166, -551, -251, -1745, 97, -1661, 1415, 1088, 1160, -302, -1090, 67, -579, -1891, 1583, -571, 821, 1007, -356, 1184, 447, -644, -701, -1283, -1219, 157, 2003, 797, -291, -811, 2646, -182, 1278, 1510, -938, -94, -1218, -1081, 528, 1097, 1304, 331, -13, 884, 310, 851, -18, -1888, 678, -460, -389, 1547, 344, -687, 1274, -461, 1023, -448, -475, 1140, -1060, -1505, 2303, -922, -37, -331, -1648, 1025, 1055, 1678, -399, 1639, -1629, 147, 1034, -550, -626, -164, -1371, 559, -852, -47, -552, -829, 579, 1068, -377, 1352, -113, -2689, -753, -627, -16, 556, 1622, -357, 2058, -2174, 1378, -427, 33, 2021, 815, 467, 479, 122, 97, -817, 349, 204, 2782, -870, 690, -1487, 992, 831, 341, -1508]
5960a508J065P59j763K22L88K200k237L74mJ300p22K52R03j269n35K732k974J145
5978C28r80M77N12j137P34j69M87k46J12O4q41J325J098j596M73k127J937K59
5996G10j089J979j207j174R04R14j507K78p95K141j833J581q7j702O49k68J069
6013E63k385K250p30M4P12M34j017J860k079J369L27j675l79K251q02J208l244
6030a293K302k106J384Q94l68l04n77p82K970m72j856j702l12L283q82o03O81
6047B57O75k07j290l11J255k461K068J336j978N86N71m04J095j314L05k88M28
6064C23K17q88L96p12P23j128K59J556k610Q62J726j991k45J709p70O89L80l18
6082A78L14j990J417J32m20P94k41L17k144J915o52p92J174l37m86J112J048j16
$$ y = [-1508, -443, 316, -1447, -1225, -837, 1363, -874, -500, -504, 796, 74, 326, 1229, -40, -575, 2157, -817, 328, -652, -175, 337, -800, -66, -235, 252, 6, 118, 182, -659, 666, 1764, 168, 641, -1486, 451, 710, -379, 1600, 393, -781, 123, 1037, -470, -192, -987, 1154, -679, 902, 815, -887, -238, -506, 563, -1822, 428, -302, -258, 454, 888, -129, 1731, -348, 1021, 1348, -327, -706, 1545, 743, 1951, -1293, 1009, -1097, 287, 1181, 813, 509, -68, -850, 2120, 1648, -208, -1910, -2222, 1061, 179, -424, 257, 932, 725, -565, -876, 379, -2082, -14, 1322, -656, -70, 501, 97, 1192, -122, 183, -105, 323, 540, -348, 48, -664, 59, -1069, -810, 746, -1864, -1002, 724, -1267, -1512, 197, -573, 116, 496, 178, 492, -1498, -81, 51, -369, 425, 184, 501, -1643, 272, -380, -1172, 2, -335, -821, 291, 1339, 1223]
6100A223l875N78J965O2k26n28j828K673J5l01j12K40m67J272j78P41p67j440
6118i53J924o14L46n20P18L21j118M05L13j083q96J030Q47J312j680K74k684k17
6136b275L594k683J350K30J540q78j401J554j406O47m4n86N67L50o31J298j382
6153a56k306J883J530k387K688j349o78O78Q68L91j210l64Q71j313M93J617j541
6170b85P08j018N04r09J587l83m00J045j789P10m12J077K12j629Q33P45r05m92
6188h01M04L54n99R49L5r49P81j341J023k44L08j864K666J2K28j633J57J174m68
6207A92r59J086Q22p54J740k349J55M17M04l37j104m26R54J1j024K149n51J342
6225A768j194m77J24n80J315l078J543P19N93j42p38J615j224l00l30o40K40J289
$$ y = [1223, -2652, -2074, -109, -47, -273, -801, -2629, 44, 59, -242, -354, -114, -581, 691, 513, 1254, 487, -953, 971, 357, 703, 183, 901, 1222, 104, 509, 822, -261, -1157, -127, 720, 2032, 352, 626, -2058, -2275, 1319, -1364, -14, 216, 1756, 878, -523, 1031, -375, 272, 228, -358, 209, 559, -72, 1226, -156, -2462, -579, 951, -1436, 1252, -97, -775, -97, 771, 1162, -48, -412, 459, -854, -361, 1256, -285, 423, -595, -91, -1000, 587, 204, -196, 849, -940, -230, -642, 435, 647, -982, -149, 596, -309, -801, -397, -43, -642, 307, 342, -607, 174, -1167, -144, -388, -80, -1944, 722, 734, 962, -671, -514, 660, 192, -767, 319, 1141, 387, 2127, -222, -67, 350, 754, 417, -687, -1113, -159, -148, -1172, 977, 426, 1768, 574, 97, 221, -359, 956, -2122, -579, 140, 733, 591, -147, 1468, 244, -56, -386, -1026, -786, 503]
6243E03Q63J82n77l9j527J3j11M57jL33p18K176n13k029J620j215P60r45M28J087
6263G47j477J024q12K87R62q37m53L47L6L53q48j83k03R74O10j300Q63l14p22
6282i46J503p14K11q29M76o50J020J070n40n11j51j103J202k29r64O46J121o29
6300a7M10j59k31n94J599j461j61J18J45O32j023J582q82R9P67np68q39K61J35
6320c92J10J370m88q71K28m90J428j525L75R27j196M78j026J990j439M66j655
6337a710M79R85N99p22r77J738Q31j86j931K070J7q39k234K236n42M36K73j985
6355a462J500Q85l01j632J563r22J32n26J341j217R63j71j18J473L3j992j62J529
6373I16j121L97o21j79l77R50J08n29j164L476k326J850K89r94r18R2l24Q04K67
$$ y = [503, 1366, 1548, 971, 932, -595, -582, -693, -236, -237, 96, -622, 1554, 1041, -988, 632, -583, 177, -768, -340, 747, -730, 294, -518, -231, 731, -106, -559, -212, -176, 177, -671, -854, -1057, -83, 527, -773, 90, -224, -946, 557, -157, 54, -775, -299, -949, 71, 1141, 601, 90, -61, -1164, 38, -191, -1155, -509, 612, -17, 393, 234, 3, -591, 1008, -453, -614, -496, -351, 281, -742, 840, -42, 57, 824, 819, 51, -788, -527, -392, -282, 1088, 600, -271, -43, -533, 895, -630, -255, 672, -524, -46, -1072, 918, -521, -55, -1710, -1231, -246, 353, -369, -1346, 392, 1223, 1037, -894, 1176, 1193, 354, -1880, 356, -186, 250, 523, -1462, 38, 923, 622, -1010, 553, -369, -237, -763, 578, -639, 324, 153, 35, 1508, 1541, -451, -613, 916, -205, 192, -429, -608, -985, -35, 73, -456, -1620, 1856, -470, 1380, 1669, 675, -243, -151, -475, 329, 596]
6392E96k35J84J510l721M47L53K748k006m85j090R42Q04j77j63P6k69K24M1M70
6411B49P21r73K216l190J529p89N00p99J378j202K71q9J016p10Q03R5k550J245
6429b79J068k98k84m83l39l19J229l11k12M81j937L91J819J8p71R45j029r78P10
6448e79l02J315k22p91O85j57q57J811J19o32j136R85j336L27Q34J224o69m29
6466A90N66n70j354J532n13q17Q31Q40p95j523K289r79J054m50O46k250K72K271
6484A240q78J43j003N2J072k74j721M84P78L88o75J025m35K42n18O00q82m15P07
6503g0K83k06k32j336J161N65L64q34L30q77Q67Q13q22r81J346O1l34J477p32
6522H43j690J465L04q98P22j085K36j35j58J011q13M51J52l45r0m65Q93l03O1
$$ y = [596, 361, 545, 2055, -1666, -1219, -866, 1882, -124, -609, -1699, -757, 47, -130, -293, -217, -486, -262, -221, 249, 970, -3, 2213, -977, 552, -237, 263, -536, 842, -360, -89, -178, 838, 128, 931, 1026, -1524, -279, 789, 491, 207, -276, -615, -934, 295, -16, -228, 253, -1684, -1293, 526, 544, -227, 718, -311, -1289, -579, -881, 434, 212, -579, 106, -51, -908, 903, 1022, 390, -746, 239, -1097, -770, 64, 1288, 619, 190, 756, 186, -1168, 364, -149, -966, -135, 705, -90, -1613, 676, -303, 751, 301, 947, -1303, -1031, 1240, 362, 505, -498, -446, 626, 352, -1369, -885, -107, 281, -394, 631, 196, 438, -80, 520, -362, -777, -70, 213, 7, -225, -1561, -400, 165, 529, -305, 25, -852, 15, 828, 6, -975, 371, 432, 98, 1575, 843, -847, 618, 922, 24, 746, -339, -103, -238, -396, 615, -198, 253, 405, 60, -30, -495, 398, 95, 156]
6541A56k03k27l55N59N37R55k925K72J745Q82j346n88J899J62j366M11L04n77
6559B95J157q65j97K37k63j242R34j135K281j867M87J055j787j058J669m50l23
6576a072L162j012n14j448Q70K26r3j24J775k262N27j128J496n93l22R51j52M47
6594G34m93q71j56K60l07R47j749K567q24m13n59j30J079K35j560O27J414r80
6612a79J351P90l252J670M65r22l42M42K92n3j414J935j05j166Q64L67j47l9J120
6631A677k032l24J049O34l83n03k33k222J945j518K988j255k78M67l93M76L4J041
6649A170j112q69L86J908k61O81k066o01QN90K18j06M44r83K430l921k90L162
6667G88j64j266n11J623J415j333j24L10k395J923J504r21J31r19q76L072l087
$$ y = [156, -47, -274, -629, -70, 467, 1422, -1503, -1231, 514, 1396, 50, -538, 1361, 1523, 157, 568, 872, 295, 1452, 587, 390, 627, 364, -878, 56, -1079, 1202, -665, -178, 877, -910, -1968, -299, -749, -1072, 2090, 1078, 564, -884, -14, 212, 119, -5, 1770, -492, 35, -1093, 403, -190, -512, 439, 287, 734, 241, -630, -786, -526, -833, 114, -1635, 932, 108, -305, -864, -994, 85, 320, -1240, -613, 801, -179, 1172, 1962, -1290, 380, 845, -77, -419, 23, 315, 262, -1152, 783, 678, -488, 376, 743, 596, 557, 1677, -355, -679, 370, 1004, 621, 118, -115, -2337, -392, -1910, 1078, -177, -455, 12, -381, 95, 129, 1170, 58, -811, -425, 1483, 1222, 1903, -163, -764, -756, -166, 52, -54, 390, -593, 1837, -2084, -2374, 788, 624, -642, -1153, 470, 1885, 552, 428, 738, -1657, 266, 1770, 849, 980, 61, -815, 2257, -830]
6684h30j308J896K82o24j74P45N61N7J15J160J17p90r96L6M09p2L91j349J37R30
6704F93J493j864L98Q94j110p80K192l066M8J203J998p89l571L382k170L69k17
6721h97J093J165k967M111r42j089j669K21Q04M06P42p67k88q81L09L085l267
6738h31J060Q35k949P97k57M05o66K277Q7R7J82j856J590L96l15n65p09o09O35
6757c96l319M004m0j270J574j072K273k343k64r38J819J779k838kr50J948O07
6774E72k018O44J734K151k634n73J584j217R33n93n10r18K771k402J867M42j709
6791A24J16K98j466O64J664P80k346j472M55L64Q17j101J845o60m52o87L69o16
6809a304j155L214m63k40k10j335J559O34r42m93K330n55J531k313L9N43L72q45
$$ y = [-830, -2138, -242, 40, -584, -758, -13, 548, 605, 720, 1880, 1997, 1207, 211, 247, 656, 584, 975, -374, -237, 693, 2186, 322, 720, 1614, 504, -276, 1916, -1150, -1102, 101, 2099, 1310, -2261, 1121, -1049, -680, -897, 196, 1361, -1606, 2505, 1563, 474, -1195, -974, -170, 236, 978, 211, -77, -958, -649, 2436, -831, 229, 1064, -1885, -1088, -1345, -940, -1606, 671, 758, 855, 1037, -819, 771, 1167, 852, 287, -422, -1031, -396, -3715, 289, 249, -1021, 553, -519, 1754, -589, -853, -1791, 28, 1807, -1031, -1033, -1983, -35, 572, -1446, -802, 932, 3083, 449, -124, 1460, 243, 1176, 583, 73, -845, 1926, -476, 1391, 1833, 124, 240, 538, -928, -264, 1400, 2180, -166, -1638, -1183, -819, -2, -1103, 742, 82, -370, -1057, -688, -1304, -2459, 755, 292, 52, -158, -1493, 66, 700, -242, -735, 1595, 1040, 2571, 258, 297, 840, 1212, 367]
6827C67q29J889j469p37J377l1l44m60J123j602o46L781n535K278J419K61j681
6844h39J388j220J779k323K904j999j019M73J910j345J261o78J39L01m37j607
6860a312J824m97J82J405r88n69k67N09N60m33J56j064j00N91K377j463q63n63
6878e15r54J831j297J732k193J147l50m52J700j26j221O84Q40o43j32j231J77
6895a003L38j120L36j44K125m94J683j289P15O53k729j367J323N4m43L51J392
6912C81r90O63r45J289l35j198M49k56M89J040O14k38j042J707j770N74J15r07
6930c60J329m19K32p88J351M08r39N27k331m03l34K628q20L80p44k99K369j945
6948a58Q33K41j802l30L264l142J478L41j145P34k83J81n84L07m7n8R27j215J339
$$ y = [367, -462, 1427, -42, -779, 598, 567, 223, -237, 886, -716, -1362, 2419, -3116, -838, 581, 842, -839, 549, -671, 1108, -1215, 1689, -310, -1329, -856, 1054, -291, 970, 292, 431, 732, 295, -1312, 512, 15, 197, 1602, 614, 45, -222, 287, 847, 414, 570, -494, -594, -3, 2374, 911, 48, -515, -1469, 362, -935, 797, -1396, -249, -599, -1051, 649, 523, -698, -14, 826, 183, 51, -1180, -1003, -665, -1785, -1449, -1593, 532, 38, 1721, 432, 1147, 1800, -929, -2296, -973, -919, -1362, -1011, 381, -609, 54, -891, 398, 63, -1135, -686, -942, -453, 587, 1201, 963, -79, 1628, -142, 432, 547, -360, 969, 550, 782, -6, 1345, 1753, 814, 1341, -990, -1393, -1727, 901, 81, 461, -283, -582, 1787, -158, 675, 916, -886, -1216, 2048, -1094, 384, 725, -420, 314, 31, 212, -372, -65, -112, -170, 757, -458, 881]
6967H81j342l15O91L90r03l44K056n94N72l58j816K38K96m48j32M80O29j066J072
6986a3J115k145K762%j522J568p79l116K756j086J414J173p0r53m94o97r92J247
7004A68o17J121k72r61J378Q42j061l34j13j227J002j062J305J035k769K494j855
7021i26J321j559j92J290j500J285L14q23J935j174K30N98l81j512J924k694J228
7038f36M59j90j271N59J545P35k661J281L25n6q47R44j521O96J131o07K330l927
7056a711J928j041J135K76R3L84Q4j79L80m84k025M387l944L9J639k883J35J823
7074C6j239K155j220p3n81J165J090j003j805J216J754j664j246K451j10L69L12
7091A607k25k167O88j68P0Kn1J604j253j923K032P78k854K094l34R57L8k2q59
$$ y = [881, -461, -776, -85, 305, -598, -942, 1114, 520, 1092, 734, -1082, -844, -548, -996, -1128, -648, -19, -1085, -13, 1102, -1043, 1719, 1719, 197, 1765, 986, -2130, 626, -460, 954, 2127, 2057, 1104, 610, -87, -1079, 168, -449, 672, 400, -561, 817, 1659, 598, 264, 151, -1076, -74, -1136, 169, 1204, -1565, 929, -926, 395, -1164, -1356, -66, -1566, -281, 33, -790, 1145, -29, 201, 799, 418, -1094, 830, -1864, -636, -177, -367, -1638, -1079, 466, 1201, -1460, -179, 146, 90, -757, 187, -1334, -638, 493, -114, 2216, -1711, 217, -824, 311, 587, 680, 1064, 1148, 969, 1349, 865, -1160, 3227, -717, -678, 961, -1922, -1787, 36, -1203, 952, -268, -341, -922, 243, 1333, 330, -1475, -259, 1495, -169, -1415, 1036, 926, 1295, 1607, 1382, -785, -97, -265, -195, -193, -244, 1360, 107, -1816, 216, 994, -1860, 234, -100, 857, 895, 873, 14]
7110A4M57j27Q88q70J300q82j784R71k40q02K007k69j471J259p26k293J947J910
7128A289j114j62Q47q23J987o66j008k550R93K057j042J067j866K012k37j541
7144g57J130j261k71q48P38J923j269j79J121n59j60J786k576K338q68k98j580
7161a590J802j820L223j203L76k78q50M02r8K026l032J312M33m40P8K248j421
7178A168j783p73K074K40N72j336j270J897j203J037j916J024n71M46K92K20r96
7195h78L56J625j638N65j314L004j147l75M31j149J065J200r33P87l311K577J163
7212B028l007n8K006j544M90O26j111j88J765j091J170Q57k507l68L204m687J183
7229a232K802l028L355o00r09O04j26k198J305j237J282n4J378n09n98q88L60
$$ y = [14, 471, 344, 1232, 362, 1662, 780, -1004, -33, -273, -1075, 932, 663, -808, 451, -275, -2568, -621, 1289, 175, 13, 860, 37, 2024, 1358, 350, -2200, -1207, 850, -192, 875, -991, 1021, 784, -757, 373, -888, -1159, -2007, -1269, 654, -615, -794, 327, -232, -392, 1394, -1182, 1156, 288, -10, -1590, 212, -1608, 1615, 412, 788, 510, -340, 62, -36, 1990, -1042, 270, 703, 263, 341, 2589, 1168, -615, -1388, 686, 926, 1498, 162, -1108, 789, -414, 623, -1293, -269, -840, -394, -102, 118, -878, -522, 1103, -535, 30, -1284, 1720, 573, 198, 629, -520, 545, 1745, 812, 1599, -1712, 865, 2028, -979, -1037, 969, -575, -85, 541, -570, -758, 1007, -84, 1086, 1943, -564, -932, 2272, -2415, -1232, 1570, -1458, 1897, 1297, 388, 992, 866, -1332, -27, -1264, 18, -36, 1342, 833, 235, -653, -293]
7246b93N82r27J594j528p99J060J500o20n91j328K137j396Q52j160j67K011j5
7263I12L81n95j50M78L76r09J079j983K21q24k58J837J075j937L48j020J54J235
7281D20n5k496M918k412l65N99N60k89q25K480j659j975M63r75L402q12q94j757
7299a672K696k490j32P59K507j97j100l44j974K345K50p63Q99j357J067m33J305
7316A366n47q68P62k722J200J904k02K52k026N4J401k734J807n3l34n16K141k968
7334b083K093L68j532o37L941j432j278R71N68j584l16K165j178n37m76J775q72
7351d4j309J170R6M74m57M72k4N43R7j668K30P25m99j029J415j13j308J653r27
7370e03J043j467o53J483J19K00j16l51J055j539O49j620J841j428K136j536J88
$$ y = [-293, 289, -638, 956, -572, -1371, -311, 1189, 569, -22, -1350, 787, -609, 243, -917, -1084, 927, 912, 1293, 698, 548, 1026, 1402, 493, 1572, -411, -190, -1014, -1272, 565, 1640, -297, 51, -969, -815, 420, 365, -2131, 2787, 375, 10, 609, 1169, 880, 55, 2535, 876, -1099, -636, -1611, 1791, 979, 85, -1672, 1024, -1466, -1598, -839, 1668, 1471, 371, 27, -1947, 398, 648, -115, 784, -573, 494, 61, 1366, 819, -49, 713, -2009, -809, 1095, 893, 1145, -881, -827, 574, -2160, -353, -406, -740, -1256, 885, -2083, 10, 378, -1154, -1791, 2150, 718, -560, 411, 979, -605, -921, 1244, 66, -471, -947, 828, -44, -1353, -183, -87, 387, -70, 402, 378, 921, 1018, -650, -420, 305, -194, -1223, 192, 79, -1229, 424, -503, 540, -927, -1580, -97, 22, 222, 106, -245, 810, -729, -80, -1700, 141, -1287, 849, -687, -499]
7387d99m97J247R25j452l64M81j105Q41N53O17l89O58r21L18L00j422K117j26
7405A282p58Q20l027J240J382o11P78O27p29j270j51R60o16Q14m9j299R20r47
7423f34N52l51j765L133j766Q35J78Q12l669L764j749O88n11J074k63m70l16K251
7441A793q07k02J015k835J056k85J175k87j073j403K864j957m20K876j573J219
7457A156q92j047p48J077m94L83k23J647o14N29o20k30M8k94J630r27j613J421
7475A89q89M34j9J420j152p64J247k172J156o42J741J29k28J676k722L30l00J601
7493A035j021K119k167o95P51j707J943j04J91l86o82M35K2n08M27N71P21l18
7511F27j347l34L853k487o88R75j349R86j092J365k600K576p34J702o80L23o73
$$ y = [-499, -996, 251, 1176, -276, -640, -159, -1264, -423, 130, 747, 358, 1016, 95, 413, 713, -709, 1408, 1282, 524, 1344, -1683, -443, 939, 328, 1106, 1733, 1004, -266, -417, 543, -73, 741, 692, -607, 313, -634, -82, -433, -2198, 935, -831, 4, 182, 994, -2675, 1089, -660, 28, -483, 591, 328, -142, -458, 1793, 986, 784, 1799, -1036, 20, -265, 910, 623, -450, -1853, 1011, -946, -1366, 1510, -63, 1156, 264, -783, -1531, -454, -948, -565, -788, 859, 245, 774, 154, -76, -28, -322, 1308, 381, -1232, 189, -700, -266, -285, 1135, -17, -781, 466, -1706, -550, -1192, 549, 678, 450, 2126, -596, -266, -566, 1035, 14, 2133, -34, -729, 22, -1685, 258, 154, 345, -41, -723, -288, -266, -774, -347, 224, 945, 627, -720, -1054, 2799, 312, -376, 599, -750, 236, -856, 509, -2091, 485, -249, 1453, 773, 1096, 423]
7528D23o46P68q9o75l12J551n52j326J35O13k41J933k508P84m28K92L99J224l040
7547a695J841K90j007K83Q49j35n60R5p34J893k632K650j242m37J786o93j251
7564f99J105j37m42J535j422N16j279L58j72P88j455J577j012R87N87l88r70J516
7582I93m04j36n90N93K31R00l11j696J451j852p1L23k506M117j171j509J749j032
7600i21L71l01R47j160J376k15m4p29m8R43j781K095J87l79j572J697j267P91
7618a0j523M336k663k06r21r2J342j248O80l69k5L246m079K248Q14j752O10o82
7636b94J071r62J406k52l257K086Q86L90j173k23J436o9j226Q94O3l760M286k005
7654g03J340J686n155J502K247j069L97k199K403j63K116l495K522j922M31N20
$$ y = [423, -223, 545, 456, -219, -531, 1020, 468, -858, -723, -110, -351, 1582, -926, -142, -570, -278, 121, 1345, -1695, 146, 436, -571, -288, 561, 426, -134, -39, -773, 1120, -1512, 1138, -104, -541, 1245, 552, -699, 406, 269, -173, 1362, -60, 456, -823, -465, -637, 151, -1304, 273, -739, 248, 835, 447, -523, 993, 589, 453, -137, 456, 687, 1587, 1276, -420, 1031, -821, -892, -569, -3075, 1042, -129, -1638, 111, -921, -550, -851, 96, -1064, 312, 97, 53, -676, -724, 219, -1562, 533, 720, 341, -1231, 466, -801, -10, -1533, 2803, 140, -66, -987, -1079, 263, -985, -305, -674, -699, 2547, -1532, 716, 1530, -222, 388, -294, 777, -185, 1221, 969, -2288, -202, 684, 1074, -99, -322, 1114, 1045, -181, 713, 776, -2984, 1302, -703, 637, 2323, -2832, -1330, 917, -152, 245, -1954, 449, 286, 2402, -1093, 1429, -493, -62, 458]
7670D58N62j357J097j239o36J528n77P9p9N03p30M03r04k79J046J358K10P18o69
7689A492o75j272M36p41m87L138r89J100l077K744l45j317l31q17K457r86J133
7706A463q16J600l501J992R94j502M76o38k360K080L73j190N93j80J366p54P71
7723G67n47K04J19K78j85j517J749q41l79J146r13J116k407K765k053K989k573
7740b82R31j563P50O29K33n62M37m33M76O49j786K962k493J426M5j212j874K663
7758I96l81o60k05k76J9r93J264k169K828J53r00k73M83M25o35m52Q14m98o49
7777a109P56r15J863j458K742k142j050K789k50j931Q11k74J231j638o30K824
7793A619n42j365R54Q45l72N89l607L220k144L83o75m48K169j900L301j849K36
$$ y = [458, 1020, -337, 760, -479, -1115, 413, -164, -85, -164, 339, -391, 12, -892, -1171, -125, 1233, 1443, 2161, 1492, 817, -455, -19, -760, -1247, 1891, 902, 2002, -1075, 1669, 1324, 7, -324, -1141, 1316, 330, 1463, 647, 2247, -1254, 738, 1732, 230, 706, 68, -2292, -212, 161, -1029, -436, -616, 750, -4, 767, 220, 424, 543, 821, 636, -881, 868, 27, -352, 794, -119, 997, -1410, 1355, -698, 2291, -282, 649, -914, -164, 465, 698, 136, 573, 140, 616, 1265, -521, 2441, -52, 1374, 1419, 207, -1667, 996, 615, -45, -250, -526, -507, -1500, -236, -2405, 423, 576, -324, -597, -114, 311, -324, -776, 38, -460, -1109, -353, -1268, 595, -863, 1879, -263, -1313, 1476, 1226, -705, 106, -168, 1063, -575, -1205, 1619, 1077, -288, 666, 1511, 1139, 1728, -1879, 1341, -803, -420, -1095, -1543, 626, -1274, 2027, 178, 414]
7810D14j541K93J645p99m19K036j873j93m99j123J371J488j62J00L26j238K57
7827H3J429m99k993J252n71K193L47j242R92J439k137J241m3j419j952L127p09
7844E38j108J221N30j252J942M67m419L309j346p07O33o46j142L57K747j297j198
7861a371J217O45o61m64P41n57J79p89J593K39j269m34o94K579J23q69n10l1K692
7880B359j973n51N25r32R49J4j625J362K97j192k92J449M1J786k309K228l078
7897i42L613k908R88j92k7j020J271j246j410m7L09J499R57K153l558J530k844
7914a874J995J146k147K08K747j21m052J224P10p58J285j879K488l79K43k100
7930a264J235l48m12L67j089L54r62K927J717q30p00M75M83j569J32j221Q28J957
$$ y = [414, -1127, -834, 811, 12, -407, 1629, -244, -437, -936, -2059, -688, 800, 638, 738, 1064, -174, 83, 1512, 1013, -1980, -728, -1299, 894, 1241, -1, 991, 2430, 293, 1534, 1491, 72, -1880, 1247, 538, -570, 651, 1181, -71, 1871, 2338, -2081, 1228, -118, -825, -192, -838, -1980, -1623, 1124, -173, -1371, -154, 491, -170, -634, 107, -450, -271, -1060, 533, 772, -497, -931, -1625, 954, 1077, 208, -302, -333, 2359, 386, -165, 360, -572, 377, 391, -1234, 128, 425, -767, -1059, 390, 431, 2217, -92, 2136, -942, 2671, -237, 751, 559, 532, -488, 783, -463, -1873, -1920, -1611, -112, 845, 2998, -560, 970, -1874, 121, 1267, -880, -672, 2075, 1954, -2098, -874, -164, -922, 363, -1516, 972, 593, 836, -1264, -29, -377, -789, -422, -1511, -1157, -2119, 808, 2525, 1695, 995, 1470, 1953, 384, 516, -705, 123, 2080]
7948B080k575L17j488L45J941k027K030m49N91k936L903k528J077P13p34J535
7964A795l318K567o40J2J137k982J942k025o18K309o29L76O26k39j35q13j055
7981a690K684J015k624J267q49L42P30K11j083J051j687P67j513r23L661K61r54
7998F66J116l403n58J810j037L789k961m30O07Q15J01P77k983J681j608J378P27
8015D87k011J523k164J369Q18n0j040K608j005L19j385P64J825l024K529r22K42
8032H83j805j142J213K671j044p37J237q5k087J36j613K597r85L82R87q46J042
8049H04r85J920m062K463J35r69K356j836K69Q43n76k67k69J441M13k035l95j34
8067h84L67O47k905M635j868K64k230M051j141m2o74l45N27Q85j577P45l115K979
$$ y = [2080, -495, -178, -1666, -1321, 620, -1407, 623, 174, 765, -2171, 1732, -796, 281, 994, 260, 1795, -1523, 1044, 404, 416, 1553, -1429, 513, -1512, -2130, 179, -450, -74, 552, 313, 178, -635, -1690, 994, 2009, -615, 652, -197, 145, 875, 1086, 3, 1054, -633, 134, -1379, -2302, 1359, 1620, 666, 1782, -1621, -2179, -369, -1406, 2383, -578, -1008, -401, 414, 515, 1292, -1691, -10, -1618, -240, 487, -1524, -1, -2165, -796, 22, -28, -1068, 1540, 535, 854, -531, 233, 2058, -966, 1563, 641, 883, -922, -2064, -851, 1820, 776, 39, 1276, 1191, -896, -760, -2373, 224, -761, -379, 608, -238, 804, -181, 1739, -2323, 140, 275, -694, 1662, -174, 95, 938, 362, 95, -174, 1267, 1680, -355, -750, -884, -517, 130, -2775, 1860, -8, 256, -1974, 2077, 936, 894, 220, -125, 402, 1287, -290, 455, -2660, 319]
8085C19p72j794J900N91L22q66r08Q89J104M95j042M60j125J35K102j480o18l72
8103f60R77p47R98J25M60j279j970K185q70n5N80j233K647j628j383L050O93k083
8121a93j677K896P87k365M56L65K27k046J446J873o98J147k049j591r87L820n82
8138H29j205R78q7k235J492J472M36o99k252L740j463k246L098l035J845o73J005
8155A000o46q1q75Q11k056J874K45j48k00P84M90O8j872L243j799k384K464j13
8173H05j205K601j606j784J342P9k61m8O12L7j251j80p86J786J754j839k37k176
8191b357
$$ y = [319, -453, -2247, -347, 244, 566, -300, -1208, -319, 785, 1280, 238, 698, -427, -292, 1810, 330, -288, -660, 317, -430, 568, 693, 1153, -126, -2096, 89, -781, -836, -256, -1489, 1158, -470, -1853, 1197, 1890, -193, -1870, 1026, 1813, -552, -96, 269, 496, -1550, -104, 1769, 1071, 2218, 169, -1422, -2409, 1411, 829, -376, 602, 515, -1720, -228, 1244, 1680, 981, -1271, 2469, 1006, -1240, 1858, -1177, 668, -5, 1000, 354, 273, -602, 209, -1847, 27, 272, 124, -76, 708, 1198, 1266, -606, 2637, 838, -1546, 918, 805, -400, 2201, 595, -1189, 153, 232, -29, -77, 535, 572, -679, -859, -1645, 141, 1895, 56, -181, -2357]
$$ Imaginary data points
##PAGE= N=2
##DATA TABLE= (X++(I..I)), XYDATA
0@%%%%%%%%%%%%%%J6j23K15k16K16k16L20m28M32n37O45p51Q63r73J162j316J478
31G87j681J911k185K470k771L113l494L913m354M839n375N958o599P294q046Q878
47D658r796J0795j1891J3096j4432J5916j7562J9416k1499K3864k6602K9790l3554
60a7801L8077m3637N0665n9869P2480r0850J20196j74278L05262j178304j323408
71b301467K832597M08196j256850l98902M7704N43716R74049p50030j042619N49708
81c93898P38135r9715M654n20258o38941R35249J164022j026501j348936O64812
91e21377J355467l2174j112258o63332P94461J151719m04185j320167M3079J068791
101C60024K31413n59013l68466q3559L39014O04218j07634q64508k49827Q27155
$$ y = [0, 0, 0, 0, 0, 0, 0, 0, 0, 0, 0, 0, 0, 0, 0, 16, -107, 108, -108, 108, -108, 212, -216, 216, -321, 324, -427, 436, -537, 625, -691, 787, -894, 1017, -1168, 1302, -1469, 1644, -1850, 2063, -2291, 2548, -2827, 3131, -3468, 3826, -4220, 4658, -5138, 5657, -6234, 6862, -7570, 8346, -9216, 10200, -11299, 12565, -14037, 15753, -17801, 20276, -23361, 27304, -32565, 39915, -50935, 69261, -105017, 200245, -978059, -2301467, 531130, 939326, -317524, -716426, -668722, -125006, 849043, 99013, -943606, -393898, 344237, 244522, 249176, -271082, -910023, 25226, 1189248, 162747, -1186189, -521377, 834090, 801916, -310342, -973674, -179213, 972506, 568321, -751846, -708767, 360024, 591437, 32424, -336042, -419601, -80587, 523631, 415997, -448511, -698338, 128817]
111A28817O79349n00429j035266J6989J220585M59670j176918q25282Q64844R67153
121G99512m08384r06523o2224O51562M02450k63947m95797j31857L58209M61453
131D04454m613o12692m38002N62831Q32957l31139j080699m6933J101859M35421
141H23444r16299p29774N74399Q62957j58017p78918j80654N31002L83674j51899
151B59915l84734k15071J96222M68753J17730n58591m94294M49143P90420j82567
161D46926r42608j62672R16397N01138p01081p09913L87048P62179l1682o40210
171a74478k38263L71233L50575n4200k93885k61729P7969M38595K28745m61838
181a7276n37091L28007P59396n5275q26925k54575P46075N32409n31282o87079
$$ y = [128817, 808166, 307737, -727529, -710540, 510045, 969715, -207203, -1032485, -167641, 799512, 391128, -515395, -577619, 73943, 476393, 212446, -283351, -415208, -56999, 404454, 399841, -212851, -650853, -88022, 744935, 413796, -666903, -713836, 388023, 823444, -92855, -822629, -248230, 614727, 456710, -322208, -502862, 28140, 411814, 259915, -124819, -339890, -143668, 325085, 442815, -115776, -610070, -160927, 629493, 446926, -495682, -658354, 258043, 759181, 58100, -651813, -264765, 497414, 465732, -174478, -412741, -41508, 309067, 254867, -39018, -300747, -222778, 215817, 444562, -17276, -554367, -226360, 533036, 477761, -349164, -603739, 142336, 674745, 143463, -543616]
191e43616K38143O67650L7958n12315k38817K35273K94279N8796k03919k91996
201b58564k671M10946K79424l66999n30429J97424O95251N9212p23663l33813
211e73882O12278N26612m01158o09400J29121N46761J10199l67026k51497J30132
221a47860K62793J17558j34653k88200q1278L48158L27210k75775n43830J00165
231c15712O44543J24191o24422l50667M80331N04423k64301n37460L4392M54712
241A50030J55756k73526k35049N2722J95946J52613n3430k89304j51089L00349
251E018L55323k03340n13797K0613N71670J90776n12466l73094L69468M79135
261C89306j66369m72596k7486L60973J68100j81396k16274k2103J48447J82791
$$ y = [-543616, -305473, 362177, 400135, -112180, -350997, -115724, 178555, 237351, 33432, -258564, -261235, 149711, 429135, 62136, -468293, -270869, 424382, 483594, -240069, -573882, 38396, 565008, 163850, -445550, -316429, 230332, 340531, -26495, -277992, -147860, 114933, 232491, 97838, -190362, -271640, 76518, 403728, 127953, -415877, -315712, 328831, 453022, -171400, -522067, -41736, 462687, 198386, -339074, -304682, 150030, 305786, 32260, -202789, -150067, 45879, 198492, 145062, -144242, -295331, 5018, 360341, 157001, -356796, -336183, 235487, 426263, -86203, -459297, -89829, 389306, 222937, -249659, -277145, 83828, 251928, 70532, -145742, -167845, -19398, 163393]
271A63393j526k67656j85990K45872L65616j25058m80613m3946N04166K30076
281D04334m22341l73509K66837M35257q6532l99479p9965K74606J75467j02433
291I2242j84178o7005R7624J94199N3652k36107k19212J89499L63766n8663m44311
302b18494j02865M31387K54969l36588l64896J85277L86220k2113l28122j07285
312b22510K00369J74025m1262j49486r7999N0450J91308R5925k07161k43111J39021
323a10431L49873j1329l96332j40093L58642K64925k49125l40868J06841L42313
333A74416L1405k63115j25926J35402J56849R946j12898j28117R313J81866J26469
344A95610j71703k50635Q6401L28179M2271l49051j68868K96333K69795j81841
$$ y = [163393, 161867, -105789, -291779, -45907, 319709, 194651, -285962, -329908, 174258, 404334, -18007, -391516, -124679, 310578, 224046, -175433, -255398, 19208, 194675, 92242, -91936, -158941, -61317, 132882, 186534, -49573, -268785, -79286, 284480, 225817, -218494, -321359, 110028, 364997, 28409, -336487, -151210, 235010, 212897, -115225, -222510, -22141, 151884, 110622, -38864, -136863, -86413, 104895, 200820, -6341, -249452, -110431, 239442, 228113, -168219, -308312, 50330, 315255, 66130, -274738, -167897, 174416, 205821, -57294, -183220, -47818, 109031, 118977, 6079, -122038, -112725, 69141, 195610, 23907, -226728, -140327, 187852, 230123, -118928, -287796, 8537, 278332, 96491]
354I6491l12517N2791K87244O4026k00227j31191P1639J39147M4226p8736j32385
365i9492l0515J63697J53277j31660k52025M1530L04623P8625k95175j86736K27241
376b6610K61578j19907k77332J102K35251Q7099j43167j31992K7563J14853P4316
387A02754m7488j32653n7515J43077J65265r3194k40154J958K68669J02160k41719
398b8840j93079J66641K41657o6029k39865l3025J86664R9983r4170j17995r161
409h7219Q7788R0648j3073j27897q2780J17542J69640n9389k26924k8694K34760
420G4402J22741j95798j92248J18125K18633k2087k02573n5386J36453J04098
430A06360m8300j06136l6530O6201R5851J0957j13986r9997R0488J67707k7779
$$ y = [96491, -216026, -163235, 124009, 188035, -12192, -143383, -71744, 67403, 111629, 32893, -99492, -130007, 33690, 186967, 55307, -196718, -155188, 149435, 228060, -67115, -253851, -26610, 234968, 115061, -162271, -161169, 74082, 161181, 18014, -113978, -86415, 28438, 102754, 55266, -77387, -134902, 8175, 173440, 80246, -159908, -157950, 110719, 212879, -28840, -221919, -55278, 186379, 120350, -119515, -152540, 34124, 134107, 39937, -78058, -87219, 569, 91217, 78144, -49753, -132533, -14991, 154649, 95260, -131664, -160358, 74402, 197143, 1345, -190903, -72778, 145855, 123768, -78805, -134191, 2262, 106360, 58060, -48076, -84606, -18405, 77446, 88403, -25583, -125580, -35092, 132615, 104836]
441A04836k05144n3682J96400J34587j49100j83013P2155J92719J0067j61420
451d1595p4290R7793J01834j9230q7239n5997L9462R7357L4281j01279j10093
462a18996O6205J64056l434j80069p2056J59136J37003j09939j66612L5288J65587
473G6169L2723j26680q0975O2536R3491P929o9603o6010J6308R3997M9250q2384
485F751j13712M4704J49173J9844j57100q3250J24130J39666p3929j52528N949
496i0302J35552N2455r1601q3798K9873Q3221L2251n0314p4677j401Q4027O3593
508H8879o5637j11285K1067J37268L1871j26521r0818R6490J26054m2280j31614
519f6526j6412J06047O3194o3461q0682P197P0107M5738l6526p3197j9381P4648
$$ y = [104836, -100308, -153990, 42410, 176997, 27897, -155116, -82961, 109758, 119825, -41595, -115885, -18092, 83742, 64512, -22727, -78724, -39262, 58095, 92376, -8903, -118996, -52791, 111265, 107831, -72238, -144294, 14842, 151845, 41906, -124706, -89418, 76169, 108892, -17788, -98763, -36227, 57264, 65193, -4410, -70420, -54112, 39885, 89135, 6751, -106961, -62257, 86916, 106760, -50340, -133590, -9460, 130206, 56277, -96251, -90302, 45250, 97705, 6104, -77694, -47821, 35400, 67651, 17337, -57340, -58741, 25286, 88879, 23242, -88043, -66976, 70292, 102163, -24358, -115176, -18686, 107368, 65088, -66526, -82938, 23109, 86303, 22842, -57840, -50643, 19464, 65202, 28676, -44521, -63902, 10746]
531A0746P0815m8663j07269K083J20222M8984j04425r3971O7083J17284j5726
542F7163j14497k9281P9674O4526l5065p4883j1544N2628N5430j8481o9835l1403
554f5568O2317P5253l1245j00965j6485J06266N5123q2192q7722L8617J05785
565E9184N052r0399m5250N7833O8347j5942o3645k7552M2585N6274k903o7836
577b4252l9343N3245O9816j4486r0709k2939Q1703O1541n7606q5714K3776Q9499
589D4531J6525p0118m9848L8187O2630L024n9096l3916K7066N6778J0467n8707
601a2477m7048L8767P0175l174p8283l2728O8377O1367l8943p8486L276P7268
613B8091K5715n4300n0204J9200N8162J3200m3073m0231J5768N2585K0444n1374
$$ y = [10746, 81561, 32898, -74371, -72288, 47934, 96918, -7507, -101478, -34395, 82889, 67163, -47334, -76615, 3059, 67585, 32520, -42363, -53907, -1279, 54151, 35670, -34165, -65568, -3251, 72002, 40757, -60208, -76693, 29573, 84696, 2504, -85218, -46601, 59184, 64236, -26163, -71413, -13580, 54767, 38825, -24820, -52372, -9787, 46487, 43584, -24252, -63595, -10350, 59466, 44980, -45729, -68668, 13035, 74576, 16970, -68744, -44968, 44531, 61056, -9062, -58910, -20723, 41907, 44931, -14165, -48081, -21015, 35763, 46230, -12477, -59525, -20758, 49417, 46243, -32040, -64768, 3609, 64976, 26033, -52453, -49177, 28091, 53806, -494, -50698, -31498, 26664, 39864, -3209, -43440, -27672, 24913, 45357, -6017]
625f017m4842K4943O7056N629o8442l5980N2268N7597k3398o7673o148N7905L3902
638D6800l4540n0492M976N0685K3447l2032m3997N923M8513K6509m0840m5292
650d0340J5629N7842J4823n6519m0264L5569N7008q032o0281k0077M8116L9596
662D3070k1269m7107n592L9704L2517k3879m3002k307M0424K9447k8389m7374
674c3757O330M9957J9370m4356l8691K3030N2608J738m8250k4432L1562L9716
686C4825q950m4005j3999L1437L3367j3381l9529j0940L3580L3242k1264m2541
698b8158j556M3966K3711l0918l8573J2410M1393Q953l5077k9548K1515L8830
710B6948k251l6066k0510K4835L4045l649l6485j6673K8252L1098r904l8534j0299
$$ y = [-6017, -50859, -25916, 41140, 46769, -21673, -57653, -5385, 52212, 28814, -38859, -45007, 12898, 46800, 12260, -38232, -33256, 17429, 40876, 8844, -35153, -29230, 19283, 45792, 4952, -40340, -24711, 33131, 47954, -8565, -48829, -13260, 43748, 35716, -24565, -44642, 3474, 43070, 21801, -25306, -30898, 8806, 41323, 17444, -25558, -27865, 12559, 42006, 13617, -33757, -27427, 22530, 41900, -2456, -41147, -18117, 34491, 36229, -12021, -36453, -4891, 34825, 25875, -18130, -32129, -692, 32675, 19294, -20235, -31175, 2405, 35647, 14383, -28158, -29714, 14252, 37963, 7045, -31528, -19118, 22275, 31228, -3849, -33397, -11882, 26948, 24697, -11369, -31879, -7044, 27001, 23352, -13133, -29806, -1554, 29544, 19640, -18894, -29193]
723b9193L4658K5073j9190l7590M726L5421J5263k7257k9508J1747L2067P709
735B3926k8489k2347J3685L2165L073k8034j9478J7606L1118m562l5407j0904
747b7648K6363K3806p892l6258l954K8398K0624j7379k8498O047K8020J3779k3569
760A839k4706J0068L0675M614k9397j4968P319L1812M43k5982j4310J6525K7418
773B1350o631k9617p491K0682K2933r370k6646m933K6231J4315j5223k4785L403
786a5782K5803R411j8246k0265N399K7104P066k2728j8640J3619K4854k039k1604
799f048j4074J5967K3177m839k6640p994K2117J6674j0726k0245l589K0835J5447
812B0062j4788k0548K838K4829L536j5079j9389P528K3935L760k0474j1847R490
$$ y = [-29193, 5465, 30538, 11348, -26242, -21516, 13905, 29168, 1911, -27597, -15850, 16217, 23926, -4563, -26910, -13225, 18940, 22013, -6021, -25499, -7893, 23225, 18663, -16744, -27648, -1285, 22521, 14629, -21629, -25583, 2815, 23439, 6060, -22438, -16391, 11629, 25408, 1839, -22867, -12799, 17876, 22490, -6907, -21875, -14556, 17256, 17699, -8283, -22593, -6068, 21350, 14719, -14898, -22389, -1707, 21226, 11856, -14790, -19723, 6508, 20823, 5600, -19185, -15782, 10021, 19432, 1186, -19079, -13680, 13424, 20490, -2238, -20878, -7259, 17595, 15556, -6048, -20122, -4155, 19022, 14183, -12457, -20451, 1666, 18340, 7614, -12631, -16220, 4615, 20062, 5274, -15274, -12436, 12393, 15929, 850, -18539, -11011, 12924, 16684, -3790, -15637, -6147]
825f147J8556J055j9430j1297J5263J7003l409j9818r777J9810J2751m950k1469
838a1859J501J4317J2071j1517j7089K550J8402N024j3335j4950K956K1881M504
851A4456j6741j1655P674K0489m151j3897r294J0455J6549m659j6565n824J3445
864B82J2114n467j8483j4J6023P661r176j2284k50J8290K561j1626j0483N559
878e293J3709J469j3349j1015J1983J1161J760j5018r609J0947J3947j790j6454
891g552m987J3959J0788q353j3095L4J5667N371j0157j0937k280J6523Q088j1935
905A134j0759K727J3872K914j1301j0913Q914J2335q82j1295o414R817R316k908
919F557j3467l482J2977R270p538j0999p04J1422O528q959j0607J924J3783K888
$$ y = [-6147, 12409, 13464, -5966, -17263, -2000, 15003, 11594, -8224, -18001, 1809, 14560, 9610, -11859, -10358, 3959, 16030, 4513, -12576, -10026, 8376, 13400, 65, -14885, -11929, 9952, 14456, -2285, -13940, -6266, 14223, 10072, -3825, -13119, -2664, 13885, 9226, -7339, -13163, 282, 12396, 6929, -11554, -11568, 4455, 12116, 2940, -9344, -9594, 8696, 11257, -369, -10852, -5293, 8416, 9885, -3464, -14479, -2496, 8665, 10425, -4593, -14202, -3255, 10692, 8902, -7552, -12539, 1420, 12208, 3855, -9240, -9206, 6461, 11832, 1675, -9262, -11542, 4981, 13069, 1134, -9625, -6898, 6974, 9888, -1413, -12326, -3412, 8923, 8041, -3254, -9668, 149, 9465, 6557, -6910, -10392, 2585, 11855, 4317, -6682, -7386, 4036, 10564, 1605, -9002, -7078, 6705, 9593]
933I593j0053p959M476J0299J994j3012l123N923J1065l007p174o895O737O578
947E442o01p906n787J0963L863l709p862k487J0382O951p057r127p45J1208K392
962E920m927r803O968O064K716j0485m252N832O000J896p575n467O490L815j81
977C011q995k024Q548P356l243j1155l277J4215O51o139p445M920N179K176n804
992b026o603M225N991L551p611m446N220P413r75o721n658N149J1154m179q753
1007d269q72O470M482m719r266M973N529K179n009m570K296N008J137l590m149
1022d370J301P405K898p539p295M129J0175l387p610k039O408N834m652o695J739
1037c698L349M157m58n889r6N171J999l995l658j663P213M371p790p215N138N207
$$ y = [9593, -460, -8419, -3943, 6356, 8350, -4662, -7785, -1862, 9203, 6196, -978, -7873, -1136, 5442, 4841, -3065, -8852, 2111, 5974, 2265, -5597, -8084, 2298, 9249, 2192, -6935, -7680, 3528, 5920, 993, -8810, -1842, 4222, 6938, -3547, -7799, -1967, 4033, 5929, -1646, -7113, -623, 3192, 3011, -5984, -8008, 540, 7896, 4653, -6502, -9779, 4436, 5087, -1052, -8497, -3577, 1602, 3778, -2026, -8629, -4404, 1587, 5138, -2473, -6919, -1699, 5714, 4739, -1982, -7640, -2491, 8663, 4484, -4269, -5141, 1329, 5811, 1092, -8174, -3201, 2328, 4507, -502, -5072, -2776, 2232, 3369, -221, -4370, -3069, 4336, 7234, -305, -7600, -3471, 6704, 3317, -4293, -6332, 76, 5910, 1258, -5437, -3698, -349, 3808, 3350, -2539, -2635, 2536, 4535, 540, -3118, -4781, 2432, 6803, -987, -8202, -3064, 2143]
1053B143J743p353l220P052M677j314n701j492L014K394J576k904m132J760Q096
1068F339k289o183l34N212K847m116n546l40J0857j303l883m047J330L562O25
1083B731n617K396N2K881O5k671k982J242N310k96k290p623N427O842k719m895
1099b147R7N016L540p248j779J861M739j240m586R60k72L507k611N38m755M503
1115A23l00L818l855p021Q003L927j913o279o3L981M942l456n252Q89L244J181
1131A969l889J425J97J270L061j697j278o110R077Q87n268o235O722M165J94p041
1147b551r56M386K686m368k107J008J476J803O00l348j34L342J857j199m920m42
1163b867K138O206n496l252K25Q248j863n413q11L412L876k844m730K136R8J970
$$ y = [2143, 3886, -3467, -6687, 365, 5042, 3728, -1973, -3465, -451, 1943, 3519, 615, -3517, -1757, 6339, 4050, -2133, -2467, 2745, 5592, 1476, -4070, -4410, 6447, 5144, 1261, -2786, -1456, 2106, 2731, -2886, -490, -438, 2443, 2508, -163, -3145, -1903, 3407, 3111, 821, -6802, -1375, 5467, 2748, -2147, -2050, 2966, 6506, -742, -2521, -660, 4079, 2839, -1747, -787, -1059, 2448, -163, 375, -4380, 123, -177, 3641, -214, -7235, 768, 4695, 2782, -3497, -3560, 421, 5363, 1907, -3345, -2456, 788, 1969, -1920, -495, -298, 972, 4033, 2336, 1058, -5052, 4025, 4912, -356, -6591, 131, 4296, 4490, -2551, -3507, 879, 3565, -803, -2910, -1902, -426, 1377, 1977, -1371, -1505, 1837, 3694, 2495, -2425, -2867, -729, 5477, -19, -3271, -3046, 5202, 3339, -2074, -2885, 527, 4403, 1559, -3171, -1035, -937, 1033]
1179A033J28M0k534O4L289o27l260p34L809K910r35n093j144M695Q01k585k094
1196b237j386M099K558l341j103N66K721N92k433l171J351L387R97j732j864Q05
1212a91K402r99o178K779L635M706p400k121J433L512K29j245j716q25M999k121
1228H99k223j57j066O247m86m251j228J483M713j599m372o37L795L800l749k456
1244a287P24P78J302k074k489K023Q6L062k798j333R72J494M20j328o97l26M860
1261C389j268n188j44J672M513j273m171K807J110j254j243J504l475M221K729
1276C929j809l601K96J313L620l367k320J386K107K11k873j063Q4K889K106k190
1292G18k852K392J337J239m055o47J311N56M026l811m822N280K205k029k631M72
$$ y = [1033, 1161, 1201, -1333, -1269, 2020, 1393, -1867, -2601, 1208, 4118, 3183, -1910, -3054, 1641, 2442, -143, -2237, -3623, 476, 3034, -307, -1410, -844, 1877, 2469, 36, -3135, -1784, 1603, 2600, 868, -996, -191, 2211, 1212, -4966, -2187, 1448, 6154, -1246, -3367, -1934, 1578, 1807, 562, -1154, -1979, 3020, 899, -1324, -1481, -2547, 3700, 3214, -1037, -2265, -782, 3931, 2332, -2040, -2677, 1118, 4918, 1169, -1287, -563, 215, 1517, -557, -3046, -1023, -937, 2125, -673, -2006, -1034, 460, 880, -448, -1145, -1471, 3389, 2121, -3067, -3211, -1539, 2974, 1701, -2470, 337, 1447, 193, -1050, 454, -3021, 1200, 3929, 2120, -1481, -1185, 128, 3748, 381, -1939, -553, 1554, 1765, -1108, -2171, -2087, 802, 2908, 718, -2134, 258, 1595, 2834, -1221, -1868, -557, -1, 4025, 214, -4608, 672, 2877, 848, -1783, -1311]
1308a311J901K529l922l747N742N5q5l886J558N40r04J446j884j61J977J454j038
1325B64j919j67K964J844j708m5l246K407K166j956j256J771l33J273k916J105
1341B48P65J068j358j143j67P74N50R36l074n43J265P00q38l40O01o9J188K98
1359H61j431P38K445L89j634k533p02L480k082K513m593J293K142J219k813j26
1375h34Q69K014N15k844k240J717J762J481l200j22J445K263l28m473J275N54
1391a46L164n27k801j009K412j516l8k990L410o75K99J272k195K026P12r57P70
1408A211m655K336J062J838k964J271j191K254R2j582l94J296N20k80j048j120
1424a354J902J842j390l406L803j954K235j766k949L372J010m75j706m44K537
$$ y = [-1311, 590, 3119, -803, -4550, 1192, 1247, 1162, -2724, -1166, -626, -1530, -84, -1968, -2129, -152, 1302, 264, -1655, -1822, 1142, 2986, 1278, 1233, -2013, 394, 2560, 604, -652, 1119, 786, 2059, -857, 248, 1013, 2081, 723, -420, -587, 187, 737, 1673, -1401, -1944, -679, 21, -817, -1157, -556, -625, 563, 861, -570, 168, 2613, 3002, 1368, -1165, -1867, 1613, -469, 2044, -2549, -1256, 886, 2105, -708, -834, 35, 2049, 2564, -280, -2520, -803, 959, 2440, -760, -882, 563, 2826, 2498, -1975, -700, -146, 3018, 2491, -310, -1319, 1093, -423, -461, -3451, -41, -716, -417, 855, -1340, 686, 1398, 441, 1211, -3444, -1108, -46, 1792, -1172, 99, -1092, 1162, 1254, -328, -722, 574, 1094, 814, -234, -1354, 548, 2390, 1000, -2406, 1397, -557, 1678, -88, -3037, 335, 1345, 870, -836, -1280, 1257]
1439A257k558K909l258J604m07m11J656j496K13M18q19J599j310l53Q00J853J12
1456A809k42n55l96J102l085J437j009J528M43n528L223K488L56k634p67J584
1472b46o2K069j535J038j909J038j949J147J480n04J92P28M77m572J969J066Q7
1489E14j372O5L46L897l066k336J789J166q99J716l619Q83J006k47n5r34K271
1506A125j060K404k657m64q4L50J447r07J762m171L870r52l382L039r4L282m088
1523e80n84N19P04P76k087J350N46J543L49k748m95R67J783k904J106j008j464
1540b227K563p81K959l818l63J653K7j535J395o16K187O32l122o69p40N367l195
1557b83n3j576R59J858j010j897J762K519j419N28l899J025L518k306J922j26
$$ y = [1257, -1301, 1608, -1650, -46, -453, -864, 792, -704, -491, -73, -892, 707, -603, -956, -156, 1697, 1809, 1567, 1012, 616, 1718, -1367, 70, -939, 589, 1032, -4496, -1273, 1215, 1571, -1063, -1830, -246, -308, 1761, 226, 1264, -645, 393, -1556, -409, 1071, 567, 759, 1487, 1964, -2608, -639, 427, 514, -858, -793, -447, 3450, 384, -1952, -163, 1003, 104, 1820, -1799, -916, 90, -157, -212, -1146, 1125, 65, 2469, -188, -652, -736, -386, 1061, 154, 1916, -2255, 1615, 663, -2719, 320, 226, 3508, -580, -1164, -645, 59, 835, -1252, 98, 644, 2187, 2536, -212, -707, 260, 2043, -861, 245, -763, -2227, 336, -445, 2514, -1304, -1667, -14, 13, -1522, -127, -743, 1444, 2076, -1046, -1715, -2455, 2912, -283, -336, -1912, -953, 905, -105, -2002, -240, 2279, 860, 1388, -2511, -1486, 2032, -274, 1648, 1522]
1573A522o73r06K667j673j706q90M75L347j714j936K604J33J09r90J30j16K007
1590B390k372p17J047j094J951j793j94L57Q38Q45j089j665J962K66J970k586
1606A16k245J044k16N32K534k113J904j225j954r96K311J036j934o4L229j175
1622G84j052R4J12j712N97Q47J529r08l374L054M38O70j467k083K763l34p49L36
1640d55j374J106N20J696k342J063n43J189Q19k155j632J346K759k506n41m63
1656a513J73L067j983j173k10M470l750M55J193k80J027j932K59j225K918m142
1672b646M169j500j112M03J235L9r06J36K012k62m40l122L499k224J218p70p65
1689a036J209K41j28K81k54k534J302J081J056l886L192K439m55m101J57K738
$$ y = [1522, 849, -57, 2610, 937, -769, -1659, -1184, 2163, 449, -1487, 1117, 1250, 1359, 369, 499, 383, 2390, 18, -699, 348, -746, 1205, -588, -782, -425, 413, 1258, 169, -1496, 466, 732, 2702, 116, -2129, -1085, -1301, -769, 1765, -348, 1556, 331, -1623, -2619, -308, 728, -1206, -1270, 1959, 784, -268, -174, -62, -1774, -1177, -330, 1199, 291, -3083, -29, 409, 1079, -388, -2471, 292, -42, -791, -455, -1829, -723, -203, 1493, -849, 214, -329, 860, 1679, -476, -2108, -762, 1997, -509, -1050, -1513, -1340, 1727, -256, -1429, -1639, 2831, -919, -464, 729, 449, 1476, -456, -197, -1422, 1496, -2646, 1523, 23, -1089, -686, 549, 588, -318, -182, 1830, 1568, 1128, -1994, 1505, -719, 499, -271, -1036, 173, 414, 286, 567, 313, -2221, -919, 162, 1218, -2668, 524, 2963, 2508, -1593, -1436, 1302]
1705A302m41j072j258J242j897J218R52j229J415N42k024Q52k195K302r58K670
1721A421K63k673K384l048L784k903R45N97K49o61j020K465j289j004K76J716
1737A502j653K43R68K31j167p01N36K343k753j25K84J098m11j72j36N32K184m094
1755a291J584k92M67n93K17j12l17J170l28j31m63j012J040K178j29l792J035
1772g69J076q4j815J49K068M15j081j486M09K871j875l46K059j545j089p02J193
1789e52k44p43J322J704m4l208l17L216N69k282m33J285J657k115j208M802k374
1806A035k558J443J569m64o74J107Q34j516j208J08J079Q00k425L65Q79q43j271
1823a740l24K856J233l562k17K701n39j631j44L289l362l1J48K520m29j813j131
$$ y = [1302, 861, -211, -1469, -227, -2124, -906, 46, -1183, 232, 774, -1250, -398, -2593, -291, -1249, 1421, 1684, -989, 1395, -1653, 2131, -772, 173, 770, 1019, 358, -662, 1803, 514, -490, -214, 1502, -151, 92, 1060, 1291, 124, -577, -41, 2302, -451, -576, -292, 806, 395, 223, 87, 619, 2803, -1291, 293, 1, 468, -125, 92, -20, -337, 833, 505, 374, -89, -1101, -61, 2117, 1988, -1804, -769, 307, 223, -1592, -1443, 625, 1040, -41, -1527, -1118, 1753, -122, -468, 1591, 46, -1043, -1745, -552, -796, -1539, -217, 1487, 1443, -1765, -2082, 1134, 1703, -579, -1012, 273, 1930, -185, -1393, 3409, 1035, -1523, -80, 1489, 1025, 351, 1458, 2292, 776, -432, -324, 755, 1555, -870, -505, 374, -469, -1740, -2064, 792, 2025, -1537, -1754, 947, 408, -1223, -1367, 1922, -1440, -1471, -1323, 1197, 768, -1045, -2176]
1840b176L022J229l629L47J641P20q84l333L539O32k326m23J918J129o26k174
1856a394K564L10k867R79K618K42k557k024L131R28k248p28K734q55j735q91K781
1873I88K76k151l72K924j008k082M29J709O85k493j112K700J178j494r91J798
1889I84J361l943j37J644Q97l066m31L930J622k796r51L257j006j484n08K024
1905A397l89j841j280L404J27j969k665M547q79l215N11K504K631l512J86K303
1921A860K98l022N70n19K908k448N24J919r83j966r40L191n06k507K015L89K48
1938A031k147q0K375M69j595k131L588n79k041r64L690K97j928j686K957K038
1954C294m375J106K432K88l061k947L784k30j052j782L543Q58l368K29L263r01
$$ y = [-2176, 846, 2075, -1554, -1207, 434, 1154, 270, -3063, 476, 1108, -1218, -1641, 277, 1406, 780, -1394, 1170, 1480, -1387, -408, 2210, 2452, -105, -2129, 1002, 1930, -318, -1046, 1688, 833, -902, -1793, 988, 1264, -887, -1259, 1665, 657, -1425, -996, 713, 1398, -1095, -2207, 493, 1671, 177, -814, 984, 2345, -1598, -1735, -91, 806, -2260, -2691, 1239, 2861, 65, -886, 2371, 1365, -119, -627, 1397, 1008, -833, -2113, 1291, 1418, -551, -3216, 1331, 452, -2763, -2252, 252, 2883, -629, -443, 1860, 2158, -864, -294, -813, 2095, -353, 171, 2090, 1107, -859, -1799, 1392, 886, -1621, 394, 783, 1031, -1116, -1196, 1179, 1648, 53, -2078, 1510, 931, -1110, -2074, 1616, 1913, -15, -1701, 1256, 3294, -1081, 25, 2457, 2745, -316, -3263, 521, 291, -761, -2543, 1000, 1858, -1510, -1281, 1982, 1081]
1970A081k330m39L391J814o646L348J493M02l963P05K865j58j523q24L250l67
1986B099k367j662L942k86k501l34M505k259k937N22L287j101m364J750K881J869
2002C044m936J524K064K87l446q62L655l08j428j109K477r24k128q01O633l279
2018D63q87k83L353j242l128q6L660m87m980J893M590o53l527j04L124O12l291
2035i73J59J904N92l205Q36k69K367j290j332L218n11l820O59P50J618o92k56
2052b45J776q93j482m60L157J161l392k077M788N00m706N34L060j725j478j602
2068c084O188j660j754r09M448j030l247j55K178P88k281j339K104K623n313J935
2084e08J490j900J499j838M942k928k757J253J722N79k933p27L373J746n034j515
$$ y = [1081, -1249, -1688, 1703, 3517, -3129, 219, 1712, 2114, -1849, -1144, 1721, 1563, 40, -784, 2466, 2099, -268, -1930, 2012, 1726, -775, -1109, 3396, 1137, -1800, -1278, 2009, 908, -3456, -1706, 1175, 3044, -1892, -368, 1696, 1983, -1463, -2325, 1330, 1022, -406, -1515, 962, 38, -2090, -2891, 3742, 463, -424, -707, 2646, 1404, -1724, -1810, 1850, 1363, -3617, -1724, 2866, 2213, -1314, -1418, 1706, 2318, -973, -814, 1090, 1682, -1523, -687, -956, 1411, 121, -1211, 2007, 1496, -2324, -1665, -915, 703, 11, -245, 1531, 638, -844, -1304, 1853, 3014, -378, -2455, 2333, 2833, -1873, -1339, 1721, -4, -1482, -3084, 3104, 1444, -310, -1219, 3229, 2199, -1048, -1203, 975, 1763, -518, -1857, 247, 2870, -2443, -508, 982, -918, 581, -1257, 3685, 757, -2000, -747, 975, 1554, -1379, -2106, 1267, 3013, -2021, -3536]
2100c536M478J038k825j805M476J72k964o12K692k28j428o94L440o20k998j660
2116c074M732L38n114P75L518J143o024J293K537J299l267P38L221q43k900j965
2132c593L711L193l888r38K758K16l927J724J176M7j614q81K586J380m220N81
2148a689L225j0j244k852L783M1k088j433L785n0k160N92N97J271l979L65M145
2165B299j214k509k228L231J736j407O74O88j90q39k360K916J876m027j21L056
2181A581O61j869l572O420j734l207O56J527j19k349j210M084J235k031j913K438
2197E98J183k179l272L843J374l384q4M720n22j241l782N400k071k549N26K490
2213A050K195k151l959N566m24k365K10P44P86k152j531L009O24p47k112L762
$$ y = [-3536, 942, 1980, -845, -2650, 1826, 1998, -966, -1578, 1114, 886, -542, -1236, 2204, 1584, -1414, -3074, 1658, 1996, -3118, -2343, 1175, 2318, -3706, -2413, 124, 1423, -1844, -1106, 2115, 1272, -1628, -3593, 118, 3311, -577, -1515, 1243, 1459, -2468, -744, 432, 479, -1135, -2016, 570, 1950, -2270, -1689, 1536, 1526, 282, -2570, 1213, 1254, -834, -2267, 1518, 1468, -692, -100, 497, 1768, -2211, -1846, 2299, 1085, -1424, -3652, -421, 1315, -92, 582, 1270, 1080, 241, -2119, 797, 2673, -1354, -1475, 1581, 2242, 373, -3199, 3221, 1487, -1720, -1064, 463, 344, -2005, -3215, 869, 2104, 73, -1840, 598, 1781, -398, -3670, 173, 1547, -1837, -1921, 2799, 2277, 1036, -2746, 2654, 583, -1966, -1440, 1050, 3245, 1094, -2865, 2701, 2277, -88, 122, 866, 1652, -500, -2031, 978, 1602, 855, -1257, 2505]
2229B505q65k138l15K303k63k012Q90P42K499n238N09K249J924l791K8K847O22
2246B496m023L6J630K039l615J677k452L352k113j159M286q19k254L90N85L593
2262C649n209j201K642J988j989j482P85K201k369j060L231K611m294R7J002M4
2278F46L95j330J512K395n495J561K804r95j721j81J414j950M38k626L853J795
2294B515j593j587L161l336L8n43L798p46k537R68N59J671l747j918N205m31j759
2311b82j063L068K08n42j445R2K059l492o8K743R02l261j222K386K92M55m195
2328c365L590K373l114m72K539j420l45j160L283R96k771k51K310j217o59m0K56
2345E33K306l520m15J965J597m405j11L436O17l578p98K758K053k358q79K047
$$ y = [2505, 1640, -498, -813, 1490, 1227, -785, 105, 847, 3346, -1892, -1383, 866, 2790, -1001, -973, 1874, 2496, -1527, -1491, 139, 2178, -1437, 240, -2212, 1140, -973, -2132, 2154, 1335, -919, -529, 56, 3649, -1560, -2761, -119, 1869, -120, -1602, -817, 1384, -985, -2045, 1186, 3797, -497, -400, 602, 646, 1041, -289, 1223, 3618, -1877, -316, 2488, 1493, -228, -409, 1005, -945, -507, -3133, 720, 2515, 922, -665, 2496, -840, -802, -1345, 2453, 1707, -830, 138, 697, 2368, -1379, -3297, 1908, 1477, -282, -1345, 1723, 1931, 1389, -56, 36, 2095, -1397, -1465, 1278, 2180, -1081, -2303, 83, 375, 830, -3365, 225, 2598, -516, -988, 1551, 131, -214, -1374, 1909, 2905, 134, -117, 2193, 976, 317, 277, 533, 2839, -681, -1096, 869, 2466, -1939, -2050, 1386, 2003, -1575, -2373, 385, 2438, 80, -799, 1248]
2361A248K069n081K07J186M09n55k99K826l120J788p96K09J872k968m42L796j925
2378D24m71P8L24O07q91Q98o56Q36l06q25J7J531j030j825J371L48q69r11K280
2397I30J291k820l44J497J322k657l96J361j14j541P67r5K028j953L79J320O29
2414A604k588P20k96O94j65j186J518J637k167j054J936L60j823R16J764N81l610
2431a159O5N48n62J514k052L150j599R60k491N041j778r38k211O01K927k262l9
2448b85o95K459j553j211J892p8m5p66O6K720k325j013j5J417r88r04J374J247
2466A297j708n77J636j33l15m70M48J48m54K19p78J226k987J830J946p6k98j559
2484f05J494N25k133l61N35J680k770L029j210J210k451j094L000Q41j162j169
$$ y = [1248, 3317, -1764, -1557, -371, 38, -517, -816, 2010, -1110, 678, -118, 91, 1963, -1005, -1447, 2349, 424, -47, 31, 355, 962, 71, 969, 313, 1149, 843, 18, 35, 1566, 536, -1289, 82, 430, -439, -1350, 930, 2221, -599, -943, 554, 1876, -781, -1177, 184, 70, -1471, -704, -799, 1229, -724, -345, 975, 1604, -984, -264, -560, 134, -31, -1217, 301, 1938, -229, -1283, 653, 1013, -810, 106, 1870, 2451, -1159, -1094, -546, -1108, 406, -1646, 1504, -95, 865, -1626, 3415, 1637, 699, -1512, -911, 2016, -246, -285, -980, 1479, -74, -1285, 607, 529, 484, -282, -216, 2504, 179, -834, -849, 568, -420, -1324, 50, 1297, -411, -988, 648, 515, 200, -270, 178, 326, -128, 91, -687, 539, -2448, -618, 1328, 1252, 954, -605, 889, 1414, -719, -1080, -545, 1135, -1635, 1394, 184, 1394, -1057, -2151, 849, 1690, 528, -641]
2500f41J378J127j947j02P85J033j343j702K190J635j867r01J98J892o49j731
2516f45L460k547n86m66L66R82j92j664J380J25P96k572L121p73q42N63L45j909
2534a058J41P4J505k38j522R55K76J302r10l2p55N04q8k21O74o13q35j085L20
2553a606K023n34q59L157j261n13m56q81R99m1P29j158K062j618p40R62N58j981
2571a158p57J443J431q3j462j083L125q66O67j464L57J76j527K529j234J395j915
2588d26J712o95k89j397K172q18M72r89k18J137j298J952k582K899p16j380P08
2605B44k199K710l470K096J405j330K95P57k11P50j243N03P2l3N45m97n5n10J854
2624A683k060j26j531R29J539K94m82J108m83J469k314M90Q38k661K533m505L576
$$ y = [-641, 737, 1864, -83, -185, 600, 1633, 290, -1412, 778, 2413, 546, -355, -157, 1735, 1086, -645, 2815, 268, -318, -784, -418, 564, 372, -1292, 88, 213, 1009, -1563, 1558, 785, -57, 506, 851, -1058, -917, -843, 662, 424, -1098, -143, 133, 1435, 525, 493, -262, 242, 154, -67, 607, -6, -841, -1926, -1606, 417, -117, -976, 2181, 920, 407, -49, -930, 69, 28, 757, -401, 1661, 43, -697, 265, 823, -1158, -1915, -472, 959, 876, -586, -1669, 1456, 590, 1257, -207, 150, 326, -1201, 1328, 94, 1489, -426, 1286, 591, 302, -1095, 1077, 259, 731, -258, -476, 661, -637, 1315, -1267, 1632, 916, -464, 244, -1955, 755, -2715, -619, 786, -544, -249, 508, 297, 1047, -196, 307, 379, 346, 891, 394, 339, -171, 1683, -377, -503, -2034, -1105, 434, 728, 246, 1354, 871, 2340, 26, 516, 1354, -1307, 1226, -3279, 297]
2641B97P54j677o79J032J290j669k11L805k587R37p06k24j256l09l38J871j061
2658g31L95j567L205j804j699l95L499L14n92o10j604K570o7j438L930l47l365
2675c06Q55N06m26r65n52n23p1J223j052J073j259J019M91k38J336q97R05j389
2693b70N42J264k062K15J49k23J848j112o60N01q74p17K836j755j157J839j24
2710B40n65j28K541k574k37R35j569K058k577K360k47K185k321o65J295n0p90
2727a09J281j024q00M80p37J794j579J290J350k360K228r67r09n5K019m283J647
2744g34K954m99k882J894O4k440K431k924J817M92J555j539K36k45P94q56J72
2761B90J261j949N41j861O54K297k486L414j305k330M145l314n75n48L405j663
$$ y = [297, 1051, -626, -1305, -273, 1017, -652, -863, 2942, 355, 1292, 586, 362, -894, -1203, -1541, 330, -731, -336, -1903, 1302, -502, -2201, -2596, 903, 1217, 625, 15, -1589, 981, 914, -524, 3406, 3059, -306, 549, 1055, 629, -336, -888, -1411, -1482, -259, -1311, -238, -1497, -478, 13, -225, 1111, 214, 1119, -270, 272, 1536, -526, -311, -162, -385, 1463, 351, -309, 192, -682, -1399, 1437, -318, -1475, 364, 240, -325, -453, 2088, -486, -723, 212, -1357, 701, -1876, 484, 237, 2422, 101, -564, 731, 681, -109, 1172, 148, -652, -172, -909, 885, -694, 596, 1946, -414, 1814, 847, -62, -117, 1902, -2381, -734, 2220, 1721, -1161, 733, 797, -1643, 788, -2136, -319, 173, 1728, 189, 425, 180, 974, 118, 290, 1551, -398, 143, -1718, -1064, 1233, -1253, 2161, 856, -1474, 2671, -643, -1218, -1766, 1639, -24]
2777b4O40q63J314J153k212p60r91K878j632m38L355k633J9J49k81j107n7K344
2795H54M22j117K92j699k41O35J481k422J646J384j425p15J254j163K251Oj742
2812b99n48M66J370j282J424J91l169K676p92j16P78n54K645k319l4j735k80J348
2830b30J191j95J44p45n14J944j220K54n56J627j210m73m96nK501j237j22j243
2848e85J734o79p68J242j354R97r5j180J162n65j060J340M87K767m067Q86R6r54
2866e96J427j498K170k066M81K92J660l324J683J060j957J429k39j589J288K3
2882B44j389O87J729j702K66J20PN79n21O27P18k223M376k28o38j722k691m61
2900b222L142m74k404K131q60K46N1q30L449j281M62k524o21R66L60N89J174m55
$$ y = [-24, 616, -247, 1067, 2220, 8, -752, -1743, 1135, -497, -935, 2420, -213, -194, -45, -326, -1433, -1490, 854, 1276, 159, 451, -1248, -1489, -854, 627, -1795, -149, 1235, -190, -905, 349, -814, 1437, 1443, -299, -847, -381, 989, -293, 1131, 1322, -1847, 829, 37, -79, 699, 145, 2790, 471, 437, -1298, -1578, -230, 961, 766, 910, 165, -349, 1595, 375, 629, 73, 1700, 490, 17, -479, -484, 2017, 780, 658, -585, 1149, 470, -298, 944, -410, 587, 492, -688, 474, -91, -1151, 189, 676, 3443, -624, 262, 358, -596, 831, -667, 1503, -563, -82, 210, 1870, -1454, 229, 1289, -668, 761, 522, -1067, 221, 244, -1145, -458, 1271, -431, -165, -45, -38, 541, 20, 647, 1365, -858, 3518, 3290, 2652, 930, -1761, -2222, 920, 446, -1958, 173, -687, -441, -390, -1220, 2229, 948, 1410, -1114, -1735, -769, -409, 180, 1354, 899]
2918H99j268M75L50r49O01J137j682K448k806K121k169Q81N33j66j86j456J240
2935Cj772J489M60k07K343l248R46R85Nk29j707L80Q91m06o49k62J655J74j173
2954c22J664o59n29o13j93K6J50J306J012r47p28m42r79J271o52N12J934j760
2972E1k30J261J07j252q04L542k840R71q37J381m44m55J93L07j380L87M39L3J204
2991A634j407K52K912k503o37n8j608J354L61j464J939n15j194J233r10N08l41
3008d44J266M46o40J45j216N07l76J970k321J178P73r35K05o70P53J15j315k33
3026g92j08P41L36p18J145M7L52j424m74K391j779Q79j36J38j324P88n56M06J474
3045A386j815j653J872R80j59j258Q82k109K329r36j32K532k371K308j674p3k008
$$ y = [899, -369, 106, 456, -493, 108, 1245, -437, 2011, -795, 1326, -843, 38, 571, 405, 219, -1237, 3, -1769, -280, 180, -27, 2316, -932, 14, 999, 1004, 775, -932, -552, 339, -67, -716, -978, 677, 851, -322, 1342, 683, 154, -459, -652, -626, -476, 830, 1842, 895, 167, -275, -1254, 17, -635, -123, 1811, 51, -179, 1082, 1189, -63, -867, 2675, -165, 806, -31, 1350, 906, 451, 644, 951, -429, -42, 397, 430, 1634, 227, 479, 3391, 888, 251, 193, -1415, -61, 300, -1164, 775, 260, -934, 299, -611, -103, -444, 822, 1268, 628, 773, -443, 64, -312, 1658, -663, 515, 1288, 353, 558, -112, 641, 756, -559, -792, -900, -159, 177, -541, 604, 651, 1003, -421, -895, 1496, -283, 596, 460, 598, -726, 62, -494, -88, 1386, -429, -2082, -210, 770, 611, -647, 235, -1874, 455, -481, -613, 1919, -452, 1856, 182, 109, -1899]
3062a899K684J274j098j418O56k0j640K628J156l462J214k494K299J673n43R19
3078A929k762P62J325j473j168K702r82m55J324k863K439K6j789J522J147J31
3094A815k384J897k381Q52K7o12L1Q70Q59q65n70l34J303k214Q00m12M22K342
3112A446j248j802J811l07J175j868J457P82k294Q07K274j561j316J851j251k997
3128c041L693j614K00M51q01J216j588K494j458r99K337o59j220J110q19P34J863
3145A899k254P3N93P33k504k6J90J056J903q41M1o51J476K2k144M17k60M36p87
3164f28m31j36L362l203J165k34O27L70j036j60j356K746q24R26l16P21j615Q26
3182H04j88K65j24R60l251J238M72j774K125K20k133L061j356J608k245j885O42
$$ y = [-1899, 785, 2059, 961, -457, 199, 179, -1461, 1167, 2323, -1139, 75, -2419, -120, 1553, 1010, 1929, -833, -71, 1254, -219, -1387, 1315, 333, -122, 1202, -1661, 778, 804, -985, 537, 1684, 1815, -569, 1328, -1053, -201, -174, -786, -755, 115, 974, 109, -461, -795, 508, -1706, -906, -1318, -896, 1446, 198, -1604, 207, -100, 1075, -793, 664, 1446, -848, -41, 2233, 672, -644, 1207, -44, -3041, 652, -962, -762, -311, -1112, 104, -1484, 1010, -448, -1447, 890, 231, -989, 121, -698, 36, 1899, -355, -282, 311, 1044, -1460, -1486, -1296, -240, 1663, 822, 863, 212, 1688, 1710, -434, -17, -277, 159, -628, -1059, -1195, 2167, -1036, 129, -105, 522, 892, -144, -304, -1660, 1086, 262, 1188, 872, 1593, -22, 804, 616, 881, 757, 1717, -1534, -296, 176, -1598, 527, 747, -1386, 1675, 319, 1927, -318, -2203, -1561]
3199a561J075Q84n6k82J69Q15j389P2n06J314r13p86J691J658r42j620r47J501
3217A77l036K163j005L023j369K275o19n52j028m13K938k971Q02j56j298K013
3233I44L46k544J193k041K675j504J817q03Q51K04j839J434j272q84N21K175j521
3250b48lm32J118l86J995k767J37K42j059P34N90j762J360J802j984M43j342K71
3268a291J944j161L96m57J0N16j720L115j881J931o27m26N11p32J114l57p29L82
3286E38J038k024j80J910j855m57O38R67O06q63L76l74j799M91R73J521L26j816
3304A6K004j777k45m03Q97J023j71Q41k338L48j280J966k89L51m8j915J700N25
3322A205j833J174k0j668J414O76m22Q02j531J015J266k789p32K496N24k204J175
$$ y = [-1561, -486, 398, 342, 60, 229, 1044, -345, -273, -779, 535, -378, -1164, 527, 2185, 1243, -377, -1324, 177, -2859, -696, -1701, 1322, -47, 2228, 1609, 1057, 29, -384, 2554, -417, 385, 229, -1069, 944, 1290, -1254, -61, -2102, 573, -931, 886, 83, 934, 1138, -701, 733, -539, -1423, -902, 1273, -248, -251, -683, 435, 49, 2044, -723, -586, -344, -1403, -669, -79, -1841, -481, 1321, -663, -220, -1562, -1291, 653, -508, -112, -569, -559, -43, -1763, 1352, -529, 1402, 775, 349, 860, 128, 1242, 885, 156, 538, 1576, -448, -628, 1282, -573, -1030, -392, 575, 1181, 318, 694, 320, -1479, -988, -15, 1506, 1832, 16, 2020, 243, -2, -405, 492, 1515, 1344, 2185, -153, 195, -1085, 881, 592, 943, 895, -1020, 680, 1205, -628, 546, 526, -1142, 272, 948, 526, 1328, -203, 812, 2078, -711, -1443, 1053, 1577, -627, 548]
3339E48K58J8k453L42j21J298J80O53j20k119J222J161R76r19o06r1J233l276
3357a816J902j944K067l38J351j136J248j612q38J418K162l388m34N0Q26J549
3373A067p15j058K438q45j742O21r65K90J856j340K001j107k475K223n0n07j79
3390d87R12j115q70R93J302p1j304N86o23M86k855L142j896L639M07j877J59p98
3408b70M07L2J070n95j095k13Q44O71j975P89K810l128N99m06J16M66j369q63
3426b110K170m73J150n07J029j964m13J416j449M67J03P18j065NL319l838K680
3443A238J96l639J119J328J73j276J739o34J770m01j98j334p21J86k75J244m75
3460D0l91J857j882N64K909l813J747N47K85O97l111O95K91j11j184K28O20J994
$$ y = [548, 806, 824, -1629, -1287, -1408, -110, 70, 723, 603, -1516, -294, 867, 1843, 924, 318, 227, 1460, -1816, 86, -1858, 209, -129, 1222, 86, 1334, -278, -1116, 302, 2464, -924, -1358, -1308, -482, 1067, 352, -706, 1732, 887, -855, -234, -1199, -909, 947, -393, 1608, 501, -1974, 249, 199, -308, -487, 425, -690, -1560, -567, 735, 664, -640, -54, -677, -191, -3046, 96, -1800, 1839, 2246, 369, 528, -270, 137, 169, 1239, 644, -451, -664, 180, 851, -1124, -335, 2475, -653, -54, -460, -344, 122, -1247, -2110, 60, -413, 737, 230, 1259, -705, -1118, 298, -1151, -684, -581, 137, -928, -923, 2396, -1442, 1238, 1434, -2205, -1086, 242, 415, -861, 878, 244, 2014, 1613, 1415, 81, -640, -454, -729, 515, 40, -351, 1506, -376, 188, 3097, -716, 1031, 1578, 1863, 2560, -551, 144, 435, 324, -860, -632, -12, 1982]
3478A982j422p98j397R96J624r62l61r43J824o04J129j555k00Q22J01j108M258
3495C386j416j102j81n04q94K81Q18q92J502k765J162k92p64L183j421j242K503
3512A362O74j653o02J76j213j60J041Q2J94o33N34K443k752r29N94P64j256J540
3530B06o05M9J508k038L047l288K904k36q97l185J594K242o03k73j551J165l77
3547c38J874k055K643k245j233K033j113o24L940l901L792l462K046k809J595
3562A43o73R38j02p74P92k216J2K965j749j335m12J809Q96K95L37j412K525l621
3580a582M70J149p06P27q27J525l8j926J742k194K07K971l06j079k40j084P80
3597d11J685j970J271j897K276q79p88J514m27J139j684M77j723J589j153K359
$$ y = [1982, 560, -238, -1635, -639, 985, 23, -338, -1281, 543, -61, 1068, -487, -687, 135, 236, -872, 3386, 1970, 868, 687, 183, -711, -430, 388, -504, 998, -1767, -605, -897, -1661, 1522, 101, -1141, 1362, 2036, 383, -219, -43, -1256, -1416, -375, -293, -99, -732, -198, 2245, -507, -1436, -842, -78, -1334, 206, -399, -350, 1158, -880, 2167, -1121, 1783, 1547, 650, -2535, -941, 1301, 698, 425, -1126, 39, -338, 1536, -519, 2124, -121, -1354, 679, -434, -1058, 2882, -1019, 2773, -689, 1357, -1452, 143, -530, 408, 306, -468, 324, -1892, -1880, 1085, -664, -1999, -2411, -602, 294, 589, 926, -486, 2039, -1582, -1112, 37, -669, 58, -769, 756, 718, -1208, 534, -1660, -1453, 1518, 1212, 133, -107, -1191, -411, 1274, -696, 575, -1322, 954, 75, -713, 801, 374, 1513, -171, 306, -1417, 172, -981, 1378]
3613A378j107k508K061p82l73n2M564j571k482P1J292Q21k567J659k105K847m473
3630c327L441j567j10M38K936n0k716J558k731J288j472K442J006j780J286K99
3646I41l14K2j818K712l650N14L714j553n20j816L653k559K361j99j720P74o66
3663a24M60P02j201P57p16J489k892L200j400j228m7J168J962j282j930J278L93
3680E89j234K110j809K273q25k698j22L981k747J356j20J968k757O63k488P35
3696a125k6L383j191J918q66n398M707k707K321l54m37J093M1k93j845L05J353
3713H79k093K543j112j82J763l582L312k189K290O33j652m72M35O39n55r99k78
3730f20J941l95q97J349l171J828m55Q53r16K164j27j260P13j49k89q11M37K93
$$ y = [1378, 271, -2237, -176, -958, -1331, -1383, 3181, 1610, -872, -801, 491, 1312, -1255, 404, -1701, 1146, -3327, 114, -1453, -1563, -1125, 1811, 1761, -955, 603, -2128, -840, -2312, 130, 1136, -644, 642, 941, 627, 649, -1169, 1543, -2107, -1593, 2121, 568, 48, -1768, 1885, -674, 1687, 1488, -232, 542, -124, 336, 1038, -163, 594, -122, 1367, -1525, 1675, 275, -953, -1000, 168, 2130, 848, -1082, 196, 589, -645, 1465, -344, 1929, 1104, -1594, -1716, 2265, -482, 874, 754, 2722, -35, 628, -1860, -1125, -1151, 2232, 1041, 2959, 2093, -3305, 1402, -1305, 1016, 662, 225, 1318, 1359, 1066, -779, -474, 879, -1214, 1329, 217, 35, 1798, -1784, 1528, -661, 1629, 2262, 610, 138, 573, 1212, 657, -342, -620, 1321, 926, 29, 1378, -1793, 35, -420, 433, -483, 1681, 1554, 294, 1007, 858, 569, -242, 195, 488]
3748D88j890K035j429J448r73J207j181Q22K07K48k700M312l340Q58M60M55r04
3765A23N03k396L95K097q77k96J228J064k998M28J326Kr4o65J084J078l014Q88
3783a24J14J719j338j348P40K225k903J261j049J736L22j279k485L313J260j723
3799D41j833j554J026L340r43K358k711P46M2n17p99P59j048O83K72J788q72j376
3817a98K114k390M03N70j63p77j5J863j075k132K204N46m69j691J464J408j850
3834a88K512J665l920o66P4R86K247j946o40N5o92j814K942o31R91j619L222l671
3852a093M00L67Q17m90J130q99r19J137j785O43j052J623n59J389k63L73r37q14
3870i32p06K309N71j062j399P26J031Q14l90r44J090j627j041J810k391K667J070
$$ y = [488, -1402, 633, -796, 652, -321, 886, -295, 527, 734, 982, -1718, 2594, -746, 112, 572, 1027, 123, 626, -1770, -1375, 722, -155, -451, 777, 1841, -1157, -729, 597, 599, 505, -160, 924, 2002, -1012, -124, -10, 1709, 371, -977, -237, 1988, -915, 346, -703, 1033, 1355, 76, -2409, 904, 2164, 441, -1392, -2946, -1920, 1420, 477, 2835, 124, 870, 912, 395, -404, 355, -693, -10, 262, 2050, 1178, -198, 1916, -474, -71, 499, 336, -441, -456, 1407, 332, -1800, 404, 950, 481, -1210, 254, 1662, -188, 2324, 3989, 69, -597, -523, 463, 2710, 764, 124, 179, -513, -2327, 615, -16, 975, -644, 2578, -1093, -693, -326, 491, 1, 1131, 232, -687, 450, -1335, -692, -1744, -121, -680, 709, 446, 819, -118, -932, -1638, 671, 1242, 180, -1219, -493, 538, 1352, 962, 18, 1108, -519, -1560, 250, -2141, 526, 1596]
3887A596j734n4j37Q61j24j968R53O16L77j624J222K137k289J078j379O03P91
3904I25j209M61j062L081k670J895K24l662K210J134j650n37Q40J490l45p10k35
3921A80J146k700J491K40j6p7m51J125j470p58N4L641l475K025m97o38K36L5O89
3940G80j292P55Q48m83k011J717l86O52J14M69j383N21P49J867k611Q6j052L23
3958c37j77q83J754N52k224o45K823J088r90j528P99O23J55j610J267k555J382
3975e06L30J180J599k174j073j329J376M46J907k66j468M47l34K022k923k36J555
3992E53l01K8j630J187J03J35p92L20P40j253r2J630m78J635k404J611j842P68
4010h2r14J613J352l616J541Q25Q24J628m76k613k94p1k4J157k601L138j596J253
$$ y = [1596, -138, -192, -329, 532, 408, -1560, -607, 9, 386, -1238, -16, 2121, -168, 910, -469, 134, 925, -284, 177, -885, 2196, -474, 1421, 1645, -2017, 193, 1327, -323, -860, -20, 1470, 1125, 415, 180, 1326, -1374, 117, 357, 341, 264, -187, 938, -532, -1290, -1236, 2405, -1070, 955, 458, -180, 56, 91, 780, -512, 243, 1091, 608, -1403, 314, -72, 580, 694, 1163, -220, 301, 1050, 2917, 306, 392, -660, -337, -514, -1397, 357, 909, -1315, -1960, 863, 1951, 961, -567, 232, 855, 1010, -600, 667, -1888, -506, -176, 1004, 2603, 429, -644, -1973, -597, -151, 1756, 1490, 22, 469, 135, 2157, -766, -1002, 553, 252, 280, -1350, -163, -60, 75, -717, -397, 343, -910, -1002, 628, 150, 1785, -619, 992, -850, -82, -996, 617, 1969, -1647, -106, 719, 1543, 3171, 2695, 82, -212, -283, -307, 850, -1751, 1387, -209, 1044]
4028A044Q49k745k70O36j12O61j645J317O22j803J876J48k112K437j074P4m77
4045e74J47j574L607j132P26j639j06J043M69r52J417j633j040J403K33J456j698
4062A53p46n00N44J71K711k016o53R01j574L66R34N32k979K145l44j750J412O9
4080f24M24J344j548k94l8J730k287J0J345j711J496J630j07r73l42O26j459J338
4098E60J278k660K66J589j748J598j785J477n70m57n46K259J313o97j277j220
4114f20P63j518o2q21J624N07R75k30j151R35k182K043J320m37q39j219L053j497
4132F44r56J051O16k251K16J077j151N44k98J236j90R55j729J30J854l93k876
4149a521Q9K635k013N74N84L51QR79k461O51J441q76K91j955K615j759M2N17j498
$$ y = [1044, 1893, -852, -1122, -486, -598, 63, -1582, -265, 357, -1446, 430, 578, -1534, 903, -171, -97, -574, -427, -2001, 1606, 474, 1200, -439, -545, 498, 967, 15, 1432, -201, -1241, 162, 395, 1851, 153, -593, -1093, -549, -378, 2333, 317, -336, 565, -1009, -643, 291, 823, -2156, -11, -355, -2105, -693, -624, -200, 1144, -404, -698, -736, 994, -1293, -1283, 62, -1649, -153, 1477, 1370, 397, 55, 681, -778, 560, 1838, -822, -556, 1033, -715, 883, -902, 575, 5, -452, -998, 1261, 2574, 1877, 600, -620, 143, -1375, -1437, -2258, -634, -127, 848, 618, -533, 402, -1780, 263, 1583, 1146, 307, -912, 2141, 644, -312, 739, 1355, -896, -680, 397, -754, -210, -508, 728, 538, 1493, -236, -106, 1748, 1355, -1521, -1432, 1203, -810, -236, 348, 699, 707, 1686, -775, -124, 1317, 441, 732, -1223, 1392, -367, -325, 192, -1306]
4168a306L749l112o7J063j744j04J716K018k022m31k28J292R91k470J119L6P54
4185A254k571J747J032j404O06M64k563L054j683J281j584o00N78p93P80n92L27
4202f67J163p71J374m97m76P3n85K143k497O31N29J190k794N77K201L48l98j651
4220a07p09K246j814J304l29p34J633k378J710J183k277j24Q88q37r96J687M29
4237G75j60j047L8j526K505m97l09Q28j363R35M91j211j20R7o68j85L959k274
4255B68l81N67k285N09M13p57R16l07r45Q99J868j21j338k136K972J129k300P14
4273c15J431k418J297J106j28r79Q4O79k446J718j270l28K018r10J308r25j556
4290a634K046l59M17p43p45K584N84m062R23m73J035K252j391k56p67J108P42
$$ y = [-1306, 2443, -669, -736, 327, -1417, -1521, 195, 2213, 191, -240, -468, 824, 1815, -655, 464, 500, 1254, -1317, 430, 1462, 58, 664, 1128, -1435, 1619, -64, 1217, -367, -967, -389, -1182, -402, -994, -667, 496, -275, 1099, 602, 126, 199, -386, 1757, -740, -109, 420, 1610, -1184, -607, 1594, 1942, 1544, -107, -816, 1430, -384, 920, 591, -143, 1490, -888, 822, 2005, -272, -396, 492, -345, -1341, 346, 775, 615, -432, -394, -1920, 585, 88, -221, 607, -756, 179, 670, -541, -661, -564, -1232, -1417, 2542, 268, -113, 454, -1831, -1322, -909, -1666, -750, -1057, -2002, -1103, 765, 644, -694, -2830, 142, 1271, -1029, -315, 1116, -1302, -5, 1101, 973, -6, 78, 757, -1689, 29, -1241, -1569, 449, -461, 847, -78, -1634, 412, 53, 470, -273, -1018, 1566, 2150, -1912, -989, -1462, -427, 1825, 434, 178, -589, 519, 1261]
4307A261j441j587K288O58n54L77J90O45k932M37J761k050K065k03k07K86n54
4324D40O06k250J449M13L90l94p84r5L40K4J09l21k92p48L143l118L41J652m13
4343D92j416o57J753M5P63j424j71q78R67j761K370j190L057k245J02J72J288
4360A267j848K313l319J482q20N76n44Q07O42j437K414k679K024k012K097K72
4376A235j435k09l92O91M16J600j304K81Q48l569K166qp96O7q62n92J845j091
4394a109P53K264k692K349j284j361J210l75K128o4k838J982N67k599N07q34K4
4411a372R10l74M71Q7pj590K116J551j752k195J328P67j589J238J507j787R10
4428B19j443Q28J545j085R05k85q39l4P0q38K507j806P00R14R5m71l142L099j137
$$ y = [1261, -180, -1767, 521, 1179, 625, 1002, 1192, 1837, -1095, -658, 1103, -947, 1118, 915, 708, 994, 440, 1046, -1204, 245, 658, 1048, 654, -130, -225, 115, 139, 248, -73, -365, -1113, 2030, -1088, -747, 905, 492, -924, -1581, 172, 217, 980, -444, -615, -1493, -526, -2287, 83, -1107, 1950, -295, -193, -21, 1267, -581, 1732, -1587, -105, -925, -349, -893, -86, 556, -881, 1533, -1146, 878, -1134, 963, 1235, -200, -409, -801, -110, 306, 1906, 602, 883, 1731, -1838, 328, 320, -476, -409, -1271, -1863, -18, -1109, -356, 1908, -784, 1565, 281, -1080, 130, -245, 1883, 1819, -1019, 963, 1530, -1069, -562, -1396, -1372, -462, -836, -365, -278, -285, -1875, 241, 1792, 40, -2155, -827, -60, -1649, -411, 1096, -691, 219, -1224, -396, 1149, 64, 969, 684, -155, -189, -119, -957, 1550, -256, 444, 1358, 1453, 982, -2160, 939, -198]
4447a98l177J974K344k164Q65j344O24K64K95J805j919J321j803N7O73M47M88
4464E52j558L50j624K317r05J742p37N66n58j2j318J373n03R49P78n11k122J633
4482D12q69r45J998Q22j177J54r66j4M64o84J775j523J408R1j277Q07K69p94J828
4501A779k858J919o48r63P79K4J83N12j05o57k76N36k32K12k4q37k87R11j0m65
4521e07J34K0r25K458P76k970J920l15J274n00o29n42J01M27j486J711r80k535
4539b568K014J81Q69Q75j218M15J093k15l352J041K868k456N83K47O50n6j080
4556a09N59k311L738r05j990L17J673l51J90j337m56j6J340r76K9P08J93Q33m42
4575F87j722J258m38J548j563q33O37J450p74l4l66K46p95O59N10j098j386K222
$$ y = [-198, -3375, -1401, 943, -1221, -356, -1700, -1076, -812, -517, 1288, -631, 690, -1113, -1056, -383, 64, 552, -1006, -656, -2280, 37, -868, 874, 137, 703, 145, 133, -1185, 188, -315, 634, 1412, 901, -1221, 412, -457, -1402, 596, 1418, 241, 395, -571, -585, -121, -805, 970, -553, 855, 946, -331, 476, 745, -49, 1779, -1079, 840, 192, -771, 8, 32, 215, 727, 622, -35, -311, 225, -7, 205, 181, -656, -943, -32, -42, -507, -373, -353, -1278, 1180, 1956, -1014, 906, 591, 1865, 1365, 736, 194, 295, 722, -764, 947, -33, -2568, -554, -373, 496, 1371, 153, 568, 1661, 1446, -1906, -865, 2003, -453, 130, 377, 1027, 971, -109, 450, -1861, 1877, 972, -1018, -701, 972, 621, 811, -526, -982, -998, 342, -634, -605, 103, 296, 1129, 687, -1035, 223, -215, 1333, -230, -1063, -426, 1024, 250, 216, -150, 96, -699, -40, 470, -628, -2014, 208]
4593B08n8Qk82j686K768Q76j175N08r37o06j949L71J508J57J235M87n73j109J157
4612I08j467L34K911k190N8o84l6J776j837r42K230j897J990j350P57Q62o91r02
4630a70R77k230K234P53j414J91k45p4J272k446K042l88j111P90o74O07q1l11
4648b78m81J445L8q71p93K757k575q89O38l31l15r73J619J366o57r0M74m94l73
$$ y = [208, 150, 158, -124, -1810, 958, 1834, 659, 1167, 230, -376, -2325, -1954, -446, -289, 946, 1433, 860, -249, 908, -559, -225, 2686, 496, 554, -130, -166, 1610, -227, -1169, 1061, -836, 1154, -196, 561, 1423, 732, -170, 807, -1423, 811, 1564, 150, 341, 96, 22, 1294, -1152, 890, 502, -609, 181, -493, 114, 33, -278, -759, 686, 724, -147, -940, 1817, -758, -1647, -1009, -1340, -1655, -2628, -1009, 357, -300, -390, 84, -410, -783]
$$ [...]
##END NTUPLES=NMR FID
##END=
