##TITLE=1H_SAM_3B.244
 CDCl3, 8 sc, 
 23.08.2021
##JCAMPDX= 6.0         $$ Bruker NMR JCAMP-DX V2.0
##DATA TYPE= NMR FID
##DATA CLASS= NTUPLES
##ORIGIN= UXNMR, Bruker Analytische Messtechnik GmbH
##OWNER= root
$$ XWIN-NMR		Version 3.5
$$ Mon Aug 23 12:31:46 2021 Russian Standard Time (UT+4h)  she@DPX200
##.OBSERVE FREQUENCY= 200.131506
##.OBSERVE NUCLEUS= ^1H
##.DELAY= (6, 6)
##.ACQUISITION MODE= SIMULTANEOUS
##.ACQUISITION SCHEME= undefined
##.AVERAGES= 8
##.DIGITISER RES= 18
##SPECTROMETER/DATA SYSTEM= spect
##.PULSE SEQUENCE= zg30
##.SOLVENT NAME= CDCl3
##.SHIFT REFERENCE= (INTERNAL, CDCl3, 0, 15.7039)
##AUDIT TRAIL= $$ (NUMBER, WHEN, WHO, WHERE, WHAT)
$$ ##TITLE= Audit trail, XWIN-NMR		Version 3.5
$$ ##JCAMPDX= 5.01
$$ ##ORIGIN= Bruker BioSpin GmbH
$$ ##OWNER= she
$$ F:/spectra/data/she/nmr/H-F/1/audita.txt
$$ ##AUDIT TRAIL=  $$ (NUMBER, WHEN, WHO, WHERE, WHAT)
(   1,<2021-08-23 12:30:33.84 +0400>,<she>,<DPX200>,
      <created by zg, POWCHK disabled, PULCHK disabled
       configuration hash MD5:
       00 E9 B6 7A A2 85 ED C7 34 08 36 98 17 FE 4E 26
       data hash MD5: 16K
       06 FA 40 DC 9A F5 6E A6 ED 7B 63 04 26 49 2B 0C>)
$$ ##END=
$$ 
$$ hash MD5
$$ 2F E0 24 C9 FF 34 AF EF 43 6B 84 67 C7 E1 21 F9
##$RELAX= 
##$RELAX= 
##$RELAX= 
##$RELAX= 
##$RELAX= 
##$RELAX= 
$$ Bruker specific parameters
$$ --------------------------
##$DU= <F:/spectra>
##$EXPNO= 1
##$NAME= <H-F>
##$PROCNO= 1
##$TYPE= <nmr>
##$USER= <she>
##$AMP= (0..31)
100 100 100 100 100 100 100 100 100 100 100 100 100 100 100 100 100 100 
100 100 100 100 100 100 100 100 100 100 100 100 100 100 
##$AQSEQ= 0
##$AQ_mod= 1
##$AUNM= <au_zg>
##$AUTOPOS= <>
##$BF1= 200.13
##$BF2= 200.13
##$BF3= 200.13
##$BF4= 200.13
##$BF5= 200.13
##$BF6= 200.13
##$BF7= 200.13
##$BF8= 200.13
##$BYTORDA= 1
##$CFDGTYP= 0
##$CFRGTYP= 5
##$CHEMSTR= <none>
##$CNST= (0..31)
1 1 145 1 1 1 1 1 1 1 1 1 1 1 1 1 1 1 1 1 1 1 1 1 1 1 1 1 1 1 1 1 
##$CPDPRG= <>
##$CPDPRG1= <>
##$CPDPRG2= <>
##$CPDPRG3= <>
##$CPDPRG4= <mlev>
##$CPDPRG5= <mlev>
##$CPDPRG6= <mlev>
##$CPDPRG7= <mlev>
##$CPDPRG8= <mlev>
##$CPDPRGB= <>
##$CPDPRGT= <>
##$D= (0..31)
0 1.2 0 0 0 0 0 0 0 0.06 0 0.03 0 0 0 0 0.0002 0 0 0 0 0 0 0 0 0 0 0 0 
0 0 0 
##$DATE= 1629707433
##$DBL= (0..7)
120 120 120 120 120 120 120 120 
##$DBP= (0..7)
150 150 150 150 150 150 150 150 
##$DBP07= 0
##$DBPNAM0= <>
##$DBPNAM1= <>
##$DBPNAM2= <>
##$DBPNAM3= <>
##$DBPNAM4= <>
##$DBPNAM5= <>
##$DBPNAM6= <>
##$DBPNAM7= <>
##$DBPOAL= (0..7)
0.5 0.5 0.5 0.5 0.5 0.5 0.5 0.5 
##$DBPOFFS= (0..7)
0 0 0 0 0 0 0 0 
##$DE= 6
##$DECBNUC= <off>
##$DECIM= 32
##$DECNUC= <off>
##$DECSTAT= 4
##$DIGMOD= 1
##$DIGTYP= 9
##$DL= (0..7)
0 120 120 120 120 120 120 120 
##$DP= (0..7)
150 150 150 150 150 150 150 150 
##$DP07= 0
##$DPNAME0= <>
##$DPNAME1= <>
##$DPNAME2= <>
##$DPNAME3= <>
##$DPNAME4= <>
##$DPNAME5= <>
##$DPNAME6= <>
##$DPNAME7= <>
##$DPOAL= (0..7)
0.5 0.5 0.5 0.5 0.5 0.5 0.5 0.5 
##$DPOFFS= (0..7)
0 0 0 0 0 0 0 0 
##$DQDMODE= 0
##$DR= 18
##$DS= 0
##$DSLIST= <SSSSSSSSSSSSSSS>
$$ [...]
##$SUBNAM2= <"">
##$SUBNAM3= <"">
##$SUBNAM4= <"">
##$SUBNAM5= <"">
##$SUBNAM6= <"">
##$SUBNAM7= <"">
##$SUBNAM8= <"">
##$SUBNAM9= <"">
##$SW= 20.0188882624521
##$SWIBOX= (0..15)
0 0 2 0 0 0 0 0 0 0 0 0 0 0 0 0 
##$SW_h= 4006.41025641026
##$TD= 16384
##$TD0= 1
##$TE= 0
##$TE2= 300
##$TE3= 300
##$TEG= 300
##$TL= (0..7)
0 120 120 120 120 120 120 120 
##$TP= (0..7)
150 150 150 150 150 150 150 150 
##$TP07= 0
##$TPNAME0= <>
##$TPNAME1= <>
##$TPNAME2= <>
##$TPNAME3= <>
##$TPNAME4= <>
##$TPNAME5= <>
##$TPNAME6= <>
##$TPNAME7= <>
##$TPOAL= (0..7)
0.5 0.5 0.5 0.5 0.5 0.5 0.5 0.5 
##$TPOFFS= (0..7)
0 0 0 0 0 0 0 0 
##$TUNHIN= 0
##$TUNHOUT= 0
##$TUNXOUT= 0
##$USERA1= <user>
##$USERA2= <user>
##$USERA3= <user>
##$USERA4= <user>
##$USERA5= <user>
##$V9= 5
##$VALIST= <valist>
##$VCLIST= <CCCCCCCCCCCCCCC>
##$VD= 0
##$VDLIST= <DDDDDDDDDDDDDDD>
##$VPLIST= <PPPPPPPPPPPPPPP>
##$VTLIST= <TTTTTTTTTTTTTTT>
##$WBST= 1024
##$WBSW= 4
##$XGAIN= (0..3)
0 0 0 0 
##$XL= 0
##$YL= 0
##$YMAX_a= 49542
##$YMIN_a= -52815
##$ZGOPTNS= <>
##$ZL1= 120
##$ZL2= 120
##$ZL3= 120
##$ZL4= 120
##$ABSF1= 10
##$ABSF2= 0
##$ABSG= 5
##$ABSL= 3
##$ALPHA= 0
##$AQORDER= 0
##$ASSFAC= 0
##$ASSFACI= 0
##$ASSFACX= 0
##$ASSWID= 0
##$AUNMP= <proc_1d>
##$AZFE= 0.1
##$AZFW= 0.1
##$BCFW= 1
##$BC_mod= 2
##$BYTORDP= 1
##$COROFFS= 0
##$CY= 11.3945322036743
##$DATMOD= 1
##$DC= 2
##$DFILT= <>
##$DTYPP= 0
##$F1P= 2.36226072786647
##$F2P= -0.459571619588291
##$FCOR= 0.5
##$FTSIZE= 0
##$FT_mod= 4
##$GAMMA= 1
##$GB= 0.15
##$INTBC= 1
##$INTSCL= 1
##$ISEN= 128
##$LB= 0.24
##$LEV0= 0
##$LPBIN= 0
##$MAXI= 10000
##$MC2= 0
##$MEAN= 0
##$ME_mod= 0
##$MI= 1.114404
##$NCOEF= 0
##$NC_proc= 0
##$NLEV= 6
##$NOISF1= 3.799351
##$NOISF2= 2.8
##$NSP= 1
##$NTH_PI= 0
##$NZP= 0
##$OFFSET= 15.70392
##$PC= 1
##$PHC0= -13369.28
##$PHC1= 29.801
##$PH_mod= 1
##$PKNL= yes
##$PPARMOD= 0
##$PSCAL= 0
##$PSIGN= 0
##$REVERSE= no
##$SF= 200.130013532006
##$SI= 16384
##$SIGF1= 3
##$SIGF2= 2
##$SINO= 400
##$SIOLD= 16384
##$SREGLST= <1H.CDCl3>
##$SSB= 0
##$STSI= 0
##$STSR= 0
##$SW_p= 3612.71676300578
##$SYMM= 0
##$S_DEV= 0
##$TDeff= 0
##$TDoff= 0
##$TI= <>
##$TILT= no
##$TM1= 0
##$TM2= 0
##$TOPLEV= 0
##$USERP1= <user>
##$USERP2= <user>
##$USERP3= <user>
##$USERP4= <user>
##$USERP5= <user>
##$WDW= 1
##$XDIM= 8192
##$YMAX_p= 0
##$YMIN_p= 0
$$ End of Bruker specific parameters
$$ ---------------------------------
##NTUPLES= NMR FID
##VAR_NAME=  TIME,          FID/REAL,        FID/IMAG
##SYMBOL=    X,             R,               I
##VAR_TYPE=  INDEPENDENT,   DEPENDENT,       DEPENDENT
##VAR_FORM=  AFFN,          ASDF,            ASDF
##VAR_DIM=   8192,          8192,            8192
##UNITS=     SECONDS,       ARBITRARY UNITS, ARBITRARY UNITS
##FACTOR=    0.0002496,     1,               1
##FIRST=     0,             0,               0
##LAST=      2.0444736,     0,               0
##MIN=       0,             -52815,          0
##MAX=       2.0444736,     49542,           0
$$ Real data points
##PAGE= N=1
##DATA TABLE= (X++(R..R)), XYDATA
$$ [...]
2137fj71l5K92o4P8m4j19j41J84J8j07J83K1j23k24K94j58K40P4r8r6N7J66O3
2161B84k40P3l03J06J87l03J83L98n82L79j33O5j48k7L1O9k46K3J81r6J98l7m4
2184A8j51K21kJ72o16L24N4k2j08K11j86J74k9l12M74l20J08j93P6J21k33M43
2206B24j18k55J11kj95L37q9J65k24J78j42J30k73J09jj57J19N12l96j73J81K0
2228F1k06K62J2l22M8R7J63k44L38j15L4k58J05k95K81n7J18j04J44j22j46L31
2250A25q9Qk41J33r3L98k05P9k2k70J54J06o7k2j00K17P3j95Np2K79l04J48l72
2274c27L32m2k58L71j41O8j01P8j33M60j38j64Q7O5k57N1J14N4k26J88r8K25l35
2297a27J85o5oq6O5J96q6p3Q3o5J79j87P7j18q5M8J29r9J36l00M1L29k06J39j75
$$ plain form
2137 -6 -177 -212 80 16 94 50 -69 -210 -26 -8 -115 68 89 -34 -258 36 -122 118 192 94 -2 55 221 284
2161 284 44 117 -186 -80 107 -196 -13 385 -197 182 49 114 -34 -61 -30 39 -207 -184 -3 -99 99 62 18
2184 18 -133 88 86 258 -358 -34 20 -2 -110 101 -85 89 60 -252 222 -98 10 -183 -107 14 -219 224
2206 224 106 -149 -38 -40 -235 102 13 178 -46 132 -10 120 -153 -44 -45 -202 -83 429 33 -140 41 61
2228 61 -145 117 129 -193 -145 -48 115 -129 209 94 128 -130 -25 -320 -39 -96 22 -82 62 -60 -206 125
2250 125 36 44 -197 -64 -157 241 36 115 93 -177 -23 83 16 -6 -106 111 184 -11 -6 -78 201 -103 45 -327
2274 -327 5 -37 -295 76 -65 3 -98 -20 -153 307 169 5 92 157 -100 -49 65 119 -107 81 -17 208 -127
2297 -127 58 -7 -13 -99 -34 162 76 3 86 21 200 13 90 -28 -113 -65 64 -35 101 -199 -158 171 -35 104 -71
2322g1M36k16r3m8j98M10q5k62p1J59J74QJ5j97J13r6J26l76J69mJ58j74J03J39
2346A19j10o1N7L4J31j04j61m7J03Q4m9J42k20K36p2q7p5K9M5k49J08J70p6K4
2370b9Q7k22j3J15J90k90M16l36K42n2M0k58J85j52J24k28J86Q5q2J17j76j24
2392a75L14k40j33M20l79K59j59Q8J0K7J6n0J06j83L58k69J37j56K33q1k19J91
2414A15k06n3K42J15j72O4j20J83l1j40M1k9p8J71l02J05m6P3j6L30l91l7K15
2437C3qM2j54J99J6Ol04J35L7j06K89l8m62L41J97j46R7k44j04J69m1k37K56j40
2461a67K97j48J45o8j15j3j09M54j36k80L8O1j6L22l23J2m3K36n0j11L6P5k1Q1
2485A57l17J59J44l72J75q0L19j06k5j64MjK22Q4j32j17k0k4L2J7j21J24R6J62
$$ plain form
2322 -71 365 149 56 8 -190 220 135 -127 -198 -39 135 143 158 -39 74 -22 104 -272 -103 -107 51 -123 -20 119
2346 119 9 -52 5 39 170 66 -95 -142 -39 45 -4 138 -82 154 82 -5 -80 -51 -6 -255 -147 23 -53 -29
2370 -29 58 -164 -177 -62 128 -162 254 -82 160 108 148 -110 75 -77 47 -181 5 90 8 125 -51 -175
2392 -175 139 -101 -234 186 -193 66 -93 -5 5 32 48 -2 104 -79 279 10 147 -9 224 143 -76 115
2414 115 -91 -144 98 213 41 105 -15 168 137 -3 38 9 -69 102 -200 -95 -141 -68 -84 246 -145 -182 33
2437 33 25 67 -87 112 128 134 -170 -35 2 -104 185 147 -315 26 223 77 174 -70 -174 -5 -46 -283 -27 -167
2461 -167 130 -18 127 59 -56 -69 -178 276 140 -140 -102 -41 -57 265 -58 -46 -89 147 97 -14 22 97 76 157
2485 157 -160 -1 143 -229 -54 -134 185 79 54 -110 -106 -107 115 199 67 -50 -70 -94 -62 -45 -166 -42 54 216
2509B16m41M70l74K67k00K27k7k93K57k40lj05P9o8M98l66K71j0j78k7o3K1KJ96
2533A09j0jk3k33J24j05J83J27k84o1J3k0K4J58L39n09Q8J55r8k6j05J41J01p9
2557Hn2K06j19j35L8K02m4j40J70L0j21lk8O0j71J87j37J28j19k75L77n1K5L4
2581G0j46mo7n3K86j76L11l33J38J08j44n7J25J40J07m58nJ99K6J96j40k62J81
2604D2j82K89j21n8J77rM5l06L32p83O47M28r98P08L20m76k60K81o68J425n64
2625B69j82m76L05j32K3O2j14K7J30j38j47K07k30N38Q5n52m8J082k070J291p53
2646h23R22M66j005N93j14j76j54K04j70K77J93j64K0mJ0J14R3k12k12J16R7j96
2668a25Q6r6J1J39O3P7o0r0k1J06j26j30L56l34M9K18K75n20o6J48J80M8n0j65
$$ plain form
2509 216 -225 245 -129 138 -62 165 138 -155 102 -138 -141 -246 -167 -235 263 -103 168 158 -20 -47 -110 -89 -87 109
2533 109 99 98 75 -158 -34 -139 44 171 -113 -174 -161 -181 -157 1 340 -169 -81 74 -24 -50 -155 -14 87 8
2557 8 -44 162 43 -92 -54 148 104 -36 134 164 43 40 12 72 -99 88 -49 79 -40 -315 62 11 36 70
2581 70 -76 -80 -147 -200 86 -90 221 -112 26 134 -10 -67 58 198 305 -153 -158 41 67 263 123 -139 42
2604 42 -140 149 28 -30 147 138 183 -123 209 -574 73 501 -497 211 531 55 -205 76 -592 833 269
2625 269 87 -389 -84 -216 -193 -131 -245 -218 -88 -226 -373 -166 -396 142 227 -325 -373 709 -1361 -70 -823
2646 -823 99 565 -440 153 39 -137 -291 -87 -257 20 213 49 69 65 75 189 282 70 -142 -26 71 -125
2668 -125 -39 -135 -124 15 78 155 95 5 -16 90 -36 -166 190 -144 -95 123 398 -122 -188 -40 140 188 138 -27
2692b7m2Q7m0P8j01j41n5K97q8l0J33K35K2J00m89n0K79l30K74k18k72J98K4O2
2716i4k53P3J73K12l68N38l55R9k98J52M5P9j1J74j03l84N01k21P7j46L15n12
2738c07K06k90P33n57L29k69JN19K04r29j66Q69j204%P45P31q88N25o18j24N8
2759d32O65l16k06M90k55m02j62P09l32P8N47q36N25l88N03k52j63J18J15J30
2779A36L89l98r1j80M12m3l58k04K29L60l50M16j75k8j43k78K82K2K38n86J38
2800b12M21o05N0L93K55J65l46q48K23L21j53J36K8Q9R9K15l96L2O20m17l38J67
2822a01p67O21k68L06J90l89M32N68n95N8r8N94o20%n6k91O73M74n56m2j19j65
2844a51J04K48j14k72K16j12J47j95k3J25K01o5j33p4rJ35J1J5k32L81l01J16
$$ plain form
2692 -27 -69 18 -22 56 -45 -186 -241 56 -32 -62 71 306 328 428 -61 -111 168 -162 112 -106 -378 -180 -156 -94
2716 -94 -347 -274 -101 111 -257 281 -74 25 -273 -121 -76 3 -8 166 63 -321 180 -41 36 -110 205 -307
2738 -307 -101 -391 342 -215 114 -155 -154 365 569 -360 -526 343 -861 -861 -116 615 -273 252 -366 -490 -432
2759 -432 233 -83 -289 201 -54 -456 -618 91 -241 -163 384 -452 73 -315 188 -64 -227 -109 6 136
2779 136 525 127 36 -144 268 225 -133 -337 -108 252 -98 318 143 115 -28 -306 -24 -2 236 -350 -212
2800 -212 209 -396 -346 47 302 467 121 -727 -504 -183 -336 -200 -172 -83 16 231 -165 -133 487 70 -268 -101
2822 -101 -868 -247 -515 -209 -19 -408 24 592 -3 55 -43 551 -69 -69 -125 -416 257 731 175 133 14 -151
2844 -151 -47 201 87 -185 31 -81 66 -129 -152 -27 174 109 -24 -98 -107 28 39 54 -178 203 -98 18
2866A8P7k18K38O0k56k8l3j40J08L96n21J13M0J67K1P9j99K6j54J66K14k23j82
2889b31k52J36M32L93k12l23n2m82K05K71J71j33M02J03m4r05l4P46m93m4J66
2910a80J58J90n83K11L16j18M07j22n27j94K06N18m31j41Q4o4N19k5J33k19K73
2931D11q38K92J64k53M32n70r8N26m18N06l18N86l87j55j06P93l59j58k35K27
2951D2J88j14n32K65m62L95P5J04j87K92r7j30K10J2k87N8P2r6K71K60m99j26
2973b86P85o21k12O13n76N01l47Q34j266O15n0k8M40m29K54o36L03J86nL2j17
2994a0L19o30r2L25k37P14n41j82M21J95l47L61j46l17L27l75r0J41qL53o16M14
3016b1k33N06M8OK14l74j29n2J60n69Q36l58k33j29j30N8N1J87j25K8m62K46j77
$$ plain form
2866 18 95 -123 115 175 -81 -109 -142 -282 -174 222 -299 -186 -146 21 42 121 -78 -52 -206 -40 174 -49 -231
2889 -231 -483 -347 85 478 266 -57 -109 -591 -386 -115 56 -77 325 428 384 -521 -555 191 -302 -346 -180
2910 -180 -22 168 -415 -204 112 -6 401 279 -248 -442 -236 282 -149 -290 -206 -270 249 224 357 138 411
2931 411 -427 -135 29 -224 208 -362 -460 66 -352 154 -164 422 35 -120 -226 567 208 50 -185 42
2951 42 230 116 -416 -151 -613 -218 -143 -39 -226 66 -31 -161 49 61 -226 -168 -96 -192 79 339 -160 -286
2973 -286 499 -122 -334 279 -297 204 -143 691 -575 40 -10 -38 402 -27 227 -409 -106 80 75 107 -10
2994 -10 309 -321 -413 -88 -325 389 -152 -334 87 282 -65 296 150 -167 160 -215 -305 -164 -172 181 -435 -21
3016 -21 -254 252 300 306 520 146 17 -35 125 -444 392 34 -199 -328 -458 -400 -349 -162 -287 -259 -721 -475 -652
3039f52J03l10L61J61P6N26l23j19J42l87M69M35k50j25K68k93n6k7l59M61J79
3060B80l89K15m4l09K55k2N1l3R8l83M07R2j31oN7k11J35o5J2j41R6J59R5l40
3084a22J90l92M21n05N26k8j27Lk5j73J81n8J12J52k68Q6j50QK84M9k89L2J06
3107A3L20k42r1k9L50k74O4k75j08J88N4nl5p9Q6K59j27j70K58j75O7J33J0j0
3131A82j88Jr1J43pJ40m2P1m28R9P4m5l4P0m00M03j55J68J9J19j23K09j64N5m90
3156d14N18J23m14J85M09k48l97J81K25m63k5L37J57J32r4l71j8L36m83L04N6
3177C6L52n55m04K36M01L5m25o0K73J53K38j7n82J007j87m27L29j022R15J212
3197A508j520K70L69m74n53J62M64m37L61n55L31R7J2O2k29j20L02k04p5K15K48
$$ plain form
3039 -652 -549 -859 -498 -337 -261 265 -58 -177 -35 -422 47 482 232 107 375 82 26 -1 -360 101 280
3060 280 -109 106 62 -247 8 -14 37 4 102 -281 126 218 87 81 138 -73 62 -3 9 -132 -36 123 218 -122
3084 -122 68 -324 97 -408 118 90 -37 -34 -59 -232 -51 -109 3 155 -113 -27 -177 -169 115 164 -125 -93 13
3107 13 333 91 0 -29 321 47 111 -164 -272 -84 -30 -35 -70 -149 -63 196 69 -101 157 -18 49 182 192 182
3131 182 -6 -5 -96 47 40 180 138 209 -219 -120 -46 -91 -125 -55 -455 -52 -207 -39 -20 99 -24 185 21 76 -414
3156 -414 104 227 -187 -2 407 159 -238 -57 168 -295 -320 17 174 306 212 -159 -177 159 -324 -20 36
3177 36 388 -167 -571 -335 66 101 -324 -384 -111 42 280 263 -319 688 501 74 403 -619 296 1508
3197 1508 -12 258 627 153 -400 -238 226 -211 150 -405 -74 23 35 97 -132 -252 50 -154 -229 -14 234
3218B34m66L61k23K50l8J04l98J77J4P9K27m43J82m0Q6J8k23L01J32j89n0M2j56
3241a9j56j97K83L03k64J53j50o7j5L36K4m2k91J68j21Jr7K36j34K98k73j19k
3264a45JK3n6O19k97o3j56L1j89K63r0J19k15J25M2N8j50Q4o3k54L34j17L30k45
3288a1q1O5K44j5k22L2j45mn1J49J75r6J17j20L2J56m07K34J12m3p2o6k4N4O1
3313G4J68j25J4k0j18K49L9l27RP9N1l0k66n5J87l7J18q2j9K06o2k13J26Q0nJ13
3339A54j19R9j05J01qr2m5j90K18K20k70n5K12p4j33k54O21j26m61J37K32q2K20
3362B00l00K9J09j4j28n8J01o6R0k27P4m7K06k76N51k01J4k01K50j65K27j28j43
3385a03J20j89M7J13j0O0K40m24K44J72l71j28L09Mk83J71r7J19J52j11p2K2Q5
$$ plain form
3218 234 -232 129 -94 156 118 222 -176 1 15 94 321 -122 60 20 106 124 -99 202 334 145 95 137 -19
3241 -19 -175 -372 -89 214 -50 103 -47 -114 -129 207 231 189 -102 66 -55 -54 -151 85 -49 249 -24 -143 -145
3264 -145 -144 -121 -177 442 145 82 -74 -43 -232 31 -59 60 -155 -30 12 70 -80 4 -59 -313 21 -96 234 -11
3288 -11 -92 -27 217 202 -20 12 -133 -137 -188 -39 136 40 157 37 69 225 -182 52 164 121 49 -17 -41 13 74
3313 74 242 117 131 111 -7 242 281 -46 -37 42 93 63 -203 -258 -71 -108 10 -72 -91 115 53 -160 -34 46 41 154
3339 154 35 134 29 130 122 30 -15 -205 13 233 -37 -92 120 46 -87 -341 280 154 -307 -170 62 -20 200
3362 200 -100 -71 38 24 -104 -162 -61 -127 -37 -264 -190 -237 -31 -307 244 43 57 -144 106 -59 168 40 -103
3385 -103 17 -172 -125 -12 -22 38 278 -146 98 270 -101 -229 80 84 -199 -28 -125 -6 146 35 -37 -15 70
3408G0j12m5J36q9Rk01J48J67k69K13k46K64r8K07rk53J45k9p1J16J37l41n2K95
3432I2Q8j69P3l6J37l9k60k0J69l02L81l63L05mL2M0l25L00k84J79m2j04M70m36
3456a18K36k63j3m3K04k6j02q3mJ65O1J85j60J48l21R8j97K82k1j06M4j69O2K57
3480A16k68Q2oL53k52P1m23R2N12l16m0J23N7o9R3k36r8K26j13k01L03O4m6j02
3504g8L5k9J47j63J00j15K43m31L25p3q5j55K73k42K85N6J36j13Q1p2l15N0j13
3527b53O13m75k4J51j61P9K30L1j57k23M82l60O5J81R4l41Q1L5J42j75l16M18
3549A17J30k80j49N1K44r9J10j79r8J39K5r5J18k98P6J95j87L3J82j3k02N1J6
3572a13K66j67J21j20J5l8p3q1J98J9n7J48j13J57m74L92k38K21m3J28j03J33
$$ plain form
3408 70 -42 -87 49 -40 -31 -232 -84 83 -186 27 -219 45 -53 154 145 -108 37 8 -63 53 190 -151 -203 92
3432 92 180 11 84 48 185 146 -114 -134 35 -267 114 -249 56 52 84 124 -201 99 -185 -6 -48 -152 318 -118
3456 -118 118 -145 -158 -201 3 -23 -125 -208 -212 -47 14 199 39 187 -134 -36 -233 49 28 -78 -34 -203 -141 116
3480 116 -152 -70 -76 277 25 96 -327 -235 277 -39 -79 44 101 32 125 -111 -209 17 -96 -297 6 70 24 -78
3504 -78 -43 -72 75 -88 12 -103 140 -291 34 -39 -124 -279 -6 -248 37 93 229 116 197 125 -190 -140 -253
3527 -253 360 -115 -139 12 -149 -70 160 191 34 -189 293 -67 -2 179 273 -68 13 48 190 15 -301 117
3549 117 247 -33 -182 -131 113 14 124 -55 -153 -14 11 -84 34 -264 -188 7 -180 -147 35 22 -180 -129 -113
3572 -113 153 -14 107 -13 2 -36 -109 -190 8 27 -30 118 5 162 -312 80 -158 63 20 148 45 178
3594A78j76K32o8NJ57j70j56n6L08r2m13J02J58k30K16o4m6J0K8L1K9j32J63K6
3618D0J11l78L73j11j3J49J6l1J66l52J12j67mQ5r1N9K43q2O4l06J77J21k08k16
3642b43L50q3o5K4j15M1j33J26K25j09L2j73R1J77k7j59j91L24k34K50Q0r8j61
3665g1L21j90O0M8j22J14j86O4o9J36j94l15P03k42l06K89o6N31n18J08j75K8
3687e2L83m74L34m16L31k77J66J84j19q2J05JQ8k49NnJ15r9J19L60l50j58J06
3710A6J38K79p25L16l08K74m59O9M58k07k3M81l72j54M92j67k19J52jL98p1q10
3732d43M06L9L06n5J9l19l02J80K18N21k75k18p3M3J94J91n64K33p58J017j50
3753B10O50m11j422J160j053J199o58J68N99o82J74l10p3O02j94J33m09L40L22
$$ plain form
3594 178 2 234 166 171 328 158 2 -54 254 162 -251 -149 9 -221 -5 -69 -115 -105 -77 -46 -17 -149 14 40
3618 40 151 -227 146 35 22 171 187 156 322 -30 82 -85 -89 -4 -95 -36 207 125 189 -117 60 181 -27 -243
3642 -243 107 24 -41 -17 -132 -91 -224 -98 127 18 50 -123 -32 145 118 -41 -232 92 -142 108 188 90 -71
3665 -71 250 60 120 168 46 160 -26 38 -31 105 -89 -404 299 57 -249 40 -26 505 -13 95 -80 -52
3687 -52 331 -143 191 -225 106 -171 -5 179 60 -22 83 84 172 -77 -72 -77 38 -61 58 418 68 -90 16
3710 16 154 433 -292 24 -284 -10 -469 -400 58 -149 -172 309 -63 -217 275 108 -111 41 40 438 367 -443
3732 -443 -37 2 308 253 272 -47 -349 -169 49 570 295 77 4 47 241 432 -132 101 -657 360 210
3753 210 860 449 -973 187 -866 333 -325 -157 442 -240 -66 -376 -449 153 -41 92 -317 23 345
3772C45m58L65p79j99R28j13m18J57R21Q1o74R52r28n90j09N15q8o01J269n98
3792b2L27m41P23p53L80k00k04p05L48O35l8J87k34N44L70j595O93m11P07L2p6
3813B67n72J15K2J02K09n8O98k42P2m75L28o23O70J56o08N21k29j01r44R16L0
3834B54q14O79k62P62q97J001k53m79Q28j240O68r52J449q69M47K64l55M3q24
3853e50J9Q65l12m68J94M4P20j69l40o97J123l39j94Q89m93j127K83P99k38q06
3873g97Q98j02M27m2j034P26q3K30J45k55l12P62m23J44k18r6o07K99k94J84J045
3894E97k46M08k84n83J97l05M21o55j12M64n47J345n44o61P06m33K35J17L5J97
3914C52M07p61m12M3O08j90P43r14R35r66Q67j076J359j228k43J036p23O15r29
$$ plain form
3772 345 -113 252 -527 -726 202 89 -329 -172 749 830 156 1108 180 -410 -519 -4 -92 -693 576 -22
3792 -22 305 -136 587 -166 214 14 -190 -895 -547 88 50 237 3 547 917 -678 15 -396 311 343 267
3813 267 -305 -190 -168 -66 143 85 783 541 613 138 466 -157 513 669 61 582 353 252 -692 224 254
3834 254 -560 119 -143 619 -278 723 470 -9 819 -421 247 -705 744 -125 322 586 231 274 -550
3853 -550 -531 334 22 -446 -252 -208 512 343 3 -694 429 90 -104 785 292 -835 -552 247 9 -797
3873 -797 101 -1 426 384 -650 76 -7 223 368 113 -199 563 140 284 66 -30 -637 -338 -632 -448 597
3894 597 351 759 475 -108 89 -216 205 -450 -562 -98 -645 700 156 -505 201 -232 3 120 155 352
3914 352 759 -2 -414 -371 237 47 790 -124 811 -155 712 -364 995 -233 -476 560 -163 452 -477
3933d77M55P2Q9m20K22K75j88R76j260l41N10P35K76r41j05N17l63P9m04N94o77
3954c76Q06q18P20J70o49k59P92l82O53q80J24k42j06L48J01M46Mj60m5n34L08
3975B1O79j35k71j91M16l81l78P50q47O36j76Jm07Q91m54M4p90k47J409m60ll3
3997G4O9o93L54N59R72o07r05k59M12r80J340k4l30PJ49L42n58L24J09k34j04
4018A7o9k75K95M8K66l30O53l00l09N34l82j01k32N39k38K2K87j29l45J64m34
4039c19N18l4k58J8j66M84m97L97j09j05J02j19K16j02pJ12J29j40n4k09m9M04
4061B12q3k40K90k91K05j25Q5k29J77p2P6N7j87L21o23J55J53k36L8M15j06j02
4083a10N6K69l30K23k50O04m71J77l30N3m9J14J30j46M6L41l90j35M11l50J27
$$ plain form
3933 -477 -22 50 139 -281 -59 216 28 1004 -256 -597 -87 648 924 -17 -122 395 32 111 -293 301 -376
3954 -376 430 -388 332 502 -147 -406 386 4 657 -223 -99 -341 -447 -99 2 448 452 292 247 -287 21
3975 21 700 565 294 103 519 138 -240 510 -337 299 123 124 -283 608 154 198 -592 -839 570 110 107 74
3997 74 143 -550 -196 363 1335 728 -177 -436 -24 -1004 336 312 -18 -11 138 480 -78 246 355 121 17
4018 17 -52 -327 -32 16 282 -48 605 305 -4 530 148 47 -185 354 116 138 425 296 -49 115 -319
4039 -319 199 165 -93 -75 -241 243 -254 143 34 -71 31 -88 128 26 19 131 260 120 66 -143 -192 212
4061 212 129 -111 179 -112 93 -32 53 -176 1 -71 5 62 -125 196 -427 -272 -119 -355 -317 98 -8 -110
4083 -110 -54 215 -115 108 -142 462 -9 168 -162 -109 -158 -44 86 -60 -14 327 -63 -198 213 -137 -10
4104a0n7K08M4m54N09l25J75o53P50j62k83M94K31j87j49j81j80J0K25J09K57
4125C71q09M59kk53m80O78L43n23K3j24J67J99QJ02o33M40L90n42M43l55M42m98
4147a54R9k23L62j43J61n37N63p3Q5J13o41O78r52O15l92P64m88K39k00m74K99
4168b99o27J340r44k69P70L7n04K75k28R97J14Jk81M36r93m03j05P02j13j76J48
4189a22P1l04K44Q0m14M69j95Q11q18K35q3m85J530j402L93m71l43P32l28Q6q6
4210d00O1J120j042L70n61J47O71K60m69l49L07M21J53j346O72k47J168j562K02
4229d24P86j015J60N44r51K25K64M71n22M26k18K02n08J37K23J55m18M86L52q79
4249e04K0L22M10J99n42l55N74l8j60L66l59l43J81j59J044q16n04R89k18O8n99
$$ plain form
4104 -10 -67 141 185 -269 240 -85 90 -563 187 25 -258 236 467 280 131 -50 -230 -220 5 114 371
4125 371 -438 21 19 -234 -714 -36 307 -216 -193 -317 -150 49 57 159 -474 -34 356 -186 257 -98 344 -154
4147 -154 -55 -278 84 -59 102 -435 128 55 140 253 -388 290 -662 -47 -439 325 -163 76 -124 -598 -299
4168 -299 -926 414 -530 -799 -29 8 -496 -221 -449 548 662 663 382 818 -175 -578 -683 19 -94 -270 -122
4189 -122 -51 -355 -111 -31 -445 24 -171 640 -178 57 -26 -511 1019 -383 10 -461 -804 -72 -400 -314 -400
4210 -400 -339 781 -261 109 -452 -305 366 626 157 -192 115 536 689 -657 15 -232 936 -626 -424
4229 -424 362 -653 -493 51 -900 -675 -411 60 -462 -36 -254 -52 -560 -423 -200 -45 -463 23 375 -504
4249 -504 -484 -162 248 447 -95 -450 124 86 -74 292 -67 -410 -229 -388 656 -160 -664 325 107 175 -424
4270d24M06j09K26J012j261N74l12q6j28r7J66N71m61m07P41n18J25j42L55o74
4290d43P60p09p4P58n70K07M8j66K82k85l34M36J58L25r43P23l01K64k69J20j47
4311a60K34m93M82k5K07q9j82J73j13k0m52L03o1j30M3K45J08j2K9j67M1n1oJ05
4335IK58n8o2r98P56J56K32j88L5j15l26N53k84J53j47L02l95K9L95p25L15L8
4357f7P8J38M13o95o84J146k03J9k31N17m45K75m65K55Q4l94k25M61L8K35k37
4378A3R9J59j85J8j74K58m80L32M5j43J37j84n5K07j46J04r0K45j41l44M05j46
4400f6Kl3L4l34M09K57k77oP8l0n6j43K92J9k1j02r8P9j91M65r9l56K61O7l8K12
4426C25l14j83K09K10l73N2J98j16J2k90L10j8l28K68N5j34K16k79K02M3j24K10
$$ plain form
4270 -424 -18 -127 99 1111 -150 424 112 26 -102 -199 -33 538 77 -330 411 -107 18 -124 231 -443
4290 -443 317 -392 -466 292 -278 -71 -23 -189 93 -192 -526 -90 68 393 -550 173 -128 136 -133 -13 -160
4311 -160 74 -419 63 38 245 156 -26 147 34 14 -438 -135 -196 -326 -283 -38 70 58 87 -80 -39 -90 -96 9
4335 9 267 209 147 -851 -95 61 293 105 140 25 -301 252 -32 121 -26 276 -119 -90 305 -420 -105 -67
4357 -67 11 149 562 -133 -817 329 126 145 -86 431 -14 261 -204 51 135 -259 -484 -23 15 250 13
4378 13 112 271 86 104 -70 188 -292 40 85 -58 79 -105 -160 47 -99 5 -85 160 19 -325 80 -66
4400 -66 -64 -97 -63 -397 12 269 -8 -14 64 34 -22 -165 127 146 125 23 -75 4 -187 278 179 -177 84 151 113 325
4426 325 11 -172 37 247 -126 -74 124 8 20 -270 40 22 -306 -38 17 -117 99 -180 22 65 -59 151
4448A51m14J41P4J66j56L37k63o1k66L24J27k43k6J47l12K20Q3J27j11k2m4k1
4470d2m2l3L99m82R9j62L91k76J75j20L27k78N2k30K10k11K64o2Q3J6p3N8m3N1
4494G1J68k58j7R2J7o3k9J69j57K13l6k61L52j88p6J27J37k23K71j19j20J81m07
4517a56L4R0m4J10L0j08L1j34oL98k81m2K2k7jJ30K66j98j73J15P4l83L97N9J2
4542B15k47k33K37N0l2m9K61r1oj83j76J73J29K12l77K58J3O0j57K32J8l28P3
4565E2j5K3R9j14l45M13Rj90K54l4j92R5k08J34j71o3J12K57j53J4L59l02j00
4588f6j07K12m2K43j65K39m35J6J51j74L29k89L8P1JK86l53K13j07R0j78r9R6
4611c0k47L85L2j29L7r1J27j36k9K73j86k8J08j10J14j48%K90l84L05j25N5K55
$$ plain form
4448 151 -263 -122 -48 118 -38 299 36 -25 -291 33 160 -83 -109 38 -274 -54 29 156 45 23 -21 -42
4470 -42 -84 -117 282 -200 -101 -263 128 -148 27 -93 234 -44 8 -222 -12 -223 41 -21 62 78 5 63 20 71
4494 71 239 -19 -36 56 73 10 -19 150 -7 206 170 -91 261 73 -3 124 261 38 309 190 70 251 -156
4517 -156 -122 -32 -76 34 64 -44 -13 -147 -153 245 -36 -78 -56 -83 -84 46 312 114 -59 56 130 -253 144 203 215
4542 215 -32 -265 -28 22 -10 -59 202 111 105 -78 -254 -81 48 260 -117 141 154 214 57 289 307 -21 52
4565 52 37 60 159 45 -300 113 122 -68 186 152 -40 55 -153 -19 -190 -253 -141 116 -37 -23 336 34 -66
4588 -66 -173 39 -3 240 75 314 -121 -105 46 -128 201 -88 -50 21 22 308 -45 168 61 151 -27 -126 -30
4611 -30 -277 108 140 11 48 -43 84 -52 -81 192 6 -22 86 -24 90 -58 -58 232 -152 153 28 83 338
4634C38l74n6j03J20P6j05l9ML36j95J44Q0J2k62j87M01j98n5NN9J06j30J40j76
4658e9J20L1k62L9K58o8j78k1K88k63R8L8m3n7J69P6l0j39m1l2J07K01j75r1o
4683d0l15J64J24j20P8P1L8j54M1j07J84k34K27oo2M01j41k15N8J73l79O7N4J62
4707F9j9L4q7J3P8o6k17J95J7l06L55J08j48K79l03J10r2J43o5K2p4p7m3J5o9
4732a28J99M9k07K19k6j97Q6j0Q6J9j62J38j43jO8Q1o0P7j08K59k94M8J12k21
4756a16P8K6J56q7j99K38m81L78l8qL7O5J81k77J52k88O7K3R1j02m1J87k07J95
4780C0J28j46q4J02J4J61j07q7K9K4Pq4l36j76N00J73k94J79o21P56j25k00j09
4803b66K52L01J5o1l43J95p9M72N05n59o54M82l28k99O13rp63R00k24K27p11J63
$$ plain form
4634 338 -36 -92 -195 -75 1 -104 -143 -139 197 2 146 226 238 -24 -211 190 -8 -63 -58 1 107 -23 117 -59
4658 -59 61 92 -170 -131 127 59 -119 -140 148 -115 -17 21 -22 -79 90 166 136 -3 -44 -76 31 232 57 -34 -40
4683 -40 -355 -191 -67 -187 -109 -38 0 -154 -113 -220 -36 -270 -43 -49 -111 290 149 -66 -8 165 -214 -147 -93 69
4707 69 50 84 -3 10 88 22 -195 0 17 -289 66 174 26 305 2 112 20 163 98 120 46 -31 -74 -59 -128
4732 -128 71 120 -87 132 106 -91 -5 -15 71 90 -72 66 -77 -78 -10 71 11 88 -20 239 -55 -7 105 -116
4756 -116 -38 -12 144 57 -142 96 -385 -7 -45 -53 -16 49 230 -47 105 -183 -116 -93 -2 -104 -145 42 -165 30
4780 30 158 12 -72 30 44 205 98 11 40 64 71 -13 -349 -525 -25 148 -146 33 -588 168 43 -157 -266
4803 -266 -14 287 302 241 -102 93 14 486 991 432 -222 260 -68 -367 246 237 -526 374 150 377 -334 -171
4825a71n58J068l37Q02j212L71l97M68P51p75m03M62M58j129Q6N17N16l90J90
4844C17n20l84P40k96k97Q38o6L1n58l41P00q0J135k153K205j265J75m8J98n93
4864b62O34p61K16L05M4M75q82L38J27j56k61J93l70R10l8j77J98p50j84J030
4884F29n20Q41p12j99n2k36Q09l84l60K27l99L76M57o87J91j11L73n10N26k18
4904D1K99l25J35K61r10K11r8N21p70J17P47K5O3J75m50N91l49q59P90k32L82
4925C65o98R73j019P81N10j8k70o09O13l86J51o92J522j689O32l97Q2Q60r23Q2
4945a30R7j87Q0Q83q78M97j19r97R26L05p97O19n5Ko80M42Q3N7n68O60n1J12j57
4968A44j012J089K28o60J4N01qm29k9k02j26O75J01l23M68q88j14J184M31k04
$$ plain form
4825 -171 -729 339 2 804 -408 -37 -434 34 785 10 -393 69 527 -602 -516 1 517 127 317
4844 317 -203 -587 153 -143 -440 398 332 363 -195 -536 164 84 1219 -934 1271 6 181 133 331 -262
4864 -262 372 -389 -173 132 176 651 -231 107 234 78 -183 10 -360 550 512 335 533 -217 -401 629
4884 629 109 950 238 39 -13 -249 560 176 -184 43 -356 20 477 -210 -19 -130 243 -267 259 41
4904 41 340 15 150 411 -499 -288 -386 135 -635 -518 229 254 317 492 42 633 284 -575 215 -17 365
4925 365 -333 640 -379 402 912 894 624 15 628 242 393 -299 1223 -466 166 -231 -149 711 -212 -130
4945 -130 -33 -220 -140 743 -135 362 243 -754 172 477 -320 299 244 246 -434 8 91 148 -420 240 189 301 144
4968 144 -868 221 449 -211 -197 304 296 -133 -162 -364 -490 185 286 -37 431 -457 -571 613 1044 840
4988H40o84r24J295k17k30j79K08j80O07p23M31m9n45k59O66O0nP1o43P30J7L42
5010F29q3o23P91k40j43Jj94L04m59O35o58P39q26n3J51l52J454p04j92K09r54
5031e68K26L49P23q13R2J36m06Q5P2Q58r84J487q65j24m25J5L59q40K49M38j70
5052a06q75J231l53n98J227o30O36r07Q94l10m54P82j759J437o0n14J93N93m10
5071A7L93p36n43Q46N93q54R1P6l21M55O99l48l09l14L32l40L20J90j04j33R03
5092I13m43j118Q06P92o34l64o94O97n79J03N36O93j55n38m31K58k36r2k06R29
5112B37P92m13n89j79o66J238k26j49L41k86L04J77n86N86o19M7R0L17k83M4k66
5133h9Q4Q82r60l80J91M97r2k54J69J64J98q99M33J27K93J63l35J86j99K80r00
$$ plain form
4988 840 156 -768 527 310 80 -99 109 -71 536 -187 244 195 -350 -609 57 117 112 183 -460 270 287 629
5010 629 546 -77 714 474 331 332 138 442 -17 618 -40 699 -127 -180 -29 -381 1073 369 177 386 -568
5031 -568 -342 7 730 -83 9 145 -261 -176 -104 754 -230 1257 392 268 -157 -142 217 -623 -374 64 -106
5052 -106 -981 250 -103 -701 526 -104 532 -375 519 209 -245 537 -1222 215 155 -359 -166 427 17
5071 17 410 -326 -869 -23 570 -284 -193 -117 -438 17 716 368 59 -255 77 -263 57 247 143 10 913
5092 913 470 -648 158 950 316 -48 -742 -45 -624 -521 15 708 553 15 -416 -158 -394 -486 -692 237
5112 237 1029 616 27 -152 -818 420 194 45 386 100 404 581 -5 581 -38 9 99 416 133 177 -89
5133 -89 -5 877 -83 -463 -272 225 133 -121 48 212 410 -489 -56 71 364 527 192 378 179 459 -441
5154d41L92p5r2L80q0K66n74m3N88P38j783Q79p75Q05o76J92N79j078M68M24p12
5175f18O13m2k12J019r34k8L14P58n52n06M82Q6j32O5n98J09p4O08j25q9k33J82
5197I3L79j037N72O31o48m81P08l27M16m15K95R1P3m96N15J86l04j28K06m61N3
5218g9l57N52O5m56k28P14n0j68j6L45L56o26P2n03M78N34j181P28o2p72O35M73
5240D54k04k9m28M19Q3o47N65K88o71N78n21j079J953n09N33p16n40P86l12k23
5260b20O94m06K67r9r43K77N35n57M6K06m18K85L71j13K56J0q22k0J077p18J26
5281a66O05j299L11J581p87O44K65j471j41J700p77j193j42J528j249J658j637
5298e70O62o3L35m44l8Q77n67k58n08J055m13k2J0n76L00J85k81K14N14lr80Q02
$$ plain form
5154 -441 -49 -124 -216 164 84 350 -224 -267 321 1059 -724 155 -620 185 -491 -299 280 -798 -330 94 -618
5175 -618 -5 -47 -259 760 -174 -202 112 870 318 -188 294 380 248 313 -285 -176 -250 358 233 144 -89 93
5197 93 472 -565 7 638 -10 -491 217 -110 306 -109 186 277 350 -146 369 555 251 123 329 -132 -79
5218 -79 -436 116 181 -275 -503 211 161 -7 -23 322 678 52 124 -379 99 633 -548 180 118 -654 -19 454
5240 454 250 221 -207 212 295 -352 213 501 -170 408 -113 -1192 761 252 785 69 -471 315 3 -220
5260 -220 474 68 335 236 -707 -430 105 -452 -406 -200 -618 -333 38 -75 181 191 -631 -651 426 -292 -166
5281 -166 439 -860 -549 1032 245 889 1154 -317 -458 1242 465 -728 -870 658 -591 1067 -570
5298 -570 92 29 364 -80 -118 759 192 -66 -574 481 68 46 56 -520 -220 -35 -316 -102 412 409 -571 231
5320B31k57r8L81K5k68o58N66K84K1L22K48o34O6r5P74r98J19N41j365P29l00
5341c66J552j475P86r66P89J85r62J45j33J203j628K11L46M11M62o59j54J260
5359A007r4K9p60J233q64j064N19J79P90o47m88O32j275J176k27L18j82q05J199
5378F76r86N29Rn88R22k4j175Q73k93J93J71M93j175P89j177R14J87l86l80L47
5398h1N05l04j87j70K15r43J038j03p6J13N23j369J094m8n94M32k30N01j202K50
5418f36J43j13O01j28M00N33q30K57M04r65K48j4k31M0P71p30m70P51J4p17P98
5439A26o6m75L46K14p1k40L58k80J04K14L70n61L68l0n04M2J39M11m83k03m60
5460f81N01O57K59k66j309o50J828o7m40m02P04r02J538j190k40J348n36j388
$$ plain form
5320 231 -26 -124 257 282 14 -644 -78 206 227 549 797 163 229 134 908 -90 29 570 -795 -66 -366
5341 -366 1186 -289 497 -469 320 505 -457 -312 -445 758 -870 -659 -313 98 560 -99 -253 1007
5359 1007 913 942 182 1415 551 -513 6 185 975 328 -160 472 -803 373 146 464 282 -523 676
5378 676 -310 219 228 -360 562 538 -637 236 -57 136 307 800 -375 414 -763 151 338 -48 -428 -81
5398 -81 424 120 -67 -237 -22 -965 73 -30 -106 7 530 -839 255 207 -387 45 -185 316 -886 -636
5418 -636 -493 -606 -5 -133 267 800 -30 227 631 -334 -86 -100 -331 -291 480 -250 -720 31 45 -672 126
5439 126 60 -415 -69 145 74 -166 192 -88 16 230 600 39 407 377 -127 -85 54 465 -18 -221 -681
5460 -681 -180 477 736 470 -839 -1489 339 272 -168 -570 134 -768 770 -420 -660 688 152 -1236
5478a236J519k26O2n94O95L2m70j47MN01r22N94N27k15rk42j13j73L15J68k40
5499a70K34l26J68l3K80l38m96O73k67O4qL29n61P25j58K94L8j118N96P35j405
5520g44J57N94l76L11l14L92M28q98L82o01J36O17n41K24j53L60n62J153j258
5539f93J25M11R34m10o12K91j85L09l64O0J93n88O74l18J58K6J81n32P87Q3j86
5560C44q38Q10l30K89l92K92j17k8n2J23k90O8JJ24L2J62j94o1m7K19k84K83n7
5583E7oK02k86J70j5m06K17j90M81m67M81o69K19M4L25oQ6k48j63J30q5N84m57
5606bL80l21k43J82p0J96p2j90j04K06L03k86j49L39l78L08P4J5k77J67k81j52
5628c55L61R0k03j00j28R5P5J25O15r44J140r52K72L50o76m1L06k39j78P19q80
$$ plain form
5478 -1236 283 57 119 -475 220 252 -218 -365 -361 140 -782 -188 339 124 115 -127 -240 -413 -98 70 -170
5499 -170 64 -262 -94 -127 153 -185 -681 -8 -275 -211 -219 110 -451 274 116 410 448 -670 -74 661 -744
5520 -744 -587 7 -369 -58 -372 20 448 -450 -68 -669 -533 84 -457 -233 -386 -26 -588 565 -693
5539 -693 -568 -157 777 367 -245 46 -139 170 -194 -134 59 -529 145 -173 -15 11 192 -340 447 530 344
5560 344 -494 316 -14 275 -117 175 58 30 -22 101 -189 -121 -120 4 36 198 4 -57 -104 115 -169 114 57
5583 57 51 253 -33 137 122 -284 -67 -257 224 -243 238 -431 -212 -168 157 151 237 -11 -174 -44 -129 455 -2
5606 -2 378 57 -186 -4 -74 122 50 -140 -244 -38 265 -21 -170 169 -209 99 173 188 -89 78 -203 -355
5628 -355 6 96 -107 -207 -335 -240 -165 -40 575 -369 771 -181 91 441 -235 -276 30 -209 -387 332 -548
5649e48K62N98n10M61p82K12N5M17q60R38l41m75N02L85l95J85n97P73q29Q38
5669B89m47J77J55k04m5K04L18p22K84R7k38K19k30Q4M66l75O2P3n0l7m7M47l29
5692A51j70k1j72K96K7k23J62j41l7PJ34J02j05k82M72l70L42k89k1M54m83J27
5714d0K11o7j84L59l42L65k40j77K20k83L0j19M9L51k14NL16j49k54M4L50l06
5736g5j27M91l12j06Q7k53O78l6n95J17n19L68R01p48K25k74K42K24n55N58O6
5757C57l45N03j25o08jK33o07P78J84p94M95k32j59R25K5q49O50k26n19N68K35
5778D88m06k79L72m94M76J54k18l3k22NK32J55l87K98K97o98O50n33l24Q55q65
5799d77M08q5R86o21op65K16n3j0J85J64J52L89k70n12K22O4J24j18K1N3k8j77
$$ plain form
5649 -548 -286 312 -198 263 -519 -307 -252 165 -695 243 -98 -573 -71 314 -81 104 -493 280 -549 289
5669 289 -158 19 174 -30 -75 129 447 -275 9 106 -132 87 -143 -59 407 32 94 167 117 80 33 480 151
5692 151 -19 -40 -212 84 111 -112 50 -91 -128 -121 13 115 10 -272 200 -170 172 -117 -138 316 -167 -40
5714 -40 171 104 -80 279 -63 302 62 -115 105 -178 -148 -267 -218 133 -81 -76 240 91 -163 -119 231 -75
5736 -75 -202 289 -23 -129 -42 -295 383 347 -248 -131 -650 -282 619 -129 96 -178 64 288 -267 291 357
5757 357 12 515 390 -218 -219 14 -593 185 369 -425 70 -162 -321 604 629 -220 430 204 -315 253 488
5778 488 82 -197 175 -319 157 311 93 60 -162 -157 75 230 -157 141 438 -260 390 -143 -467 388 -477
5799 -477 -69 -154 832 211 205 -560 -344 -397 -407 -222 -58 94 483 213 -299 -77 -13 111 -7 14 67 39 -138
5822a38L04j07j50J52j13R9n5k60O34j9L28j52k25p82p8P33k64J65L5k65J6L14
5844A72l42N62n51M5k9m39n4N76O36n69K71l9o83K96j61K38j03K8k94J8M36j21
5866a07l04M26l02J13p85J429J56m17o26J82M1L93j94k23N34n87M55q33P32j27
5886d4m91M83o38P07Q9rl43l8k49L14J471q66j318O40N40m85Q1R33j060N91M78
5907G86k31r73P61o04%L86j99j44M46l39R83p59P6m60J4j56M98L30j262N44Q40
5928E37j55r40J061m46M44n76P14R5j107O72N93o63j38m12O88N91j578J93P79
5947C52l77n44P40m86K35JJ702k022K18k4R04p54k33M98k73m37L08K59J046j899
5967g86N54P4J78j66O54j20mj52N27r36P32j308J564k90o92p84M24J422k19o18
$$ plain form
5822 -138 166 59 -91 61 -52 47 -8 -268 366 347 675 523 298 -484 -562 171 -93 72 107 -158 -142 172
5844 172 -170 392 -159 -114 -143 -582 -636 -60 576 7 278 239 -444 -148 -309 -71 -174 -146 -440 -422 14 -107
5866 -107 -411 15 -287 -174 -959 470 626 209 -417 -235 -194 199 5 -218 316 -271 184 -649 83 -44
5886 -44 -535 -52 -690 17 106 97 -246 -284 -533 -219 1252 386 -932 -292 248 -237 -156 777 -283 308 786
5907 786 555 -418 343 -261 -261 125 -74 -218 228 -111 872 113 189 -271 -257 -413 85 415 -847 -303 537
5928 537 382 -558 503 57 501 -75 639 734 -373 299 892 229 91 -321 367 958 -620 -427 352
5947 352 -25 -569 171 -315 -80 -79 1623 -399 -181 -205 699 -55 -288 210 -63 -500 -192 67 1113 -786
5967 -786 -232 -158 20 -146 508 388 384 232 759 -177 555 -753 811 521 -171 -955 -531 891 672 54
5987E4M10j40l94M49J02J2j191J519j406J005q3K57q08N4J147j211J289j092n6
6006h3m82J290j282K01k43J101k51p10O84m80N71M18n38n59K91j2m9N03J50q44
6026c24M68p46J163j020J77j62N77Q90l94k00M03n94q55O40j62K55o8n78M27J12
6046Ij224O94P0R58l59j05J98n80K41P90l12q97J95l79M79J082j117n75J001j045
6066h76N39j55L0K44Q9o23J403p77m45O37J273j435j47j04j51O68Q08j687J448
6085G39p97m53M17l23M00n07P58m42R9k69L59N30l43j56N13k74o7l74PK14l4N87
6107E84j270R83q9j77M95r73M19N1M4K02K06k78L40l64k31Q42p87m67R56o58M87
6128C15r77N65k46J89P1J79L15q83J084q58N92l91M59m81m74J155n70N52o10m1
$$ plain form
5987 54 464 324 -70 379 481 493 -698 821 -585 420 337 594 -214 -160 987 -224 1065 -27 -83
6006 -83 -565 725 -557 -356 -599 502 251 -459 225 -255 316 734 196 -363 -72 -84 -133 370 520 -324
6026 -324 144 -602 561 -459 -282 -444 133 1023 629 429 832 238 -617 23 -139 116 48 -530 -103 9
6046 9 -1215 -521 -451 507 148 43 241 -339 -98 692 380 -517 -322 -701 -222 860 -257 -832 169 -876
6066 -876 -337 -492 -462 -218 -129 -752 651 -126 -571 66 1339 -96 -243 -347 -498 170 978 -709 739
6085 739 -58 -511 -94 -417 -17 -524 234 -208 -109 -378 -19 511 168 12 525 251 184 -190 -183 31 -3 584
6107 584 -686 297 208 31 526 -447 -28 23 67 269 475 197 537 173 -58 784 -3 -470 486 -172 315
6128 315 -662 -97 -343 -154 -83 96 411 -472 612 -246 346 -45 414 -67 -541 614 44 596 -14 -55
6148e5j30k9L22J51k85K83m15J001K5m7j250O42l35Rj32l6R0j80L60K19k58l88
6170d38M24M95j59l78J83k42L91k6m77k43N40j68L2J54j50J86k73j4J09q2J67
6191C1J86m00K6L95l72N58n12L38j63l8l09O5J1lk3J67L77k62k61R9J15p4K10
6214A61k58qK25k08R2J63n46L45n1J37k7j77O4K20l11K66j94K96j80p2M1J82j68
6237hk01M49l47J00o3M3l8j46L38k70N5J36j78K62P2k42J66J33m85K68m7j6J22
6260A03j34J30m17J3N64m40o7K3L30j27M7l62Q7L25k0m3L4J32m5k75L03k58j32
6283b29Q0n2L67J1k40R8j35J93N6l43K80lj00j3j9j95K16N9p0m9K36j11l9PJ05
6308A10l13M50l01K62n95O01o28K27J47n32J39k3K23M0N54n8k53K40N6q39N91
$$ plain form
6148 -55 -185 -214 108 259 -26 257 -158 843 868 821 -429 213 -122 -113 -245 -281 -191 -371 -11 208 -50 -438
6170 -438 -14 481 322 -56 127 -115 276 250 -227 -470 70 -98 -66 88 -62 124 -149 -163 -54 -136 31
6191 31 217 -183 -157 238 -134 424 -88 250 87 49 -260 -195 -184 -187 -210 -43 334 72 -189 -90 25 -49 161
6214 161 -97 -105 120 -88 4 167 -379 -34 -85 52 25 -152 -88 132 -179 87 -107 189 9 -63 -22 160 -8
6237 -8 -209 240 -107 -7 -70 -27 -65 -211 127 -143 -88 48 -130 132 204 -38 128 261 -224 44 -3 -19 103
6260 103 -31 99 -318 -305 259 -181 -248 -225 105 -22 25 -337 -250 75 55 12 46 178 133 -142 161 -97 -229
6283 -229 -149 -201 166 177 -63 35 -100 93 149 -194 86 83 -17 -30 -49 -244 -28 31 -39 -88 148 37 -2 5 110
6308 110 -203 247 -54 208 -387 214 -414 -187 -40 -572 -433 -456 -233 -193 361 303 50 290 346 -493 98
6329I8Q0j76l87J104j392J400j384J685j066L14l73j42R03q09l84o59J365LJ92
6348C72k34m18K84j2l86P78o24K29k50J22pJ64l60N23m90k2P54Q7o56nJ02o73
6370g22J148o60l81J541p75m98K5M05K05l72J40l5Q6j88J84k25j18R7J97j60J04
6391bj30K47k09M8J87o0k33K99j30j38M6Q2J2J88p7K2j27k6l80N91j96j40J2K3
6415i1K30j42K31k26m8R2J75k65J88nk6j14o6n6k0l5K18k38R7K5l8N9L07k96O7
6440B3j07lK17j47O0q4q9L05j04P5m6j16k9J73o5j27R9MJ93m37K10pJ5k2K06j59
6466C8k51J40L32m01j10L25j17J98K6k88L37l00KL54m90K49o9Q0j98L24k15K85
6488B51Q7p0p6p4k38oK69q1l0l0j89L15k30N3J95N7j74j3J31j50j88j37K78O4
$$ plain form
6329 98 178 2 -385 719 -673 727 -657 1028 -38 276 -97 -239 664 -145 -529 -1188 177 180 372
6348 372 138 -280 4 -8 -394 384 -240 -11 -261 -139 -146 18 -342 181 -309 -331 423 510 -146 -151 -49 -722
6370 -722 426 -234 -615 926 151 -347 -322 83 288 -84 56 21 107 -81 103 -122 -240 -143 54 -106 -2
6391 -2 -132 115 -94 -46 141 81 -152 147 17 -121 -75 7 19 207 130 152 25 -1 -381 210 14 -126 -114 -91
6415 -91 139 -3 228 2 -46 46 221 -44 144 139 113 -1 -67 -123 -143 -178 40 -198 -101 -76 -114 -55 252 -44 23
6440 23 -84 -87 130 -17 43 -41 -130 175 71 146 100 -16 -45 128 63 -64 35 39 232 -205 5 -2 13 -9 197 38
6466 38 -213 -73 259 -142 -252 73 -44 154 180 -108 229 -71 -69 285 -205 44 -25 55 -143 181 -34 251
6488 251 338 268 192 118 -120 -126 143 62 32 2 -187 128 -102 -49 146 203 29 16 147 -3 -191 -328 -50 14
6512A4J05l00l9K96o9j37L0K11o5l5oJ42k39r6K1K61q0pL0j37O9K14p6r3J71k13
6538b8n8P8J3j16k8M16k66M10o13o0K16o9o9L09j18Q8l1j45K05r7j30P7K7k9L0
6563A2j42J69k99M91k78l38L92Oj6L6j04K34l7j64J97l79K71j30J02m9m7M1K90
6586B58k60m2J01QQ9J9r6N6k27N8p9o4R1M0lj97M19j85N2j77L48j50l1J5k98P6
6612a79R6j67R4K41m5j7n4o5K32j74K34k7j94Q0k21O26n91R42o36k77M68l14J38
6635A90J7J23l87K11j17j37q0J64nJP5j45K2k6m5L11m49N5q7L52o9J19o8r2J32
6660F5k1N3k24L6K27k09J5q6K16r6l16O55j85k12j62K87m6K51k78L9N0pj22j71
6684b41j28K25J23J12J29n6Mk93J62n5J38M2m2l02K17j8l69L2J85K57n47M40k13
$$ plain form
6512 14 119 -181 -220 76 7 -130 -100 111 46 11 5 147 -92 -188 -167 94 14 7 37 -100 -31 183 107 14 185 -28
6538 -28 -86 -8 5 -111 -139 277 11 421 -192 -252 -36 -105 -174 135 17 105 74 -71 134 37 -93 -16 11 -18 12
6563 12 -130 39 -260 231 -47 -385 7 13 -3 33 -71 163 126 -38 159 -220 51 -79 23 -26 -73 -32 258
6586 258 -2 -44 57 65 154 173 77 133 -94 -36 -115 -179 -88 -48 -51 -248 171 -14 38 -139 209 59 28 43 -255 -179
6612 -179 -83 -250 -156 85 40 23 -31 -96 136 -38 196 169 -25 55 -166 460 -131 811 175 -102 366 52 190
6635 190 207 330 -57 154 37 -100 -180 -16 -21 -20 55 -90 -68 -94 -139 172 -277 -222 -309 43 -26 93 25 -67 65
6660 65 44 97 -127 -91 136 -73 -58 -144 72 -24 -340 315 130 -82 -244 43 -3 248 -30 9 59 52 -70 -241
6684 -241 -369 -144 -21 91 220 164 168 -125 37 -18 120 162 120 -182 35 17 -352 -320 -135 122 -425 15 -198
6707a98L66j72O1P9p5j67J37P9K2o8J20n13L09N0j14k07P1P5O25n62j29L59m39
6730b91M26p21Q47o7l43K42n9k55L91l46Q3O1N03m75l4J0l16N23j61K64o57P18
6752C43r62L95L52j06l63j17L80k1Q8R0kK48m89O16o92N89n69J08M09n13L7L47
6774A68n28P54k22p37N64J61j46m5J26k21K6R6M56k18j99M2O4l88O48j80K7k45
6796CL70K44m24m74K29n1n8K93K02q58P12n76O67l07n00K67k61M86m84M91J4K8
6818A3j46n64O01J82j36J5K00N08j176L55l23j7O24K24q61Q97r39Q7N11K06q91
6839f30N23m02L82L54k14O9j166P18Q05m68L73q69L99j45R19k03j62k65j219R40
6859b61R90l86j46J20j021M71L24O72q84K90p1N60n91j47L12p54P40N7l85N08
$$ plain form
6707 -198 168 -4 57 136 61 -106 31 110 132 64 184 -329 -20 30 -84 -291 -220 -145 480 -82 -211 148 -291
6730 -291 135 -586 261 194 -149 93 34 -221 170 -176 -93 -32 471 -4 -38 -28 -344 179 18 282 -375 343
6752 343 -619 -224 128 22 -341 -458 -78 -99 -11 79 77 325 -164 452 -240 349 -220 -112 297 -216 -179 168
6774 168 -360 394 172 -565 -1 160 14 -31 95 -126 -100 -4 452 234 35 77 141 -247 401 221 248 3
6796 3 373 617 193 -281 -52 -103 -161 132 334 -524 188 -388 279 -28 -528 -261 -522 -36 -520 -29 -15 13
6818 13 -133 -697 -96 86 -50 -35 165 673 -503 -148 -471 -488 136 360 -501 396 -543 -456 55 261 -630
6839 -630 -107 -509 -127 227 13 82 -1084 -366 439 -29 344 -525 -126 -271 648 445 283 18 -1201 -261
6859 -261 729 343 197 317 -704 -233 91 763 -121 169 98 658 67 -80 232 -522 218 275 -110 398
6879C98j60O9j228J217J33p80P96l86J43N48o88L92o00K85J57o81L07O08o20J33
6899D3J7n57N20L9J075r05o50L08k74K84j46N51j11L72m13j31O32n62l70R4O55
6920D71n42l69J71j73j60N94M57q35J78K28J05J70J12q60J094m40p03L76j29P28
6940D73q52N3k84m90Q15O54K87l17j006J52L70N02N9j461Q46N37K99q18N55m86
6960a12l12P18j57l07m18P30n3M48J2p56O99q30N00K26j47n26N13L88j46q23P46
6981C93j33k31j18n28N41L74m63M16M61r58N41k85K40j92n25K81P06n77O0L4n30
7002d93N38r2o56N95K20j62M29l00n21N46j69q7N32j027K00KR82l79l5L4m56P38
7024D39p96m02J021q79J51L84j217J956p95Q94K85j295J552r72K7q24J43R19k57
$$ plain form
6879 398 238 307 -921 296 429 -351 445 59 202 750 62 454 -146 139 296 -385 -78 530 -90 43
6899 43 60 -497 23 62 1137 232 -418 -110 -384 -100 -246 305 194 566 153 22 654 92 -278 -184 471
6920 471 -71 -440 -269 -442 -602 -8 449 -386 -208 20 125 295 407 -453 641 201 -502 -126 -255 473
6940 473 -379 -326 -610 -1100 -285 369 656 339 -667 -515 -145 357 416 -1045 -199 338 637 -181 374 -112
6960 -112 -424 294 137 -170 -588 142 89 537 549 -207 492 -338 162 388 241 -285 228 616 470 -353 393
6981 393 260 29 -89 -617 -76 298 -165 251 712 -246 295 10 250 58 -467 -186 520 -57 3 37 -493
7002 -493 45 -47 -703 -108 112 -50 379 79 -442 104 -65 -152 380 -647 -447 -445 537 158 123 157 -299 439
7024 439 -357 -759 262 -617 -466 -82 -1299 657 -138 756 1041 -254 1298 326 353 -471 -328 591 334
7043C34J82L44r65L90M23j195Q12k55M77m32n06K88P6K12n26J115k49l72j8m1
7063I4l03k36L26k25O58m92R3M4o83Q73L59k0k15j225R76P04m97o06p9J48M76
7084A70M06m07l95L70l42O33j7K36p45M51k472K686p3j073M17j084J125K63r24
7103g75R17L84p60R54j281P23j59j11J25l05N1L20L16j24n57O50n95K0N83m78
7123a02J73j52N90r0n10j31O41m94K92k30j61M71j79L59p64M33q5k34L52l2l39
7144a92l73P07m5n93M99j40j08K48J42J5N05j136pN14m66L95j70M19j07m98K80
7165a11Rq3O35o46L48q33J87Q24N9r63O41L90n54M58l84L8M34p68j73P08o47J54
7187b77J68J477j161r1n28m9O6N97n3N44j287M59M78q56P93n35R3r50J712p41
$$ plain form
7043 334 516 860 -105 285 708 -487 325 70 547 115 -391 -103 -27 185 -341 774 525 153 135 94
7063 94 -209 -445 -119 -344 314 -178 -85 -41 -724 149 508 488 273 -952 24 728 231 -375 -454 -306 170
7084 170 576 169 -226 144 -198 435 418 654 -91 360 -2112 574 501 -572 -155 -1239 -114 149 -775
7103 -775 142 526 -234 720 -561 162 3 -108 17 -288 -237 83 399 275 -282 368 -227 -207 376 -102
7123 -102 71 -81 509 419 -91 -222 419 -75 217 -13 -174 297 118 477 -287 146 61 -173 179 147 -192
7144 -192 -565 142 97 -496 3 -137 -245 3 145 160 665 -471 -478 36 -430 -35 -205 214 107 -391 -111
7165 -111 -102 -185 450 -196 152 -681 -494 330 389 -574 67 457 -97 361 -23 15 449 -319 -492 216 -431 -277
7187 -277 -109 1368 207 116 -412 -461 -395 202 149 693 -594 -135 343 -513 280 -255 -162 -1112 600 -141
7207a41P6M2NJ58n43j1Q09n16o01N6M83J29o06M16n3Q71m65n03J88M3K1k31K68
7230a05Q95o92P3m69K18o02J005J37j65l10k09J31p58J16N27L51o36J128j018
7249c83P29m08Q5l03Q4K52J83J89m09l50K95or4J09o19P77j18m8P7m20N36m32
7271b74N46k89k50r6M07J12j34m8J42j72L2M2j55K01l5N2k15J74j99J40N8j0J75
7294B04j53O0j67K5oJ0J27m09K46J97Q7j91O6j40p9J69K46m4l65N9J84l75M04
7317A55N8p0o5K2r0j48J31J14j11O8M5j50J06N8q8l0j01K40k08j88K79J17Jj63
7341a8J69n0R7k55N3l80O3J36J56K16n02k1O04m11L6J62J77j23j08j74M59j70
7363A16k89J71j72N35n46J84N4j54J32j91R4J42j59O8l5J89k1j93J68M79m39j81
$$ plain form
7207 -141 -65 -23 -18 140 -403 -414 395 -121 -722 -666 -183 -54 -660 -244 -297 574 109 -394 -206 -163 -142 -373 -105
7230 -105 790 98 171 -298 -80 -682 323 460 295 -15 -224 -93 -851 -735 -208 143 -493 635 -383
7249 -383 346 -62 23 -280 -196 56 239 428 19 -331 -36 -42 -136 -27 -646 131 13 -35 42 -378 158 -274
7271 -274 272 -17 -267 -363 44 156 22 -26 116 -56 -24 18 -137 64 29 81 -134 40 -159 -19 39 29 204
7294 204 51 111 -56 -31 -37 -27 100 -309 -63 134 221 30 96 -44 -123 46 292 248 -117 -58 126 -249 155
7317 155 213 143 78 100 10 -138 -7 107 -4 64 109 -41 65 123 35 5 -96 144 -64 -252 27 144 145 -18
7341 -18 151 101 198 -57 -4 -384 -321 -185 -29 187 -315 -336 268 -143 -107 55 232 109 1 -173 286 116
7363 116 -173 -2 -174 361 -185 -1 53 -101 31 -160 -66 76 -83 -15 -50 139 118 -75 93 572 133 -48
7385d8Kj13L74l64j68K8L34M3k53N64l75j38M05j47j84J91m4q6rP1K01l40r1j83
7409c30K18K96M4o1r1l76M14j58L05k30N4m36K01J87J18m9j34N4O9L9l23L36l24
7432a77L39l2nM3j85O9k03L11l46L34J8l36K07l1K2l01K54L4Q3k12J50kl12O5
7456b13K47J08O4j05N5n3j47Q3O5j12nP4k28L16J75k45j14%L29l36J40j43J53
7479A08j27J44k02L4J14Q8j73n4j14K15m0J61r7j9p8M0K28l05K97j37l85K15K92
7502B05k09O9o1p0m6K75j34l16Q5K68N0k12J26j6j15K09j48J8jN7Q1k75J24p9
7526a15J00K79k94jm9J56P2l97K96j64j15L49r3r8K68j96o1j82L35J8j05J8R8
7549A19m37M04J25k34N5k63K13J32l09K40j48K77l66o7J99J41P1l61N44j82O2
$$ plain form
7385 -48 -46 -159 215 -149 -317 -289 45 88 -165 399 24 -114 291 144 -40 151 107 21 12 83 284 -56 -147 -330
7409 -330 -112 184 228 167 76 -300 114 -44 261 31 85 -351 -150 37 155 106 -28 26 95 134 -189 147 -177
7432 -177 162 130 125 168 -17 52 -151 160 -186 148 166 -170 37 6 28 -273 -19 15 98 -114 36 34 -278 -213
7456 -213 34 142 206 101 156 103 -44 39 104 -8 -13 61 -167 149 324 79 -35 -35 294 -42 98 -45 108
7479 108 -19 125 -77 -43 71 159 -14 -68 -182 33 -7 154 57 38 -40 0 228 -77 220 83 -302 -87 205
7502 205 -4 65 4 -66 -112 163 29 -287 -202 66 116 -96 30 14 -101 108 -40 -22 -23 34 115 -160 -36 -115
7526 -115 -15 264 -30 -31 -80 76 148 -249 47 -117 -232 117 24 -74 194 -2 -63 -245 90 108 3 21 119
7549 119 -318 86 211 -23 32 -231 -18 114 -195 45 -103 174 -192 -259 -60 81 152 -209 335 153 215
7570B15j13j70j08J60K85p2k61Q6n4J23J51k82l6K0L7%P2j38k53L30Lj27J83k78
7594b27o6O03m10P3j03K46j30L4l00L66j3j36K23k10J18j95L00o5N2j5k53J60
7616E2R0K2k31M6K1j20K38L2j75J37p3J5J0J08o2k85M68j86j52K76l53O9q0K82
7640A49o01N72k66R6o7L21k98J40K37k95j10J61j59k3Q1K66j11j53J01o9M78l83
7662F7P0k14K82k68K27p5p7j00J49j6j2k28K12Ql26L08o8K68j38k31J01J19r4
7685c6o6O6J99p1M8l98J84P2j17L05k69j9K66j36q7J10l9j95J74l0K65l25L5k6
7709i0K36k52Jj13J78p2P6K17rl19J18M4j26j08L01J09k84J55r6L49j24o44N71
7732A18m2J13m91K49j20J3M01l88rL17l58Q8l67M52K6J15O7j35J50m89Q1J32N8
$$ plain form
7570 215 102 -68 -176 -16 269 197 -64 22 -32 91 242 -40 -76 -56 -19 -19 53 -85 -338 -8 -5 -132 51 -227
7594 -227 -293 310 -100 -27 -130 116 -14 20 -280 86 73 -63 160 -50 68 -127 173 108 160 145 -108 52
7616 52 142 164 -67 -21 0 -120 118 150 -25 112 39 54 64 172 110 -175 293 107 -45 231 -122 -53 -133 149
7640 149 -452 120 -146 -50 -117 204 -94 46 283 -12 -122 39 -120 -143 -62 204 93 -60 41 -28 450 67
7662 67 137 -77 205 -63 164 89 12 -88 61 45 33 -195 17 25 -301 7 -61 207 69 -162 -61 58 -36
7685 -36 -102 -36 163 92 140 -258 -74 -2 -119 186 -83 -102 164 28 -59 51 12 -183 -9 -39 226 -99 -64 -90
7709 -90 146 -106 -105 -218 -40 -112 -36 181 172 -147 -29 15 -111 -219 82 191 -93 62 -34 315 191 -453 118
7732 118 76 189 -302 -53 -173 -160 241 -147 -156 161 -197 -109 -476 -24 2 117 184 49 199 -290 -209 -77 -19
7755a9N2j75K00K19m96K61Nj24O1J63j67mp4p5P3J67l01j64N75l33K30J17n1j97
7779e7J74J14m44N6Q9J07j19K15m3k58K07k6j3j70Q5J05L20l31J3J87j51J74l34
7802a00J92N6k0l49q9M11j65k46N09j73r8J92j10k66r0L22M8N0k60J59N7R7P7
7825B04l51J04K93j39j35K9L30m20j38J37M05l39L04k69k3r8j09L16j32m5Q7K58
7847B69k06j92l67M66P5j11K2J69M1m62K30K70j06j91K93j94p4L59l95J43j00
7868f1R8q7K1p4L30l99L47r7k83J43K42l03J54L7j36M1k54K48J81j3p9k15L23
7891A64oj20j22j09L19Qr0l13K70j94K51J45k12K89m25J93Qj28M54l18Q1k79R0
7914d4M3K5K0j50K69k11L83n02lK62k50K03O8k18j68nJ10L78O0k34P1l78N50k53
$$ plain form
7755 -19 33 -142 58 277 -219 42 47 -77 -16 147 -20 -24 -98 -173 -100 67 -234 -398 177 -156 74 191 140 -57
7779 -57 117 231 -213 -157 -68 39 -80 135 92 -166 41 15 2 -168 -83 22 342 11 24 211 60 234 -100
7802 -100 92 148 128 -221 -310 101 -64 -310 199 26 -72 120 10 -256 -346 -24 24 74 -186 -27 30 127 204
7825 204 -147 -43 250 111 -24 5 335 -85 -223 -86 319 -20 284 15 -8 -106 -215 101 -31 -76 11 269
7847 269 63 -129 -496 -30 45 -66 -44 125 166 -296 -66 204 98 -93 200 6 -68 291 -104 39 -61
7868 -61 37 -50 -29 -103 227 -172 175 78 -205 -62 180 -123 31 68 -68 -27 -281 -33 148 135 56 -159 164
7891 164 158 38 -84 -193 126 134 44 -269 1 -193 58 203 -9 280 -145 48 56 -72 382 64 145 -134 -44
7914 -44 -1 24 44 -106 163 -48 335 -167 -170 92 -158 45 113 -105 -273 -278 -168 210 270 36 107 -271 279 26
7938B6l9K0j00M7K92j42j73L19k72J62j71p5R0K5m1L41k84J75k22%J08O9j37j47
7962a29K15l91K68m9k8p8J43J2P0M9j04R7k17J31O1K31l77m5J28j11J55k36j70
7985c75M81j06m9L21m10R1J36k37L36k95o4R5J01j38K02nn0l1L44m85L00m8J65
8008B79p3m45K07m1j58O7J72K59k06j20L3j56J51J98k38q6j85L35l9J01q2j6K33
8031A90j66j94L01l73J12K23n06M51L8Lr0K48r6P32j088N24K20l79N0k74j0j29
8053b13M82r8n55P18k43k14L87J96m88O40n50J37L16n43k54j0M47J99k49j32q0
8074a07l02M14N54m85J1J06o62P45N87l93O24o21j56l52K72J97p13J74L36r95
8094g66O39j3M91k57mj07K93l14Q8j5K86l48n3p3L25k49O3j9J58R0l68J93j49
$$ plain form
7938 26 -13 7 -93 -46 246 104 -69 250 -22 140 -31 -106 -16 9 -32 309 25 200 -22 -22 86 155 18 -129
7962 -129 86 -305 -37 -86 -114 -192 -49 -37 33 82 -22 75 -142 -11 50 281 -96 -141 -13 -124 31 -205 -375
7985 -375 106 0 -49 272 -138 -47 89 -148 188 -107 -171 -76 25 -113 89 84 34 3 347 -138 162 114 279
8008 279 206 -239 -32 -73 -231 -164 8 267 61 -59 -26 -182 -31 167 -71 -157 -342 -7 -46 55 -27 -43 190
8031 190 24 -170 131 -242 -130 93 -413 38 76 79 -11 237 141 873 -215 309 529 150 200 -74 -84 -213
8053 -213 269 171 -384 334 91 -123 264 460 -28 612 62 199 515 -28 -282 -292 155 354 105 -27 -107
8074 -107 -409 5 559 74 85 191 -471 274 861 468 1092 471 315 -37 235 432 -281 -107 229 -766
8094 -766 -127 -140 351 94 90 -17 276 -38 50 35 321 -27 -80 -153 172 -77 -14 -33 125 215 -153 40 -109
8117a09K44L5k75p2J76J34q3k03k1M1J58r5Q5Qk9k2p6L16j79L9J46%j63j72k76
8142c93N41L38q68L83k31M67n53P1J154j093J26P46m69k57j82L6J226r68M41L55
8162H70j25r64K20N53q08J48l74L27J01q40N88J93M36m47L08l22L48m9k50m39
8182e26M21K80j6j17P1oO6l29J49
$$ plain form
8117 -109 135 170 -105 -177 -1 133 50 -153 -174 -133 25 -70 15 23 -6 -28 -104 212 33 72 218 218 55 -117 -393
8142 -393 148 486 -382 1 -230 237 -316 -245 909 -184 -58 688 219 -38 -220 -184 1042 74 515 870
8162 870 745 -219 1 554 -254 -106 -480 -153 -52 -892 -304 -111 325 -122 186 -136 212 163 -87 -526
8182 -526 -105 175 159 42 113 107 173 -156 -7
8191g
$$ Imaginary data points
##PAGE= N=2
##DATA TABLE= (X++(I..I)), XYDATA
0@%%%%%%%%%%%%%%%%%%Qj6J6j6J6j6K2l0L2l3M1m8N4o3P1q0R1j03J13j26J42j59
40h4J76j96K19k42K66k93L25l59L94m35M81n28N81o41P10p86Q70r70J086j222
60f48J386j586J837k164K610l253M265o109J0496m0911j8738P7458k3651l4896
74c3904L5807J0280l6358J4308K0461k0626p840K1111r295q695J2869k848o835
87a1565R416j013j695K060n6J819J169l047M59J910N19o408L183O796j0950j39
103g542J4548r020p076J4494P15j1902O406J0491j1843m347J6079p394j1748J5292
117G153k286j2539J1173K845j0258M763O038n183j291O914k195m093N553j341
131E253m519M857l456k609N555m307k022N741k952j987L920L22l128O45N161m268
$$ plain form
0 0 0 0 0 0 0 0 0 0 0 0 0 0 0 0 0 0 0 0 8 -8 8 -8 8 -8 14 -16 16 -17 24 -24 30 -33 38 -42 49 -54 59 -67 75 -84
40 -84 92 -104 115 -127 139 -154 171 -188 206 -229 252 -276 305 -336 374 -412 458 -512 574 -648
60 -648 738 -848 989 -1175 1435 -1818 2447 -3662 6834 -34077 -52815 24643 992 -33904
74 -33904 1903 12183 -24175 -9867 10594 -10032 -17872 3239 -6056 -14751 -1882 -4730 -11565
87 -11565 -2149 -3162 -4857 -2797 -2853 -1034 135 -2912 -2453 -543 -24 -6432 -3249 3547 -7403 -7542
103 -7542 7006 -2014 -9090 5404 6119 -5783 623 11114 -729 -5076 11003 3609 -8139 7153
117 7153 4867 -7672 3501 6346 -3912 851 6889 1706 415 7329 5134 1041 6594 5253
131 5253 734 5591 2135 -474 5081 774 -1248 4493 1541 -446 3474 3796 668 1313 6474 2206
147B206l620O980l312n854O755j268n810L274K310l728j262M563j072m254N877
162A785R6o296N512O43o155M067P00n397J977J954k990n69L233j264k347N408
178C57j614m037O562j226m973O070o29n487L860J043l786P26K984j882k397M820
194C91J20m797N670J067n403M113J570m205J838J792k187j353K472L96m110L369
210G43J438m262L415K293m633L182J781l372J450J496k274j216K859o04l700L282
226A878J083n282L863K199n026L067J977l801J025K639k236j664K247k38l443
241a712K240R32m312K694J723m351K239K250k999O75J756j209j210J651J34k829
257b328J689J013l786K079J679l717J803J761k239K14J881r33p90J650N82k906
$$ plain form
147 2206 -1414 5566 2254 -3600 3155 1887 -3923 -649 1661 -2067 -3329 1234 162 -4092 1785
162 1785 1881 -4415 1097 1740 -4415 -348 352 -5045 -3068 -1114 -4104 -4673 -1440 -2704 -5051 357
178 357 -1257 -5294 1268 42 -4931 1139 510 -4977 -1117 -74 -3860 -3134 -150 -2032 -4429 391
194 391 511 -4286 1384 2451 -2952 1161 2731 -1474 364 2156 -31 -1384 1088 1484 -2626 743
210 743 2181 -2081 1334 3627 -1006 2176 3957 585 2035 3531 1257 41 2900 2296 -1404 1878
226 1878 2961 -2321 1542 3741 -1285 1782 3759 -42 983 3622 1386 -278 1969 1731 -1712
241 -1712 528 1460 -2852 -158 1565 -2786 -547 1703 -1296 -621 1135 -74 -1284 367 501 -2328
257 -2328 -639 374 -3412 -1333 346 -3371 -1568 193 -2046 -1832 49 -884 -1674 -24 558 -2348
273b348J862J900m520J720K483m120J357K324k580O04J974q45r45J610R32k640
289a232J478K034l538J287K359l916J044K161k471N21J631q08q02J410J243k493
305i2J038K263l256O95K498l349L90K004k323p0J550k86j431R65J414k130M10
322B90K709l207j54K911k797j12K124j981o68J584p04j211O18J711k681K66K719
339A417k470l62L014k909Q6K064j875n56J379m01j248M32J403j870l09K696j983
356a492m67K761k115m04K436j522p49J155L9q11k03J678j686j06K468j818m83
373a319K816j855n04K317j332n58J208J43j076J54J296j256p71K703j913q86L178
390B345j723j027K570j080q10J052R6r55P7J504j651o16K341j227j673L180j527
$$ plain form
273 -2348 -486 1414 -3106 -1386 1097 -3023 -1666 658 -1922 -1318 656 -189 -1134 476 1408 -1232
289 -1232 246 2280 -1258 29 2388 -1528 -484 1677 -794 -273 1358 550 -252 1158 2401 -92
305 -92 946 3209 -47 648 3146 -203 187 2191 -132 -202 1348 1062 -369 596 2010 -120 290
322 290 2999 -208 -362 2549 -248 -360 1764 -217 -885 699 -5 -1216 -598 1113 -1568 -1302 1417
339 1417 -1053 -1415 1599 -1310 -1224 840 -1035 -1591 -212 -613 -1861 -1429 -26 -1896 -2205 491 -1492
356 -1492 -1959 802 -1313 -1717 719 -803 -1552 -397 -358 -1169 -1372 306 -1380 -1486 982 -836 -1319
373 -1319 1497 -358 -862 1455 123 -435 773 916 -160 -6 1290 34 -737 1966 53 -833 2345
390 2345 622 -405 2165 1085 275 1327 1423 468 545 2049 398 -218 2123 896 -777 2403 876
407H76j333K214p35j095Q03N71j195l0J340j207q59K162j626j239K488j188j255
424a308J826n30q55P42K72n51o90J458o39j516K227r67j613K369o93j562J880
441a50m55j043R12N44j000k13J414p47j184K203q38j550K088k30j568J507L25
458A5j211O70L95l66n53J587m51j168J941n64j321K042o43j411J654K37r51L16
476B18Q04n29p20Q57M22j755J789L24j711J487J79j618J432P1j108L26R07l73
494A002j040J343k67j381J272J53j803J722J02j608J042M49j302M21L81k64q04
511e82J304l36j461J325M82k148J346L74j259O07K37n93kM42n1m58O92K74j666
530a473J205O32j970J239M48j455P73J39m30O5M33p3o59O11O51j431R27R51k139
$$ plain form
407 876 -457 1757 1022 -73 730 1301 106 76 1416 209 -650 1512 -114 -1353 1135 -53 -1308
424 -1308 518 -12 -867 -125 147 -404 -1094 364 -275 -1791 436 -531 -2144 225 -468 -2030 -150
441 -150 -605 -1648 -736 -192 -1192 -1405 9 -738 -1922 281 -557 -2107 -19 -249 -1817 -310 15
458 15 -1196 -526 -131 -497 -1050 537 86 -1082 859 295 -1026 1016 373 -1038 616 853 -98 218
476 218 1022 493 -227 630 1052 -703 1086 1410 -301 1186 1365 -253 1179 1250 142 468 1375 1002
494 1002 -38 1305 1038 -343 929 1082 -721 1001 1103 -505 537 986 -316 105 486 222 -582
511 -582 722 386 -1075 250 732 -1416 -70 304 -955 -348 -111 -704 -706 -264 -315 -773 -81 193 -1473
530 -1473 -268 364 -1606 -367 81 -1374 -601 -462 -892 -827 -394 -467 -1126 -515 136 -1295 -368 583 -1556
549a556J058R39j493P02O80q92K40M20p0l96R68M1j054Q79R68j932J031P66j441
568a42L85O47r00J09N85J50q46M55R01j227L96R60j682R26O01j250L08L93k91
587D78k32K60M0q79N17N04j248O00Q25j609P03J214j450J51O81o93j41K63k1j012
607a049O43O90j066M39J004j180k35J511j708O63P81j391k32R29m11n02O15L43
625a56p07j75J104j374P56J207j357J4J123n47j019P34P98r52N7P19j01j238J218
644A04j2l49L13m98l93J383K13n51l40Q1j24P21M49p30o89J589j136k10J062p18
664A65p5O01l21n4M20K99n92l05J040j027j38P32p32J53P10p64R9M08o47K57K10
685D39p2j85m48J011q50n07J500j005n86J013l84n53L20J37n45Q2P43o47o7P19
$$ plain form
549 -1556 -498 441 -1052 -350 330 -562 -322 98 28 -368 600 641 -413 466 1434 -498 533 1299 -142
568 -142 243 890 -10 99 684 834 -12 443 1344 117 513 1473 -209 717 1318 68 376 769 478
587 478 246 506 546 -333 184 688 -560 40 865 -744 -41 1173 -277 -126 555 -138 -279 -16 -37 -1049
607 -1049 -406 284 -782 -343 661 -519 -754 757 -951 -288 493 -898 -1130 -201 -612 -1114 -499 -156
625 -156 -863 -1038 66 -1308 -552 655 -702 -688 435 -112 -1131 -397 401 -551 -494 225 124 -1114 104
644 104 92 -257 56 -442 -835 548 761 210 -130 -49 -173 548 997 267 -422 1167 31 -179 883 165
664 165 90 691 370 316 736 1035 443 138 1178 151 13 745 13 166 876 112 211 619 -28 229 439
685 439 367 182 -266 745 -105 -612 888 -117 -703 310 -74 -627 -307 -170 -715 -633 110 -537 -604 115
705A15o81k37J293j172m81J398j181m1Q08l40j12J84O7l19J36P76m31m78R15k45
725b6n76Q20l86n94M83j2R4KK40k94k56J105m30o20J096n82l02R38m02k45M03
746D56j55rk06M21r0n26J042n55o47J099j51o75P72N9p79M03N17p44k87O39l08
767B76o26J039k06r34J128m05o31R03j34n90L83N6k45l26L52r1l44N71L7r91Q84
788A06j25p57P68j5l16l9K7K25p81N91M9m04M65o3n12N96m6l86J22L73l65l7M51
811g3k65j26O41k92l91O49K7j365J544N2j637J426l86KL10l45L3O26K73J26j047
832b18J19j1L4L43P36n44J48n9o46J7K29M09j03n9O16o73K58K02j101L62J67o1
854A65j56L61q8j07N4K41n71K19K80n63M91K30p03L11Oo30N21M33q04Q5K77m05
$$ plain form
705 115 -566 -803 490 -682 -1163 235 -946 -987 -179 -519 -631 -447 -380 -699 -563 213 -218 -696 219 -26
725 -26 -602 218 -168 -762 -279 -291 -197 -195 45 -249 -505 600 170 -450 646 64 -238 700 298 53 456
746 456 301 292 86 507 417 -109 933 378 -269 830 679 4 776 835 56 459 976 232 -55 584 276
767 276 -350 689 483 -451 677 272 -359 544 410 -180 203 259 14 -312 40 -51 -395 176 213 -778 106
788 106 -19 -776 -8 -23 -339 -378 -351 -126 -907 -316 -267 -671 -206 -269 -781 -185 -231 -617 -495 -122 -487 -524 -73
811 -73 -338 -464 177 -115 -506 143 170 -1195 349 401 -1236 190 -196 -194 116 -229 -196 430 703 829 -218
832 -218 -99 -110 -76 267 1003 459 607 548 -98 -81 148 557 454 395 1011 338 596 798 -303 59 226 165
854 165 9 370 282 175 229 470 -101 118 398 -165 326 556 -147 164 170 -460 61 494 -310 -225 52 -353
876c53K45n8K71n57K65M30j027L21N62n39K72L73o60K91K48m65j03K3K71k06j17
897e13O73p20L35L10o41L04K66k99K40J76q9k94%N61l80O4L97m66J3N27q38P23
919C49j21j04J39m6r5r8k8K91j70j28M46n05L23L55q04N22L3k63J36M6Q6r2k02
942G0O22m90j66O72p07j61P81p80q4M77l76K61K9O9l84O6M19m16k52N25k03l75
964d03Q37q18j10M86j34J24l55M00m73J17K53l20n9N12o30K13K79m81L86N3K0
985a03k07J57j69K47r0K4k21j04O69m19j61M14k15J08K63l71K36m7J80j49l04
1006b62M69k48j6L65j89r2M92n29J50K19l94L62j89K00j89j44L89J8m83L88j13
1027B04k23P27l92l23M21l07o8K07Ml49N05l00M1l23P53n09k47O21l70J56k6m07
$$ plain form
876 -353 -108 -166 105 -452 -187 243 -784 -463 99 -440 -168 205 -455 -164 84 -381 -484 -461 -190 -396 -513
897 -513 160 -560 -225 85 -556 -252 14 -285 -45 131 42 -252 -252 309 -71 -7 390 -76 -63 464 -374 349
919 349 228 124 263 217 122 24 -4 287 117 -11 435 -70 253 608 -196 326 359 96 232 278 364 272 70
942 70 692 202 36 708 1 -160 621 -159 -243 234 -142 119 148 217 -167 -101 318 -98 -350 175 -28 -403
964 -403 434 -384 -494 -8 -142 -18 -373 27 -446 -329 -76 -396 -455 57 -573 -360 -81 -562 -176 -123 -103
985 -103 -310 -153 -322 -75 -165 -141 -362 -466 203 -216 -377 37 -178 -70 193 -178 58 11 191 42 -262
1006 -262 207 -41 -57 308 119 27 519 -10 140 359 -35 327 138 338 149 5 394 412 -71 317 204
1027 204 -19 708 316 -7 414 107 39 246 250 -99 406 106 147 -176 577 68 -179 442 72 228 202 -205
1049b05L86k68J14r0m4Rj78j79M32j93k34O41n50j08L01j62J08k32M16j59j90
1070c85L57k47k09K92J96k78L33k18j44K6K02j4M8o6r7k2R9J03j86M96k02l44
1092b60L47k64j19M66l15J91k77L18L6p8m2j2j13M63J57n97L31k25r9M30j70j63
1114EK63O1L3P9J6k32j83r6K94k79J49n4J35m6p0R2k99M64j60l14M54j48k40K03
1138A27Pj19K04j38m82N34k17n5J94K38k88m17L78K6p6J7M5m67M35n9l48M84j97
1161a74q4J85j25k3L4k59L05k45L12rj84K39j1j9Rm4j53k8L48o8k74n6M79m41
1185b86O55p3m27M37k53k31K18P3j33j0L7K65k94P9M31n45N37j99j72K7Q0j66
1207E0K5o7J55j37j57J90mL46l57qkK20n12K93J60k93K06R3M8j08j18J19k79J44
$$ plain form
1049 -205 181 -87 27 -63 -107 -98 -276 -455 -23 -216 -450 191 -359 -467 -166 -328 -220 -452 -36 -195 -385
1070 -385 -28 -275 -484 -192 4 -274 59 -159 -303 -277 -75 -89 -41 -107 -204 -226 -127 -24 -210 286 84 -260
1092 -260 87 -177 -296 170 -145 46 -231 87 123 45 3 -9 -122 341 498 -99 232 7 -92 338 168 5
1114 5 268 329 362 441 457 225 42 -54 240 -39 110 56 191 145 75 167 -132 332 172 -142 312 164 -76 127
1138 127 134 15 219 81 -401 133 -84 -139 55 293 5 -412 -34 -8 -84 -67 -22 -489 -54 -113 -461 23 -174
1161 -174 -258 -73 -198 -221 -187 -446 -141 -386 -74 -83 -267 -28 -39 -58 -49 -93 -246 -274 74 6 -268 -324 155 -286
1185 -286 369 296 -131 306 53 -178 40 113 -20 -30 7 272 -22 57 488 -57 480 281 109 136 216 50
1207 50 75 8 163 26 -131 59 55 401 44 36 34 254 -258 35 195 -98 108 201 249 141 23 142 -137 7
1231GJ31k09j3K97l61N5K89n03J13J09r8J98k94J63j21j4J30J04l41L82k99J98
1253g7n1J0m5K9J03j38J26J40M8k00M51m56k29P4k9L71j83j7J17o6k56K75L09
1276C06r5k09J07L13m57j32N04k11j33J20k43L36Q6l66L29j35L62m47J90Pj64
1297F8j18L04r8k06M93l82Pnl1J45N9j42J65j82r0Q4N9l8Kj30K52m85K56M1j46
1322a18L4j6m9J38j06L52j43m88M73J0l19J29L5J26k2k17J37J38R9l80l08L27
1344a68J18Q5j08pj69M08l77K01mj45Kj1J27n6p1K35Rj26o8j39K96J00k29O8J61
1369A32k8j65l5J54L9n3J39j99o3J38J38k42J65j29j14L83k94L71m17K85K4k95
1391f6K39k77M05q8l3r7M3J81j49j76K71p2k52K78j56r8J87j37PJ11k26k41K19
$$ plain form
1231 7 138 -71 -84 213 -148 -93 196 -307 -194 -85 -183 15 -279 -116 -237 -251 -121 -17 -358 24 -275 -77
1253 -77 -128 -118 -163 -134 -31 -169 -43 97 145 -55 396 -60 -289 -215 -244 127 -56 -73 44 -22 -278 -3 306
1276 306 211 2 109 422 -35 -167 337 126 -7 113 -130 206 292 -74 255 120 482 35 225 232 68
1297 68 -50 254 156 -50 443 61 68 63 32 177 236 94 259 77 -13 71 130 92 94 -36 216 -269 -13 28 -118
1322 -118 -84 -100 -149 -11 -117 235 92 -396 77 87 -232 -103 -68 58 36 -181 -44 94 193 -187 -495 -168
1344 -168 -50 35 -73 -80 -249 159 -218 -17 -21 -166 -164 -175 -48 -104 -175 60 69 -57 -125 -264 32 132 -97 -29 132
1369 132 104 -61 -96 58 97 44 183 -16 -79 59 197 -45 120 -9 -123 260 -34 337 -80 205 229 -66
1391 -66 173 -104 301 213 180 83 126 307 158 -18 253 181 -71 207 51 -47 140 3 10 121 -105 -346 -127
1414a27n6K2K23p7l19R5K9N16l15qO5m0J31q7m08K10n6p4M83m74J20J90j82J0
1438a29K8J06M6l02J94J16j30Q7k86J6K22j02J70qk8L60n76M59j58k24R0K54j79
1461B6mJ62l10J08N0J44k37J20K73j17l25L60l50J30q7N9pP3k5M1O6J15J17k55
1485A27j87OJ46K35l06J05o7q8L40j68K7j60J92j09k80J11Q7p8J32k69J57l6J79
1508I6j41j24P7j5L21o18J75J1J36L57l88O5q2j59R9L02m40M18j28J13l02J67
1530f0P6J39M4j80o6K6q4mK33k30l9L28j02k10J64j55j3K39J88l38j57K58O0j84
1554f7k1N2j1R5O1o3P3K56l61j49K29o7j37K91q1j07J30l4K46j70P6l2j06r3j42
1579a32j24J6K34k80O6J26K69j3k49p0L8L47j76J04k48K23j24L9m3k86K90m1K4
$$ plain form
1414 -127 -183 -161 62 -15 -334 -239 -210 306 -9 -17 48 8 139 52 -356 -146 -202 -276 207 -267 -147 43 -139 -129
1438 -129 -101 5 51 -251 -57 59 -71 16 -270 -254 -32 -134 36 28 0 360 -216 243 85 -139 -49 205 26
1461 26 22 184 -126 -18 32 176 -61 59 332 215 -110 250 -100 30 -57 2 -5 68 43 84 150 265 382 127
1485 127 -60 -54 92 327 21 126 59 -29 311 143 170 10 202 93 -187 -76 11 -67 65 -204 -47 -83 96
1508 96 -45 -169 -92 -107 214 -404 -229 -218 -82 275 -113 -48 -130 -289 -190 112 -328 90 -38 75 -227 -60
1530 -60 16 155 199 19 -47 -21 -105 -109 124 -106 -145 183 81 -129 35 -120 -133 106 294 -44 -201 57 117 -67
1554 -67 -88 -36 -47 48 109 46 119 375 14 -135 94 27 -110 181 100 -7 123 89 335 165 241 209 103 10 -132
1579 -132 -256 -240 -6 -286 -220 -94 175 162 -87 -157 -119 228 52 156 -92 131 7 46 3 -283 7 -34 -10
1602a0n9J93k02l4n6M6P5p6p8NL85l51K34j25M7k84K29k3p1m0L55k22O4m5N5K74
1628B86m57L14k25K83k76L2q4J47l8j60K2J72K96l11R8k95J68J09o3J70j9k17
1650d8M3O5j64J18o7J0J83k59K3N0K23j33l9m9J6J12j66K56j70n1OL7J01k8k11
1675a42R2m0j69K59j58J97k6K35k23k3k5K4j79M1P1j15K8q5K45p7m0K38j66j80
1699b18L48j18n4l3J18L2m18O14m56L64k15j56MJ46L82l87J94ok30m6K6J91O4
1722A46k45J26k40J43m1K55L5l44K64L8o5j17K75j87m8J59j47J85k76r1M80l09
1744dO2N4j5J43m6k21k40K52R1K46j57k82l2L38r8j29Q6k6l78K03L85l13L20l98
1768a59K6J09j4oK4m4p8pR4R2k59L49N8j58J20j6k6J92m99J43J40j47j54N0L56
$$ plain form
1602 -10 -69 124 -78 -112 -168 -122 -47 -123 -201 -196 189 -162 72 -53 -6 -290 -61 -84 -155 -195 160 -62 2 -43 12 286
1628 286 -171 143 -82 201 -75 -43 -127 20 -18 -178 -156 16 312 1 99 -196 -28 81 18 188 169 -48
1650 -48 -5 60 -104 14 -53 -43 140 -119 -96 -46 177 44 5 -44 -28 84 -82 174 4 -47 -41 -4 97 69 -142
1675 -142 -50 -90 -259 0 -158 39 13 248 25 2 -23 1 -178 -137 -66 -181 -153 -238 7 -70 -110 128 -38 -218
1699 -218 130 12 -42 -75 43 75 -343 271 -185 179 -36 -192 -188 -42 340 -47 147 141 -89 -135 -109 82 146
1722 146 -99 27 -213 -70 -111 144 179 -165 99 137 72 -45 230 43 -5 154 7 192 -84 -175 305 -4
1744 -4 58 112 97 240 194 -27 -267 -15 76 322 165 -117 -149 189 91 -38 48 22 -356 -153 232 -81 239 -159
1768 -159 -133 -24 -38 -44 -20 -64 -142 -149 -55 37 -222 127 185 27 147 131 105 297 -202 -59 81 -66 -220 -170 186
1793A86k03qr0J79o4J30l22K03q7q8J45J15K9j36k9L1j76n8J15j00K56N4J65k62
1817a5o0M2J02j41j64M05l30L30j10P7l34K47k36J23J21k41qR8J18L02n2O5l40
1840aO9J81l65J45J86j65o8K2J26k53L32J6j35J03j39J62N9n7J6P2n25JJ27J1
1864h0K33k69n6KJ10M8j19L4K80k01j76P4K83N8l08J14j78J06J61k25%mJ76o9
1888fJ7j30q1L93l27J89J3P5j75K7J6k23R8r6K03j12K96j32k03J93Lj90K43J04
1912A95k0m34J89K5J83m17K95R0j79R6r1M9K70Q5m10K41k96P8J81J86k81p7N70
1935E28n65K2K03k32j18L29n9n2k72J76J53O2l88J64J00j66j4m1K30M5l26L67
1957A46k05M5rk22L74j27j18j6J76K3q0k85L21k88K41j14J81k5L1j67N2k4K54
$$ plain form
1793 186 -17 -25 -115 64 0 130 -192 11 -76 -164 -19 96 125 -11 -40 -9 -185 -243 -128 -228 28 82 247 -15
1817 -15 -75 -33 69 -72 -236 169 -161 169 59 136 -198 49 -187 -64 57 -184 -192 -94 24 326 274 339 -1
1840 -1 68 249 -116 29 215 50 -18 4 130 -123 209 225 90 193 54 216 275 218 234 306 -219 -218 -91 -80
1864 -80 153 -116 -172 -170 -60 -12 -131 -97 183 -18 -194 -120 163 221 -87 27 -151 -45 116 -109 -109 -113 63 -6
1888 -6 11 -119 -200 193 -134 55 68 143 -32 -5 11 -212 -114 -210 -7 -119 177 45 -158 35 38 -152 91 195
1912 195 175 -259 -70 -45 138 -279 16 106 -73 23 -68 -19 251 336 -74 167 -129 -51 130 316 35 -42 528
1935 528 -37 -15 188 -44 -162 167 108 56 -216 -40 113 175 -213 -49 51 -115 -129 -170 60 105 -221 146
1957 146 -59 -14 -23 -245 129 2 -116 -132 44 67 -13 -298 23 -265 -24 -138 43 18 49 -118 -66 -90 164
1980A64k76J84n6l25J89k7k4J07J33r7n7J41J00l33J98k74K02m7K19k44K45j59
2002c7J86O6j97m2M7p2J29J00p5R7j01k66K01n6J84K61j48j15m04K79n4J51l19
2025a85L47l28J20j72K11M95k98k59O6K12j17J43m39K13R3n9K9Jk25L58p1L6j03
2048F8k11j54J78q7l5J92J11m8J04l19K74j71J16k14L17J09o21O37m02m0K15o4
2070d5j2J26q4j47J24oj27J81L4Mo5K75J74k16j05J00l13J25O6j13O7M6J53k98
2094e6n1J87m54L98J70m42J90J07p4J25j14J74O2m7n6j79J6J41j86R7j12K55K08
2117C59m36L21m8k91Q6M9L37l05r8J19k41J04k11J78j8P0N8j38J20Oj56j11j05
2140c51K83l2l4J73q1J58j7r0j95rO8j17K52j27q1l4M59l20O9J69q9O0k11j02
$$ plain form
1980 164 -112 72 16 -309 -120 -147 -171 -64 69 -28 -85 56 156 -177 21 -253 -51 -98 121 -123 122 -37
2002 -37 149 215 18 -24 23 -49 80 180 105 202 101 -165 36 -20 164 425 277 162 -242 37 -17 134 -185
2025 -185 162 -166 -46 -218 -7 488 190 -69 -3 209 92 235 -204 9 102 43 72 73 -152 206 135 171 68
2048 68 -143 -297 -119 -206 -241 -49 62 14 118 -201 73 -98 18 -196 121 230 -391 246 -156 -196 19 -45
2070 -45 -57 69 -15 -162 -38 -44 -171 10 44 48 -17 258 432 216 111 211 -102 23 89 -24 43 89 242 -56
2094 -56 -107 80 -374 24 194 -248 -58 49 -25 100 -14 160 222 175 119 -60 -44 97 -89 8 -104 151 359
2117 359 -77 244 196 -95 -9 40 377 72 -26 93 -148 -44 -255 -77 -95 -25 33 -105 15 21 -135 -246 -351
2140 -351 -68 -100 -134 39 -42 116 99 9 -186 -195 -127 -244 8 -119 -200 -234 225 -95 -26 143 54 114 -97 -199
2164a99K18l8K16p7m41L37m3r8N5J53q9p6M8k16K04q3L16r7l22L59j19R4l43K15
2188b6K31j54j43j81K90j50J30M8J24j58j26M5K56Q1j56j03j01p1K66M9k77K30
2210A04j3j87jOrJ11J53j33o4k3qr1J95L25k83N3l40L98l53L44j56Q8K9R9m06
2235a62j73N71j24n06K93K5K18j82o6Q3r9j0J06j91J79L60k24j56J50Q2k17q5
2257a28J83lo5j24J43K5mo0L6N7j87K52R1k93k4N3j24J12Q5k14j63K74J98j26
2281fj16L88k56j9k23J70P4j14n7K72j4l12K74P4j10k50P6K27j85L0j77L14m0
2304B0k0J51j45R8J9j13K64k33k6J45k74J0L72l46j8P6K36q6Ok63q7J61N7K4r8
2329g0l9K03P7j75n4L25l85K28p9j43N0r1Q7J25j46J22r7k4k8q5M7J95j04J94
$$ plain form
2164 -199 19 -19 197 120 -321 16 -27 -125 -70 83 -6 -82 -34 -250 -46 -129 187 90 -232 127 8 102 -241 -26
2188 -26 205 51 -92 -273 17 -133 -3 45 169 11 -115 -70 186 267 111 8 -93 -164 102 151 -126 104
2210 104 91 -96 -97 -91 -100 11 164 31 -33 -56 -64 -155 40 365 82 135 -205 193 -160 184 28 116 145 244 -162
2235 -162 -335 236 112 -394 -101 -76 142 -40 -106 -23 -122 -132 -26 -217 -38 322 98 -58 92 174 -43 -128
2257 -128 55 52 -13 -137 6 31 27 -33 3 60 -127 125 216 -77 -101 -48 -172 -60 25 -189 -352 -78 120 -6
2281 -6 -122 266 10 -9 -232 -62 12 -102 -159 113 99 -213 61 135 25 -225 -149 78 -107 -77 -254 60 20
2304 20 0 151 6 104 123 10 274 41 15 160 -114 -104 268 -78 -96 -20 216 130 136 -127 -214 -53 4 28 -70
2329 -70 -109 94 171 -4 -58 267 -118 110 31 -112 -62 -153 -66 59 -87 35 -62 -86 -114 -199 -152 43 -61 133
2353A33q1m1j09P1q1M03k65P2k49J89K6k58m1j8L03j40o6J01j82J58j8K59j43
2376B3mn0J23k02%L64m51K05j1J85n0j70m6O4K97L8l26J22O3j62k28L58l22K31
2400E1nJ74m40L54Lj08M8l63K56K8RK78m55K25J66k86J46l1Nk56nJ28PP5J2l7
2426b1N0j68J40Q3M7k74K37j92l0L36j47k73M27l66J42l80M67j43R9k70J45J19
2448B8k34L14j20j14P7j13N76l47j03O6j78K06J04o5l33L8J75Q8l52J82N1MJ06
2471E6RM5Q4m10L01k29Q6j78N9J43k5j02K16M5k64L33k29k52L68k47J13J38q0
2494b0Q6j23J52l25L49j23M8L8k62K99k08K6J24l45K12J79j71k57L41k7j45R1
2516f1K30l11K55J9j33J51j12J07j88N3K3l8m42N69j39J67j32k34L33j48R9K6
$$ plain form
2353 133 52 11 -98 -27 -108 295 30 102 -147 42 68 -190 -231 -249 54 -86 -152 -51 -233 -75 -93 166 23
2376 23 19 -31 92 -110 -110 254 -197 8 -3 182 132 -38 -84 -20 277 315 -11 111 174 12 -216 142 -180 51
2400 51 46 220 -220 134 137 29 77 -286 -30 -2 7 285 -170 55 221 -65 81 50 55 -201 -206 -78 -71 4 16 -21
2426 -21 29 -139 1 84 131 -143 94 -98 -128 208 61 -212 215 -151 -9 -389 78 -65 34 -236 -91 28
2448 28 -206 108 -12 -126 -49 -162 414 67 -36 30 -148 58 162 97 -236 -198 -23 65 -287 -105 -54 -50 56
2471 56 65 110 194 -216 85 -144 -58 -236 -177 -34 -59 -161 55 100 -164 169 -60 -312 56 -191 -78 60 -20
2494 -20 66 -57 95 -230 119 -4 44 82 -180 119 -89 -63 61 -284 -72 107 -64 -321 20 -7 -152 -61
2516 -61 169 -142 113 132 -1 150 38 145 -43 10 33 -5 -447 122 -17 150 18 -216 117 -31 68 94
2538I4K0j24p2K02j06J67j65j62J27J83n6k1l07J45R3R5K84m41K2J86n8j92l2
2561a18J76l9j93J70j20K31k78JM29k62P4j49O3L17j50l08J78j47K36j28n0J97
2583A30J01l7k76p5L24q3P6k29J76K4j14J21m06J63J08K64j79R2j12j27p3K23
2605I1O0n24L62m3j00J82l05M92j79r9k64N7M93r46N69M45N90o2j019j67O01l33
2627i9j7J01k42N53l83K2R8p6K98j27P7m0J59l99O84o00M06k5k31m8k05K39r4
2650E1j45J96L58p20J97n8o0j03L04p2l1l5K40j02Q8Jq5n9j0J53J07j26j04R9
2674H4k17J55j8m3J4P7M8J04L5l30r8K31l35J29L61j44J8k44N7K58Jj49J60L7
2698A91m10J11L23l76j56L56j16J4M1p9K20q1K45k30K4k32L64j70L1nk79O9K73
$$ plain form
2538 94 114 -10 -82 120 14 181 16 -146 -19 164 108 87 -220 -75 18 113 397 -44 -22 164 106 -86 -118
2561 -118 58 19 -174 -4 -124 107 -171 -170 259 -3 71 -78 -15 302 152 -156 22 -125 111 -17 -67 130
2583 130 231 194 -82 -157 167 84 160 -69 107 131 17 138 -268 -105 3 267 88 180 68 -59 -132 91
2605 91 151 -373 -11 -54 -154 28 -277 215 36 -63 -327 -270 223 -723 -154 291 881 819 -200 -367 234 -99
2627 -99 -116 -15 -257 296 -87 -65 33 -43 255 128 205 165 324 -75 609 9 415 390 159 111 -94 145 51
2650 51 -94 102 460 -260 -63 -121 -181 -284 20 -52 -83 -118 122 20 108 109 24 -35 -45 108 215 89 -15 84
2674 84 -133 22 4 -39 -25 52 100 204 239 -91 -189 42 -293 -164 197 53 71 -173 -116 142 143 -6 154 191
2698 191 -219 -108 215 -161 -317 39 -77 -63 -22 -101 119 38 283 53 77 -155 209 39 70 65 -214 -145 128
2721A28r8J39k12l2q7Q8N1j43J59M1j2K13j69k07J99J62r1k13P3l0L85l26j58
2744a40L24l19l1M64n43K39L13k26K37o5n72L89M0k75M15m49J68L77o05R16k62
2765C95j26m08M43k8n06M06k86l76M01L31l40K78Jm1j05K03q2N5j65j54Q0L04
2787B80n00N49l06m69L09L10m24j84N77J25j54k02j02L55J83k16j78K8K9K79L0
2808C19n81Q51n38l54M57rl64L47L7j50m59O17j59l3j14n46L42J48Q01q25J44
2829f9M20k96M7j86j26l71O66k17L39r5j07J97Ml26K43O3r5q5J55j48j68l1J89
2852CJ80l06J53%J42j16P3Q6j88j25j9j50M31k07r2J78j70M34m41J0K14p1o7K45
2876A97l7M3n95L17K40m20M32l81L34k23p8m81Q61j49Q0K48p74N85k68R5M32n79
$$ plain form
2721 128 30 169 -43 -75 -162 -74 -23 -166 -7 34 22 235 66 -141 58 220 129 -84 -11 -41 344 18 -140
2744 -140 184 -135 -166 298 -245 -6 307 81 318 253 -319 70 110 -165 250 -199 -31 346 -259 657 395
2765 395 269 -139 304 276 -230 176 -110 -486 -85 246 -94 184 185 144 39 242 160 215 50 -104 -24 280
2787 280 -220 329 23 -446 -137 173 -251 -435 142 267 113 -89 -191 164 347 131 -47 -19 10 289 319
2808 319 -262 589 51 -303 154 145 -219 128 165 15 -444 173 14 -19 -133 -679 -337 -189 612 -213 -69
2829 -69 351 55 102 -84 -210 -581 85 -132 207 112 5 202 206 -120 123 186 91 6 161 13 -155 -186 3
2852 3 183 -123 30 30 172 56 129 215 27 -98 -117 -267 164 -43 -135 43 -127 307 -134 -124 90 19 -48 197
2876 197 160 203 -392 -75 165 -255 177 -204 130 -93 -171 -652 209 60 140 388 -386 199 -69 26 458 -121
2898a21M75n19l3J53k07N37m8k68J35J82l29j02K0k3K9k95K29M38N5o15K64N5
2920A2J97k09k4m19O02N9o2k65O1q7L17k58L03k12N19j55o93N77k07J53k65l66
2942d22L09J30j27o34O68L95j93p1l94J86MJ20L81l88m20L11O57j16k62k96k8
2963a90K63l14M92L7J94k89Q2K7k29L6R5M77n94k06j11L69N8l65k0l40N15J72
2985A59j29k61J08N47m29k62P05m45J45k53L30l40L22k68J55N0J91n0Q2P8k00
3006B35j67K9K59m39J1j36L02J22K17m34O26j167Q65k14J60k71l26M23Q5K06n75
3027a89M32K0p45O49o07R0N16o18N08m14L72N41n14j18K27m54L51Q28q29L50K1
3048D17o21q15J115j47J9o7K2M30k86j97J7qK94J39l47O2o9J3j22K20J24k65J73
$$ plain form
2898 -121 354 -165 -198 -45 -252 285 237 -31 104 286 -43 -145 -125 -148 -119 -414 -185 253 308 -307 -43 12
2920 12 209 0 -24 -443 159 218 156 -109 -48 -135 182 -76 227 15 534 379 -314 263 56 209 -56 -422
2942 -422 -113 17 -110 -744 -76 319 126 55 -339 -153 -149 -29 352 -36 -456 -145 512 396 134 -162 -190
2963 -190 73 -241 251 288 482 193 275 302 73 109 204 681 87 -119 -230 139 197 -168 -188 -528 -13 159
2985 159 30 -231 -123 424 -5 -267 438 -7 138 -115 215 -125 197 -71 84 134 325 275 357 435 235
3006 235 68 97 356 -83 -72 -208 94 216 433 -1 625 -542 323 109 269 -2 -328 95 180 386 -189
3027 -189 243 263 -482 167 -440 -350 166 -452 56 -358 14 555 41 -77 150 -304 47 875 46 396 417
3048 417 -204 -1019 96 -51 -32 -99 -77 353 67 -130 -113 -121 173 312 -35 27 -42 -29 -151 69 193 -72 101
3071A01k02N8K00k9k44L48k50J57j79R3mL6j91q9L78l65K79R4q2j73j45J81l1
3094e9O4J28P1k71R3j14R1K12k29%j57J56j59J12J09l5M5k98O57l68j37P8k3J16
3118H2j95L16k74j0n1J08K68j09l91M12j49J29o3j9k12K73N2q8o9mJ04K2p7l5
3142B0l74L95K59k61M4l57M78m19J58m5N42o01J03J71L5J47l62p7J60N3k7k45
3164b03r2L97J91n07L15J25ql86J3K09n2J67N7q7l81n31J192j067J275L20j586
3185f39L11Q81K26q70Q20j058R10n11P11j218l19N21q39J171k18N60k08o75K74
3204a70m6M43q76N36O8K41j09Q1o9m59L90j38J00O1o7qK48n7k16K05k00J73k34
3227a03l9J9j6J07Q4J84k26m2J27j46R7j16L12l78K23K50m17J42r2K00K04n24
$$ plain form
3071 101 -101 -43 157 128 -116 232 -18 139 -40 53 49 85 -106 -195 183 -182 97 191 109 -64 -209 -28 -59
3094 -59 5 133 204 -67 26 -88 3 215 -14 -14 -171 -15 -174 -62 47 12 57 -241 416 48 -89 -11 -34 82
3118 82 -113 203 -71 -81 -132 -24 244 135 -256 156 7 136 73 54 -158 115 167 79 10 6 110 132 55 20
3142 20 -354 41 300 39 83 -274 204 -215 -57 -102 440 -161 -58 113 148 295 -67 -144 16 69 42 -203
3164 -203 -295 102 293 -214 101 226 218 -168 -155 54 2 169 226 139 -242 -773 419 -648 627 947 -639
3185 -639 -328 553 779 -91 729 -329 581 70 781 -437 -756 -235 -1074 97 -121 439 231 -444 -170
3204 -170 -216 227 -649 -113 -45 196 87 168 99 -360 30 -108 -8 53 -14 -22 226 169 -47 158 -42 131 -103
3227 -103 -142 -123 -139 -32 52 236 10 -32 95 -51 46 -70 242 -136 87 337 -80 62 -30 170 374 -150
3249a50R1M45k78j11j61L69k25J10p1j20J54Ol54L44r1R4p8J43k28M51m37J65
3271F8j03k48L57K75m20J95j6j17m0k3J49j1k59K57m2jj15K66j47k1m95N09m9
3294c1n7K71k45Lm0J84J1k01L06l37L11l33L09m09M05m24L17m7oM2j39jl6L55
3318B08j93P0j36M1O6J51k41J69l6l8j26l3J02m6O5Qj10J51J45n77J76p2J60P2
3342b4m6j1K6j12K20k5j15K08R5rk4k66J63R8n53L47J65J45n03J10J08K10k02
3365Ek27M02k21K39J8j47J1j48j18K07rN1l29K19P8K48l26l7K64r8m2q4K3r5J33
3390A7O0m83M72J7n6Q2J32n30K01J21M8J12k21J74l9k17K8o7K79l22j7K6J55Q0
3414E2%nr5J74n2k70j44M28j10P7k31K90o2j73K21n2M1j07J34j89j2J87K9j78
$$ plain form
3249 -150 -59 386 108 -3 -164 205 -20 90 19 -101 53 59 -295 49 -42 52 -26 117 -111 340 -97 68
3271 68 -35 -283 74 349 -71 124 108 -9 -49 -72 77 66 -193 64 22 21 -94 172 25 4 -491 18 -31
3294 -31 -88 183 -62 -59 -99 85 96 -105 201 -136 175 -158 151 -258 147 -277 40 -7 -13 29 -110 -111 -147 208
3318 208 15 85 -51 -10 56 207 -34 135 99 61 -65 -98 4 -42 23 31 -79 72 217 -360 -184 -256 -96 -24
3342 -24 -70 -81 -55 -167 53 28 -87 121 216 207 183 -83 80 178 -375 -28 137 282 -221 -111 -3 207 5
3365 5 -222 180 -41 198 216 69 80 -68 -186 21 12 63 -266 -47 31 279 -47 -84 180 82 40 -44 -21 -116 17
3390 17 77 -406 66 83 27 109 241 -289 -88 33 81 193 -28 146 107 -110 -82 -149 130 -192 -209 -183 -28 52
3414 52 52 47 -48 126 74 -196 -340 88 -22 55 -176 114 52 -121 100 48 89 -18 116 -73 -85 102 131 -47
3438d7j85J56K09j34R6k00J39j28k21M89k29K38j79j57L11j56N2j0l13L64k10
3459a15J20N1j44J24j4j30O6K69k84j83M08k2k29J37J75m63K35J28P8j97M0j32
3481h2R2k57LL02M7k3l65N14j25K1K8m03J04R1p2K77j29m7j56L85k47k2q7K14
3505F3m9K1k01J14j5J52j90J56n5L5J11n4M4q2O8J77l42J34k58K64K9k43K33l26
3529b14J01K59j16p1J25l65K04MJ38l6p3r8K57J1l76K20o5J52J4q6j93L08k13
3552a13j24L20j17J50J70l33j33n1P8K26o3Q0j96J40K9m6J36l10N8K57r2j30J73
3575A09k64J70j78J19K24q0j54O6l7O2O0O8n1j32R1o3kP9R3k33j46L51q7M3l14
3600b06L1K96j60J94k42K39O2k06J15l9Q9k86J6L21m61k23O03k08r8q1P6j25J40
$$ plain form
3438 -47 -232 -76 133 -1 95 -105 34 -94 -315 174 -55 183 4 -153 158 2 54 44 -269 95 -115
3459 -115 5 56 -88 36 22 -108 -42 227 -57 -240 168 146 -83 54 229 -234 1 129 207 10 50 -82
3481 -82 10 -247 -244 58 105 82 -283 231 106 127 155 -248 -144 -53 -125 152 23 -24 -180 205 -42 -64 -151 63
3505 63 14 35 -166 -52 -67 85 -105 51 -4 31 142 88 132 50 118 295 -47 87 -171 93 122 -121 112 -214
3529 -214 -113 146 30 -41 84 -281 -77 -73 65 29 -44 -142 115 126 -250 -30 -95 57 71 -15 -208 100 -113
3552 -113 -237 83 -34 116 286 -47 -180 -231 -153 73 10 90 -106 34 63 17 153 -157 -99 158 66 -64 109
3575 109 -155 15 -163 -44 180 100 -54 12 -25 37 97 165 114 -18 73 10 8 87 180 -53 -199 152 65 108 -206
3600 -206 -175 121 -39 155 -87 152 214 8 123 84 173 -113 -97 224 -237 -460 143 -65 -163 -244 -168 -293 -153
3623a53K3R3R6j78J76Pj88j48K12O3j70K36j1K4M0l9j62K24jr8K34n5k86LL94
3648C36m12j23K3J11%r4R0J49j75j25J69M12l61J09l60J35K63qm3j3J2j31P4j41
3672a03L06j43J57l73M68l82P9L58l89j43L18l08j0K98J36p3j99j38K93O3q0k0
3694A15m32M24k70N6L82m09P7J28j29P9N76o38L8J35j81K43j20j44K5J31j00K08
3716A94n31J99N42l50j89%J8n98Q67l34j77M04K8j33J10O86o58K88l21M74l08
3737B11m93N28m4L19p16J75o13L58J13P80j234K65N46n02m61J457o28o0O73n30
3757A44N72J98p59M2P5o76Q63K85m61m44K03L5p44K30O21K88Q4o09L9k36Q13j047
3779d84M27j19M28o58M89l77j98O38o23J524j588J122q8o18J31l84l7L30N46j30
$$ plain form
3623 -153 -130 -37 59 -119 57 64 -124 -272 -60 3 -167 69 58 82 122 83 -79 145 144 46 280 225 -61 -58 336
3648 336 -76 -199 -176 -65 -65 -159 -69 80 -95 -220 -51 361 0 109 -251 -116 147 139 96 83 95 -36 38 -103
3672 -103 203 60 217 -156 312 -70 9 367 -22 -165 153 -155 -165 133 269 196 -3 -141 152 215 135 115
3694 115 -317 107 -163 -107 275 -134 -57 71 -58 21 597 -41 -3 132 -49 194 74 -70 -45 86 -14 194
3716 194 -337 -138 404 54 -135 -135 -117 -715 152 -182 -359 45 73 -60 50 736 78 366 45 519 211
3737 211 -282 246 202 521 -195 -20 -633 -275 -162 618 -616 -351 195 -307 -768 689 61 1 674 144
3757 144 716 914 155 197 272 -404 459 744 283 -161 42 77 -667 -437 184 472 556 -53 -14 -250 563 -484
3779 -484 -57 -176 252 -406 83 -294 -492 146 -477 1047 -541 581 493 -125 6 -378 -415 -85 461 331
3799C31l13P85m02j64J61J09k49N16q29Q05j288L7L17n85J199l61K75q12P27n89
3819c30L45m78K59k70O95r9L4P1k44M95r46O05L85n68L51J5m05j31K38l23L50
3840D9N47q81K44L29m70J58m5N73k13r84J040k40j13r97J129J10l88r9J32O70
3860E51o21J08M94m32j09J267q91m72m2m01R52j17o42K9M4NJ98M92k02k71m39
3881d99Q32o15M36q8j9m53N44k21J472j862K63k78L11k46R39K8o63J1N81q0q5
3902C08J68o91M85L65K31n55L25j189K17P63r3L09m55J21j040J360j205R86k09
3921B01L74m9o30n50J384p55J89N30j384j01O07K35j98j28J531q52r9o22o73J353
3941C63j043j47O37K10m65Q00Q0l72N56r09n3N08L97n78J71o6r11P77m03J07K8
$$ plain form
3799 331 18 803 401 237 398 507 258 774 -55 750 -538 -501 -184 -769 430 69 344 -468 259 -330
3819 -330 15 -463 -204 -474 221 122 156 227 -17 478 -468 137 522 -46 305 320 -85 -216 22 -301 49
3840 49 596 -285 -41 288 -182 -24 -69 504 291 -693 347 107 -6 -1003 126 236 -152 -251 -119 551
3860 551 -70 38 532 100 -9 1258 367 -105 -147 -548 404 287 -355 -326 -282 -277 -79 413 211 -60 -499
3881 -499 333 -282 154 66 47 -406 138 -83 1389 -473 -210 -488 -177 -423 516 544 -119 -108 473 393 308
3902 308 476 -215 270 635 866 311 636 -553 -336 427 334 643 188 309 -731 629 -576 410 201
3921 201 575 526 -104 -654 730 -25 164 694 -690 -791 -184 51 -147 -275 1256 404 305 -317 -990 363
3941 363 -680 -827 -190 20 -445 355 435 63 619 -290 -343 165 562 -16 155 89 -822 -45 -448 -341 -313
3962c13J062n55j34J60R1K93j016P45Q7J07O1q23M96l45k82R31j151J50N09n41
3982d68n28J083J10j66j17j93J91O14m08m33R41l85l93Q99p72O20L37j158M00
4001A74k45Q25q56R67j474R35p95P34o6J414j456n43O22k98L60k88K19k90N82
4020E21p89N14m04O26k99o47O83jo17K23M66n72M82n7n4K77q2p55N95j4k99k6
4042b29p0N73k67o0k15m0K87l36K01M7R6k26L64k35L07j72j14P9Q4L79m98J65
4064A20k26R2j55J88K40q9j96J6l27L78P6L3k65R9m3O0M8k9M50n84n6K52k39m1
4088a98L76j01R6j06k21J01K94p1L64n05K61l88K14K53o00J20m0K57l04M20n8
4109A64m9J67K02q77K92J03P1K89m52L03p7K3J00j86l31k46L10l06O48l71J096
$$ plain form
3962 -313 749 194 60 220 311 604 -412 333 420 527 588 -235 261 -84 -366 565 -586 -436 73 -468
3982 -468 -996 87 197 31 -86 -279 -88 526 118 -315 626 241 -152 747 -25 595 932 -226 174
4001 174 -71 754 -102 865 -609 326 -469 265 199 1613 157 -386 236 -62 298 10 229 -61 521
4020 521 -268 246 -158 468 169 -478 205 204 -413 -190 276 -296 186 129 75 352 270 -485 110 96 -203 -229
4042 -229 -299 274 7 -53 -268 -308 -21 -357 -156 -109 -13 -239 125 -110 197 25 -89 -10 74 453 -45 120
4064 120 -106 -14 -169 19 259 170 -26 -10 -337 41 117 150 -115 -16 -59 1 49 20 470 -114 -170 82 -157 -198
4088 -198 178 77 173 67 -154 -53 241 170 534 29 290 -98 116 369 -231 -111 -151 106 -198 222 164
4109 164 115 282 484 -393 -101 2 73 362 -90 213 136 159 259 73 -258 -504 -194 -500 148 -223 873
4130H73r65n02O96l14J58j69N42K81o30P6l63K49J41K40l37j89N06j25K16r6k49
4151C9k37P68p62k28N81r34N27q3J008q22L39N9l56R91j233l56P95j72q95J305
4171C34l13K92l10P22m84J57o07Q64j465J116p59J41Q70O40j234n42O35o6q10
4190h19o1Q40M20K42k04j134J264m48K03o15K60K35n11o1O06k35J18L0m7n03j41
4211e61N05k31j71M10N05m92K7j1q44N35N99m16P32j583J190N5m61m34Q28k93
4231a11j38o46M27P85m51J76k83L4p0n50J046k83l77R66n4k45J63o60N07n95P37
4252C78m16J03M21m90k6j98L63m9M76j005L19m4J3N32k17K2k31j42L67m11K66
4273C1j28J92K28o95O20J61m91K54J08k58K84m40J02L22p4r8j71o2p8O38p44K77
$$ plain form
4130 873 -92 -594 102 -212 -54 -223 319 600 -30 46 -317 -68 73 313 -24 -213 293 168 384 288 39
4151 39 -198 570 -192 -420 161 -773 -246 -329 679 -143 196 255 -101 890 -343 -699 96 -76 -971 334
4171 334 21 313 3 725 241 398 -209 655 -810 306 -453 -312 558 1198 -36 -578 57 -9 -819
4190 -819 -880 -40 380 622 418 -716 548 100 303 -312 -52 183 -328 -389 217 -18 100 130 83 -420 -561
4211 -561 -56 -287 -458 -48 457 -35 -8 -19 -863 -328 271 -145 587 -996 194 249 -212 -646 182 -111
4231 -111 -249 -895 -468 317 -134 42 -241 -207 -277 -827 219 -64 -441 525 471 226 389 -271 236 -359 378
4252 378 -38 65 486 -4 -30 -228 135 86 562 -443 -124 -168 -155 377 160 182 -49 -191 176 -235 31
4273 31 -97 95 323 -372 248 409 -82 172 280 22 306 -134 -32 290 216 118 -53 -115 -193 445 -299 -22
4295b2K58j88q9j4O5L12k55O5k26K76J09n5n00K56K0q0J04J63l43M8J78m85L49
4318e4K88n53J85J28J37Q9n6j60l1J35pr0KoL3O2j78J03P6l47J67J33K3k22L47
4343B04J12j86j16P4r5l53K05n4L44M9j12K62k31r5k19%N28m09j40N24n67M79
4365B04o0q3k09K3k7p0K79p5M7J40j30K36m07L52O6p5k62P7k55P4M13l06jN3j79
4390a75K96n3l32L72k73L86m21L40M7m65O2j8Q8J28j05n8J90J37k08P0j52J26
4412a8L30l60Q9q3L7O9k26P1j1k01J41J97j22J33J00j18j18K34m7k19J19p0M0
4435c3Q9M1n3k9K0m3q5P3k4M5k70K63j51J77J24k14J03k7Q0PK40k62P5o4J39j17
4461A04j34K07L1m4oj85L67j53l22K78k3j14j14J26k38k9Q9M32j65k12J02l5O1
$$ plain form
4295 -22 236 48 -41 -55 10 322 67 132 -94 182 291 236 -264 -8 12 -68 36 199 -144 -96 82 -403 -54
4318 -54 234 -319 -134 -6 131 220 164 4 -27 108 101 11 13 7 40 102 -76 27 103 -244 -77 56 79 -143 204
4343 204 316 130 14 88 -7 -360 -155 -209 135 184 72 334 103 8 -211 -211 317 -92 -232 292 -275 204
4365 204 144 61 -148 -125 -152 -222 57 -18 29 169 39 275 -132 220 286 211 -51 26 -229 -155 258 -48 -49 4 -175
4390 -175 121 68 -264 108 -165 221 -200 140 187 -278 -216 -234 -146 -18 -123 -181 9 146 -62 8 -144 -18
4412 -18 312 -48 41 -42 -5 64 -162 -91 -102 -303 -162 35 -87 46 146 28 -90 144 97 -122 -3 -73 -33
4435 -33 56 97 44 15 35 -8 -93 -20 -44 1 -269 -6 -157 20 144 -70 33 6 86 93 333 71 146 82 221 104
4461 104 -30 177 208 164 158 -27 340 187 -135 143 120 6 -108 18 -220 -249 -160 272 107 -105 -3 -38 23
4484B3k06J12l9J04j14M66l33j40k7K33kk64M22j14j44O9m6Oq7Or9K32j05j81
4508b28K81l55L87r5n7j96J66jk3j57J97N5J1K08j71J83l61Q7K98j37oj17J76
4531A45l7k33l3J31N8l2M9Q9p2o4o0q0J07l03K72J82k90M06l4l63K68j75J2j36
4555a93M50q8l63J2K60l02m1J97L0j49l0L22j04j07k60K31P2K3j01K69p4P8k61
4578a29K75k1k9k60L74k49J74p1k65J3N7K35N1q7j2j36O6J4Q9L8M1o2J5M1l10
4603a48M60l17j5j94K45j24K02k64K83j19p8R1q9K51k44n5N2k83M05l5N5j6L2
4626I5j97k23L85m2J32j08O5j21J17J45k87r3K07j72K2o6K36J10n5j05p1j83N65
4649C56l88j13j3O5Q4O9k51N1O1R4j17J47j60L10k58K14j66J20kk55K43l5m12
$$ plain form
4484 23 -183 -71 -110 -6 -120 346 13 -127 -154 79 77 -187 235 121 -23 46 0 6 -81 -75 -174 58 -47 -228
4508 -228 53 -302 85 -10 -67 -263 -97 -98 -121 -278 -81 -26 -15 193 22 205 -156 -69 229 92 86 -31 145
4531 145 108 -125 -158 -27 31 -1 48 137 65 1 -59 -139 -32 -335 -63 119 -171 235 201 -162 106 -69 -57 -193
4555 -193 257 169 -194 -182 78 -224 -265 -68 -38 -187 -217 105 1 -106 -366 -135 -63 -40 -141 128 54 132 -129
4578 -129 146 125 96 -164 210 -39 135 64 -201 -188 -131 104 155 68 56 -80 -14 0 89 127 168 106 121 162 -148
4603 -148 312 -5 -20 -214 31 -93 109 -155 128 9 -69 22 -67 184 -60 -115 -63 -346 59 24 79 63 95
4626 95 -102 -325 60 18 150 42 107 -14 103 248 -39 -132 75 -97 -75 -141 95 205 150 45 -26 -209 356
4649 356 -32 -145 -158 -93 -9 60 -191 -140 -79 15 -102 45 -115 195 -63 151 -15 105 103 -152 91 56 -356
4672c56J29J24Q8q6q0L75m2R4l32mJ38O7l69N53m78L29l10L22J0k08p2J01pJ25
4696A11j93n9K44k40K98n9n2K77m47J55k01J36j36J73K61m00K16j46J2j74L07
4717H3q5Kq9Q1Jk05K49K83k59j40K37k68mR1k24L94l05K35l17M72r5K00k93j8
4741B6j02J3R0j54P1j13L44m27K65L5J50m10L96l47L00k08l30L63j3O7j27J22
4763A1K6N9k00L83k48p0P5K22l74K26j93Lm1N05k95j20KJ0K8k28K07J31j3K21
4787C27p8j95j98K76k27L71n62L98K03q41J004k9m73J0K0J41J07j75j80J74L8
4808A11k67L65k16l54N13l96N88K06q37K23n36N64L00k28j14n05J07L39k36L05
4828f8L2N33m15R66r10p85N46l99O00P12j47o15M25p14J010m53r1m98n27Q85J86
$$ plain form
4672 -356 -227 -103 -15 -101 -181 194 152 246 -86 -90 48 115 -254 299 -179 150 -160 162 172 -36 -108 -7 -14 111
4696 111 -82 -141 103 -137 161 102 50 327 -120 35 -166 -30 -166 7 268 -132 84 -62 -50 -224 83
4717 83 -2 0 -89 -8 -7 -212 37 320 61 -79 158 -110 -114 -23 -247 147 -158 77 -240 232 137 337 44 26
4741 26 -76 -63 27 -127 -56 -169 175 -252 13 48 198 -212 184 -163 137 -71 -401 -38 -51 16 -111 11
4763 11 37 96 -104 279 31 -39 36 258 -116 110 -83 -80 -121 384 89 -31 -29 -19 9 -219 -12 119 106 327
4787 327 249 54 -144 132 -95 276 -286 112 315 -526 478 449 -24 -14 6 147 254 79 -101 73 111
4808 111 -156 209 -7 -361 152 -244 344 550 -287 -64 -600 -36 264 36 -78 -583 -476 -137 -373 -68
4828 -68 -36 497 82 1048 138 -647 -101 -500 100 812 665 50 475 -239 771 318 227 -271 -798 87 273
4849B73k36j26K66O3n7J6K34n57L71M39j23Pn49M01k24L4o54Q20r8p56O92n92
4871c56L73k11O5k92M34p42M82J318j042o78O25P32j393J016j005J150l69m68
4889c61K98J005o70o70jJ292p64p97j44J460j16k78m69L71J13L53k59P2j029R18
4909C24J4m88NL20o3p9m00k30P48k90m16P32K30j110J081L82l40r35J084l25j308
4930a064K027l70k68o7K72J25l60P2l72q27J161m32J33j50J32N69l18k17j25k54
4950c33O45l96j09P78l75k16J5J19j31J00M5k10J20o5L34n9m25m42R46O79r82
4971C8j63P60p03O91j031O00l63Q42m87L35p46O35N57p53r7l17j23J236r29L01
4991B83J66m74m60L22J50L88m31N53j3j189J307r40R02j69p97n75K74N5J675r93
$$ plain form
4849 273 37 -89 177 240 183 199 433 -124 247 686 563 570 21 422 198 232 -422 398 300 -456 236 -356
4871 -356 17 -194 -129 -421 13 -729 -247 1071 29 -649 -24 708 -685 331 -674 476 107 -361
4889 -361 -63 942 272 -398 -399 893 129 -668 -812 648 532 254 -215 156 269 622 363 435 -594 324
4909 324 338 -150 -145 175 112 33 -367 -597 151 -139 -555 177 407 -703 378 760 420 -515 569 244 -1064
4930 -1064 963 593 325 258 530 655 295 367 -5 -832 329 -103 30 -120 12 581 263 46 -79 -333
4950 -333 312 -84 -193 585 210 -6 9 128 -3 97 142 -68 52 -13 321 262 -163 -605 341 1020 38
4971 38 -125 635 -68 623 -408 192 -171 671 184 519 -227 408 965 212 115 -202 -325 911 -18 283
4991 283 449 -25 -485 -163 -13 375 -56 497 484 -705 602 -338 564 395 -402 -977 -703 -648 1027 34
5011C4O03j154M49k73R51J74k27k05m5K74j309R85l1k37K78q9J32M31r94O83m05
5032B5j93O32j255K63O36K10L56r04J071q93j78J10k56P56l72J23M39r57N02r9
5052A6J92J14j024Q6N10N3O73k37J96j016j07N66P31n07j64k04Q21j136L63m48
5072e22L92J119r41m36O65l72k2J98l99K52P69j78m99m99Q42L80l70N9n51l64
5092d77o68R71l63R49k71J01j434J559o27P22o28Q2L27m58j26r27J791r91L31
5111a37l89N87j86M35m88K86N1j54J51M5J61k98K46p61P42O2j95j3R0k29n28N68
5133D6k70l3J68k27L74m11p5Q13q93L42K41n62L87m82K96M55J70K00n90J99p0
5154G8l32O71p06N35l27k67L80p5o18M80L18o07P93m04r5J126p68m02J028o23
$$ plain form
5011 34 637 -517 -68 -341 610 784 557 352 307 581 -728 257 226 -11 267 178 310 741 -253 430 25
5032 25 -168 464 -791 -528 108 318 674 -230 841 -52 -230 -120 -376 380 8 131 570 -387 115 16
5052 16 208 322 -702 -616 -106 -53 620 383 579 -437 -544 22 753 246 82 -122 699 -437 -74 -522
5072 -522 -130 989 48 -388 277 -95 -117 81 -318 -66 703 525 26 -473 369 749 379 438 -113 -477
5092 -477 -1145 -174 -537 412 141 242 -1192 367 -260 462 -166 -84 243 -215 -341 -1268 523 -468 -137
5111 -137 -526 61 -125 310 -178 108 159 5 156 201 362 64 310 -451 291 353 158 145 235 6 -522 46
5133 46 -224 -257 -89 -316 58 -353 -428 385 -508 -166 75 -487 -100 -582 -286 169 339 539 -51 148 78
5154 78 -254 417 -289 246 -81 -348 32 -43 -661 -181 137 -470 323 -81 -176 950 182 -220 808 185
5174A85m21M62k45l24K88N34q65M98j52K28M13q71M54Q5k47L2M03l00m04L49o81
5195e79N77J84K65o67M21N7m07M21m55N5N22q09P09L60j044K82L76j52l13N15
5215C18l19J86j28L16k73N69n29p44O11n3m9J55j38l51M08m75l4K53J52J21o2
5236f6K14l78J84j62J05q3n5N23j14j40l42N05K72p02M96k14k99j42J99J02Q8
5257iN98q07j53N43J19l00m7J21k65M74p25J95J78j05m1J69J41P9p6J6n00m0J067
5280F32N6n63l83M8K39L92K95m33P4j179R86J95N13k71r72K46K94L81j735J047
5300a38J5J83Q10j38j869J093N69o57M66K4m00k24O55j5L54j110O38m76n6L04
5320B8K4n13l5J379j706R83k64p3M93r05L00J94J13j70N39R28q48j222R72j67
$$ plain form
5174 185 -236 226 -19 -343 -55 479 -386 112 -40 188 601 -270 184 269 22 54 457 157 -247 102 -579
5195 -579 -2 182 447 -220 201 258 -149 272 -183 -128 394 -415 294 654 -390 -108 268 116 -197 318
5215 318 -1 185 57 373 100 669 140 -604 7 -46 -95 60 -78 -429 -21 -496 -530 -277 -125 -4 -66
5236 -66 148 -230 -46 -208 -103 -186 -241 282 168 28 -314 191 463 -239 257 43 -256 -398 -199 -97 -9
5257 -9 589 -218 -371 172 291 -9 -56 65 -200 274 -451 -256 -78 -183 -224 -55 86 165 89 105 -395 -435 632
5280 632 688 125 -258 -210 29 421 716 283 357 -822 164 359 872 601 -371 -125 169 550 -1185 -138
5300 -138 -123 60 870 732 -1137 -44 525 -132 334 358 -42 -266 389 374 728 -382 256 -220 -276 28
5320 28 52 -461 -496 883 -823 160 -104 -177 316 -589 -289 -95 18 -152 387 1315 467 -755 217 50
5340E0K61o28j60L55l37Q91l20k22k82K58p38o29n09K550M57n92p30R71q14l1
5360a99r4L8Q95p87J131j044O36K65l23j167Q75o44M48m7K21m96L00R49l38m88
5380A31J32r1n15K41K19K08k60J14M5M22j275R29P9N15j70r22N90K40k17l84j0
5401B1r8J28l39M9M52o49K96M21j119J020J54o46M5O31j138R08k13J06m01L19
5421e3J60k58Q93p44M82o99P43n32j38l94M65o43J05J057m33M4M69k94K27q38
5441c81M73k22j58M00J27l85L37Q4n09n9l99N46L8L51n58m27j67Q24o41P09O68
5462F51j25j314L40M28L51r87O82J21L4m00k28R12l40k62j97m7K18Q81j043K57
5482f8O60q73L44L28o40L46l13O48k28r12N74m14m84J658r74J19Q97k04k20n14
$$ plain form
5340 50 311 -317 -477 -122 -459 432 112 -110 -392 -134 -872 -1501 -2010 540 997 405 -325 646 -168 -199
5360 -199 -293 -255 640 -147 984 -60 576 841 518 -649 226 -418 30 -17 204 -292 8 957 619 131
5380 131 263 172 -343 -102 117 325 65 179 224 646 -629 300 379 894 724 -198 392 632 415 31 21
5401 21 -77 51 -288 -239 213 -436 -140 281 -838 182 336 -310 -265 366 -772 136 -77 29 -372 -53
5421 -53 107 -151 742 -2 480 -219 524 -8 -146 -540 -75 -718 -613 444 11 55 524 230 457 -381
5441 -381 92 -130 -288 112 239 -146 191 275 -234 -293 -692 -146 -108 243 -315 -742 -909 -85 -726 -17 651
5462 651 526 -788 -448 -20 331 -656 26 147 181 -219 -447 465 125 -137 -334 -381 -163 718 -325 -68
5482 -68 592 -281 63 391 -249 97 -216 432 204 -708 -134 -548 -1032 626 -348 -229 668 464 244 -270
5502b70l11M03J92Q87j341K6O48j85p66J002p21N43R7q35M1R15n38J43M03k42
5522I1k78n93N76J62K63k80m34J487o07j432R34j20l02P97N95j491L43n9P90n77
5542a35N59k5j55j94m43M30j23l58K08j49J298j119m8J97j27k05J038p77J98k14
5562a44oR9o0J62m3j77N6j0o5J51l3K07r0O3j40k9J87j83J73j80j2q1K4P7P4O4
5588H4L5j41l94L30J71KN0k20J98J22k03J33j7l32J37L5L99m31nn2R9k37K66o8
5612c9K65k53k52K39M2p8k05J75L40l04J24K79n44O0k45M69K05o93p3L91J61J3
5634G7J93p33k85O81Q4j75M32m41K57J18o39N20O01j085J037j36N38o62m88N71
5654D65l32m8k84N03j03l20R1J30j81K05o2j90N94o22J47rK38J26l67K50K2OJ92
$$ plain form
5502 -270 -581 -178 14 901 -440 -414 234 49 -717 285 -436 107 204 -631 -590 325 -213 -70 333 91
5522 91 -187 -780 -204 -42 221 -59 -493 994 387 -1045 -111 -231 -533 264 859 -632 -289 -348 442 -135
5542 -135 424 399 244 50 -393 37 -86 -444 -236 -385 913 -206 -254 -57 -184 -389 649 -128 70 -144
5562 -144 -150 -51 -111 51 8 -169 -113 -123 -188 -37 -70 137 47 110 -30 -59 128 -55 118 -62 -74 -155 -131 -54 20 84
5588 84 119 -22 -416 -86 85 87 137 -83 115 237 34 167 150 -182 -45 -10 389 -42 -47 -99 0 -237 29 -39
5612 -39 226 -27 -279 -40 2 -76 -281 -106 234 -70 54 333 -211 -151 -396 73 278 -415 -488 -97 64 77
5634 77 270 -463 -748 -67 17 -158 274 -167 90 208 -431 89 690 -395 642 506 1044 382 -106 465
5654 465 133 85 -199 304 201 -119 -28 102 -79 126 64 -126 468 -154 -7 -16 222 348 -19 231 253 259 451
5677D51l65p3J24j61O2K32K28p74L87K0l80J93K09J59n11J15m6J46j85J93j57
5698a33J78k20L89l17MK64j75j47J53nj06k40N95l11J40j80k99J59K58J1o06P84
5720A96j46l59j7O41l93M5K7Q8j12J64k42K99j13k86L93j66M01p99L28j7l78O11
5742A65k45RM87k32k73k71J91M43l73J65j43k63K24J74m00K33J07L07r9K89j38
5763C57r69L21k4J011o85LM17m72l4K68n09M11l78L76j89l59L96Q64r74j6J29
5784e6L70p22L91M08q62O75L52j020M64j2l66K95j82J59k87M46K60l23Q93n69
5804C14k63n38L23p4Q11n69M39p70O62k25j95K16m29L84K97o78P55q39L0L04K
5825d3k93K11K81j81Q6p52J200j87l52n61Q94j99k9j00m98O35K29k38k53j46L11
$$ plain form
5677 451 86 13 137 -24 38 270 498 -276 111 131 -249 -56 153 312 -199 -84 -130 16 -169 24 -133
5698 -133 45 -175 214 -103 -99 165 -10 -157 -4 -9 -115 -355 240 -71 69 -111 -410 -251 7 18 -588 196
5720 196 50 -309 -326 315 -78 -33 -6 82 -30 134 -108 191 78 -208 185 19 420 -379 -51 -68 -446 165
5742 165 -80 -71 416 184 -89 -360 -169 274 -99 66 -77 -340 -116 58 -342 -109 -2 305 206 495 357
5763 357 -612 -291 -315 696 11 14 431 -41 -75 193 -316 95 -283 93 -96 -455 -59 805 -169 -185 -56
5784 -56 314 -408 -17 391 -471 204 556 -464 0 -12 -378 -83 -265 -106 -393 53 313 -10 883 314
5804 314 51 -487 -164 -238 573 4 443 -327 335 110 -85 131 -298 86 383 -295 460 -379 -349 -45 -43
5825 -43 -336 -125 156 -25 61 -691 509 322 -30 -591 303 104 75 -25 -523 112 341 103 -150 -296 15
5846A5n0j34O40m89N7K55n58Q68p77L77l41J31l35Q93o48M70p37o5J288r61J90
5867H9m02P68j07o24K38r2n92N57J18m46N86LL50j14n9o43N84M25l25Jl12k87
5889b84K55N55o69Q83j055K70j94N61N84m37r43N75L91o98Q68m33p19J320j190
5908c60L75l22L61j46n0M23o95k64J108J33m03J47k98R8K11O5q11P37K73n25k76
5929b19J73m53L55j036J758m71K25l99m03J313n42q90K82k05J073n36l77K47j8
5948a23p82M95K73K17O82p77L57j84j08K73O24n41j54m55l83J147k60l57N07Q2
5968E33J01j141J46K087j319m65J68K92O21r63R67m16q20K90J26p46M87n04P63
5987B07K88N26n57j071j85O28l30L62P12q47m59K63L84n29q9N52l34J027q80M4
$$ plain form
5846 15 -35 -169 471 -18 39 294 -264 604 -173 204 -137 -6 -341 552 -96 374 -363 -428 860 -101 89
5867 89 -313 455 348 -276 -38 -130 -722 -165 -47 -493 93 96 446 332 273 -370 214 639 314 315 3 -284
5889 -284 -29 526 -143 740 -315 -45 -239 322 906 469 -474 101 492 -206 662 229 -490 830 -360
5908 -360 15 -307 54 -92 -142 281 -414 -678 430 563 160 307 9 107 318 383 -428 309 582 57 -219
5929 -219 -46 -499 -144 -1180 578 107 332 -67 -470 843 301 -589 -307 -512 561 25 -352 -105 -123
5948 -123 -905 -410 -137 80 762 -15 342 158 50 323 947 406 252 -203 -586 561 301 -56 451 533
5968 533 634 -507 -361 1726 407 -58 110 402 1023 60 1027 611 -209 81 207 -539 -52 -556 207
5987 207 495 1021 464 -607 -792 -164 -494 -132 580 -267 -726 -463 -79 -608 -697 -145 -479 548 -332 -288
6007b88j61N01l60N67L6j334J427m79L52L03o32K09O89j184K64K51k78J250j222
6026h9p4j09k42k43P44j63P15J10o42O13r19q0N45L44k98m67L89l28K71k06M15
6047B86q87M88m27Q7R53r58m99J198j88l55L17l12P21l39k05R4o5M04j65m08L54
6068I4j6J87r2K26M2j084Q40r58J169k09J45J1l22K92l84Q05j075J004n75n46
6088d46N30k48j09K73k43Q27k34q0o75J121j037N41k78k70N51j21j35l15J014
6107F66j095J85P97qp50M08l79L70p44L76r1M89J38j63o17M68j9P2l27K72nJ1
6129E4j13j3m41K79Q15j434P96o82Q55K83j290O34K45K52k31l5J07n34M65L1M15
6150D58o54M58L49m96r7n64L76k84O59j68N3l62K83n95J131j53j150P92l5K95
$$ plain form
6007 -288 -449 52 -308 259 295 -1039 388 -91 261 564 -68 141 830 -354 -90 161 -117 1133 -89
6026 -89 -163 -272 -514 -757 -13 -176 539 649 7 620 -299 -379 166 510 212 -255 134 -194 77 -129 286
6047 286 -601 -113 -540 -453 500 -458 -957 241 53 -302 15 -297 424 85 -120 -26 -91 313 148 -260 94
6068 94 78 265 173 399 441 -643 197 -761 408 199 344 355 33 325 -59 746 -329 675 100 -446
6088 -446 84 -164 -273 0 -243 584 350 270 -405 716 -321 220 -58 -328 223 102 -33 -348 666
6107 666 -429 -244 553 545 -205 203 -176 194 -550 -174 -265 224 362 199 -418 50 31 103 -224 48 43 54
6129 54 -59 -72 -513 -234 581 -853 -57 -739 116 399 -891 -257 -12 240 9 -26 81 -453 12 43 458
6150 458 -196 262 611 115 18 -546 -170 -454 205 37 90 -272 11 -584 547 394 -756 36 1 296
$$ [...]
8191H2
##END NTUPLES=NMR FID
##END=
