##TITLE=1H_SAM_33249
 MeOD,8 sc, 
 24.9.2021
##JCAMPDX= 6.0         $$ Bruker NMR JCAMP-DX V2.0
##DATA TYPE= NMR FID
##DATA CLASS= NTUPLES
##ORIGIN= UXNMR, Bruker Analytische Messtechnik GmbH
##OWNER= root
$$ XWIN-NMR		Version 3.5
$$ Fri Sep 24 12:42:10 2021 Russian Standard Time (UT+4h)  she@DPX200
##.OBSERVE FREQUENCY= 200.1314
##.OBSERVE NUCLEUS= ^1H
##.DELAY= (6, 6)
##.ACQUISITION MODE= SIMULTANEOUS
##.ACQUISITION SCHEME= undefined
##.AVERAGES= 108
##.DIGITISER RES= 18
##SPECTROMETER/DATA SYSTEM= spect
##.PULSE SEQUENCE= zg30
##.SOLVENT NAME= MeOD
##.SHIFT REFERENCE= (INTERNAL, MeOD, 0, 15.7039)
##AUDIT TRAIL= $$ (NUMBER, WHEN, WHO, WHERE, WHAT)
$$ ##TITLE= Audit trail, XWIN-NMR		Version 3.5
$$ ##JCAMPDX= 5.01
$$ ##ORIGIN= Bruker BioSpin GmbH
$$ ##OWNER= she
$$ F:/spectra/data/she/nmr/H-F/1/audita.txt
$$ ##AUDIT TRAIL=  $$ (NUMBER, WHEN, WHO, WHERE, WHAT)
(   1,<2021-09-24 12:40:11.45 +0400>,<she>,<DPX200>,
      <continue with go, POWCHK disabled, PULCHK disabled
       configuration hash MD5:
       00 E9 B6 7A A2 85 ED C7 34 08 36 98 17 FE 4E 26
       data hash MD5: 16K
       EA AE 56 02 74 37 A0 DB 78 31 D9 A0 37 A4 B3 E3>)
$$ ##END=
$$ 
$$ hash MD5
$$ 43 35 7F 35 CB 91 3E D4 0C C1 AA 20 D6 02 95 4F
##$RELAX= 
##$RELAX= 
##$RELAX= 
##$RELAX= 
##$RELAX= 
##$RELAX= 
$$ Bruker specific parameters
$$ --------------------------
##$DU= <F:/spectra>
##$EXPNO= 1
##$NAME= <H-F>
##$PROCNO= 1
##$TYPE= <nmr>
##$USER= <she>
##$AMP= (0..31)
100 100 100 100 100 100 100 100 100 100 100 100 100 100 100 100 100 100 
100 100 100 100 100 100 100 100 100 100 100 100 100 100 
##$AQSEQ= 0
##$AQ_mod= 1
##$AUNM= <au_zg>
##$AUTOPOS= <>
##$BF1= 200.13
##$BF2= 200.13
##$BF3= 200.13
##$BF4= 200.13
##$BF5= 200.13
##$BF6= 200.13
##$BF7= 200.13
##$BF8= 200.13
##$BYTORDA= 1
##$CFDGTYP= 0
##$CFRGTYP= 5
##$CHEMSTR= <none>
##$CNST= (0..31)
1 1 145 1 1 1 1 1 1 1 1 1 1 1 1 1 1 1 1 1 1 1 1 1 1 1 1 1 1 1 1 1 
##$CPDPRG= <>
##$CPDPRG1= <>
##$CPDPRG2= <>
##$CPDPRG3= <>
##$CPDPRG4= <mlev>
##$CPDPRG5= <mlev>
##$CPDPRG6= <mlev>
##$CPDPRG7= <mlev>
##$CPDPRG8= <mlev>
##$CPDPRGB= <>
##$CPDPRGT= <>
##$D= (0..31)
0 1.2 0 0 0 0 0 0 0 0.06 0 0.03 0 0 0 0 0.0002 0 0 0 0 0 0 0 0 0 0 0 0 
0 0 0 
##$DATE= 1632472331
##$DBL= (0..7)
120 120 120 120 120 120 120 120 
##$DBP= (0..7)
150 150 150 150 150 150 150 150 
##$DBP07= 0
##$DBPNAM0= <>
##$DBPNAM1= <>
##$DBPNAM2= <>
##$DBPNAM3= <>
##$DBPNAM4= <>
##$DBPNAM5= <>
##$DBPNAM6= <>
##$DBPNAM7= <>
##$DBPOAL= (0..7)
0.5 0.5 0.5 0.5 0.5 0.5 0.5 0.5 
##$DBPOFFS= (0..7)
0 0 0 0 0 0 0 0 
##$DE= 6
##$DECBNUC= <off>
##$DECIM= 32
##$DECNUC= <off>
##$DECSTAT= 4
##$DIGMOD= 1
##$DIGTYP= 9
##$DL= (0..7)
0 120 120 120 120 120 120 120 
##$DP= (0..7)
150 150 150 150 150 150 150 150 
##$DP07= 0
##$DPNAME0= <>
##$DPNAME1= <>
##$DPNAME2= <>
##$DPNAME3= <>
##$DPNAME4= <>
##$DPNAME5= <>
##$DPNAME6= <>
##$DPNAME7= <>
##$DPOAL= (0..7)
0.5 0.5 0.5 0.5 0.5 0.5 0.5 0.5 
##$DPOFFS= (0..7)
0 0 0 0 0 0 0 0 
##$DQDMODE= 0
##$DR= 18
##$DS= 0
##$DSLIST= <SSSSSSSSSSSSSSS>
$$ [...]
##$SUBNAM2= <"">
##$SUBNAM3= <"">
##$SUBNAM4= <"">
##$SUBNAM5= <"">
##$SUBNAM6= <"">
##$SUBNAM7= <"">
##$SUBNAM8= <"">
##$SUBNAM9= <"">
##$SW= 20.0188988654967
##$SWIBOX= (0..15)
0 0 2 0 0 0 0 0 0 0 0 0 0 0 0 0 
##$SW_h= 4006.41025641026
##$TD= 16384
##$TD0= 1
##$TE= 0
##$TE2= 300
##$TE3= 300
##$TEG= 300
##$TL= (0..7)
0 120 120 120 120 120 120 120 
##$TP= (0..7)
150 150 150 150 150 150 150 150 
##$TP07= 0
##$TPNAME0= <>
##$TPNAME1= <>
##$TPNAME2= <>
##$TPNAME3= <>
##$TPNAME4= <>
##$TPNAME5= <>
##$TPNAME6= <>
##$TPNAME7= <>
##$TPOAL= (0..7)
0.5 0.5 0.5 0.5 0.5 0.5 0.5 0.5 
##$TPOFFS= (0..7)
0 0 0 0 0 0 0 0 
##$TUNHIN= 0
##$TUNHOUT= 0
##$TUNXOUT= 0
##$USERA1= <user>
##$USERA2= <user>
##$USERA3= <user>
##$USERA4= <user>
##$USERA5= <user>
##$V9= 5
##$VALIST= <valist>
##$VCLIST= <CCCCCCCCCCCCCCC>
##$VD= 0
##$VDLIST= <DDDDDDDDDDDDDDD>
##$VPLIST= <PPPPPPPPPPPPPPP>
##$VTLIST= <TTTTTTTTTTTTTTT>
##$WBST= 1024
##$WBSW= 4
##$XGAIN= (0..3)
0 0 0 0 
##$XL= 0
##$YL= 0
##$YMAX_a= 1570978
##$YMIN_a= -2608606
##$ZGOPTNS= <>
##$ZL1= 120
##$ZL2= 120
##$ZL3= 120
##$ZL4= 120
##$ABSF1= 10
##$ABSF2= 0
##$ABSG= 5
##$ABSL= 3
##$ALPHA= 0
##$AQORDER= 0
##$ASSFAC= 0
##$ASSFACI= 0
##$ASSFACX= 0
##$ASSWID= 0
##$AUNMP= <proc_1d>
##$AZFE= 0.1
##$AZFW= 0.1
##$BCFW= 1
##$BC_mod= 2
##$BYTORDP= 1
##$COROFFS= 0
##$CY= 11.3945322036743
##$DATMOD= 1
##$DC= 2
##$DFILT= <>
##$DTYPP= 0
##$F1P= 2.36226072786647
##$F2P= -0.459571619588291
##$FCOR= 0.5
##$FTSIZE= 0
##$FT_mod= 4
##$GAMMA= 1
##$GB= 0.15
##$INTBC= 1
##$INTSCL= 1
##$ISEN= 128
##$LB= 0.24
##$LEV0= 0
##$LPBIN= 0
##$MAXI= 10000
##$MC2= 0
##$MEAN= 0
##$ME_mod= 0
##$MI= 1.114404
##$NCOEF= 0
##$NC_proc= 0
##$NLEV= 6
##$NOISF1= 3.799351
##$NOISF2= 2.8
##$NSP= 1
##$NTH_PI= 0
##$NZP= 0
##$OFFSET= 15.70392
##$PC= 1
##$PHC0= -14065.96
##$PHC1= -5.599119
##$PH_mod= 1
##$PKNL= yes
##$PPARMOD= 0
##$PSCAL= 0
##$PSIGN= 0
##$REVERSE= no
##$SF= 200.130013532006
##$SI= 16384
##$SIGF1= 3
##$SIGF2= 2
##$SINO= 400
##$SIOLD= 16384
##$SREGLST= <1H.CDCl3>
##$SSB= 0
##$STSI= 0
##$STSR= 0
##$SW_p= 3612.71676300578
##$SYMM= 0
##$S_DEV= 0
##$TDeff= 0
##$TDoff= 0
##$TI= <>
##$TILT= no
##$TM1= 0
##$TM2= 0
##$TOPLEV= 0
##$USERP1= <user>
##$USERP2= <user>
##$USERP3= <user>
##$USERP4= <user>
##$USERP5= <user>
##$WDW= 1
##$XDIM= 8192
##$YMAX_p= 0
##$YMIN_p= 0
$$ End of Bruker specific parameters
$$ ---------------------------------
##NTUPLES= NMR FID
##VAR_NAME=  TIME,          FID/REAL,        FID/IMAG
##SYMBOL=    X,             R,               I
##VAR_TYPE=  INDEPENDENT,   DEPENDENT,       DEPENDENT
##VAR_FORM=  AFFN,          ASDF,            ASDF
##VAR_DIM=   8192,          8192,            8192
##UNITS=     SECONDS,       ARBITRARY UNITS, ARBITRARY UNITS
##FACTOR=    0.0002496,     1,               1
##FIRST=     0,             0,               0
##LAST=      2.0444736,     0,               0
##MIN=       0,             -2608606,        0
##MAX=       2.0444736,     1570978,         0
$$ Real data points
##PAGE= N=1
##DATA TABLE= (X++(R..R)), XYDATA
$$ [...]
684 105207 145555 6508 -217223 -301478 -134194 138588 273610 176028 -12986 -94981 -31019
695 -31019 40177 -23198 -168242 -202605 -31705 214408 305284 152486 -96679 -214928 -133229
706 -133229 6684 31915 -49590 -82823 33571 208519 242060 62567 -189277 -285420 -151539
717 -151539 56691 145184 75093 -11430 15775 117056 131264 -23538 -225725 -269249 -90999
728 -90999 152051 244552 136054 -29089 -76851 -6147 38322 -46137 -174646 -179040 1957
739 1957 221673 274296 106815 -113069 -190841 -97657 17909 16957 -65578 -76280 55308 215115
751 215115 217971 24690 -200930 -256363 -110249 73756 125922 44078 -20615 32807 129895
762 129895 117642 -49804 -229852 -240132 -50962 164075 218505 96609 -42425 -58865 14080
773 14080 35862 -62395 -179862 -156937 30784 225764 240893 69955 -120291 -165161 -68477
784 -68477 22266 1134 -76712 -64590 75176 216371 189389 -7121 -203149 -224949 -74321
795 -74321 82300 103524 22069 -20850 47918 135530 99987 -72854 -232896 -209635 -15530
806 -15530 171672 189234 63432 -48827 -41524 33675 32283 -80807 -185814 -135602 59434
817 59434 227519 210392 34233 -128538 -139776 -37645 26777 -17120 -88433 -52537 96437
828 96437 214309 161932 -36214 -203628 -193875 -42523 84757 80965 2312 -18257 64240
839 64240 139410 79839 -94847 -227110 -177158 12696 167675 159666 36209 -49869 -20902
850 -20902 44979 22737 -97495 -182398 -109115 83080 221738 177790 4340 -128168 -112987
861 -112987 -15373 24803 -36080 -95154 -37744 114847 210707 132644 -64326 -199080 -161201
872 -161201 -12286 84531 58363 -15521 -12107 81112 140073 58533 -115539 -218789 -145128
883 -145128 40272 164531 129236 12302 -45193 -1965 52675 9405 -112454 -174689 -81903
894 -81903 104019 211698 144142 -19938 -120739 -86718 -121 17288 -49816 -95057 -18099
905 -18099 130517 198296 100240 -85644 -189752 -128427 8250 79356 34667 -27025 123
916 123 96079 134767 34868 -132686 -207705 -110630 64186 155222 100622 -7015 -39819 17793
928 17793 58317 -6116 -128323 -165455 -51132 122191 197799 111006 -41928 -111960 -61268
939 -61268 13455 7875 -66281 -90673 2225 141525 183771 68539 -102438 -174577 -98999 25704
951 25704 68573 15247 -30382 14384 104680 122756 9983 -143391 -189118 -79286 79123
962 79123 140091 74380 -18493 -28656 32542 55692 -23419 -135310 -151085 -25118 135059
973 135059 181169 80221 -58272 -100668 -38574 22071 -4608 -78734 -85014 22214 152194
984 152194 167284 40194 -116463 -159440 -70085 37964 56710 -3066 -32909 27904 115499
995 115499 110485 -12769 -151731 -170666 -50896 89858 124567 49028 -25360 -16217 43821
1006 43821 50067 -39270 -141205 -133671 -32 141327 160771 53175 -65166 -84525 -19915
1017 -19915 23432 -18468 -86041 -72508 42001 155654 146862 13354 -122362 -139491 -44211
1028 -44211 44498 41805 -18328 -30693 43474 121895 96389 -37657 -158453 -149782 -21932 98020
1040 98020 106812 26655 -31201 -1765 56987 43884 -56356 -144944 -115251 24121 145012
1051 145012 139368 27687 -70932 -68031 -1476 23250 -30676 -91722 -61116 59601 156902 125319
1063 125319 -10822 -124078 -118516 -23859 47079 26997 -29239 -24557 56646 122320 78208 -54251
1075 -54251 -156444 -125208 -28 98508 86970 9063 -29612 12569 63327 33288 -72051
1086 -72051 -144268 -94118 45926 144966 117171 2982 -71780 -49928 14236 18706 -46704 -96417
1098 -96417 -45117 78202 154940 101669 -34144 -123774 -96091 -1756 46299 10558 -38356
1109 -38356 -14610 72012 121949 60091 -73752 -152737 -101916 20679 95968 66982 -5058
1120 -5058 -23721 26618 66770 19898 -86678 -139258 -71253 62632 137612 93294 -12859
1131 -12859 -66498 -31595 22346 10082 -59537 -93652 -26990 92415 148245 76346 -51058
1142 -51058 -116551 -72275 13795 40251 -5946 -44406 -3635 84603 116618 36724 -89945 -144359
1154 -144359 -76525 39059 88792 45584 -17599 -16340 40459 66818 2575 -100701 -131184
1165 -131184 -47026 78616 129448 67369 -28031 -59509 -14468 27372 -1782 -70650 -87225
1176 -87225 -7390 102821 135431 52555 -64240 -106215 -51823 20424 29118 -20072 -41874 11859
1188 11859 93122 105691 15800 -98941 -129933 -53235 49342 78367 27178 -22256 -3907
1199 -3907 52084 59883 -14786 -108195 -116650 -23936 88838 114534 44840 -35866 -47629 2146
1211 2146 29288 -14603 -79451 -78693 11381 110783 119327 28830 -72302 -91276 -31571 27890
1223 27890 17976 -31032 -38724 26581 98436 92451 -3777 -104191 -113639 -31757 54176 64695
1235 64695 12877 -21914 6824 57677 51232 -29493 -109204 -101608 -3399 91427 99192 27912
1247 27912 -38682 -34376 11287 24532 -26724 -83493 -65162 27424 111852 103926 10488 -75652
1259 -75652 -77587 -16995 27496 6064 -39195 -31827 39346 100762 77959 -22107 -106506 -96791
1271 -96791 -13927 56351 51313 473 -20527 18967 62545 41293 -43372 -109957 -84167 12100
1283 12100 92214 83434 13309 -38964 -23243 19102 18541 -37075 -83166 -53681 40721 110334
1295 110334 86621 -4096 -73343 -63173 -6820 24217 -3860 -41055 -22419 48711 98180 62543
1307 62543 -35399 -103349 -80489 384 54796 40390 -8980 -16458 28373 63588 29808 -54590
1319 -54590 -107097 -69066 26739 90193 69222 24 -35718 -12260 25308 12886 -46806 -82851
1331 -82851 -40074 52256 105941 70570 -18281 -72043 -51112 3594 21618 -13084 -42704 -13436
1343 -13436 56512 93408 47926 -44769 -98524 -66931 10559 51568 28874 -11999 -10472 34832
1355 34832 60744 19508 -61997 -100517 -55334 36178 85959 54726 -8127 -32647 -3498 27654
1367 27654 5377 -54302 -77605 -26579 61148 100530 56249 -27451 -67789 -37959 11807 16298
1379 16298 -22866 -43341 -4729 64386 90843 34032 -55874 -93715 -51127 20605 48495 16794
1391 16794 -18447 -5305 43478 60204 8713 -69127 -95425 -39565 45589 79820 40720 -15838
1403 -15838 -29346 5738 29533 -2423 -59809 -74240 -15235 67348 94557 41326 -36198 -62215
1415 -62215 -25705 16262 12064 -29660 -43166 3871 71652 84203 19671 -61704 -87016 -37666
1427 -37666 27875 42771 5787 -22015 2586 50165 55425 -2919 -76281 -88621 -24848 54279
1439 54279 73258 26824 -22833 -21597 15326 30002 -11699 -64986 -67631 -1140 73956 86106
1451 86106 25288 -42917 -54695 -14677 20363 4904 -35784 -39443 14047 74841 75565 6676
1463 6676 -67305 -78103 -23631 32274 34602 -3669 -22286 9656 54568 50590 -14479 -79121
1475 -79121 -78448 -10222 57841 64690 15057 -25834 -15428 23138 27453 -20017 -70125 -60955 11662
1488 11662 78301 76669 12698 -47161 -46389 -2952 22540 -4811 -42372 -34986 24671 79278 66905
1501 66905 -7186 -71142 -67691 -8880 35707 26090 -11266 -20817 18026 58344 43413 -25689
1513 -25689 -81314 -68187 2606 59553 53810 4532 -26390 -7422 28343 22439 -28586 -71468
1525 -71468 -50447 22423 79298 65416 31 -47990 -35997 5976 19531 -12557 -44934 -27753
1537 -27753 34293 79387 55224 -19439 -71482 -55230 1708 35466 16126 -19238 -16573 28094
1549 28094 61208 34566 -36115 -80758 -56199 14769 59274 41476 -5453 -24221 3857 33376
1561 33376 16496 -37903 -69956 -39766 32916 76436 52811 -10254 -46141 -25415 13326 16088
1573 16088 -21086 -46691 -19747 43159 76544 41749 -27835 -67896 -44120 9802 31575 7037
1585 7037 -22430 -10942 34371 59074 24039 -44672 -77011 -43216 23438 55085 30743 -11930
1597 -11930 -18935 12717 35177 9467 -46092 -67428 -27223 42429 71379 38218 -18303 -40989
1609 -40989 -13937 17160 9839 -28788 -46037 -9118 51346 73251 28603 -37172 -64083 -32815
1621 -32815 16678 26661 -868 -24948 -3248 41983 55670 13089 -50210 -72100 -29705 29621
1633 29621 49859 20589 -15341 -14677 18092 32970 1407 -50177 -62452 -16014 47767 66082
1645 66082 26287 -24552 -35898 -5477 18977 4004 -34065 -42702 -811 54597 65898 18218
1657 18218 -40847 -56625 -20277 21469 20101 -9875 -24895 3574 47074 51369 2249 -56028
1669 -56028 -65145 -18241 35443 43854 10287 -17921 -7303 25212 31134 -7988 -54285 -57364 -5584
1682 -5584 50781 60025 15705 -27911 -29278 1582 18952 -3572 -38171 -37891 7736 58368 58438
1695 58438 8946 -45134 -50766 -10613 22377 14165 -15629 -22771 11454 49030 44103 -6061 -57285
1708 -57285 -55992 -8622 37187 36706 2782 -18125 -1663 29837 28091 -16519 -56631 -49446 5932
1721 5932 53576 51495 6582 -29890 -22116 8431 18565 -10970 -41268 -32839 17297 60343 51831
1734 51831 -2004 -46670 -41235 -2508 22319 7676 -20619 -19657 18067 51212 37948 -15754
1746 -15754 -57936 -49644 -660 37630 29058 -4635 -17900 5121 31884 23204 -22525 -57109
1758 -57109 -42296 13230 54216 42512 -1628 -28133 -15586 12820 14615 -16450 -43782 -26090
1770 -26090 25517 59517 41519 -10255 -45235 -33111 4847 21249 1335 -24338 -14105 26065
1782 26065 51786 30176 -23131 -55841 -40634 8832 37298 22110 -9063 -14644 11744 34766
1794 34766 17034 -29890 -56374 -32608 20002 52172 33997 -7418 -26750 -8322 16532 12182
1806 12182 -21873 -42803 -18814 29451 57320 34028 -16874 -43348 -24845 9507 17696 -6323
1818 -6323 -25605 -10508 29672 48915 21782 -28638 -53584 -29726 13246 33919 13326 -13499
1830 -13499 -9762 18461 32788 9841 -34862 -53904 -23486 26781 47602 25559 -12643 -22661
1842 -22661 -1244 19027 5651 -27771 -40821 -10833 34960 53181 23853 -21171 -38778 -16945
1854 -16945 12316 13617 -10343 -23132 -3024 33463 45750 14656 -32918 -49670 -22552 17602
1866 17602 29528 7945 -14560 -6929 21395 31181 3490 -37780 -48065 -16790 30517 43610
1878 43610 16549 -15059 -19008 3797 18311 1229 -31170 -36790 -5058 37793 47072 16083
1890 16083 -24882 -34265 -10145 14704 8840 -15852 -23793 2456 35604 41389 5842 -35536 -45007
1903 -45007 -13982 20597 25273 1384 -14581 -1902 24219 28435 -2866 -39970 -43901 -8872
1915 -8872 31774 38094 10575 -16018 -14226 7464 18147 -2660 -32261 -33723 1542 39544 43374
1928 43374 10016 -26021 -30219 -6077 14511 4975 -17294 -21763 5841 37011 36713 681 -37401
1941 -37401 -40029 -7663 22128 20350 -3059 -14291 1828 26842 25541 -8059 -41371 -38357 -2721
1954 -2721 32828 34028 4775 -17414 -10692 11769 15142 -7323 -33779 -29060 5766 40122 38597
1967 38597 3696 -27373 -25875 -452 15259 2633 -20010 -18348 10377 38541 33013 -3951
1979 -3951 -38092 -35613 -3218 22762 16620 -5723 -14037 5215 28497 22543 -11958 -41393 -33753
1992 -33753 1589 34472 28988 433 -17987 -7689 13590 14886 -12189 -34840 -26667 11585
2004 11585 41816 33017 -2175 -29104 -21904 5425 15473 -1885 -22810 -16992 15945 40298
2016 40298 28954 -10845 -39269 -30678 3793 23725 12288 -10891 -14656 9638 30255 20582
2028 20582 -16062 -42610 -29456 9650 35511 24236 -4536 -18753 -2862 17775 14244 -15635
2040 -15635 -37443 -22106 15996 41134 28583 -8416 -29225 -17239 9942 14440 -5431 -26008
2052 -26008 -13940 20524 40532 23428 -16781 -39037 -24221 9782 23589 5984 -15581 -11974
2064 -11974 14849 33367 15087 -21996 -42996 -23772 15534 35193 17782 -10780 -17857 2928
2076 2928 21057 11164 -21178 -37916 -17045 22481 41215 21261 -15350 -28453 -10613 14052
2088 14052 12881 -12028 -28529 -9992 25842 41048 17383 -23119 -38530 -16915 14653 22194
2100 22194 -117 -18602 -9134 20975 33514 10245 -27519 -41328 -15886 19631 32593 10716
2112 10716 -16594 -14639 9911 23885 4555 -27980 -36629 -9347 29029 38500 12348 -19606
2124 -19606 -24122 -1147 16806 7753 -19666 -28149 -2196 31097 38439 7902 -27287 -33802 -8645
2137 -8645 18566 17274 -7452 -19446 -2917 26482 31354 1715 -33587 -36764 -6288 26229 26552
2150 26552 1795 -17544 -7784 16138 23505 -1094 -31392 -33050 -118 32305 33404 3566 -23307
2163 -23307 -18681 5545 17808 1643 -23363 -24070 4096 34487 33317 -656 -30638 -27422 191
2176 191 19906 9804 -13829 -17821 4605 29757 26359 -7141 -34312 -31500 2520 27982 20322
2189 20322 -5751 -16886 -1730 20260 19331 -9655 -33803 -26176 7535 33673 26144 -4335 -22376
2202 -22376 -11743 11603 14495 -6298 -26350 -19392 11838 36130 24850 -7546 -28776 -19496
2214 -19496 5907 18137 2347 -16573 -14096 11679 31528 20033 -14063 -34223 -22209 7743
2226 7743 24240 11942 -11179 -13374 5567 22149 12521 -16134 -33755 -18969 14245 31241
2238 31241 17922 -8896 -19320 -4521 13555 9992 -12353 -26471 -12218 17722 32264 16311
2250 16311 -12903 -25827 -11104 9253 13914 -3611 -17067 -7031 17191 28380 12283 -18092
2262 -18092 -31009 -14803 11206 19710 5566 -10080 -8015 9539 19822 6070 -19166 -29955
2274 -29955 -11429 16650 26462 11281 -9867 -14468 1628 12152 3776 -16230 -23066 -5752 21264
2287 21264 28154 10362 -14795 -20658 -5902 9926 7680 -6429 -14811 -1997 19530 23659 5067
2300 5067 -18866 -25599 -8650 12204 14640 1306 -9338 -2665 12947 17119 1278 -20513 -23740
2313 -23740 -6226 15038 20258 7147 -7547 -7741 2629 10493 -97 -15624 -17923 -1070 19479
2326 19479 22383 6238 -13195 -15400 -4466 6821 3630 -8626 -10875 2117 18340 19764 2108
2339 2108 -17208 -21231 -6581 9709 11255 -8 -6395 1125 11434 12529 -2817 -18614 -20221
2352 -20221 -4036 14725 16250 4966 -6347 -6671 3078 6165 -3474 -14049 -14162 876 16884
2365 16884 19459 5111 -10264 -13709 -3356 5397 2672 -6247 -8190 2243 16723 16763 1416 -14872
2379 -14872 -16490 -6035 7936 9370 1669 -3739 595 10293 9561 -1165 -15851 -17601 -3014 12106
2393 12106 15678 4517 -5078 -5755 2293 5026 -1202 -13459 -12591 775 15879 17773 5555 -9328
2407 -9328 -13469 -3920 4784 3185 -5034 -7944 2339 15600 16188 408 -13974 -18625 -6898 7739
2421 7739 10093 2143 -4971 -531 8435 10157 -1534 -15093 -17741 -3663 12312 16514 6553 -6945
2435 -6945 -8080 1452 6366 98 -13135 -14086 -189 16307 19089 6544 -10243 -14546 -4428 6007
2449 6007 4296 -5763 -8531 1286 14194 16606 1276 -16348 -18876 -5034 9473 10146 1675 -6430
2463 -6430 -1127 9301 11643 -848 -17365 -18893 -2950 15036 17036 3927 -8458 -7418 2933
2476 2933 8753 -552 -14470 -16214 410 17374 19544 4206 -14162 -16284 -841 8396 4115
2489 4115 -8021 -10880 1822 18257 18886 86 -18544 -20452 -3192 13469 10778 -2642 -10200
2502 -10200 -1548 12650 14219 -1515 -20564 -18674 89 18716 17489 -133 -13033 -7484 6958
2515 6958 10773 -2494 -17430 -16158 3100 21743 19388 -1135 -18237 -13276 3019 12388 2554
2528 2554 -11815 -12384 5245 20368 17124 -4292 -22113 -16686 1727 16528 9377 -7556 -11293
2541 -11293 2299 17262 13253 -6903 -24228 -18149 5323 21241 15325 -5240 -14589 -4587 11958
2554 11958 11334 -5952 -20958 -14313 8050 24155 16919 -6833 -19311 -10417 7191 12108 -2288
2567 -2288 -16350 -11268 9780 24004 14452 -10067 -23431 -13636 8288 16207 3635 -11870 -11656
2580 -11656 7995 19749 11141 -12715 -26433 -13114 12606 21387 10338 -9617 -14432 1718
2592 1718 15934 9448 -11708 -23312 -10591 14984 24972 11798 -11350 -18460 -4769 12043 9905
2605 9905 -7454 -19181 -7213 15093 25367 9205 -15795 -23478 -7546 12393 14905 -790
2617 -790 -14648 -7218 12403 21785 6231 -16922 -24800 -7126 16090 19770 2380 -13790 -11024
2630 -11024 8036 16085 4014 -17122 -23603 -4441 19041 23293 4956 -15889 -15494 2551 13329
2643 13329 5208 -12342 -17795 -1741 19556 22865 3283 -19466 -19815 -1639 14737 11052 -7535
2656 -7535 -15416 -2787 18295 20145 552 -21184 -21814 -1388 17915 16480 -2834 -13977 -5121
2669 -5121 11558 15427 -1663 -20165 -19715 1334 20699 19709 -1234 -17132 -9738 5967 13591
2682 13591 792 -16826 -15891 3847 23049 18006 -3411 -18845 -16145 4971 13823 4083 -10933
2695 -10933 -12120 3560 19889 14665 -5796 -21644 -16789 4591 17146 9245 -6716 -11054 -722
2708 -722 13979 11557 -6104 -21008 -15557 6922 20230 13976 -5148 -15039 -5674 9456 10260 -3593
2722 -3593 -16896 -11221 8422 21459 13180 -7409 -19341 -8727 6297 12574 367 -11860 -8133
2735 -8133 8172 18795 11240 -8804 -20429 -11188 6920 15963 5361 -8133 -9376 4383 15163
2748 15163 8404 -10208 -19736 -10443 11544 17692 9309 -8467 -11579 -476 9855 5543 -8405
2761 -8405 -15427 -7372 12110 17872 8538 -8733 -15698 -5235 7321 8820 -3432 -12476 -4630 10095
2775 10095 17081 6949 -11360 -17857 -7240 7375 13133 3674 -8908 -4870 5716 13174 3896
2788 3896 -10926 -16238 -6174 10035 15597 6361 -7492 -9168 1900 9312 3813 -8442 -12832
2801 -12832 -2993 12296 17033 5987 -9411 -13021 -3574 6727 6660 -4945 -9325 -2473 10348 14292
2815 14292 4348 -11843 -15012 -4457 7772 9942 576 -8248 -2927 6877 11995 1757 -11192
2828 -11192 -15738 -3229 10761 12887 3785 -5807 -7319 2175 8100 2068 -10086 -12633 -1753 11265
2842 11265 14558 3796 -8652 -11700 -1776 6808 4490 -4776 -8317 -833 11335 12590 2154 -11110
2856 -11110 -13840 -3459 7573 8601 -382 -6364 -2016 7414 9578 860 -12144 -13678 -2556 10439
2870 10439 12086 2981 -5940 -5928 2828 6727 800 -9252 -12206 -1563 13212 14033 3518 -9345
2884 -9345 -9686 -1354 6333 3358 -4828 -8481 -59 11229 12448 1089 -11553 -13053 -3038 7662
2898 7662 7451 -404 -6282 -1140 7933 10064 309 -11791 -13304 -1439 10392 11312 1883 -6832 -5438
2913 -5438 2891 6723 54 -10886 -11212 16 11505 12338 818 -9482 -9811 -308 7183 2957
2927 2957 -6230 -6806 675 11658 11430 247 -10986 -11726 -1736 8020 6686 -2149 -7316 -1601 8479
2942 8479 9984 -1515 -13173 -12037 -589 12120 11017 440 -8357 -3934 4774 7521 -481 -10526
2956 -10526 -12387 1882 13918 12513 578 -10626 -8971 568 7520 2215 -8103 -8665 3304
2969 3304 13997 11170 -1560 -13287 -11271 424 9525 6557 -3494 -6707 817 9953 8229 -3883
2983 -3883 -13635 -12529 2195 11218 9013 -1916 -8151 -2571 6091 7049 -2112 -12420 -9276 3732
2997 3732 14301 12202 -2196 -11385 -7891 3532 7972 880 -9106 -7564 3892 14462 10248 -3332
3011 -3332 -14552 -8509 2448 10011 4534 -5826 -6401 2059 10997 8954 -5099 -15187 -10790 4561
3025 4561 12809 7449 -4971 -7468 -1246 8033 6583 -3897 -12912 -9039 6329 15467 9312 -3332
3039 -3332 -11233 -4814 5586 7788 -945 -10609 -6007 5334 14687 8213 -6091 -14770 -7547 4531
3053 4531 10240 2403 -8117 -7208 4501 12796 6149 -7146 -15631 -8828 5912 12925 5196 -5893
3067 -5893 -8029 21 9197 5731 -6976 -13980 -7454 7664 14231 7277 -7813 -10027 -2651 7032
3081 7032 6431 -4744 -10822 -5346 8540 14533 6521 -8935 -13737 -5179 7480 8562 -741 -8866
3095 -8866 -4363 7570 12293 4607 -10095 -14781 -4901 8032 12400 2434 -7523 -6539 3738 10711
3109 10711 2753 -9777 -13645 -4395 9910 14765 3776 -8757 -9532 -22 8297 4221 -5872 -10801
3123 -10801 -3145 10228 14637 2849 -9649 -12191 -2366 7606 7619 -2005 -8497 -3501 8729 11963
3137 11963 2224 -11488 -13322 -2244 10321 10484 617 -8320 -4565 5839 8824 1522 -9396 -12001
3151 -12001 -2418 11039 12538 1984 -8898 -8264 1662 7437 3243 -7578 -11060 -59 11112
3164 11112 13270 1590 -10949 -12208 -1595 8950 5099 -4230 -8826 -1453 10642 11027 392
3177 392 -12908 -12276 -1530 10768 9458 -715 -7674 -2469 7457 9143 -1231 -11435 -11501 -28
3191 -28 13202 10780 -929 -9061 -5829 3342 8852 1324 -8632 -9565 2292 12381 10616 -823
3205 -823 -11358 -8613 724 8211 4307 -5389 -7933 1044 9435 8949 -1916 -12361 -10337 802
3219 802 11362 7328 -2900 -6258 -1764 7440 8448 -2873 -12763 -9556 3162 12715 9457 -2488
3233 -2488 -8796 -5003 4113 7098 -1315 -9244 -8404 4783 14006 9395 -2378 -10828 -6996 3016
3247 3016 6793 2110 -6696 -6058 3229 10554 7230 -4198 -14022 -8958 4200 11013 5792 -4260
3261 -4260 -6190 21 8907 5840 -4817 -13087 -7880 4769 12748 7926 -3591 -9521 -3766 5754
3275 5754 5795 -2454 -10548 -6061 5307 11750 8042 -3327 -11050 -5660 6178 7837 -489 -8000 -5577
3290 -5577 5878 12456 6256 -5167 -12907 -7988 4680 10132 3723 -5994 -6275 1491 8904 6013
3304 6013 -5858 -11832 -7453 5944 11158 5835 -5564 -7906 -601 7363 5918 -4720 -11473 -5732
3318 -5732 7076 12338 5980 -5989 -10686 -3602 5548 5258 -1331 -7508 -5013 6149 11814 4595
3332 4595 -7495 -12834 -4701 6848 8969 1217 -6500 -6145 4053 9417 3836 -7687 -12045 -4818
3346 -4818 7791 11410 3423 -5798 -7741 858 8016 4312 -6787 -10134 -3682 9484 12232 5038
3360 5038 -7619 -9797 -1691 6004 5347 -3137 -8627 -3008 7226 11268 3182 -8945 -12769 -1911
3374 -1911 6613 7217 146 -6354 -3998 5282 10064 892 -8509 -12244 -3966 8943 11025 2043 -6366
3389 -6366 -6650 2891 7181 2235 -7525 -10316 -2073 8523 10599 2187 -7510 -8723 318 8636 4732
3404 4732 -5042 -7703 -1151 9577 11948 680 -9161 -9913 -1164 7846 7118 -781 -7699 -2776 7549
3419 7549 9275 299 -9760 -11284 -21 9300 9047 -1256 -7533 -4194 4869 7714 593 -8834
3433 -8834 -8916 887 10119 9621 -541 -8936 -7538 1068 6616 2730 -6509 -7898 -394 10025 9866
3448 9866 -92 -10143 -8842 710 8563 5370 -3020 -7539 -488 7945 8028 -2626 -11155 -9459 1035
3463 1035 10307 6954 -1939 -6717 -2829 5394 7141 -807 -9018 -8817 2120 11715 9600 -689 -8763
3478 -8763 -5166 3572 6939 1350 -7552 -6557 2508 10557 8739 -2274 -10709 -8555 2062 7342 4136
3493 4136 -5186 -6414 504 8224 7456 -3419 -10799 -7762 2769 9888 6995 -2778 -6972 -1786 6308
3508 6308 5647 -2886 -9454 -7454 3371 11662 7922 -3671 -8416 -3977 4017 7193 -176 -8887 -5659
3523 -5659 3653 10310 7262 -4364 -11214 -5802 2368 7889 2821 -5981 -5444 2629 9742 6551 -4669
3538 -4669 -11513 -6594 4541 9469 4466 -4608 -5935 -83 7756 4254 -4065 -9724 -6879 5174
3552 5174 10808 6640 -4748 -9117 -3042 5429 5112 -2099 -8365 -4995 5672 9961 5859 -5771
3566 -5771 -10376 -4795 5412 7970 1388 -6088 -5684 4415 9909 4814 -6817 -11070 -4686 6182
3580 6182 10341 3989 -5267 -5184 2303 7800 3502 -4962 -11041 -4470 6932 11182 3838 -7423 -7736
3595 -7736 -1543 5960 4683 -4481 -8411 -2144 6847 10112 3637 -7855 -9885 -2865 6826 6858 -1011
3610 -1011 -6563 -3194 5764 9621 3857 -8548 -11468 -3057 7032 9062 1805 -5720 -4633 3193
3624 3193 7660 2163 -6506 -10435 -3296 8387 10442 2800 -7971 -7835 1716 6674 4010 -4740 -9666
3639 -9666 -786 8791 10602 2003 -8217 -9723 -113 7587 5730 -2913 -6766 -1877 6673 8956 1042
3654 1042 -9069 -9056 -2135 7336 7564 -829 -7809 -3394 4968 8685 544 -8545 -9712 -177 9011
3669 9011 9908 608 -8488 -6474 2731 6947 2087 -7785 -8265 235 9729 9841 -240 -9370 -7892
3684 -7892 1221 7832 4408 -4916 -7541 359 7833 8460 -231 -10196 -8912 1521 8560 6357 -1868
3699 -1868 -6293 -2072 5436 6065 -1121 -9763 -8429 1411 10021 7249 -1980 -8182 -4579 4415 5319
3714 5319 -122 -7901 -8386 2118 10449 8524 -2082 -9119 -7216 2900 7762 2211 -6056 -6779 1145
3729 1145 8985 6324 -2423 -10396 -8341 3939 9158 4404 -4271 -6976 382 7443 7246 -2465 -10636
3744 -10636 -7452 3142 10843 5461 -2808 -8167 -1158 4853 5427 -2542 -9088 -5965 4175 11467
3758 11467 5918 -4871 -10334 -4563 5172 6388 968 -7295 -5547 3204 9469 5777 -5757 -11662
3772 -11662 -6241 3588 7502 3216 -5257 -6077 1116 7379 5319 -4125 -9411 -5199 3676 9696 4207
3787 4207 -4797 -6236 -588 5621 4945 -3664 -9656 -4021 5209 11193 5001 -4881 -9122 -3316 4988
3802 4988 4829 -517 -6888 -4067 5336 9426 4171 -6450 -9546 -4229 5892 8805 639 -6000 -4683
3817 -4683 3100 7706 4131 -5927 -9799 -4325 6002 9063 2514 -5233 -5640 458 6112 3148 -4817
3832 -4817 -8995 -2008 6015 10114 2863 -6338 -7507 -1281 5841 5118 -2845 -6841 -3817 5780 8865
3847 8865 2532 -7619 -9751 -876 6466 6999 -607 -5696 -3609 4220 7747 2220 -7744 -10029 -2899
3862 -2899 6924 9232 2007 -6614 -5510 2662 6537 2324 -5875 -7785 -1319 8499 8220 1775 -8140
3877 -8140 -7350 -405 6186 4339 -3271 -6741 -1183 7874 8781 429 -8284 -8281 -702 6550 6133 -844
3893 -844 -6771 -2503 6053 6895 -182 -8003 -9567 -272 9011 7821 923 -6381 -3894 4303 6057
3908 6057 1427 -7796 -7877 207 8579 8472 -921 -7699 -5822 1974 6124 3566 -5506 -6714 -325 8023
3924 8023 8886 -973 -8806 -7064 673 6234 5104 -2820 -6191 -700 7685 8544 -1281 -7674 -7083 1532
3940 1532 9333 5941 -1281 -7044 -2571 3717 5708 -913 -8358 -7447 1282 9419 6329 -1384 -7542
3955 -7542 -4955 2663 6207 -687 -5819 -5268 2592 9016 7135 -2665 -8500 -5980 1531 7420 2985
3970 2985 -4069 -6493 260 7744 6507 -2891 -9518 -7079 3107 8005 4885 -2671 -6316 -2091 5406
3985 5406 6151 -2181 -8241 -5757 3556 9881 6649 -3266 -8629 -3486 3790 7100 -157 -7127 -5131
4000 -5131 2973 9983 5248 -3387 -8843 -5100 3697 7057 1655 -5127 -5214 1764 7849 4794 -4537
4015 -4537 -10433 -5179 4617 9011 2673 -4414 -6113 205 7198 4783 -3448 -8964 -4376 4968 10189
4030 10189 4276 -4594 -7024 -2333 5488 5438 -2200 -8679 -4613 5001 8356 3384 -5414 -9215 -3581
4045 -3581 5015 6664 451 -5081 -3964 3950 8455 2660 -5824 -8917 -3428 6001 9422 839 -5195
4060 -5195 -5477 816 6882 2887 -5848 -9171 -2362 6569 8393 2214 -5447 -6879 -254 4849 4141
4075 4141 -3453 -8348 -2537 6798 8656 1498 -7416 -8245 -1818 6045 6591 -1241 -6407 -2935 5475
4090 5475 8165 1972 -6704 -8416 -1285 6594 7206 -730 -6374 -4309 2538 6909 2195 -6182 -9583
4105 -9583 -2493 7529 9466 916 -7173 -5383 1720 6287 2980 -4294 -6422 -1437 6954 7946 758
4120 758 -7503 -7709 585 5401 5066 -3039 -6989 -2491 5692 8278 82 -8755 -8000 -1119 8178 6367
4136 6367 -1702 -5893 -1722 5277 7017 1002 -7293 -7554 195 7683 8003 -753 -7631 -6166 2260
4151 2260 6268 1995 -6021 -7638 -157 8677 8350 -1629 -7967 -6380 1239 6849 2908 -3918 -5172
4166 -5172 -155 7163 5826 -1871 -7977 -7252 1092 7520 5804 -3011 -5813 -1728 5098 5622 -1645
4181 -1645 -7652 -6478 2334 8631 6100 -2590 -7319 -3117 4245 5435 103 -6459 -6132 1873 8294
4196 8294 5927 -1177 -9000 -5951 3388 6808 2323 -3768 -5792 2578 7304 7060 -2663 -9097 -6027
4211 -6027 3363 7857 4270 -4195 -5097 -31 5676 5077 -2687 -8801 -5360 3681 8352 5118 -4105
4226 -4105 -6792 -1680 4684 4629 -1640 -7633 -4733 3422 8410 5477 -3529 -8812 -2715 3736 5900
4241 5900 269 -5136 -4342 2871 6704 4845 -4097 -9349 -3758 4075 6943 1380 -4860 -5099 1147
4256 1147 5876 4159 -4610 -9246 -4337 4960 8121 3115 -5846 -6646 266 5715 4692 -2634 -8136
4271 -8136 -4134 5698 9209 3190 -5323 -8187 -2835 5352 5694 -1460 -6056 -3626 3369 8277 2590
4286 2590 -5705 -8768 -1878 6156 5891 921 -5176 -3651 2863 7658 3423 -6067 -8170 -2083 6476
4301 6476 8190 1721 -5702 -5977 1656 6278 3639 -3977 -7490 -2240 5757 8566 2097 -6426 -6758
4316 -6758 -1159 5997 4986 -2555 -5705 -2391 6926 8091 1541 -7302 -7572 -1401 6714 6049 -1320
4331 -1320 -6446 -2993 4063 6291 932 -6236 -7055 -921 7023 7001 610 -5405 -5069 1981 5386 2628
4347 2628 -5449 -6896 -906 6953 7531 -308 -6789 -4786 1021 5698 2764 -3578 -5974 -1825 6464
4362 6464 7160 368 -6854 -5971 358 6839 4052 -2133 -5369 -1556 5516 6033 -618 -7925 -7082 937
4378 937 7764 6881 -1439 -6466 -3369 3847 5428 346 -6396 -6421 38 7384 5149 -421 -6621 -4912
4394 -4912 2500 5633 1992 -4690 -4953 561 8180 6636 -1449 -7233 -5515 2135 6300 2742 -2413
4409 -2413 -5491 -1007 4865 5854 -1709 -7997 -4930 1810 6989 4338 -3152 -6266 -2330 3953 3113
4424 3113 -320 -6718 -6567 1263 7910 6330 -2206 -6536 -4075 1865 3855 468 -4913 -4485 1776
4439 1776 7278 4645 -2711 -7146 -4537 3132 6374 1855 -3560 -4777 1511 6279 4458 -3055 -7260
4454 -7260 -3552 2876 6360 3783 -2399 -4351 -993 4220 5329 -2257 -6156 -3810 2543 7120 4496
4469 4496 -2906 -5936 -1799 3520 4749 194 -4919 -4001 2489 6968 3975 -2879 -6741 -4041 3089
4484 3089 5334 1030 -4122 -4344 1323 5686 3263 -3318 -8145 -3988 4033 5778 2708 -4090 -5205
4499 -5205 -29 4941 3061 -2171 -6424 -3321 2465 7168 3870 -4085 -6230 -483 3420 3568 -1825
4514 -1825 -5160 -3079 4068 6583 3162 -3319 -6737 -3282 3360 5007 1264 -4678 -2809 2221 6002
4529 6002 3033 -3284 -7483 -2072 4151 6711 2470 -4764 -5166 -15 5259 2655 -2856 -6857 -2181
4544 -2181 4251 6884 2574 -3649 -4769 -865 4254 4318 -2264 -6267 -3478 3509 7424 3232 -5199
4559 -5199 -7752 -1666 4543 4995 -571 -5439 -2920 3716 6595 2595 -5140 -7641 -1593 4612 5629
4574 5629 557 -5219 -4524 697 5286 3330 -4302 -7908 -1388 5512 6921 1367 -5493 -5185 507
4589 507 4953 3033 -3408 -5689 -1558 6250 7334 923 -6407 -6729 -1457 5806 5620 -2211 -5799 -1872
4605 -1872 5041 6610 1689 -6187 -7042 -614 6266 5947 -556 -5956 -3666 3733 6504 1711 -5643
4620 -5643 -7574 -558 6883 7610 -348 -6190 -5226 2115 6245 2146 -5094 -6475 -680 6194 6580 -866
4636 -866 -7811 -7068 1154 6194 3804 -2917 -5856 -1300 5150 5771 775 -7261 -5618 442 6775 6088
4652 6088 -2356 -6948 -1739 5387 6463 1417 -7201 -6635 1006 7391 6257 -2714 -7794 -3848 3821
4667 3821 5217 991 -5578 -5589 968 8859 6332 -1467 -6621 -4727 3136 6059 1635 -5059 -6014 517
4683 517 7596 5488 -2097 -8863 -5221 3473 7209 3004 -4298 -6571 -1255 5961 5552 -2174 -8104
4698 -8104 -4832 2826 7716 4748 -3851 -6706 -2510 5145 5061 -1193 -7826 -4783 2952 8258 4512
4713 4512 -4516 -8072 -2838 5411 6905 322 -6319 -5101 2429 7667 3566 -4713 -8331 -3137 5180
4728 5180 7549 620 -5953 -5577 1462 7247 4798 -4018 -7003 -3479 5800 8260 1645 -6876 -6694
4743 -6694 698 6500 3292 -3061 -7498 -2728 5645 7920 2458 -5945 -7395 -1113 6346 4453 -2130
4758 -2130 -7632 -2847 4907 7779 2129 -6953 -8429 -1240 6363 5924 -960 -6839 -3715 3735 6523
4773 6523 901 -5611 -7565 -580 6490 6902 -404 -6267 -4472 2504 6784 1904 -4092 -7262 -1401
4788 -1401 6007 6875 336 -6172 -4632 1780 6858 2650 -2952 -6079 -1261 5792 6494 436 -6749
4803 -6749 -5640 1666 5488 2816 -2503 -5411 -891 4464 5835 -1265 -5792 -5105 1634 7651 4194
4818 4194 -1801 -6705 -1918 4054 5059 152 -5763 -5383 1630 6424 4366 -2327 -5775 -4303 3160
4833 3160 5982 705 -5010 -4470 328 6626 4448 -2226 -6317 -3894 2901 5419 2254 -4181 -4218 871
4849 871 5172 4237 -2653 -6253 -4030 2834 6026 2935 -2460 -4743 -1090 3837 4128 -1605 -5182 -3940
4865 -3940 2684 5376 2406 -2603 -6055 -1003 3321 4014 -762 -3833 -3649 2802 5802 3412 -3095
4880 -3095 -5660 -3600 3424 4330 1377 -3464 -3549 753 5135 3615 -2934 -6185 -2676 3641 4689 2463
4896 2463 -2450 -3959 39 3485 2163 -2461 -4246 -2462 2731 4809 2440 -2935 -4315 329 3598
4911 3598 2741 -332 -4488 -2392 2248 4088 1358 -3364 -4719 -1397 2056 3463 385 -3498 -1516
4926 -1516 1314 3665 1483 -2824 -3681 -1273 2985 4465 1033 -3233 -2644 706 3095 1981 -2251
4941 -2251 -3545 -1745 2890 4981 1503 -3366 -3662 -762 2230 2873 -876 -3226 -1816 1643 4236
4956 4236 1927 -2001 -4543 -1912 2392 3051 -135 -2318 -2430 1341 3527 650 -1607 -3955 -2192
4971 -2192 2068 2758 649 -1833 -2177 245 2433 1834 -1718 -3028 -2094 2447 3448 1323 -3059 -3614
4987 -3614 -614 2279 1667 -498 -2636 -1252 2616 2990 1345 -2416 -3865 -1227 2321 2508 1067 -3198
5003 -3198 -1859 1888 3549 1092 -2215 -4509 -2205 2184 4281 2000 -2836 -2575 166 3485 3131
5018 3131 -1508 -4197 -1648 3009 4882 743 -2494 -3889 -319 2035 2288 -1403 -3443 -2142 2142
5033 2142 3847 2144 -1731 -3720 -1278 2616 4434 -226 -3566 -2490 2213 3124 1687 -2422 -4309
5048 -4309 -917 2456 3331 650 -3116 -3247 603 3781 3274 -3138 -5040 -1700 4525 5571 954 -3071
5064 -3071 -4059 378 4142 2653 -1009 -4308 -1677 2703 5100 28 -4552 -4513 674 4186 3126 -125
5080 -125 -3286 -1870 3250 4479 255 -3816 -4745 33 4002 3372 -779 -3884 -3382 2693 4540 1919
5096 1919 -2973 -5321 -743 5040 4516 -200 -4834 -2664 1285 3847 1199 -2735 -5278 -470 4053
5111 4053 4005 -978 -4844 -5582 -108 4443 2709 -2689 -3778 -673 3559 4244 -117 -4205 -3849 1818
5127 1818 4879 3502 -1449 -5178 -2789 3129 4504 323 -4609 -4417 535 5256 3903 -1402 -5994
5142 -5994 -2977 1501 5046 732 -4184 -4561 1925 5199 3134 -2193 -6759 -2642 2612 5191 1323
5157 1323 -3573 -4143 -562 4876 4362 -1134 -5336 -4217 2060 5555 2757 -2941 -4267 -314 3147
5172 3147 3704 -1153 -5604 -3373 1434 5569 2704 -2859 -6133 -1550 3956 3413 74 -4909 -3334
5187 -3334 1853 5909 3007 -2681 -6075 -2930 4143 3975 281 -4833 -3391 1676 5886 3418 -3912
5202 -3912 -5585 -1733 3268 5269 134 -4440 -3799 1492 4315 3159 -3490 -5453 -2755 4075 6366
5217 6366 924 -3443 -4402 164 4570 3491 -1993 -6008 -1909 2717 5785 1632 -4964 -5185 -324
5232 -324 3732 3641 -660 -6522 -2840 3660 5197 855 -5179 -4722 -1766 4061 4717 -585 -5419 -2558
5248 -2558 2264 4555 1793 -4449 -5820 -775 5100 3929 -1334 -3920 -3807 1946 4496 1524 -4069
5263 -4069 -3806 -547 3357 4439 -302 -4124 -4756 216 4799 3156 -2759 -4042 -1784 4743 3867 552
5279 552 -4101 -3685 348 5355 2087 -719 -4166 -1789 2791 3915 -716 -4690 -4188 1202 4391 3066
5295 3066 -1068 -5265 -1177 1796 4128 691 -4295 -3745 333 3855 3933 -1575 -5422 -3201 2631 4731
5311 4731 1573 -3965 -3093 563 3577 4110 -1215 -4739 -2271 2117 4587 1795 -1989 -3587 292
5326 292 4419 3277 -1897 -4279 -2397 2086 4621 3062 -1462 -4867 -946 2675 3246 -474 -4284
5341 -4284 -2482 949 4919 2567 -2200 -3924 -2046 2531 3480 74 -3436 -3278 513 4142 1243
5356 1243 -1976 -4317 -2284 2678 3633 686 -3429 -3932 -115 3649 3003 -1885 -3780 -2807 1857 3682
5372 3682 441 -2763 -2446 -368 2543 2494 -174 -3971 -2026 2786 4452 2026 -2436 -3123 -2016 2219
5388 2219 3134 1056 -3917 -1886 1265 3249 2682 -2334 -4462 -1318 2796 3745 549 -3215 -2244 871
5404 871 3262 1783 -2482 -4454 -2261 1853 4189 1131 -2744 -3049 210 3761 1881 -2321 -3096 -1251
5420 -1251 1835 3324 970 -3166 -4115 -1055 3402 2787 -909 -1936 -1642 1552 3410 1492 -2311 -4213
5436 -4213 -185 3820 2078 -341 -2929 -2098 1447 3125 1313 -3056 -3629 -1059 1741 3854 362
5451 362 -3785 -994 174 2796 2456 -3046 -3290 -1517 2867 3669 1324 -2884 -3204 266 2835 1622
5467 1622 -760 -3060 127 3040 2512 549 -2905 -2996 664 3456 1027 -200 -2956 -853 1971 3193
5483 3193 617 -2635 -4315 -643 3296 3890 -137 -2821 -1345 1055 2848 1804 -1582 -2905 633
5498 633 2381 2484 64 -3472 -2621 78 2437 1475 -1786 -3160 -542 2891 3589 652 -3035 -3841
5514 -3841 620 3360 1301 -714 -3495 -920 2278 2417 562 -2759 -3319 1425 3547 2438 -629
5529 -629 -3961 -1165 1532 3432 223 -2917 -3500 -519 3276 2984 -361 -2869 -2266 611 4420 447
5545 447 -2770 -2867 811 2647 2814 -1185 -2433 -2137 1334 3733 1884 -790 -2447 -134 2986 2062
5561 2062 -305 -2854 -3022 1014 2814 2127 -1342 -2909 -1322 2811 2378 475 -3186 -2674 1395 2891
5577 2891 2324 -1775 -3241 -1757 1378 2560 603 -2631 -3656 522 3500 1606 -2301 -3150 -2156 1137
5593 1137 3295 339 -1906 -3751 449 4116 1932 100 -2439 -2697 1258 3669 699 -1543 -2437
5608 -2437 739 2098 2249 -985 -2715 -2701 1673 3137 2186 -2819 -2923 -330 2561 3329 -432 -3137
5624 -3137 -1484 2073 3778 1909 -2383 -3105 -1020 2378 2819 -704 -2959 -1963 1052 2523 1643 -2148
5640 -2148 -3462 -1436 3060 3941 1227 -1863 -2342 177 4194 1786 -956 -4097 -1364 2510 3219 325
5656 325 -1866 -2708 -113 2705 1496 -610 -3758 -1941 2627 3539 982 -1428 -2782 -159 2503 2997
5672 2997 260 -1747 -1479 1282 3218 1171 -2297 -3674 -351 2505 2391 106 -2845 -2219 646 2640
5688 2640 283 -1340 -1925 -382 2315 2115 305 -3178 -2444 485 3012 1878 -1924 -2265 -982 2831
5704 2831 3029 -85 -3218 -3498 -359 2154 1897 -1261 -2690 -790 2140 2791 -140 -2882 -3168 -61
5720 -61 3130 2336 -1428 -2568 -1761 1380 3251 8 -2255 -2767 -1112 2744 2534 -604 -2632 -1392
5736 -1392 1298 3160 -226 -2456 -3382 216 2457 3161 -792 -2834 -2143 1005 2067 708 -1775 -3027
5752 -3027 -296 2215 2247 -229 -2734 -2396 462 2866 1583 -339 -2924 -1080 1730 1850 546 -3128
5768 -3128 -2551 743 3289 2208 -1603 -3129 -2129 1759 3067 344 -2500 -2444 763 2954 1305 -446
5784 -446 -3055 -2162 1284 3180 1071 -1157 -1702 243 2081 2067 -1296 -3713 -1182 1790 3114 1145
5800 1145 -1173 -2116 365 2072 2636 -841 -3413 -2142 302 2707 1550 -1731 -3371 -654 2291
5815 2291 2444 103 -2347 -1261 337 2750 1690 -802 -2429 -1758 1292 2331 -274 -1836 -1752 825
5831 825 3156 915 -1398 -2386 -2027 1920 2617 1795 -2146 -2767 -149 1787 1671 -1576 -2890 -916 1867
5848 1867 2857 852 -1379 -2205 357 2019 2015 -808 -2781 -1791 1471 3302 761 -2333 -2788 -758 1436
5865 1436 2453 -326 -2490 -2103 946 3458 1742 -2186 -2346 -1567 2491 2126 -532 -2920 -2245 927
5881 927 2696 977 -1861 -3088 -1136 2055 3235 863 -2001 -1631 -632 1688 937 -1406 -2246 -1567
5897 -1567 2424 2498 251 -2678 -3011 50 2129 1551 -589 -1853 -840 1561 1665 673 -1547 -2723
5913 -2723 -746 1803 2544 -591 -1624 -570 716 2676 502 -1303 -2391 -407 1991 2180 -432
5928 -432 -2230 -2228 1292 1480 -127 -1753 -1895 -911 2470 2888 -935 -1917 -1881 688 3016 1079 -2130 -2656
5946 -2656 -1634 1668 3266 21 -2441 -2518 172 2946 1644 -1627 -2495 -1062 338 1759 572 -2216
5962 -2216 -2880 -691 2632 2542 -414 -2156 -1248 1574 2036 871 -1943 -2101 84 2782 1741 166
5978 166 -1810 -2006 1657 2224 683 -1147 -2108 -839 1613 1969 -711 -2126 -1942 438 1577 896 -2407
5995 -2407 -2612 -525 2459 1840 -348 -2318 -1311 1041 2996 1399 -1117 -2799 -1162 801 1782 586
6011 586 -1798 -2166 1450 2125 1006 -1255 -2746 -1560 890 2428 229 -2576 -1305 327 1918 1977
6027 1977 -889 -2435 -1039 1156 2405 580 -1381 -1015 355 1245 1485 -598 -2620 -2202 450 1900
6043 1900 1219 -1569 -1523 -1134 1184 1818 -305 -2288 -1823 1141 3340 720 -800 -1528 -483 1517 3079
6060 3079 387 -1441 -981 812 2565 895 -1092 -2349 -1102 735 2360 -122 -705 -2110 837
6075 837 3169 2239 -728 -1886 -759 1152 2111 887 -1521 -2092 564 893 1212 378 -3079 -1158 1532
6092 1532 1721 1026 -1521 -2318 683 1404 1994 497 -2489 -2058 1918 1835 948 -1704 -2152 -318 1318
6109 1318 1337 347 -2193 -1049 1213 1662 1401 -1398 -1941 -206 1849 1847 193 -1019 -1331 256 1218 476
6127 476 -745 -1745 -1056 906 2372 -542 -1674 -1217 581 971 1438 -192 -1875 -775 1019 1269
6143 1269 891 -1709 -2914 46 2009 1329 -255 -1376 -1529 1006 3161 300 -1498 -2337 161 1517
6159 1517 1924 -606 -2473 -429 1345 1750 618 -1813 -2092 -776 1499 1763 394 -1569 -1715 79
6175 79 2883 1059 -399 -1888 -964 2478 1755 -100 -1930 -2123 -183 2458 1945 -625 -2031 -231
6191 -231 1435 1279 201 -1393 -896 -251 1983 1487 -357 -1585 -968 457 1580 402 -2077 -2150 -7
6208 -7 1281 1854 -843 -2200 -700 1100 2073 1259 -1226 -2008 -767 1774 1616 603 -2504 -1764 389
6225 389 1497 387 -613 -1096 -29 902 1655 627 -2279 -1805 991 1089 425 -270 -1466 -1217 1373
6242 1373 2594 235 -1628 -1864 690 2444 1188 -801 -1488 -786 1151 1429 1032 -1913 -1256 574
6258 574 2280 1500 -926 -2903 -404 1179 2360 824 -1587 -2031 1297 2254 512 -227 -2289 -1440
6274 -1440 356 1467 880 -1440 -1171 -700 1203 1223 355 -1499 -2106 609 2258 746 24 -1884 -83
6291 -83 845 881 -574 -1649 -817 309 2269 1231 -1218 -2477 -980 885 1521 -606 -2136 -1379 914
6308 914 1414 658 -810 -1466 -1786 1787 2132 231 -1262 -2546 -277 1038 1770 -611 -1920 -1185 638
6325 638 2236 1362 -1762 -2269 -467 1835 1363 -647 -1548 -1288 274 2060 880 -881 -1829 -74 994
6342 994 1839 23 -1552 -1375 798 1806 1269 -1655 -1491 153 145 1741 177 -1233 -657 293 1628
6359 1628 788 -1695 -1973 -459 1073 1644 -152 -1805 -429 767 625 887 -561 -2326 124 929
6375 929 1522 403 -1050 -2238 -418 1264 1710 -194 -592 183 980 1187 1196 -1432 -1481 -109 711 2184
6393 2184 51 -1472 -1242 582 1828 396 -916 -1860 -1209 1127 2007 -1144 -2162 -170 930 1997
6409 1997 320 -699 -1424 -818 695 1649 372 -997 -1021 1211 764 1314 -335 -2115 -365 926 2150
6426 2150 574 -1050 -286 -171 1770 786 -1295 -757 -505 918 1139 705 -1634 -1306 -362 1912 1148
6443 1148 -856 -1698 -1477 698 1363 833 -1016 -1314 -78 2125 1431 -135 -1944 -463 767 1726 648
6460 648 -558 -1437 -619 926 1348 869 -2251 -646 493 1181 1387 -1106 -1717 -1455 1127 1159 20 -2151
6478 -2151 -966 846 1433 1605 400 -1695 -674 653 1835 524 -919 -1441 1256 1327 551 -316 -2019
6495 -2019 -1268 999 1108 842 -1112 -1956 -244 970 1397 -471 -1781 -1305 741 1233 576 -330 -1916
6512 -1916 -857 1526 798 -287 -2212 -1136 1199 855 731 -77 -1193 -497 2354 1181 -833 -1177
6528 -1177 -1567 858 3114 682 -970 -911 -696 745 1315 312 -90 -340 1284 1508 1294 -345 -2477
6545 -2477 -1123 -170 766 1225 -993 -1508 -424 1507 1455 -703 -1242 -858 866 1815 644 -879 -1872
6562 -1872 291 1433 517 -47 -1440 -1019 0 1266 998 -56 -1001 -808 816 1763 72 -632 -626 127
6580 127 1482 1269 -497 -1938 -282 178 1087 193 -1321 -1296 334 1285 1708 -1260 -1289 -166 846 2051
6598 2051 392 -676 -1026 676 1975 1261 -12 -1038 51 1390 1688 844 -412 -1326 233 1163
6614 1163 1211 -491 -632 -844 1127 1724 939 -1455 -554 -750 1144 1628 -413 -415 -1198 861 1410 493 -231
6633 -231 -495 282 267 229 130 -1871 -1294 883 247 200 130 -2148 -148 1544 1410 -388 -1308 -696 -704 1341
6653 1341 791 -1347 -1286 -372 525 1194 161 -747 -1650 -801 820 1390 -198 47 -651 824 1200 970
6671 970 -153 -2063 -1 1163 505 -478 -1843 -1054 479 1169 15 -311 -1234 -708 1421 2073 -588
6688 -588 -1827 -1520 -76 1694 -463 8 -595 -219 1304 1114 576 -937 -714 950 2499 465 -1178
6705 -1178 -924 18 500 807 573 -322 -1191 283 597 780 309 -2184 725 -606 1675 -907 -193 -933
6723 -933 7 2086 -60 -592 -128 -1896 -62 942 645 263 -1621 -1350 1555 540 -321 -979 -1249
6740 -1249 574 902 672 -1300 -1276 -772 656 1280 -357 -2083 -1714 556 777 706 -674 -1423 276 869
6758 869 1022 444 -1136 -969 -588 1727 735 -789 -1274 -931 94 850 -69 -1477 -737 -640 1103 494
6776 494 -170 -527 -1339 506 1590 961 180 -1113 -227 1154 740 -218 -546 -1015 821 1783 408 -481
6794 -481 -18 224 621 1037 803 -2147 -170 370 661 1995 -1009 -165 -702 688 721 -1386 -1579 -1677 1228
6813 1228 904 748 318 -1325 45 1087 758 266 -1464 99 735 1354 586 -1374 -2469 -761 1522
6830 1522 1359 414 -1226 -301 229 745 -231 -566 -980 -784 697 1013 -31 -227 -91 248 1458 723
6848 723 -495 -994 -346 341 419 1449 216 -801 -448 557 1111 475 -1143 -257 440 354 11 -285 -518
6867 -518 -273 675 174 -103 -1027 -437 637 1321 784 -662 -1796 892 517 -105 -1078 -576 -824 706
6885 706 985 -183 -1633 -1087 -1314 207 648 94 -472 -462 1061 628 935 725 -607 14 1258 1688
6903 1688 -328 -959 -1200 -621 1008 1261 -1336 -424 -849 254 594 372 -152 -1411 -226 1623 1780
6920 1780 310 -754 -1202 -41 1202 298 -1278 -175 194 1291 282 169 -1351 -597 92 2446
6936 2446 237 -795 -1413 -414 6 395 347 -693 -1123 -113 1462 941 -757 -1102 -1494 1586 846 231
6954 231 -346 -871 109 314 371 -663 -667 -497 -383 1458 1015 -444 -554 -422 1553 -251 63 -857 238
6973 238 1043 275 1121 26 -845 -924 520 196 123 -114 -405 77 760 -600 -1833 -1357 -3 1933 116
6992 116 -522 -452 -724 729 1685 -300 113 -271 162 750 622 851 -677 -85 820 -278 1085 -1191
7010 -1191 -409 -191 -32 950 599 -419 -905 54 1042 302 -706 193 9 -435 1372 636 -99 -708 947
7029 947 102 694 -256 -2375 -468 457 895 980 -1582 -779 -221 466 1326 89 -1104 -939 405 416 429
7048 429 -534 -1384 339 1028 43 588 -349 -295 -608 1204 813 108 -1100 -758 -127 1378 948 -223 -657
7067 -657 -129 815 38 -429 -532 -1515 484 1063 328 -961 -1193 -399 697 -18 -299 -705 31 75 227
7086 227 112 -429 -454 -874 765 876 336 -1355 -992 334 1377 998 -332 -360 -325 134 -34 -1081 56
7105 56 -493 447 1255 1344 74 -66 54 -75 1253 164 369 -576 -68 920 1033 590 -629 -143 -167 1064
7125 1064 174 -913 -546 -226 362 36 83 -929 -234 -487 11 939 -109 -901 -841 195 1338 -537
7143 -537 -66 444 -261 442 231 261 -1032 -897 197 394 -817 -1256 278 -383 1259 -189 -525 -691
7161 -691 -539 -654 2153 863 -403 -1341 -744 503 937 -1084 -1087 -847 994 420 -297 729 -1361 -429
7179 -429 173 803 540 -1110 -699 1545 -178 690 -14 -871 -544 283 280 -583 -1014 -882 305 726 664 -938
7199 -938 -1248 223 492 454 -240 -275 -834 -712 378 1344 223 -826 -1095 1054 1068 356 -1852 -480 -726
7218 -726 1249 1406 -499 -833 607 -616 892 423 -1301 -1191 -788 886 404 -42 -981 -500 -338 848
7236 848 176 398 -678 -140 1205 1124 1221 -781 -1017 -672 710 480 -775 -1420 -612 160 353 -318 -1712
7255 -1712 -2463 -759 1636 123 -165 -1076 -259 328 1529 144 -1172 -752 -381 1115 797 -685 -1114
7272 -1114 -874 1040 678 753 -506 -1460 371 959 979 -192 -726 -567 -439 574 227 -1307 62 -327
7290 -327 12 755 -66 -1559 -425 125 1027 -12 -617 -1410 -399 890 735 -25 -688 -1030 649 868
7308 868 88 -517 -1416 119 467 1221 -132 -956 -656 -356 1158 568 -968 -788 -528 237 1304 -284
7326 -284 -1594 -832 822 844 449 -945 -665 -584 56 133 -33 -795 -412 -202 538 586 -513 -1226 -826 238
7346 238 1689 434 12 -717 -398 387 228 245 -984 587 -252 736 -127 -120 -970 622 963 1717 -981
7365 -981 -1464 -1916 319 1050 1091 -801 -1064 24 374 396 198 -363 100 22 1795 113 -584 164 138 301
7385 301 893 -289 -1294 -206 -59 1447 635 -336 -637 -310 527 1862 -449 -449 -1337 -339 953 -11
7403 -11 -622 -890 528 675 785 -87 -98 -1466 -225 966 642 -66 -585 78 601 844 25 -2168 -942
7422 -942 285 131 205 -336 -1069 -1169 364 21 693 -751 -611 175 751 1301 -883 -284 -278 1378 150
7441 150 -337 167 -976 -118 1050 377 -381 -1335 213 -56 -304 471 -437 -694 -45 192 529 413 -802
7460 -802 -916 139 1209 -358 -1247 -1357 477 823 1573 860 -348 -953 -150 526 1269 -772 37 -485
7478 -485 729 739 863 -841 -472 428 246 1063 -87 -90 -830 489 1505 802 -165 -208 -233 152 14 -1056
7498 -1056 248 -1463 274 1676 110 -742 -19 -740 1471 1168 1 -724 -302 473 880 990 -71
7515 -71 -792 1048 617 -236 -256 -707 37 341 627 956 -178 -1202 -318 807 205 113 134 -80 1820 143
7535 143 98 112 -326 -819 571 -75 183 -1225 -570 -383 407 1145 -299 -760 -973 -254 667 787 478 -1005
7555 -1005 -307 82 492 922 -298 -881 -93 1211 1556 678 -260 433 34 280 537 -111 -1089 225 978
7574 978 643 -356 -706 725 690 1386 1031 564 -619 986 20 968 -837 -853 171 -151 601 272 -364
7593 -364 -1007 191 -386 690 -355 -976 -608 -304 671 126 -448 -972 807 1521 1468 971 -703 -756 -270
7612 -270 1025 -98 625 0 -680 25 229 30 54 -521 -549 -32 -323 -130 -1110 -593 -299 -234 586 -689
7632 -689 -673 167 524 74 -293 -399 -432 97 1258 556 -719 -659 -508 437 1329 494 -520 -591 454 384
7652 384 938 274 -1244 -482 897 916 -98 -331 -845 300 1382 827 -335 -1041 -828 1000 -115 583
7670 583 3 -1162 563 246 414 996 -688 -1017 897 1100 -428 -1914 -1185 -462 114 1066 423 -685
7688 -685 -905 845 140 694 -329 -480 277 1019 387 -1266 -1274 -675 -357 2137 158 -701 131 247 -63
7707 -63 1183 158 -67 -297 719 735 561 -252 -955 -1351 1228 127 35 -18 -1130 -363 1099 1073 -269
7726 -269 -1744 -529 -178 -6 257 -399 -780 398 530 518 194 -1686 5 25 132 797 -216 -673 -539
7745 -539 666 614 31 -382 -350 -653 -69 -448 -139 -848 474 455 517 -55 -810 -662 621 761 1026 -1077
7765 -1077 -1166 -591 -58 1356 409 -2115 -480 805 1097 776 178 -350 -773 242 -308 474 -627 -831
7783 -831 10 1392 786 -400 -862 -1183 240 978 162 -306 -877 584 403 2019 -429 -1465 -535 -475
7801 -475 457 1063 -807 -814 -66 659 884 -429 85 -381 426 1010 -60 -355 -394 203 806 1229 359 -1433
7821 -1433 -1275 1000 -157 190 377 -22 -231 672 330 239 -2073 -1234 -21 737 1021 -822 -1650 -560
7839 -560 197 -254 806 -622 -806 582 1234 950 -1378 -1497 -844 623 540 1012 -992 -369 -430 691
7857 691 405 -388 -478 -1302 790 1835 -796 -640 -464 -148 814 157 312 -858 -972 642 573 -256 -938
7876 -938 -719 -1437 469 735 -1029 -1034 -1231 -652 1416 340 -450 -1190 -948 927 -116 48 18 -1270 -432
7895 -432 -295 937 536 -73 -702 -503 -572 111 -669 -1171 284 220 658 -171 -526 -696 257 1009 976 -861
7915 -861 -917 -1137 360 1016 239 -634 -710 877 310 68 89 -908 -828 1426 282 -888 375 -213 48
7934 48 189 605 -754 172 -242 2239 1132 -105 -938 -824 373 520 1005 -260 -1207 -577 625 -106
7952 -106 358 708 -990 99 959 979 811 -539 -770 -285 48 -4 203 20 127 46 1241 -12 -1398
7971 -1398 -762 869 1014 -115 -167 -575 60 855 758 -75 -2103 -826 916 1037 -251 117 -1288 300
7989 300 921 1484 284 -800 -446 588 404 624 -431 -293 -1261 557 1663 467 -367 -1404 500
8006 500 62 318 471 162 137 412 1421 270 -865 -478 766 1381 332 -509 489 172 1692 664
8024 664 49 -563 -598 -1144 161 672 416 -1174 -77 -166 970 760 -1658 142 -615 105 -131 -24 -521
8043 -521 -329 236 965 -458 -454 -1217 -438 757 1141 -942 -673 -197 905 -86 746 -217 -329 -11 234
8062 234 998 116 -846 -808 -535 1295 990 -585 -1554 -48 368 517 420 -1266 -590 -352 2153 2 104
8081 104 -808 355 1066 550 -489 -361 -404 -137 941 -796 307 -90 -423 326 1031 -183 -1018 -546
8099 -546 -70 312 334 369 -536 -437 -642 430 29 -802 -991 359 196 445 292 -83 151 -354 862 -120
8119 -120 911 -1166 289 440 330 -252 634 218 -1107 867 1655 -939 -1083 -675 907 543 -176 -821
8137 -821 -1746 -104 767 791 -220 -1003 -940 653 1055 489 -73 -1275 803 2202 1680 -1077 -1309 -116
8155 -116 405 1904 -50 -1068 -762 -242 -417 752 548 -1026 -116 1092 1087 33 -688 -1775 -142 -25
8173 -25 1184 -716 -698 -975 -466 1635 25 -288 -716 -54 -739 755 169 116 -790 827 2012 -17
8191a7
$$ Imaginary data points
##PAGE= N=2
##DATA TABLE= (X++(I..I)), XYDATA
0 0 0 0 0 0 0 0 0 0 0 0 0 0 0 0 0 -108 108 -108 108 -108 115 -216 216 -230 324 -330 432 -472 541 -648 748
31 748 -849 940 -1072 1197 -1342 1511 -1684 1888 -2102 2332 -2599 2868 -3187 3519 -3873 4282
47 4282 -4719 5201 -5732 6315 -6958 7670 -8474 9365 -10379 11548 -12882 14450 -16320
60 -16320 18569 -21372 24942 -29707 36340 -46289 62822 -95178 182609 -933584 -2608606
71 -2608606 -768610 364176 468946 533073 373955 -170573 436115 1184601 332468 -1313727
81 -1313727 -1563753 -594109 544525 1271196 1140977 22723 -668441 -112539 493164 -106545
91 -106545 -1059631 -1101019 -152306 999901 1540156 882828 -451851 -1113363 -568509 141728
101 141728 82895 -406741 -461094 172307 1043352 1298045 418770 -953317 -1449444 -669267
111 -669267 351913 603046 202998 -110223 128914 686821 772765 -86383 -1191968 -1350370
121 -1350370 -368865 754777 1063797 525075 -150070 -269311 128667 282736 -270701 -979402
131 -979402 -910017 60801 1074141 1221430 429136 -510406 -756992 -293976 115356 -67135
141 -67135 -485382 -390199 357353 1065780 966998 47907 -895445 -1038318 -380713 300198
151 300198 371728 29224 -78348 300169 710043 517293 -315879 -1065564 -979824 -127000
161 -127000 679320 771441 279684 -130426 -50006 228975 130158 -436366 -883928 -620791
171 -620791 239796 956749 899061 187761 -449948 -484823 -129149 26486 -218425 -459646
181 -459646 -212671 464321 951568 696444 -136758 -791871 -737508 -192975 218756 185908
191 185908 -29893 18347 396188 644029 312856 -433679 -918674 -686016 16758 553679
201 553679 542698 177208 -48087 71540 219683 -6874 -505760 -746026 -388292 322479
211 322479 795667 650068 85923 -336856 -312154 -88182 -75593 -290951 -373365 -53037
221 -53037 499430 787699 477908 -199556 -645420 -540769 -131439 123250 82517 -13871
231 -13871 114509 421557 524453 153561 -453123 -761560 -500429 63096 440123 402657
241 402657 147493 26002 118291 155827 -101093 -494625 -612682 -248409 335616 663293
251 663293 495933 51534 -247806 -229975 -103281 -134293 -288019 -282148 41429 481373 644198
262 644198 339202 -196370 -524893 -435270 -127845 63762 54651 30281 170683 390141 404960
273 404960 61878 -418313 -631510 -394418 61061 359960 338446 155805 67208 108418
283 108418 86897 -143712 -445194 -498892 -171809 309929 564856 419445 52211 -204451
293 -204451 -210326 -123861 -145488 -248352 -214391 71609 435834 552251 274615 -185581 -462892
304 -462892 -387245 -125395 51693 65895 55778 169593 340710 335126 32043 -378453 -553681
315 -553681 -346611 56678 329843 319878 152739 57440 79725 53548 -144926 -392307 -428748
326 -428748 -142496 281381 513408 381321 43427 -195519 -207343 -124211 -126791 -204471 -178130
337 -178130 67053 393134 502776 246874 -182430 -437576 -360361 -103430 71745 76354
347 76354 47306 140270 305903 310648 27979 -358168 -522695 -318132 74536 332202 300556
358 300556 117920 23165 63665 63667 -117484 -364372 -410232 -131683 284964 498771 347953
369 347953 6095 -213262 -193378 -89055 -92576 -189788 -180220 56863 379605 480533 218916
380 218916 -200918 -428956 -325333 -61538 94747 66645 17417 115717 293878 302941 19696
391 19696 -361367 -504464 -275759 114145 334438 260474 66532 -894 76571 87786 -106618
402 -106618 -366423 -401596 -102578 311263 487100 294047 -49844 -224691 -150674 -35134
412 -35134 -72612 -206429 -199107 64801 396509 469060 169709 -245808 -422467 -264826 2541
423 2541 106141 26384 -25283 110881 313338 303389 -11976 -388037 -483206 -211671 166100
434 166100 324797 197092 12123 -1662 108607 106069 -123314 -385732 -382824 -48454 346488
445 346488 457202 217967 -101927 -208370 -93232 4056 -81853 -236994 -199007 104108
455 104108 423047 436405 96837 -287996 -391228 -184530 55029 89361 -28522 -51373
465 -51373 136543 344389 286253 -69531 -421764 -442303 -125688 216881 292630 119896 -29534
476 -29534 22665 156007 110729 -164288 -413724 -346246 25148 379525 408004 131762 -141707
487 -141707 -170912 -28296 22590 -117142 -268436 -174740 160096 441749 379790 15647 -312980
498 -312980 -333679 -107002 77509 46563 -76051 -44730 181581 361352 238906 -137475
508 -137475 -432255 -375809 -44637 235005 233774 51192 -39416 68013 189888 84976 -216542
519 -216542 -421132 -286587 100359 390254 338523 50201 -155626 -114439 24739 18284 -163929
530 -163929 -286329 -132320 219339 443478 307758 -59767 -317313 -263134 -39446 78663
540 78663 -3368 -107369 -19734 228291 359373 174688 -196538 -418550 -298118 21588
550 21588 226609 168710 4486 -20593 115364 195187 37370 -258691 -400417 -211924 154585
561 154585 368107 259800 -4610 -136808 -56733 49325 -10733 -202736 -277550 -73583
571 -73583 262482 413934 226969 -111369 -292063 -194192 4373 58617 -53136 -119813 20599
582 20599 264449 338537 109752 -238610 -389054 -221950 70359 201820 107639 -24867
592 -24867 4749 151860 187632 -9837 -289142 -368138 -139041 191389 330668 189550 -35261
603 -35261 -107435 -12049 56692 -46543 -227871 -247687 -16045 282266 367799 158019 -137520
614 -137520 -252008 -134505 21122 26291 -84244 -107113 61052 276870 296387 49037 -254718
625 -254718 -339966 -154733 90262 165024 61050 -29077 36059 172680 166239 -55421 -300272
636 -300272 -321835 -78919 208260 288329 131493 -54627 -76779 22436 53291 -79076 -238890
647 -238890 -214150 29609 290600 322456 99045 -152383 -212324 -88440 26402 -2133 -102734
658 -102734 -89829 93196 280802 252728 106 -254926 -292048 -105300 95384 130142 31028
669 31028 -25113 64873 177393 131420 -89947 -294371 -273763 -33185 209077 244103 88949
680 88949 -54344 -47515 40811 38992 -103338 -237119 -178391 68205 287488 272833 52780
691 52780 -153691 -175938 -54577 27517 -25141 -113311 -69362 121941 275930 211644 -38512
702 -38512 -253579 -249249 -63021 101165 99611 4963 -16161 85832 177752 104154 -118100
713 -118100 -285891 -229505 7655 205174 203192 54616 -52525 -24178 52206 23540 -123251
724 -123251 -228188 -139585 98462 274135 229438 19558 -148793 -142974 -29239 21310 -46565
735 -46565 -115425 -44954 140257 262112 171620 -69420 -244369 -209145 -29058 96974 72965
746 72965 -11754 -7299 102941 174848 76014 -140972 -274931 -188108 40250 198319 168476
757 168476 25916 -50402 -289 63514 8684 -140437 -220693 -107167 121730 263659 189229
768 189229 -13202 -143536 -112551 -9745 14303 -63705 -115435 -24842 158157 248576 133386
779 133386 -93457 -231594 -170697 -5452 87990 50530 -22243 3415 116676 165421 47891
790 47891 -156348 -257368 -151323 63060 186856 133996 4707 -40435 19805 66449 -7820
801 -7820 -154115 -207383 -76313 141616 247384 149857 -37240 -135544 -82729 8311 6045
812 6045 -80523 -114757 -2432 173137 233376 98520 -116446 -217186 -134556 19213 81020
823 81020 23841 -33022 17762 129909 155762 20568 -171119 -238279 -113944 83739 171575
834 171575 101934 -10112 -30395 35320 65813 -25296 -163427 -189977 -43194 156064 225443
845 225443 113964 -54151 -119722 -56963 16868 -7645 -93790 -105332 20233 181460 211670
856 211670 63467 -129790 -197357 -99089 34215 67070 1806 -36675 32714 141786 142477
867 142477 -4135 -182730 -218055 -76957 99189 154071 70924 -22339 -18332 54609 64665
878 64665 -44992 -172125 -170961 -14275 164958 203244 79892 -68507 -102297 -30843 21758
889 21758 -22232 -104643 -93616 42124 186975 187563 31350 -137258 -172646 -68239 42431
900 42431 50205 -14257 -33350 49986 147400 123800 -31443 -185329 -191119 -44745 107371 132658
912 132658 44418 -29201 -1421 65858 54032 -64716 -175961 -149114 16133 171791 176664
923 176664 46584 -75913 -82853 -9892 23769 -38551 -112552 -79555 66560 190149 161964
934 161964 911 -144289 -148504 -40811 48918 33707 -30735 -26957 66976 147827 101950 -55306
946 -55306 -184185 -162985 -15984 110384 109848 22663 -27177 13606 71579 40745 -81636 -172948
958 -172948 -123258 40199 169049 150250 21791 -77182 -65357 5800 18760 -52320 -113900
969 -113900 -60212 84798 186257 134508 -24693 -143230 -124032 -17967 48261 15150 -41646
980 -41646 -19408 82480 147652 80090 -77910 -182492 -135473 9864 110280 87467 4187
991 4187 -24546 30020 77506 27372 -97745 -169269 -96996 63085 165184 123242 -229
1002 -229 -74258 -45191 17216 10274 -66198 -110754 -40306 101738 176095 107341 -44474 -137736
1014 -137736 -99581 -37 44113 -486 -45926 -6044 94648 140652 56208 -94135 -173567
1025 -173567 -107344 30500 105018 65770 -10148 -16647 43951 78203 10606 -112275 -161582
1036 -161582 -71017 82699 157202 95018 -19757 -70054 -26166 28591 1483 -80698 -108925
1047 -108925 -21506 115298 167362 79257 -63382 -129387 -74850 14698 36601 -15838 -49064
1058 -49064 6364 105255 131834 34116 -108542 -161057 -80670 45255 94630 46007 -18649
1069 -18649 -8806 55123 74497 -6272 -120226 -147175 -46872 93877 144113 70181 -32239
1080 -32239 -59403 -8146 31552 -10146 -89642 -100243 -454 126458 153151 53344 -76958
1091 -76958 -117025 -51114 25142 26033 -31771 -50370 22412 116810 120322 10357 -119868 -146689
1103 -146689 -53847 57916 83492 23572 -24738 3040 68487 68090 -23767 -129264 -132794 -20848
1115 -20848 103992 128141 46119 -40354 -46823 6826 30542 -25125 -97814 -88364 20634 132245
1127 132245 135885 28832 -84230 -102262 -30786 30004 12826 -42075 -43233 38329 121566 105190
1139 105190 -12787 -124458 -127643 -29995 64772 67303 6720 -25564 17329 76394 57912 -43578
1151 -43578 -133715 -114793 4356 110450 109085 23210 -46364 -31753 22643 27259 -40471 -103703
1163 -103703 -74023 41857 134428 115605 5236 -88219 -82345 -13160 29426 -1740 -50679
1174 -50679 -33351 54008 121429 86310 -32372 -124598 -106073 -7629 65076 52047 -6223 -20476
1186 -20476 30899 79364 44286 -59315 -131764 -94112 23038 108292 89373 5790 -43866
1197 -43866 -16885 30772 17682 -53990 -102589 -55227 58218 132310 93786 -15243 -86545
1208 -86545 -64217 2667 25569 -16105 -56168 -22014 69094 119674 65468 -50027 -120897 -85164
1220 -85164 8478 61859 34475 -17468 -13708 43947 77280 27792 -72815 -125368 -72063 39278
1232 39278 103994 69341 -6472 -38289 -4216 33920 6720 -64517 -97260 -37366 69718 123518
1244 123518 71576 -28626 -79247 -47209 11417 18620 -26271 -54638 -6780 78971 110706 45807
1256 45807 -62558 -113679 -65324 19726 55347 19458 -21146 -3734 55123 74627 12645 -82820
1268 -82820 -117229 -51367 51535 94280 51904 -15588 -30207 8064 35726 -4398 -73518 -90162
1280 -90162 -20335 79185 112835 52826 -37578 -71666 -33119 15950 9963 -36011 -50406 5076
1292 5076 83565 101316 28432 -69305 -102598 -48508 26560 47247 9121 -22115 4485 59689
1304 59689 67456 -1983 -88155 -105450 -34709 56772 85296 37557 -20947 -22676 17394 32667
1316 32667 -14398 -77714 -81890 -5183 85170 104139 35606 -45365 -62210 -19341 19123 1671
1328 1671 -43924 -47747 16043 89459 91977 12346 -75471 -92166 -33234 32258 38752 -1005 -22350
1341 -22350 13461 64846 59261 -13478 -91595 -94928 -19767 62209 74748 25002 -22602 -15078
1353 -15078 23725 28564 -23308 -80243 -72409 7855 86512 91611 21752 -47409 -53648 -9771 19876
1366 19876 -5654 -46573 -39779 27982 90349 80044 -1699 -78549 -80642 -19303 35312 30548
1378 30548 -11126 -20600 22271 67379 52139 -26233 -93805 -83232 -3150 65601 64285 11324
1390 11324 -25502 -8113 29889 26320 -32431 -82316 -62353 21722 88768 79429 7748 -51782
1402 -51782 -44788 1573 19566 -13434 -50203 -33535 36855 91284 68858 -13581 -78778 -69558
1414 -69558 -6532 36943 22466 -16571 -17438 29069 68729 42940 -37184 -94134 -70887 8441
1426 8441 65989 52915 351 -25620 2253 37203 20084 -42759 -82902 -50938 33081 90138
1438 90138 66704 -6251 -50866 -32252 9606 17047 -22687 -53691 -25580 46800 90816 55975
1450 55975 -26902 -78164 -56744 4018 35470 11978 -22289 -12523 38787 69126 31528 -46055
1462 -46055 -91056 -57639 19323 64906 42164 -9201 -22476 10697 38338 12623 -49263 -81071
1474 -81071 -38928 43409 86037 53368 -15003 -48850 -22599 15367 11894 -30681 -54207 -15025
1486 -15025 57309 86800 42751 -37894 -76192 -43172 14669 32279 420 -27241 -6414 48163
1498 48163 67726 21274 -55541 -88028 -42191 30112 60653 28436 -15221 -16856 18500 39204
1510 39204 3442 -57948 -76881 -25278 51579 80562 39381 -22899 -43438 -11083 19669 6464
1522 6464 -38370 -51955 -5257 61341 81421 28678 -44062 -69253 -30690 20399 26821 -6983
1534 -6983 -27926 1830 53083 62640 7703 -62645 -79837 -28844 37389 53524 16005 -19667
1546 -19667 -11135 27864 37912 -6077 -64594 -68878 -11025 58376 72978 25591 -30025 -36164
1558 -36164 -1492 21919 -2454 -45465 -47688 6796 67218 72720 14862 -50156 -61051 -18530
1570 -18530 23783 18506 -14985 -27047 11727 58282 55774 -3215 -66534 -70839 -15868 40661
1582 40661 45452 6084 -19654 -3096 32796 33984 -14506 -65631 -61241 -211 60428 62771 13323
1595 13323 -32650 -27931 6621 20924 -11012 -49584 -41098 16787 71185 63172 1352 -53395
1607 -53395 -51640 -6759 24756 10476 -23462 -23909 19510 60913 47288 -15407 -67446 -61058 -3983
1620 -3983 42446 36826 -1754 -19229 4065 37198 27899 -24065 -66481 -51443 11214 61037
1632 61037 53561 3431 -32593 -20653 13387 17329 -17582 -49085 -33644 24418 69115 52345
1644 52345 -6497 -52681 -42670 1842 23471 3257 -26420 -18256 27396 61180 37943 -24060
1656 -24060 -68087 -50313 5739 41185 28204 -9499 -16535 12884 39793 21720 -33051 -67250
1668 -67250 -41084 22016 59795 42364 -4998 -31615 -12604 18162 13601 -25282 -51148 -24650
1680 -24650 32647 68724 41797 -15991 -50081 -32485 7167 21853 -3404 -27735 -13097 34416
1692 34416 59227 29508 -30813 -64194 -39738 12980 38861 18900 -12363 -13496 18956 40006
1704 40006 14679 -38318 -63925 -32717 28976 57594 32105 -11518 -26920 -3882 21009 8144
1716 8144 -31643 -49167 -16211 40186 63887 32507 -23748 -47616 -22971 13840 17802 -12200
1728 -12200 -29887 -5958 40977 56229 19861 -37879 -61352 -28700 19774 35491 9697 -16192
1740 -16192 -8520 25158 38411 5988 -44062 -60078 -22283 34253 52723 23828 -17136 -22788
1752 -22788 2637 21671 925 -36641 -45912 -7892 44845 59944 22892 -28835 -42710 -14025
1764 -14025 16720 11701 -17830 -29660 1776 44767 52232 9439 -42598 -54887 -18769 24306
1776 24306 29812 2072 -17760 -2577 31220 36239 -1977 -47442 -54535 -11270 37786 47355 13688
1789 13688 -19568 -17119 9254 20849 -3209 -39756 -42139 -387 48038 53221 12496 -31349
1801 -31349 -36036 -7183 17174 6817 -21541 -26135 8596 46566 46145 2387 -44741 -49014 -10511
1814 -10511 26610 23894 -3575 -17172 3750 33756 31149 -9290 -49888 -48613 -3594 39964
1826 39964 39653 5365 -20657 -11823 15623 20150 -11441 -42149 -36682 8707 48690 45398 4234
1839 4234 -33544 -29870 379 15948 200 -26530 -22565 14555 48015 38801 -6294 -45561 -40001
1852 -40001 -3352 25129 18065 -8559 -15003 8398 34829 26005 -16002 -50426 -40458 3467 38311
1865 38311 32902 640 -19424 -5162 17909 15386 -16815 -42145 -30607 15921 48618 38356
1877 38356 -2490 -31197 -22437 4677 14512 -5641 -26996 -17353 19916 47623 31834 -13394
1889 -13394 -43876 -33495 3052 24949 11926 -12230 -13078 14774 34533 20903 -21102 -48158
1901 -48158 -32268 10045 38210 25948 -4338 -17160 330 19764 10884 -20719 -41229 -22561
1913 -22561 20030 46286 31796 -6717 -28857 -17872 7212 11510 -9109 -27130 -13052 23645
1925 23645 45150 25846 -16753 -41652 -27569 7605 22857 7750 -12589 -9822 17173 34026
1937 34026 15411 -24469 -46201 -26664 14543 35835 19019 -8755 -15290 3357 19778 7671
1949 7671 -23646 -39134 -18394 23367 44513 23934 -11078 -28473 -12441 11815 10495 -12628
1961 -12628 -27604 -9203 26530 43718 19505 -21412 -39406 -21164 10322 20401 3079 -15212
1973 -15212 -6907 21755 34347 11605 -29457 -43222 -19575 18500 33683 15046 -10697 -13852
1985 -13852 6504 20670 4669 -27760 -38734 -12679 26996 42795 20048 -16015 -26182 -7531
1997 -7531 13507 7777 -17433 -27029 -5072 29693 41771 14008 -24950 -37126 -16340 14869
2009 14869 18648 -2644 -16459 -3415 24648 33658 5367 -31567 -41389 -14513 22362 32667
2021 32667 9876 -15159 -11431 11522 21904 1550 -30483 -37835 -7571 31645 40253 13661
2033 13661 -19047 -23849 -3247 16097 5728 -21122 -25831 -507 34637 39744 8051 -29627
2045 -29627 -35585 -8155 17810 16497 -6960 -18524 -675 28185 31106 530 -36023 -39545 -6374
2058 -6374 26874 28423 3554 -17247 -7895 17041 21520 -5049 -34238 -35058 -498 35225 36105
2071 36105 4558 -23135 -20756 5656 17177 82 -25146 -25143 5478 38011 35713 711 -32470
2084 -32470 -31666 -599 19615 12373 -13279 -18365 4955 33241 28992 -6158 -39241 -34667 1539
2097 1539 27577 23799 -4009 -17424 -2283 21496 19802 -10084 -38296 -30769 7242 37512 30904
2110 30904 -2404 -24074 -14223 11687 16644 -6008 -28372 -22105 12952 39440 29497 -8616 -33381
2123 -33381 -23899 6074 20526 4768 -18470 -16685 12942 35031 23375 -13748 -39933 -27198
2135 -27198 9984 28195 15357 -10857 -16792 5493 24512 16148 -17100 -38630 -23706 14732
2147 14732 37922 22907 -9222 -23347 -7449 15217 13973 -13319 -31819 -16325 19957 39696
2159 39696 21889 -14688 -32622 -15749 11956 18186 -2054 -22123 -11590 18915 36435 15664
2171 15664 -21353 -37775 -18794 14553 26634 7055 -14682 -11523 11710 25850 8923 -23818
2183 -23818 -37113 -14840 21394 33539 13834 -14078 -19633 638 18637 8363 -19745 -29140
2195 -29140 -8736 25934 37106 12521 -19608 -28236 -7934 14397 12337 -9376 -21790 -4593
2207 -4593 25126 32097 6961 -25087 -33663 -9891 18426 21268 1324 -16234 -5496 16215 24943
2220 24943 1938 -28007 -32274 -6280 23675 28332 4590 -16121 -11967 7540 16753 352 -23963
2233 -23963 -26048 -918 29706 30672 3347 -21336 -22050 -594 14827 5521 -13967 -17862 3595
2246 3595 28859 26712 -1043 -27052 -27608 -2368 18373 14313 -5788 -14310 -56 19838 18793
2259 18793 -4700 -28304 -26027 -644 24865 21717 66 -15087 -6387 9806 12486 -4785 -24842
2272 -24842 -21069 5643 27982 23256 -348 -19637 -15710 2442 11329 -220 -15193 -12658 8698
2285 8698 25966 20345 -4457 -25187 -19951 2405 15501 8138 -7497 -9919 7041 20593 13509
2298 13509 -9502 -26233 -19887 4392 20632 15279 -2935 -9709 -972 10341 8426 -9279 -23094
2311 -23094 -14781 9163 24030 18292 -3101 -15755 -10348 4284 7803 -4121 -13719 -8585 11728
2324 11728 23305 14331 -7032 -20724 -14289 2400 11285 4667 -5683 -5638 7683 17526 8934 -10482
2338 -10482 -22946 -15304 5471 18449 11736 -3216 -8280 540 8909 5317 -10811 -19105 -9784
2351 -9784 9535 21791 14832 -2588 -12647 -6409 3133 5060 -4691 -12477 -4097 10841 19453 11058
2365 11058 -7386 -18539 -12885 1696 9332 3449 -4480 -3315 7791 14446 7069 -10661 -20337
2378 -20337 -12712 4488 15302 10310 -1229 -5011 391 7095 1979 -9030 -15597 -8102 8566
2391 8566 19824 13375 -2327 -12242 -7756 829 4140 -3847 -8997 -3535 9474 19134 10696 -5923
2405 -5923 -16965 -12374 79 9232 4134 -4632 -3000 6512 13130 7077 -8975 -18311 -12811 4187
2419 4187 14608 12264 -200 -5944 -1424 5938 3562 -8039 -15311 -8846 7240 18770 14377 -1795
2433 -1795 -12743 -8569 1799 5965 -1465 -10423 -5618 8997 18722 10808 -5811 -18854 -13125 1772
2447 1772 10065 5743 -3883 -4684 6504 13359 7278 -10006 -20963 -12690 6103 16334 10004 -3044
2461 -3044 -8813 -1057 8300 4773 -8484 -17490 -9879 9889 21422 13958 -5704 -13999 -7587 4840
2475 4840 7765 -3751 -13157 -6686 9552 19979 12061 -9846 -20895 -12134 4521 13061 4487
2488 4487 -7031 -7697 7325 16760 8226 -11440 -22775 -11587 8402 19340 10662 -6857 -11303
2501 -11303 1147 11075 5520 -10451 -21004 -8955 13334 21935 12194 -9160 -15840 -5462 7943
2514 7943 7796 -6339 -16864 -6038 13738 23299 9410 -13360 -21737 -7956 9416 13416 1000
2527 1000 -11670 -5463 11072 19673 4885 -15756 -23689 -8376 13216 20682 5454 -10434 -10567
2540 -10567 5291 14764 4774 -15008 -21475 -6379 18015 23887 7202 -13121 -17284 22 12227
2553 12227 6987 -10922 -17737 -2541 18974 23908 5090 -18843 -22103 -4591 13345 11945 -4942
2566 -4942 -13620 -2527 16152 19667 1079 -20734 -23992 -3193 18422 17288 -357 -14301 -6928
2579 -6928 10451 15707 1126 -20014 -21288 -532 22284 21459 604 -15798 -12715 4296 13861
2592 13861 1713 -15713 -18361 2768 21540 21630 -1023 -21072 -17742 2360 16623 8551 -11020
2605 -11020 -14823 2081 19716 18245 -3478 -24537 -20036 2802 19376 13632 -6650 -14829 -2242
2618 -2242 15328 14813 -5599 -22850 -18009 6424 23669 16745 -4552 -17525 -7647 9566 13208
2631 13208 -3168 -18645 -14048 8452 24587 16446 -8015 -22042 -12853 8158 14959 494 -14381
2644 -14381 -11877 7657 22852 12902 -10434 -23492 -14670 7342 19207 7866 -9509 -12363 3463
2657 3463 18215 11827 -10841 -23823 -12218 11919 22148 10956 -9732 -16005 -1177 13587
2669 13587 9701 -8572 -19057 -8601 13843 23842 11201 -11967 -19855 -6379 11003 12500 -3427
2682 -3427 -15518 -8636 13637 22036 7545 -15049 -22730 -8569 11871 16390 652 -13136 -8005
2695 -8005 8966 16754 4965 -15168 -21700 -6591 15719 19994 4463 -12349 -12095 2622 13512
2708 13512 6066 -12901 -19228 -4613 17172 20723 5298 -13552 -16567 -2441 11747 7806 -7677
2721 -7677 -14642 -2320 16191 19281 3711 -16598 -19733 -3596 12824 12533 -2626 -12407 -3357
2734 -3357 11302 15107 1031 -17250 -19246 -930 15597 15623 -422 -11905 -7893 6324 11486
2747 11486 1014 -14930 -15682 1067 17709 16493 233 -14806 -12339 1861 9786 3367 -9015
2760 -9015 -11609 1673 16466 15308 -1236 -16471 -15657 345 12450 7411 -4071 -10046 -909
2773 -909 12053 12904 -1617 -17639 -16188 1726 15146 13011 -2303 -9012 -5297 8076 9132 -1915
2787 -1915 -14824 -11635 5093 16848 13632 -1388 -12962 -7930 3872 8501 636 -10026 -8589
2800 -8589 5009 16103 12339 -3504 -15936 -11677 1161 10575 4408 -5790 -6158 2807 12268 9883
2814 9883 -3574 -16534 -11281 4189 14223 9799 -2040 -7694 -2457 6339 5649 -4500 -14219 -10503
2828 -10503 5092 15541 11243 -3080 -11272 -6260 3602 6907 -1070 -9129 -7521 4215 15073
2841 15073 9667 -3984 -14589 -9613 2694 10002 3124 -5196 -6484 2353 10690 7776 -5672 -14929
2855 -14929 -9605 3376 12468 6993 -2721 -6831 -1456 7367 5158 -6587 -12838 -8114 6474 14617
2869 14617 9426 -3211 -9776 -6547 3878 5753 -1389 -8778 -5550 6786 13578 9197 -4780 -13157
2883 -13157 -8538 2482 8675 3736 -4750 -5974 4554 11071 6248 -6959 -14177 -9172 5184 11350
2897 11350 6750 -2174 -6091 369 6699 4870 -5064 -13477 -6937 5535 14569 9233 -5157 -9654
2911 -9654 -4603 4253 5444 -2331 -8535 -5552 6582 13828 8201 -5642 -13771 -6971 3316 8437
2925 8437 1482 -5940 -3692 5343 11391 4999 -6877 -14614 -7791 5553 12679 6911 -3735 -7925
2939 -7925 1575 8154 4294 -5159 -13216 -6509 7049 13344 7318 -5553 -10721 -3283 5556 5148 -3147
2954 -3147 -10644 -5007 8852 14534 6175 -7224 -13473 -5652 5187 8822 860 -7123 -4435 5717
2968 5717 11767 3830 -9053 -15429 -6641 7332 11828 4477 -5289 -5683 1902 8984 2688 -10181
2982 -10181 -14305 -4449 10462 13675 6292 -6753 -9118 -1496 6853 4862 -5128 -11375 -2998 10145
2996 10145 13943 4436 -8646 -13472 -4884 7413 8461 -1593 -7347 -3078 9407 12564 3789 -12596
3010 -12596 -14796 -4292 10251 11472 1492 -7658 -4185 4373 9479 1739 -10320 -12809 -2868 10890
3024 10890 14328 3146 -9508 -8994 1003 8047 3061 -6844 -10207 -270 12195 14210 2437 -11046
3038 -11046 -12958 -1826 8816 6605 -3387 -8805 -1625 10392 12138 695 -12739 -13045 -2003
3051 -2003 10048 9795 -449 -7412 -3283 7128 9569 617 -10568 -12974 -1306 12687 13122 587
3065 587 -9510 -7785 3325 9118 1417 -8596 -10461 153 13048 13318 -123 -12375 -10896 662
3079 662 9361 4459 -5555 -8781 950 12027 10959 -810 -13963 -12117 18 11087 8739 -2778
3093 -2778 -8062 -1821 8960 8504 -1883 -12865 -10917 2365 12358 10593 -1422 -10135 -6376 5433
3107 5433 7693 -1140 -11013 -9189 2932 14953 10826 -1880 -12513 -9013 3147 9124 2316 -6943
3121 -6943 -7239 1757 12930 10597 -4413 -14101 -10045 2944 12032 6866 -4910 -7918 29 10231
3135 10231 7145 -4979 -12862 -10618 5543 14849 8959 -4251 -9220 -2958 7076 6265 -3541 -11625
3149 -11625 -7890 6226 13650 8573 -5102 -11560 -6773 4949 7588 -167 -8532 -6349 5669 12640
3163 12640 7146 -7102 -13996 -8158 5612 10432 3958 -5392 -8104 2185 10294 6516 -6760 -13611
3177 -13611 -6953 6179 12941 6741 -5624 -9312 -892 8080 5827 -5436 -11520 -5031 7941 13759
3191 13759 6661 -6606 -12064 -4677 5944 7082 -2231 -9443 -4835 7318 12546 5453 -7443 -13169
3205 -13169 -5860 6860 9781 2401 -6269 -5616 4799 9815 3722 -8519 -14222 -5194 7431 12168
3219 12168 5016 -6100 -8298 1105 7984 3783 -6645 -11013 -3311 8735 13607 5025 -7214 -10982
3233 -10982 -2200 7200 5669 -3143 -9026 -3137 9085 12012 3778 -9563 -12778 -4416 7742 8030
3247 8030 -569 -7980 -3569 6102 9436 2317 -9519 -11657 -3756 8831 10690 2450 -7571 -6005
3261 -6005 2693 7542 1854 -8051 -11278 -1400 10255 11711 2135 -10034 -8802 -574 7460 4811
3275 4811 -5251 -8814 -1169 10234 12164 1556 -9867 -11447 -739 9075 6831 -1750 -6919 -2696
3289 -2696 7733 10855 292 -10782 -11631 -1218 11227 9761 -131 -7120 -4835 4171 9048 190
3303 190 -9261 -10259 -62 10265 10673 335 -8676 -7491 1695 7280 2454 -6350 -8087 1063 10327
3318 10327 10854 -372 -10474 -9093 -98 8184 6039 -2659 -6719 -811 9230 9251 -1381 -11203
3332 -11203 -9960 1103 10451 8516 -1773 -7958 -3918 5671 6793 -1134 -9849 -9110 3105 12067
3346 12067 8930 -2235 -10070 -6851 3533 8017 1468 -7991 -7462 1949 11743 9250 -2163 -11399
3360 -11399 -7881 2333 9025 3851 -4713 -5702 1291 8692 7233 -3591 -12344 -8908 2233 11596
3374 11596 7117 -3654 -7211 -2159 6796 6969 -2963 -10845 -7476 4155 11755 7745 -3206 -8988
3388 -8988 -4603 4511 5274 -788 -7426 -6628 3345 12656 7939 -4428 -11543 -6311 3317 9577 2504
3403 2504 -6000 -5625 1949 9742 6543 -4198 -11812 -7238 4807 10759 5249 -4058 -7664 -484 7445
3418 7445 5502 -4182 -10845 -6119 6124 11972 5280 -4838 -9321 -2653 5686 5113 -3080 -8216 -5454
3433 -5454 5674 11907 6766 -5560 -11217 -5230 5073 7396 12 -6971 -4536 4311 10333 3793
3447 3793 -6479 -11304 -5247 5506 10065 3607 -5097 -6381 1564 7848 4168 -5202 -11060 -4051
3461 -4051 6531 12038 4297 -5147 -8199 -1656 5735 5119 -3332 -9407 -3451 7253 11874 4226 -6821
3476 -6821 -10709 -2898 5988 5916 -1115 -7341 -3124 4861 10473 2891 -8680 -11596 -3898 6820 8505
3491 8505 2232 -5460 -4786 2224 9426 3377 -7981 -11071 -2595 8262 11315 2639 -6781 -7520 704
3506 704 6403 3651 -5130 -7826 -2280 9121 10799 3077 -8351 -9211 -630 7398 5820 -1907 -7372
3521 -7372 -1908 7243 8980 1742 -9007 -10985 -750 7083 8796 796 -7019 -3399 4011 8765
3535 8765 269 -8447 -10103 -1037 9161 10165 582 -7319 -6971 1501 6710 1444 -6845 -8521 -447
3550 -447 8861 9759 211 -9529 -8956 231 7981 4237 -4281 -6926 -957 8381 7782 -904 -8965 -9880
3566 -9880 -359 10265 6814 -2183 -7130 -1703 5640 8471 -162 -9230 -8982 921 10896 7990 -1286
3581 -1286 -8457 -5331 2949 7606 265 -7724 -8288 1550 10293 8832 -1910 -10032 -7463 2191 7335
3596 7335 2651 -5564 -7567 1226 9370 7956 -2239 -10797 -8074 1828 8577 5284 -4136 -7001 -592
3611 -592 7764 6041 -2855 -9858 -8022 3173 10151 7198 -2766 -8348 -3800 6315 6363 -947 -8157
3626 -8157 -6902 3285 11327 8617 -2860 -9517 -5914 5555 6146 605 -6666 -6110 2674 10078 7264
3641 7264 -4223 -11440 -7441 3928 9260 4134 -4282 -6737 845 8733 6973 -4272 -11017 -6688
3655 -6688 4316 11163 5468 -4920 -7060 -2003 5367 5934 -3209 -8186 -5981 4222 12168 5710
3669 5710 -4529 -9573 -4049 4429 7027 -1642 -6926 -4032 3487 9716 4904 -6389 -11879 -4765
3683 -4765 5009 9604 1742 -6088 -5611 1613 8853 4477 -5322 -10641 -3991 7364 10389 4453 -6828
3698 -6828 -6530 -733 6911 5457 -4375 -9405 -4124 5477 11128 3698 -5948 -8762 -1583 6263 5773
3713 5773 -3649 -7588 -3660 6371 10125 2731 -7159 -10457 -3667 5747 7063 535 -6394 -4254 4641
3728 4641 8741 3023 -7094 -10833 -3330 8230 9742 1103 -6392 -6228 1446 7968 2695 -5826 -8178
3743 -8178 -1849 8619 10355 1923 -7335 -8530 649 6859 4213 -2695 -7642 -1778 7994 9536 1300
3758 1300 -8728 -9668 -1248 7826 6776 -1514 -7331 -2691 5290 8180 1383 -8620 -8961 -383 9062
3773 9062 8087 -576 -6686 -4380 3371 6446 1272 -7206 -8537 12 9457 10281 175 -7957 -6658
3788 -6658 2793 6058 2753 -5389 -7510 -423 8179 8643 -531 -8946 -9020 197 7791 5818 -3291 -5990
3804 -5990 -1047 6300 8229 -808 -9388 -8138 896 8401 7043 -1701 -6909 -2827 4704 6135 -264
3819 -264 -8535 -6873 2300 9778 6472 -1545 -8110 -5356 3108 6362 1602 -6264 -6429 1845 10014
3834 10014 7890 -1664 -9284 -6966 1507 7010 2407 -4489 -6181 -398 7532 6539 -3227 -9671 -7388
3849 -7388 2063 7710 5416 -4001 -7372 -1709 5570 6487 -1897 -8839 -6417 3683 9905 6238 -2906
3864 -2906 -9077 -3595 3998 6730 -275 -7765 -5159 2929 10474 7237 -3674 -9622 -4092 3259 8204
3879 8204 2443 -5635 -4377 2418 9216 5540 -4147 -9554 -5873 4486 7608 4427 -3726 -6901 -630
3894 -630 7192 4979 -3394 -9705 -5428 4333 10328 4569 -5049 -7306 -2294 4498 6104 -822 -6559
3909 -6559 -4167 4342 9620 4724 -5169 -8939 -3580 4644 6010 995 -5836 -3676 2997 8438 3310
3924 3310 -5742 -10168 -2807 6202 8513 3743 -4907 -5913 1385 7542 3929 -4443 -9814 -3210 6474
3939 6474 9255 3204 -4956 -7625 -1174 5853 4657 -3538 -7986 -3801 6351 9119 2959 -6329 -9400
3954 -9400 -1801 6360 5219 -1056 -5617 -3695 5538 9036 3102 -6899 -9250 -3155 6122 8493 939
3969 939 -6043 -4875 2361 6539 1909 -6282 -9196 -2540 6930 9540 1674 -5988 -6231 623 6415
3984 6415 3258 -3730 -8264 -1777 6683 8963 1510 -7637 -8033 -1324 7633 4791 -3362 -6389 -3069
3999 -3069 6013 7752 281 -7807 -8877 -602 6633 6452 -414 -6333 -3181 3436 7228 1011 -7899
4014 -7899 -8707 -892 8825 7864 429 -7496 -5799 1915 6997 2215 -5555 -7727 495 8376 9539
4029 9539 180 -8257 -7211 775 6439 3735 -4910 -6401 -380 6310 7481 -195 -8735 -7692 902
4044 902 7341 6639 -1370 -6593 -1429 5293 6902 -540 -8327 -6600 1455 8790 5790 -2240 -7156
4059 -7156 -4987 3831 6481 370 -7485 -6154 2232 8495 6561 -2153 -8816 -6724 3468 6433 3239
4074 3239 -5338 -6556 1931 7648 6155 -1951 -9062 -6971 1966 7842 4357 -4072 -6432 -723 6414
4089 6414 5704 -3108 -9240 -6078 2247 8799 6123 -2315 -7563 -3729 4631 6436 -1562 -6905 -5802
4104 -5802 2991 9871 7028 -3487 -8701 -4452 3656 5847 1011 -5714 -4840 2214 9224 4737 -3728
4119 -3728 -8983 -4758 3383 7062 3155 -3544 -4555 794 6493 4861 -3049 -9160 -4676 4397 9248
4134 9248 4030 -5369 -6578 -800 4997 4466 -2239 -7776 -4118 4688 9569 4538 -5456 -8525 -1857
4149 -1857 5726 5911 -434 -5311 -3623 4254 9286 3904 -5738 -9211 -3272 5552 6955 1642 -4442
4164 -4442 -5148 2722 7383 4187 -5660 -9072 -2248 4925 8618 1711 -4703 -6651 -194 5754 3002
4179 3002 -4556 -8602 -4156 4985 8997 2862 -5411 -8084 -1157 4626 5017 -1638 -6648 -2070 5236
4194 5236 7699 1979 -5755 -7545 -1567 5989 7424 -662 -6149 -3802 3738 7606 2394 -6662 -8859
4209 -8859 -2027 6869 6942 690 -6681 -4941 2498 5970 2183 -4926 -7922 -1333 6543 8632 700
4224 700 -6077 -8025 506 6886 3170 -4030 -7371 -1256 6007 8417 886 -7155 -8021 -91 6656
4239 6656 5078 -2540 -5195 -2323 3787 6533 90 -7746 -7023 290 7366 6769 -1551 -6866 -4249
4254 -4249 3117 7299 1077 -6851 -8110 668 8136 8004 -1782 -8161 -5530 2356 6849 2629 -6060
4269 -6060 -6099 54 7386 6805 -1216 -8116 -6789 2443 7053 4581 -2773 -5561 -1474 6110 6972 -2287
4285 -2287 -7872 -7005 2328 9143 5462 -2644 -7841 -2343 3387 4804 -709 -7478 -6088 2208 8592
4300 8592 6066 -2641 -7459 -4593 2519 6404 375 -6302 -5250 1128 7611 6268 -2666 -8440 -5765
4315 -5765 3186 7170 2142 -3803 -6113 170 6782 5380 -3984 -8486 -5701 2569 8483 3715 -3201
4330 -3201 -7235 -1563 5229 5761 -2179 -8236 -4519 3837 8369 4913 -3915 -7790 -3211 4294 6439
4345 6439 -1119 -6126 -5243 2940 9015 5157 -4250 -8314 -3635 3978 6319 204 -5497 -4244 1634
4360 1634 7034 3604 -4422 -9303 -4276 3956 7467 2656 -4646 -5142 1033 4894 3765 -2996 -7775
4375 -7775 -3473 4475 7958 2631 -3186 -6910 -722 4277 4953 -2042 -5611 -3444 4412 8157 2613
4390 2613 -4759 -7680 -2102 4941 5306 -496 -5561 -4141 3410 6989 2868 -6456 -6798 -3350 4875
4405 4875 6516 384 -5048 -3282 1815 5792 2592 -4128 -7329 -1031 5291 8480 1595 -6270 -5165
4420 -5165 297 5358 2438 -2872 -6487 -1958 4878 6892 915 -5266 -5828 -1585 5034 4481 -971
4435 -971 -4949 -2937 3734 5902 1619 -4941 -7408 -737 5754 5932 636 -5662 -2507 2207 5004
4450 5004 1275 -5108 -7663 -964 6564 6214 -430 -4946 -4779 961 5893 2237 -3877 -6512 -1013
4465 -1013 5518 7558 180 -5843 -6270 348 4423 4361 -1855 -4855 -1750 3795 6746 147 -5261 -6102
4481 -6102 235 5791 4907 -1041 -5439 -3697 2428 5269 913 -6255 -5685 824 5887 6852 -563 -4685
4497 -4685 -4097 951 5215 1110 -4348 -5960 -513 6314 5531 443 -5960 -6183 1086 5880 1797 -1779
4513 -1779 -5133 -1149 5165 5563 -279 -5154 -6752 935 6053 4764 -1714 -4960 -2987 3312 5393
4528 5393 -1160 -6618 -5282 140 6751 6337 -595 -5884 -4920 3492 6549 686 -3882 -5071 102
4543 102 7454 6006 -1044 -6764 -4941 1096 5487 2579 -3469 -5497 -279 6331 4903 -1251 -6751
4558 -6751 -5175 1556 5921 4877 -2546 -5513 -1903 4644 4941 -664 -6075 -5666 1579 6449 4635
4573 4635 -1546 -6935 -2607 3149 4936 484 -4803 -3695 2086 7363 5045 -2557 -7426 -4786 3819
4588 3819 5829 2085 -3606 -4199 1583 6700 4935 -2441 -8766 -4867 2742 7727 3181 -3921 -6079
4603 -6079 -1171 6156 4521 -1569 -8159 -5773 3794 9058 3648 -2998 -6484 -1154 5021 5102 -592
4618 -592 -6739 -4748 2493 7951 3847 -3656 -8112 -2679 4485 6335 290 -6705 -2784 1357 6903
4633 6903 4562 -5389 -7443 -2601 4809 6215 1343 -5181 -6305 1695 6241 4761 -3492 -8116 -3216
4648 -3216 4919 7273 2683 -5407 -7008 492 7107 4503 -2532 -6568 -3086 4721 8795 2641 -5676
4663 -5676 -8335 -809 5775 5994 -1571 -6860 -3050 3695 8046 2569 -6646 -8270 -994 5687 6397
4678 6397 -172 -6545 -3924 4367 7438 2969 -6073 -8050 -1568 6996 7389 436 -6915 -5931 1610
4693 1610 6923 3500 -4453 -7422 -851 7241 7144 1046 -6372 -6697 1030 7186 4216 -3116 -6648 -1140
4709 -1140 6157 7527 -490 -6545 -7051 552 7917 5881 -2820 -7178 -2747 5545 6369 963 -6373
4724 -6373 -7582 -49 8834 5970 -2956 -7312 -4467 3908 6572 1510 -6876 -6499 1241 8525 6388
4739 6388 -1616 -6490 -4097 2661 6645 1384 -5454 -7006 831 6536 6009 -2153 -7716 -4811 2172
4754 2172 7478 3282 -3462 -5914 -314 6163 5765 -2791 -7587 -4560 3953 7177 3851 -3700 -7096
4769 -7096 -2310 5722 6386 -1101 -6336 -4998 3471 9243 4915 -3722 -8230 -2166 4205 5460 -312
4784 -312 -6436 -5036 3029 7500 4046 -4825 -8258 -3069 4200 5920 520 -5490 -5149 1434 7241
4799 7241 3920 -3468 -7279 -4044 4466 6697 2362 -4703 -5344 983 5366 3512 -2951 -7396 -1914
4814 -1914 4792 7960 1564 -4934 -5368 432 5500 4636 -1661 -5278 -3023 5119 6637 1785 -4855
4829 -4855 -6334 -2126 5065 5105 -695 -4441 -3192 3107 5013 1850 -4179 -7201 -1119 4950 5839 13
4845 13 -5262 -4062 839 5044 1294 -4852 -6094 -611 5807 5244 946 -4450 -3951 1115 5195 2629
4861 2629 -3389 -4412 -580 5009 5334 288 -4726 -4474 714 4680 3387 -2529 -3839 -1974 4281
4876 4281 4732 326 -5265 -5125 290 4242 4541 -1147 -5506 -2341 1811 3968 194 -4317 -4733 332
4892 332 4568 4429 -464 -4427 -2338 1649 4511 1269 -3103 -4332 -167 4169 4929 -322 -4665 -4025
4908 -4025 -231 3972 2503 -2492 -3149 1086 2614 3463 -1495 -4491 -4045 1123 4062 3521 -982 -4704
4924 -4704 -1126 2129 3424 250 -3554 -3210 1342 4146 3951 -456 -3553 -3017 2073 3425 588 -2989
4940 -2989 -3518 660 4281 3003 -141 -3932 -3217 107 2755 2248 -1970 -2964 -106 4167 2519 120
4956 120 -3808 -3587 624 3288 3019 -677 -2638 -2353 1922 2828 -63 -3326 -3220 -244 3889 2427
4972 2427 -1243 -3131 -2093 2099 1874 246 -2395 -2709 671 3131 2807 -118 -2936 -3374 -5 2629
4988 2629 1733 -1758 -3312 -254 2724 3044 -573 -3111 -3162 568 3591 3450 -1352 -2373 -1576 2516
5004 2516 3346 254 -2770 -3256 1622 3771 3926 -1309 -3797 -2651 1816 2491 559 -3491 -2388 206
5020 206 3798 4037 153 -3031 -4022 683 2728 1424 -1983 -3024 -474 3255 2723 -558 -4364 -3326
5036 -3326 1642 5130 1847 -1492 -3791 -1776 2143 3090 -516 -3899 -3928 806 4932 4380 -798 -2907
5052 -2907 -2007 2567 3501 1142 -2596 -3712 708 4637 4104 -1440 -4912 -3043 2893 4050 1090 -3076
5068 -3076 -3811 255 4671 2826 -1639 -5164 -3999 1575 3350 1781 -2808 -4253 -342 3779 3864 -1456
5084 -1456 -4421 -2913 2723 5608 3043 -2890 -4740 -1274 2849 3770 -223 -4216 -2461 2043 5529
5099 5529 2098 -3692 -4974 -1560 2861 4711 -489 -4085 -3621 2310 4757 2307 -3443 -5604 -2736
5114 -2736 3346 4773 240 -3530 -3803 996 4505 2920 -2988 -5391 -2076 3380 6139 1533 -2762
5129 -2762 -4901 526 4725 2918 -1922 -4652 -1771 3439 6052 1633 -4414 -4747 -386 3397 3786
5144 3786 -652 -4308 -2449 3233 4571 1791 -4546 -5515 -1805 4475 3037 18 -3958 -2737 2667
5159 2667 3891 2494 -3214 -4416 -1131 4162 4256 499 -4742 -4174 1244 4693 1468 -3705 -6064 -824
5175 -824 4804 5110 -46 -4293 -4915 1184 4786 2371 -3035 -5093 -193 4112 4577 -75 -5427 -4269
5191 -4269 190 4902 3711 -1467 -4684 -1507 3408 3903 197 -5196 -4009 1363 5017 3879 -2047
5206 -2047 -4542 -2481 1952 4390 1264 -4351 -4578 1003 4965 3499 -597 -6134 -3788 1455 4683
5221 4683 1734 -3619 -3789 378 4632 4243 -1842 -5637 -3327 1935 4929 2800 -1882 -4671 -17
5236 -17 3883 3413 -448 -5688 -3726 1889 4173 2198 -2545 -3386 -1431 3273 3765 -1509 -4621 -3383
5252 -3383 2668 5859 1625 -2075 -5289 -1088 3554 4237 252 -4239 -2287 2120 4712 2584 -2612
5267 -2612 -5586 -2388 2402 4978 620 -4377 -3510 1243 5384 2346 -2556 -4281 -2324 3083 5392
5282 5392 2110 -3059 -4113 -685 3571 3224 -1919 -4571 -2575 1646 5378 1559 -3432 -5087 -443
5297 -443 3961 3244 -1369 -4662 -2322 1827 3562 2319 -3271 -4776 -1264 3497 3777 -229 -3863 -2874
5313 -2874 1907 5122 1262 -2966 -4114 -1001 3343 4217 590 -3174 -3190 1860 4307 2988 -1936 -4617
5329 -4617 -1051 4019 4106 755 -4287 -2949 680 3173 2825 -1847 -3437 -1876 3381 4400 469 -3432
5345 -3432 -4091 62 3383 2577 -826 -3683 -1321 2362 3679 794 -3273 -5089 -270 3162 3396 -1702
5361 -1702 -3195 -2615 1347 4065 29 -2711 -3576 -233 3974 3725 -532 -3223 -2322 1069 3173 1786
5377 1786 -2191 -3680 551 3034 3194 -1213 -4718 -3527 466 3868 1322 -1810 -3766 -932 2418
5392 2418 2503 -271 -3698 -2926 424 3607 1754 -1304 -3362 -1884 1858 2854 -94 -3114 -2875 239
5408 239 3894 2845 -392 -3367 -1881 1812 3081 250 -2707 -2477 -76 2389 2663 -807 -3554 -3193
5424 -3193 1566 2338 1676 -3050 -3081 473 2804 2902 -665 -2625 -2316 284 3526 2945 -1351 -2954 -2323
5441 -2323 2476 3298 15 -3168 -2638 706 4172 1894 -1593 -3422 -1186 1402 2482 94 -2303
5456 -2303 -1487 230 3292 2328 -1666 -2943 -1572 2396 3740 370 -1958 -2591 -35 2933 1859 -1512
5472 -1512 -3970 -2162 2296 2904 1240 -1816 -3145 -53 2810 2201 -1390 -2733 -1857 1392 3456 1937
5488 1937 -1867 -4200 -1015 1741 3516 -36 -3223 -1467 867 3235 1694 -1806 -4402 -2255 2808
5503 2808 2694 1024 -2795 -2325 939 3051 972 -2005 -4212 -1762 3281 3356 288 -2689 -2529 -603
5519 -603 3429 2465 -851 -4091 -1824 2471 4196 1329 -2172 -2717 188 2627 1532 -593 -2751 -2309
5535 -2309 1762 3350 1527 -1652 -4346 -742 2238 2049 -51 -2695 -1921 475 2487 1101 -2375
5550 -2375 -3988 -598 1736 3576 -159 -2405 -3023 1252 2781 2683 -941 -2390 -1271 2509 3241 517
5566 517 -2720 -2133 -227 2143 2851 -2689 -2383 -1574 2600 3420 9 -2313 -3252 596 3026 1927 -823
5583 -823 -2901 -267 1154 3294 1046 -2437 -2710 -687 2386 2993 -677 -3475 -2011 1295 3411 833
5599 833 -1468 -2765 -638 2536 2741 36 -3079 -2400 -94 3307 1631 -1148 -2012 -473 2390 2012
5615 2012 -32 -3488 -2558 966 3263 2185 -2119 -2487 -1150 2529 3336 -596 -2495 -2731 487 3712
5631 3712 2422 -798 -2876 -1554 1584 3439 388 -3123 -2554 289 3336 2867 -894 -2880 -1883 855
5647 855 3594 100 -3413 -3208 237 3175 2400 -142 -2762 -3286 1834 2620 961 -1752 -3073 -109
5663 -109 3029 2798 -891 -3147 -1770 1179 2966 1804 -2030 -2867 -423 1704 2249 473 -3390 -3300
5679 -3300 591 3201 1486 -1661 -3487 -958 1780 2795 202 -1989 -2248 218 3696 1893 -1186
5694 -1186 -3272 -1231 1649 3183 838 -1898 -2522 534 2350 2936 -348 -2783 -1836 1849 2827 688
5710 688 -2528 -1437 -392 2162 1882 -943 -3756 -2509 2182 3175 1683 -1089 -3682 -1066 1587 1980
5726 1980 -872 -3364 -1993 1317 2530 2232 -1880 -3423 -843 1659 1715 -564 -1321 -2010 1669 3281
5742 3281 1692 -2320 -3071 -1208 2376 2710 38 -2606 -2180 923 3545 2066 -1531 -2966 -886 2766
5758 2766 2768 454 -2122 -2639 169 2055 1623 -1089 -2793 -924 1718 3701 1250 -1636 -2714 13
5774 13 2327 2160 -1273 -2985 -1178 862 2921 871 -1886 -2808 -759 1941 2844 -929 -1796 -2177 413
5791 413 3221 1025 -2460 -2717 -539 1979 1954 585 -2658 -1188 952 2408 1303 -1080 -2565 265
5807 265 2548 2685 1120 -1716 -2109 603 3084 1252 -724 -2536 -1508 1737 3596 1416 -3298 -2976
5823 -2976 -254 2619 2572 12 -2532 -1762 1459 2342 436 -1324 -2645 433 1215 1416 -1111 -2818
5839 -2818 -1463 1971 2572 1112 -2075 -2923 -109 2558 2606 -586 -1639 -2332 452 1525 1238 -1853
5855 -1853 -2645 671 2242 2110 700 -2121 -3209 667 1790 1498 -859 -3083 25 2046 3515 -223
5871 -223 -3478 -2627 420 2660 2492 -1050 -2285 -973 468 1869 -468 -2628 -1376 224 2467 2715
5887 2715 -653 -2415 -991 382 2682 1138 -1376 -2655 130 2864 2167 -908 -3142 -1974 885
5902 885 2162 646 -705 -2361 -295 2465 1286 -853 -2060 -2021 1027 3836 1376 -2213 -2506 2
5918 2 2386 1124 -664 -2683 -2405 949 2666 2404 -232 -2423 -1412 1815 2372 21 -1832 -1923 -122
5935 -122 2158 1659 -152 -2155 -1871 633 3346 614 -939 -2130 222 1788 344 -1087 -1790 -1156
5951 -1156 1931 1529 1021 -1875 -2326 888 1789 1928 -1371 -2564 -1132 1753 3585 1740 -1873 -2767
5967 -2767 -525 2131 1205 -203 -2417 -1136 1808 2473 973 -1368 -3312 -1156 1352 2395 84
5982 84 -2325 -1868 -106 2655 1189 -1994 -3341 -706 947 2508 461 -2192 -1262 15 2993 1092
5998 1092 -1197 -1258 -777 2087 2174 432 -2294 -2238 138 1984 1202 -1043 -2357 -653 1698 2520 1474
6015 1474 -1606 -2087 -457 1729 995 -976 -2086 -616 1434 1226 -22 -1937 -2989 -107 1783 1854
6031 1854 -84 -2030 -1327 1730 1982 1370 -1739 -2658 -83 2434 1747 -57 -595 -2043 901 2552
6047 2552 638 -1515 -2037 -69 1722 2146 531 -1428 -2558 256 734 2146 -1115 -1857 -508 1442
6063 1442 3196 -111 -2008 -1830 -42 2776 2597 -1136 -880 -174 1513 1941 837 -1861 -1305 -430 1505
6080 1505 1261 -1158 -1298 -2346 993 1378 902 -1423 -1955 -392 1999 2771 -1085 -2169 -758 400
6096 400 1755 621 -1416 -2133 94 1156 1273 198 -1591 -788 1129 1574 2031 -1346 -1905 305 1130
6113 1130 1700 -283 -2065 -1735 -119 1680 2501 -722 -3169 -374 974 1109 415 -1464 -2651 228
6129 228 1744 1271 -954 -1838 -1981 809 1829 723 -1099 -1652 -310 1890 1229 -1093 -2551 -1800 734
6146 734 1759 1097 -1095 -959 235 2012 1794 -38 -2206 -2007 699 1266 618 -1687 -1735 -1105 1182
6163 1182 2403 -940 -2081 -1692 882 1854 1387 -1532 -1947 -835 1113 1402 -51 -897 -1717 -758 1879
6180 1879 1214 -442 -2885 192 1406 1464 322 -420 -1516 -480 1550 604 -78 -2879 -502 608
6196 608 1597 671 -989 -2152 198 1193 1632 951 -1809 -1294 1385 2468 476 -1482 -2082 -742 1367
6213 1367 1827 242 -1545 -1429 668 1749 1021 -810 -1754 -734 1013 1317 106 -2604 -1592 304
6229 304 1206 1152 -1129 -2071 -153 1591 1182 443 -444 -1700 -385 1404 1109 -79 -1614 -438 1335
6246 1335 1221 617 -1677 -1887 -259 1653 2572 -244 -1448 -904 913 2118 338 -1184 -1020 -77 2160
6263 2160 838 -47 -1751 -1294 387 1442 1795 -2187 -1299 -657 1222 1400 577 -1264 -1708 -152 1424
6280 1424 1352 -1232 -1221 -1382 1520 1827 186 -1441 -1505 782 1813 712 -1158 -1502 -165 409 3027
6297 3027 38 -1417 -1434 -376 1783 1228 -1098 -1248 -953 1083 1144 690 -861 -1457 -144 1212 1108
6314 1108 -823 -1865 -603 751 2126 937 -471 -833 -188 1350 2511 -847 -2712 -587 581
6329 581 1916 1174 -1649 -1132 286 224 1677 -359 -1477 -1827 -359 1847 1314 -573 -1699 -336 1787
6346 1787 2119 704 -851 -1610 568 1159 1237 -654 -2165 -2124 1286 1050 -217 -1115 -1110 476 1953 935
6364 935 155 -2910 -1596 1759 1406 -299 -548 -558 -923 1815 925 -738 -2027 -890 47 1475 663
6381 663 -649 -1715 -244 1077 731 -44 -1725 -1798 175 2263 448 -1191 -1609 -765 1004 1885 -1564
6398 -1564 -649 -1071 223 1322 1091 -1049 -282 -61 724 453 -664 -1950 -505 904 1093 1009 -634
6415 -634 -1630 -156 580 1125 704 -1023 -1498 707 2441 1131 -618 -1969 -1404 831 1386 -119 -756
6432 -756 -1267 -294 1623 1175 -501 -1791 -1432 1547 1801 414 -1096 -1448 -1068 823 1294 -944 -1582
6449 -1582 -737 474 1636 555 -169 -578 -1070 391 854 117 -902 -1983 -275 1876 809 -517
6465 -517 -1381 375 1897 1602 625 144 -1312 206 378 617 -305 -777 -498 941 2558 -698 -760 -1512
6483 -1512 370 1441 932 -811 -1806 -1211 837 2474 1083 -1026 -1508 -1023 1296 2123 619 -1381
6499 -1381 -567 1299 552 1274 -1149 -1015 459 365 1955 -32 -112 -522 130 1559 390 -745 -1741 -517
6517 -517 439 2293 -560 -714 -1773 87 1693 1975 -1069 -2585 -242 351 1464 -460 -1270 -2691
6533 -2691 202 708 935 -617 -1211 -620 -458 281 403 -1827 -785 677 701 1141 -546 -2496 -522
6550 -522 472 2051 239 -797 -175 559 1147 1343 864 -2217 -1320 -39 1438 -169 -918 -1655 -41
6567 -41 1610 1988 384 -1420 -547 253 1022 -173 -1316 -1003 -476 669 676 960 -2200 -1789 -134 1162
6585 1162 1080 -475 -837 -1395 1494 991 725 -1682 -1218 588 1150 1306 253 -2026 -495 1059 665
6602 665 690 -1133 -759 -30 1331 1355 -405 -1211 -226 102 1044 578 -697 -902 52 352 1534 683 -1728
6621 -1728 -1458 112 806 578 384 -1410 -147 702 1829 -420 31 -815 -484 801 419 -608 -2339
6638 -2339 -1276 909 1598 362 -1409 -647 -1134 906 599 -882 -874 -190 -117 1093 -456 -1432 -1638 550
6656 550 935 707 -264 -2110 -974 181 1342 948 -1202 -928 619 1149 -57 28 -811 -636 568 433
6674 433 1177 -776 -1043 -616 683 800 -518 -991 -1383 385 875 772 -301 -45 -535 852 918 901 -233
6693 -233 -563 -602 979 1189 -363 -727 -774 495 632 464 -1493 -1637 -1049 1525 889 -477 -1338 -1137 54
6712 54 1220 761 -809 -1329 456 1090 1237 -206 -1558 -277 -386 1163 639 -1088 -970 -43 1180
6729 1180 464 -686 -1076 -1044 630 1415 829 -882 -1427 -323 979 820 512 -825 -1140 387 1513
6746 1513 1549 -1108 -746 -892 1303 801 272 -1194 -820 -787 260 1215 -951 -1266 82 999 927 -262
6764 -262 -546 -1782 -770 1622 47 193 -909 -360 -301 469 -1410 -1482 -1083 340 258 750 -548 -905
6782 -905 -1180 896 545 -72 -789 -1558 -76 591 1020 255 -1376 -458 -893 1316 497 -737 -402 -83
6800 -83 1411 1441 94 -722 -1313 109 1662 757 -361 -673 -1338 719 1800 139 -1157 -1626 -204
6817 -204 575 514 -548 -802 -949 734 1531 115 -1701 -396 -213 528 625 -615 -1148 -1409 215 -69
6835 -69 -630 -1239 -161 139 1469 1129 -458 -294 -1581 498 906 57 -775 -2016 13 620 367 95
6853 95 -1045 -983 -20 1179 1008 -1041 -1412 -187 628 437 212 -1164 -847 358 144 754 -477 -1911
6871 -1911 -608 1031 1550 -619 -1068 -622 679 1638 28 -2 -1552 -700 959 578 101 -89 -1373
6888 -1373 67 1361 1503 -1052 -1120 -51 362 818 506 -881 -765 -179 598 529 -1112 -764 128 1409
6906 1409 917 486 -358 -1468 198 1224 1113 -11 -703 -1160 842 1434 1026 -841 -573 -76 415 609
6924 609 -486 -342 -452 958 1604 173 -1562 -735 -1048 910 -105 524 -229 158 -669 148 819 -516
6942 -516 26 -1199 470 523 406 291 -774 -230 1249 603 -520 -779 -1032 1002 2229 481 -432 -1242
6960 -1242 -7 517 1928 -146 -878 -275 1333 673 205 -17 -1778 -1440 826 1182 578 -2017 750
6977 750 638 1143 1167 115 -907 -160 1159 722 82 -874 -481 397 1018 -204 -502 -1949 -1 905
6995 905 1584 340 -60 -1966 399 861 -12 -484 -833 66 1456 -63 -326 -654 -683 392 916 943 1253
7014 1253 451 -1158 -84 1504 106 78 -25 -1113 186 1528 531 -780 -673 -150 1123 -245 -358
7031 -358 -530 39 953 248 561 548 -541 694 30 816 -911 -741 -96 -346 1291 -479 -830 -686 -262
7050 -262 -270 937 -149 -1167 110 774 1164 424 -352 195 -607 1237 902 -343 -786 -6 569 1343 1271
7069 1271 -894 -866 -688 817 400 253 -299 -1128 997 1321 -103 -1093 -348 -1077 615 391 -560 -467 -769
7088 -769 -711 971 446 -144 796 -17 -119 1004 -990 -188 -64 -1 -178 1289 800 -1679 -249 380 -83
7107 -83 668 -879 -793 -254 105 740 603 -292 -596 -1 1453 920 49 -146 503 788 219 -519 -1032 -764
7127 -764 -425 521 -240 -226 -1189 -154 1334 984 364 -1207 -1008 -781 458 659 -550 -781 -451 703
7145 703 1456 293 -794 -58 -71 1428 930 -100 -149 -71 270 105 564 101 -1304 -485 1112 1065 512
7164 512 -963 -1178 1166 1398 465 -710 -834 17 147 551 341 -272 -889 476 587 -100 922 -1107
7182 -1107 281 593 -64 -330 -746 -785 794 696 643 -1111 674 -525 315 734 -145 -1001 -1191 199 -601
7201 -601 1160 -333 -539 -1053 398 846 -420 -853 -572 -603 549 187 -863 10 -275 298 1446 843
7219 843 -311 -1223 -1172 401 206 -903 -1436 -1285 602 402 -356 -983 -713 -284 1147 1547 -1313 -605
7237 -605 -1031 -651 998 416 -1440 -1691 -516 1411 1721 278 -267 -481 787 -155 1284 418 -2353
7254 -2353 -1328 692 1031 280 -577 -717 -204 891 1456 292 -1598 -1076 1124 1446 655 -1279 -1558
7271 -1558 -463 413 930 -249 -1227 -47 709 1664 909 -713 -991 690 1970 -59 -758 -1209 -817
$$ [...]
8191B81
##END NTUPLES=NMR FID
##END=
