##TITLE=1H_SAM_30_TD-Py
 Py, 108 sc, 
 26.11.2020
##JCAMPDX= 6.0         $$ Bruker NMR JCAMP-DX V2.0
##DATA TYPE= NMR FID
##DATA CLASS= NTUPLES
##ORIGIN= UXNMR, Bruker Analytische Messtechnik GmbH
##OWNER= root
$$ XWIN-NMR		Version 3.5
$$ Thu Nov 26 12:52:41 2020 Russian Standard Time (UT+4h)  she@DPX200
##.OBSERVE FREQUENCY= 200.1315066352
##.OBSERVE NUCLEUS= ^1H
##.DELAY= (6, 6)
##.ACQUISITION MODE= SIMULTANEOUS
##.ACQUISITION SCHEME= undefined
##.AVERAGES= 108
##.DIGITISER RES= 18
##SPECTROMETER/DATA SYSTEM= spect
##.PULSE SEQUENCE= zg30
##.SOLVENT NAME= Pyr
##.SHIFT REFERENCE= (INTERNAL, Pyr, 0, 15.7039)
##AUDIT TRAIL= $$ (NUMBER, WHEN, WHO, WHERE, WHAT)
$$ ##TITLE= Audit trail, XWIN-NMR		Version 3.5
$$ ##JCAMPDX= 5.01
$$ ##ORIGIN= Bruker BioSpin GmbH
$$ ##OWNER= she
$$ F:/spectra/data/she/nmr/H-F/1/audita.txt
$$ ##AUDIT TRAIL=  $$ (NUMBER, WHEN, WHO, WHERE, WHAT)
(   1,<2020-11-26 12:51:30.28 +0400>,<she>,<DPX200>,
      <continue with go, POWCHK disabled, PULCHK disabled
       configuration hash MD5:
       00 E9 B6 7A A2 85 ED C7 34 08 36 98 17 FE 4E 26
       data hash MD5: 16K
       AA 62 E3 73 BC 87 A2 1E B3 1B E3 DD 95 F9 CC FE>)
$$ ##END=
$$ 
$$ hash MD5
$$ BC E9 98 B5 93 2B CB 2A 9E B1 71 6D 40 69 05 93
##$RELAX= 
##$RELAX= 
##$RELAX= 
##$RELAX= 
##$RELAX= 
##$RELAX= 
$$ Bruker specific parameters
$$ --------------------------
##$DU= <F:/spectra>
##$EXPNO= 1
##$NAME= <H-F>
##$PROCNO= 1
##$TYPE= <nmr>
##$USER= <she>
##$AMP= (0..31)
100 100 100 100 100 100 100 100 100 100 100 100 100 100 100 100 100 100 
100 100 100 100 100 100 100 100 100 100 100 100 100 100 
##$AQSEQ= 0
##$AQ_mod= 1
##$AUNM= <au_zg>
##$AUTOPOS= <>
##$BF1= 200.13
##$BF2= 200.13
##$BF3= 200.13
##$BF4= 200.13
##$BF5= 200.13
##$BF6= 200.13
##$BF7= 200.13
##$BF8= 200.13
##$BYTORDA= 1
##$CFDGTYP= 0
##$CFRGTYP= 5
##$CHEMSTR= <none>
##$CNST= (0..31)
1 1 145 1 1 1 1 1 1 1 1 1 1 1 1 1 1 1 1 1 1 1 1 1 1 1 1 1 1 1 1 1 
##$CPDPRG= <>
##$CPDPRG1= <>
##$CPDPRG2= <>
##$CPDPRG3= <>
##$CPDPRG4= <mlev>
##$CPDPRG5= <mlev>
##$CPDPRG6= <mlev>
##$CPDPRG7= <mlev>
##$CPDPRG8= <mlev>
##$CPDPRGB= <>
##$CPDPRGT= <>
##$D= (0..31)
0 1.2 0 0 0 0 0 0 0 0.06 0 0.03 0 0 0 0 0.0002 0 0 0 0 0 0 0 0 0 0 0 0 
0 0 0 
##$DATE= 1606380249
##$DBL= (0..7)
120 120 120 120 120 120 120 120 
##$DBP= (0..7)
150 150 150 150 150 150 150 150 
##$DBP07= 0
##$DBPNAM0= <>
##$DBPNAM1= <>
##$DBPNAM2= <>
##$DBPNAM3= <>
##$DBPNAM4= <>
##$DBPNAM5= <>
##$DBPNAM6= <>
##$DBPNAM7= <>
##$DBPOAL= (0..7)
0.5 0.5 0.5 0.5 0.5 0.5 0.5 0.5 
##$DBPOFFS= (0..7)
0 0 0 0 0 0 0 0 
##$DE= 6
##$DECBNUC= <off>
##$DECIM= 32
##$DECNUC= <off>
##$DECSTAT= 4
##$DIGMOD= 1
##$DIGTYP= 9
##$DL= (0..7)
0 120 120 120 120 120 120 120 
##$DP= (0..7)
150 150 150 150 150 150 150 150 
##$DP07= 0
##$DPNAME0= <>
##$DPNAME1= <>
##$DPNAME2= <>
##$DPNAME3= <>
##$DPNAME4= <>
##$DPNAME5= <>
##$DPNAME6= <>
##$DPNAME7= <>
##$DPOAL= (0..7)
0.5 0.5 0.5 0.5 0.5 0.5 0.5 0.5 
##$DPOFFS= (0..7)
0 0 0 0 0 0 0 0 
##$DQDMODE= 0
##$DR= 18
##$DS= 0
$$ [...]
##$SUBNAM2= <"">
##$SUBNAM3= <"">
##$SUBNAM4= <"">
##$SUBNAM5= <"">
##$SUBNAM6= <"">
##$SUBNAM7= <"">
##$SUBNAM8= <"">
##$SUBNAM9= <"">
##$SW= 16.9725356469052
##$SWIBOX= (0..15)
0 0 2 0 0 0 0 0 0 0 0 0 0 0 0 0 
##$SW_h= 3396.73913043478
##$TD= 16384
##$TD0= 1
##$TE= 0
##$TE2= 300
##$TE3= 300
##$TEG= 300
##$TL= (0..7)
0 120 120 120 120 120 120 120 
##$TP= (0..7)
150 150 150 150 150 150 150 150 
##$TP07= 0
##$TPNAME0= <>
##$TPNAME1= <>
##$TPNAME2= <>
##$TPNAME3= <>
##$TPNAME4= <>
##$TPNAME5= <>
##$TPNAME6= <>
##$TPNAME7= <>
##$TPOAL= (0..7)
0.5 0.5 0.5 0.5 0.5 0.5 0.5 0.5 
##$TPOFFS= (0..7)
0 0 0 0 0 0 0 0 
##$TUNHIN= 0
##$TUNHOUT= 0
##$TUNXOUT= 0
##$USERA1= <user>
##$USERA2= <user>
##$USERA3= <user>
##$USERA4= <user>
##$USERA5= <user>
##$V9= 5
##$VALIST= <valist>
##$VCLIST= <CCCCCCCCCCCCCCC>
##$VD= 0
##$VDLIST= <DDDDDDDDDDDDDDD>
##$VPLIST= <PPPPPPPPPPPPPPP>
##$VTLIST= <TTTTTTTTTTTTTTT>
##$WBST= 1024
##$WBSW= 4
##$XGAIN= (0..3)
0 0 0 0 
##$XL= 0
##$YL= 0
##$YMAX_a= 1026160
##$YMIN_a= -842139
##$ZGOPTNS= <>
##$ZL1= 120
##$ZL2= 120
##$ZL3= 120
##$ZL4= 120
##$ABSF1= 10
##$ABSF2= 0
##$ABSG= 5
##$ABSL= 3
##$ALPHA= 0
##$AQORDER= 0
##$ASSFAC= 0
##$ASSFACI= 0
##$ASSFACX= 0
##$ASSWID= 0
##$AUNMP= <proc_1d>
##$AZFE= 0.1
##$AZFW= 0.1
##$BCFW= 1
##$BC_mod= 2
##$BYTORDP= 1
##$COROFFS= 0
##$CY= 11.3945322036743
##$DATMOD= 1
##$DC= 2
##$DFILT= <>
##$DTYPP= 0
##$F1P= 15.9154993809931
##$F2P= -4.1035820241983
##$FCOR= 0.5
##$FTSIZE= 0
##$FT_mod= 4
##$GAMMA= 1
##$GB= 0.15
##$INTBC= 1
##$INTSCL= 1
##$ISEN= 128
##$LB= 0.24
##$LEV0= 0
##$LPBIN= 0
##$MAXI= 10000
##$MC2= 0
##$MEAN= 0
##$ME_mod= 0
##$MI= 1.114404
##$NCOEF= 0
##$NC_proc= 0
##$NLEV= 6
##$NOISF1= 3.799351
##$NOISF2= 2.8
##$NSP= 1
##$NTH_PI= 0
##$NZP= 0
##$OFFSET= 15.70392
##$PC= 1
##$PHC0= -11052.74
##$PHC1= 14.00088
##$PH_mod= 1
##$PKNL= yes
##$PPARMOD= 0
##$PSCAL= 0
##$PSIGN= 0
##$REVERSE= no
##$SF= 200.130013532006
##$SI= 16384
##$SIGF1= 3
##$SIGF2= 2
##$SINO= 400
##$SIOLD= 16384
##$SREGLST= <1H.CDCl3>
##$SSB= 0
##$STSI= 0
##$STSR= 0
##$SW_p= 3612.71676300578
##$SYMM= 0
##$S_DEV= 0
##$TDeff= 0
##$TDoff= 0
##$TI= <>
##$TILT= no
##$TM1= 0
##$TM2= 0
##$TOPLEV= 0
##$USERP1= <user>
##$USERP2= <user>
##$USERP3= <user>
##$USERP4= <user>
##$USERP5= <user>
##$WDW= 1
##$XDIM= 8192
##$YMAX_p= 0
##$YMIN_p= 0
$$ End of Bruker specific parameters
$$ ---------------------------------
##NTUPLES= NMR FID
##VAR_NAME=  TIME,          FID/REAL,        FID/IMAG
##SYMBOL=    X,             R,               I
##VAR_TYPE=  INDEPENDENT,   DEPENDENT,       DEPENDENT
##VAR_FORM=  AFFN,          ASDF,            ASDF
##VAR_DIM=   8192,          8192,            8192
##UNITS=     SECONDS,       ARBITRARY UNITS, ARBITRARY UNITS
##FACTOR=    0.0002944,     1,               1
##FIRST=     0,             0,               0
##LAST=      2.4114304,     0,               0
##MIN=       0,             -842139,         0
##MAX=       2.4114304,     1026160,         0
$$ Real data points
##PAGE= N=1
##DATA TABLE= (X++(R..R)), XYDATA
$$ plain form
0 0 0 0 0 0 0 0 0 0 0 0 0 0 0 0 0 0 0 -99 107 -108 108 -108 155 -215 216 -308 323 -410 431 -538 628 -703 803
33 803 -921 1067 -1186 1351 -1529 1731 -1945 2174 -2424 2711 -3014 3348 -3719 4113 -4548 5023
49 5023 -5536 6105 -6723 7405 -8153 8969 -9884 10899 -12037 13309 -14763 16427
61 16427 -18362 20643 -23398 26792 -31168 37068 -46016 63473 -266415 370605 -343994
72 -343994 431065 -103027 -556899 -484556 -273783 73408 586885 875989 20617 554566
82 554566 -842139 -10092 -144150 163486 618772 132094 184069 -460190 22381 -332001
92 -332001 720279 370553 527090 333273 -553008 -139041 -672109 55900 -109189 291067
102 291067 -293955 -201136 -551185 -551038 190186 -312076 630786 -269653 -170376 -586740 -710409
$$ packed form
0@%%%%%%%%%%%%%%%%%r9K06k15K16k16K63l70M31n24O31p33Q41r69J166j331J506
33H03j724J988k253K537k880L260l676M119m598N135n725O362p067P832q661R571
49E023j0559J1641j2828J4128j5558J7122j8853K0783k2936K5346k8072L1190
61A6427l4789L9005m4041N0190n7960O8236q3084J09489l29888O37020p14599
72c43994P75059n34092m53872P2343K10773L47191N13477K89104q55372N33949
82E54566j396705Q32047j34058L07636M55286m86678N1975o44259M82571l54382
92c32001J052280l49726J56537j93817q86281M13967n33068P28009j65089M00256
102B91067n85022R2819l50049J47P41224n02262R42862r00439R9277m16364j23669
$$ plain form
113 -710409 -423653 -329480 63033 -315152 50662 -767634 -122287 -426645 49017 353829
123 353829 -5541 277394 -501153 -150195 -575984 63271 -89545 246661 153095 -209954
133 -209954 135342 -376217 390912 84901 551742 176541 96767 -150584 -364201 16956
143 16956 -278465 444639 -151228 240583 -205250 -175421 3479 -88135 343680 -63936
153 -63936 204781 -477734 -187449 -572836 -241467 -96036 -219534 138651 -439525 -30631
163 -30631 -473729 10128 -139652 88296 12134 -285002 -133080 -637386 -61499 -408641
173 -408641 140686 -68296 21381 -30426 -209968 118291 -152678 405375 -67171 280575
183 280575 -184218 -134618 -114896 -217107 233272 -61526 371973 -107251 207504 -112650
$$ packed form
113g10409K86756R4173L92513l78185L65814q18296O45347l04358M75662L04812
123C53829l59370K82935p78547L50958m25789O39255j52816L36206r3566l63049
133b09954L45296n11559P67129l06011M66841l75201p9774k47351k13617L81157
143A6956k95421P23104n95867L91811m45833K9829J78900r1614M31815m07616
153f3936K68717o82515K90285l85387L31369J45431j23498L58185n78176M08894
163c0631m43098M83857j49780K27948p6162k97136J51922n04306N75887l47142
173d08641N49327k08982Q9677n1807j79542L28259k70969N58053m72546L47746
183B80575m64793M9600J9722j02211M50379k94798M33499m79224L14755l20154
$$ plain form
193 -112650 116601 168813 54713 300734 -227351 87323 -415237 -33147 -202137 45187
203 45187 67312 -73905 112505 -313573 128129 -265023 161641 -107545 -48464 -149064
213 -149064 -379126 -147307 -411577 80172 -233834 174354 -152130 -25535 -55594 -169863
223 -169863 160249 -160981 213908 -237429 23515 -279074 -84438 -28542 -29699 279484
233 279484 -61349 314721 -131893 220887 -9008 165609 157774 6804 147301 -228838
243 -228838 136170 -224346 230079 15556 193580 160390 -18576 180194 -139264 222294
253 222294 -126616 180692 -157446 -48919 -143164 -228399 60701 -199821 228799 -136681
263 -136681 141794 -132944 -17008 -53725 -105987 82809 -236694 78006 -339783 -385
$$ packed form
193a12650K29251N2212j14100K46021n28085L14674n02560L82090j68990K47324
203D5187K2125j41217J86410m26078M41702l93152M26664k69186N9081j00600
213a49064k30062K31819k64270M91749l14006M08188l26484J26595l0059j14269
223a69863L30112l21230L74889m51337K60944l02589J94636N5896j157L09183
233B79484l40833L76070m46614L52780k29895J74617p835j50970J40497l76139
243b28838L65008l60516M54425k14523J78024l3190j78966J98770l19458L61558
253B22294l48910L07308l38138J08527r4245q5235K89100k60522M28620l65480
263a36681K78475k74738J15936l6717n2262J88796l19503L14700m17789L39398
$$ plain form
273 -385 -210935 5514 65338 -1376 196094 -98473 192408 -155874 194426 -65908 106551
284 106551 43548 -89164 111276 -164865 227786 -36554 313484 83894 225208 127446
294 127446 35994 211593 -71338 273987 -108701 180119 -95858 33252 31889 3035 216881
305 216881 -12527 283497 -97018 182899 -108652 41711 -4043 -97795 69306 -224903
315 -224903 62143 -236775 91147 -102456 99362 49033 -27941 108428 -180844 124105
325 124105 -199536 97077 -124542 2591 -48718 -89986 92031 -90379 254702 -36600
335 -36600 269234 2718 123145 65957 -10758 158940 -69149 204813 -97845 187414
345 187414 -38821 159734 134154 112247 276692 5364 264980 -74878 173448 -57024
$$ packed form
273c85k10550K16449N9824o6714J97470k94567K90881l48282L50300k60334J72459
284A06551o3003j32712K00440k76141L92651k64340L50038k29590J41314r7762
294A27446r1452J75599k82931L45325l82688K88820k75977J29110j363k8854K13846
305B16881k29408K96024l80515K79917k91551J50363m5754r3752J67101k94209
315b24903K87046k98918L27922j93603K01818n0329p6974J36369k89272L04949
325A24105l23641K96613k21619J27133n1309m1268J82017j82410L45081k91302
335c6600L05834k66516J20427n7188p6715J69698k28089K73962l02658K85259
345A87414k26235J98555k5580k1907J64445k71328K59616l39858K48326k30472
$$ plain form
355 -57024 88208 19736 -28143 97953 -128771 172036 -112648 204530 -18629 110297
365 110297 34440 -57883 48980 -175983 81554 -204350 77651 -161090 3138 -39350
375 -39350 -62462 117821 -78812 188515 -96053 135872 -106674 32785 -33795 -54785 86528
386 86528 -111864 162008 -104559 182848 669 166295 124160 87601 183156 -40319 189048
397 189048 -100245 166887 -48460 106198 51473 20420 152601 -28978 231379 -27600
407 -27600 221900 -21125 99069 -6503 -57163 49488 -147443 102669 -158250 97492
417 97492 -110207 49653 -5474 -16139 94429 -103277 110728 -178939 54783 -169838
427 -169838 -17323 -69119 -78634 42923 -118916 121919 -110346 155231 -45604 107308
$$ packed form
355e7024J45232o8472m7879J26096k26724L00807k84684L17178k23159J28926
365A10297p5857r2323J06863k24963K57537k85904K82001k38741J64228m2488
375c9350k3112J80283j96633K67327k84568K31925k42546J39459o6580k0990J41313
386H6528j98392K73872k66567K87407j82179J65626m2135l6559R5555k23475K29367
397A89048k89293K67132k15347J54658n4725l1053J32181j81579K60357k58979
407b7600K49500k43025J20194j05572n0660J06651j96931K50112k60919K55742
417I7492k07699J59860n5127j0665J10568j97706K14005k89667K33722k24621
427a69838J52515n1796r515J21557j61839K40835k32265K65577k00835J52912
$$ plain form
437 107308 26618 -14716 73579 -111454 114400 -118999 134376 -51759 108552 49011 50039
448 50039 157207 -5347 217062 -45149 171215 -58243 63003 -19150 -30623 65767 -84561
459 -84561 139317 -100570 144664 -60314 87267 11209 -13591 57514 -129451 55985 -194395
470 -194395 35230 -166547 2470 -66577 -60628 40703 -116518 102114 -127747 97888
480 97888 -110107 22083 -72321 -82084 -4038 -144136 79780 -133612 117899 -64338 90743
491 90743 26284 28455 106938 -42454 136837 -99683 109848 -97637 54952 -13329 752
502 752 93794 -38892 157522 -58500 156004 -42696 90532 -10170 -21629 27677 -128477
513 -128477 58371 -158661 70011 -112732 41870 -31443 -25985 39025 -96800 74904 -153323
$$ packed form
437A07308q0690m1334Q8295j85033K25854k33399K53375j86135J60311n9541J028
448E0039J07168j62554K22409k62211K16364k29458J21246q2153j1473R6390j50328
459h4561K23878k39887K45234k04978J47581p6058k4800P1105j86965J85436k50380
470a94395K29625k01777J69017o9047N949J01331j57221K18632k29861K25635
480I7888k07995J32190r4404r763P8046j40098K23916k13392K51511j82237J55081
491I0743o4459K171P8483j49392J79291k36520K09531k07485J52589o8281J4081
502G52R3042j32686J96414k16022K14504j98700J33228j00702j1459M9306j56154
513a28477J86848k17032K28672j82743J54602p3313N458O5010j35825J71704k28227
$$ plain form
524 -153323 52659 -160548 -21856 -110787 -97921 -14726 -132308 69936 -124956 93745
534 93745 -90737 58947 -33448 -22696 31183 -109555 65840 -145356 70397 -102998 55157
545 55157 -8622 22038 84889 -29890 142713 -69562 134219 -65128 64490 -27679 -25755
556 -25755 28660 -85029 87097 -93503 117797 -62894 85354 -9355 -725 41000 -92948
567 -92948 60398 -149172 40299 -145666 -4377 -84088 -47593 10250 -92059 78279 -120285
578 -120285 78653 -113626 22404 -75390 -61059 -19402 -128326 34700 -145275 71520
588 71520 -96685 63518 -15528 12930 58146 -55533 95767 -99700 87269 -97644 45193
599 45193 -44578 -8672 40332 -47892 119429 -58691 138059 -45396 90204 -11164 1964
$$ packed form
524a53323K05982k13207J38692q8931J2866Q3195j17582K02244j94892K18701
534I3745j84482J49684r2395J0752N3879j40738J75395k11196K15753j73395J58155
545E5157o3779L0660O2851j14779J72603k12275K03781j99347J29618r2169J924
556b5755N4415j13689J72126j80600K11300j80691J48248r4709Q630M1725j33948
567i2948J53346k09570J89471j85965J41289p9711L6495N7843j02309J70338j98564
578a20285J98938j92279J36030r7794J4331M1657j08924J63026j79975K16795
588G1520j68205J60203p9046K8458M5216j13679J51300j95467J86969j84913J42837
599D5193q9771L5906M9004q8224J67321j78120J96750j83455J35600j01368J3128
$$ plain form
610 1964 29896 -78868 60152 -122522 69559 -100748 50780 -31781 3866 43754 -59004
621 -59004 79818 -107403 65536 -120653 15790 -85146 -53816 -17354 -105466 51025 -113426
632 -113426 85259 -82740 61422 -33386 -7982 13000 -83395 52111 -127425 62324 -111283
643 -111283 43326 -39719 7251 51688 -29918 112017 -60148 117979 -65571 70188 -34257
654 -34257 -3731 22400 -63800 77717 -84066 103648 -55306 91099 -2914 32466 48307
665 48307 -47165 75869 -100691 67817 -104880 32925 -57475 -14740 16059 -56365 78339
676 78339 -79390 96271 -79011 53278 -52923 -23138 -7238 -90368 37732 -118481 65066
687 65066 -95615 58148 -29034 19133 39829 -37579 81299 -84276 82137 -91769 50026
$$ packed form
610A964K7932j08764J39020j82674J92081j70307J51528q2561L5647L9888j02758
621e9004J38822j87221J72939j86189J36443j00936L1330L6462q8112J56491j64451
632a13426J98685j67999J44162r4808K5404K0982r6395J35506j79536J89749j73607
643a11283J54609q3045M6970M4437q1606J41935j72165J78127j83550J35759j04445
654c4257L0526K6131q6200J41517j61783J87714j58954J46405r4013L5380J5841
665D8307r5472J23034j76560J68508j72697J37805r0400M2735L0799p2424J34704
676G8339j57729J75661j75282J32289j06201K9785J5900q3130J28100j56213J83547
687F5066j60681J53763q7182M8167K0696p7408J18878j65575J66413j73906J41795
$$ plain form
698 50026 -50047 -286 23381 -42562 90090 -57386 121314 -43253 96099 -9267 28560
709 28560 32458 -46836 67765 -89016 81098 -78967 67512 -24288 26385 45039 -23679
720 -23679 90386 -66582 89957 -82267 46876 -60121 -15220 -4565 -67330 51941 -89399
731 -89399 82313 -70017 67273 -29908 14556 16848 -54343 49080 -101963 59276 -100251
742 -100251 44618 -47050 8376 26413 -27320 86299 -55752 104875 -58883 72817 -35328
753 -35328 12198 12812 -49236 65002 -72244 95946 -54117 88494 -8044 45769 46107 -17470
765 -17470 80046 -69610 83558 -79927 53757 -45445 9647 17743 -32659 74587 -59762
776 -59762 95885 -62856 69053 -39527 5188 47 -61177 36931 -96527 59903 -85236
$$ packed form
698E0026j00073M9761K3667o5943J32652j47476J78700j64567J39352j05366L7827
709B8560L898p9294J14601j56781J70114j60065J46479r1800N0673J8654o8718
720b3679J14065j56968J56539j72224J29143j06997M4901J0655o2765J19271j41340
731h9399J71712j52330J37290r7181M4464K292p1191J03423j51043J61239j59527
742a00251J44869r1668N5426J8037n3733J13619j42051J60627j63758J31700j08145
753c5328M7526O14o2048J14238j37246J68190j50063J42611r6538N3813L38o3577
765a7470R7516j49656J53168j63485J33684r9202N5092Q096n0402J07246j34349
776e9762J55647j58741J31909j08580M4715n141o1224R8108j33458J56430j45139
$$ plain form
787 -85236 54006 -37758 20092 22109 -29672 67293 -71840 74801 -83188 46756 -54297
798 -54297 1095 4232 -39709 64622 -59984 97328 -50727 85612 -18245 34132 25505
809 25505 -31266 60617 -72983 75321 -72097 67798 -30739 34040 30904 -11900 80642
820 80642 -51853 92988 -65176 61853 -47383 6301 -4743 -46324 46043 -74063 75819
831 75819 -69142 68543 -32211 22609 11602 -38012 45462 -83105 54578 -92012 40883
842 40883 -56763 6990 4424 -29678 62212 -55980 85156 -60755 65112 -40479 15365
853 15365 -517 -37991 46391 -70259 76256 -62925 74593 -23319 41349 27914 -11067
864 -11067 66276 -56600 76358 -72721 55923 -48415 16247 4288 -26536 56881 -54185
$$ packed form
787h5236J39242r1764N7850K017n1781R6965j39133J46641j57989J29944j01053
798e4297N5392L137m3941J04331j24606J57312j48055J36339j03857N2377q627
809B5505n6771R1883j33600J48304j47418J39895r8537O4779l136m2804R2542
820H0642j32495J44841j58164J27029j09236N3684j1044m1581R2367j20106J49882
831G5819j44961J37685j00754N4820j1007m9614Q3474j28567J37683j46590J32895
842D0883r7646O3753k566l4102R1890j18192J41136j45911J25867j05591N5844
853A5365j5882l7474Q4382j16650J46515j39181J37518r7912O4668j3435l8981
864a1067P7343j22876J32958j49079J28644j04338O4662j1959l0824Q3417j11066
$$ plain form
875 -54185 86344 -58701 69851 -37954 19758 -1111 -41104 33182 -81602 55642 -83414
886 -83414 51312 -46029 22208 8777 -22361 52581 -61631 68202 -75694 47820 -55913
897 -55913 9422 -8961 -36447 44324 -59231 76017 -55550 72973 -28298 33722 9958
908 9958 -20973 45368 -65353 65188 -72358 56735 -41268 28676 12843 -11540 60487
919 60487 -45607 79566 -61311 61551 -47619 16157 -8681 -34819 34823 -67413 65046
930 65046 -67457 64815 -39476 29055 2249 -22930 39283 -67577 55697 -81392 44581
941 44581 -58868 14015 -6402 -23571 45991 -52598 74127 -59852 63317 -42603 21920
952 21920 -7331 -29296 34051 -63633 61553 -64605 62607 -34977 35212 11435 -7926
$$ packed form
875e4185J40529j45045J28552j07805N7712k0869l9993P4286j14784J37244j39056
886h3414J34726r7341O8237j3431l1138P4942j14212J29833j43896J23514j03733
897e5913O5335j8383k7486Q0771j03555J35248j31567J28523j01271O2020k3764
908I958l0931O6341j10721J30541j37546J29093r8003O9944j5833k4383P2027
919F0487j06094J25173j40877J22862j09170O3776k4838k6138O9642j02236J32459
930F5046j32503J32272j04291O8531k6806k5179O2213j06860J23274j37089J25973
941D4581j03449P2883k0417j7169O9562r8589J26725j33979J23169j05920O4523
952B1920k9251k1965O3347r7684J25186j26158J27212r7584P0189k3777j9361
$$ plain form
963 -7926 49274 -49407 66221 -66830 54568 -50914 20023 -6185 -20770 41612 -49860
974 -49860 71771 -55965 65931 -39268 28897 -5763 -24376 30623 -64989 53669 -74747
985 -74747 51893 -48531 27209 -2267 -11918 43550 -49098 64709 -66584 52937 -53475
996 -53475 17211 -14518 -24391 31659 -53878 62585 -57560 64491 -36373 34366 -150
1007 -150 -14147 34870 -56542 55814 -69350 50226 -47732 26982 -2845 -9435 43605 -41510
1019 -41510 68544 -56262 59920 -44685 24028 -11535 -22711 27017 -54531 56356 -62573
1030 -62573 59339 -41075 35183 -1786 -9481 36438 -51172 54092 -67436 48464 -52272
1041 -52272 22679 -11948 -12588 33730 -43257 65260 -55792 61706 -41669 28212 -11381
$$ packed form
963g926N7200r8681J15628j33051J21398j05482P0937k6208j4585O2382r1472
974d9860J21631j27736J21896j05199O8165l4660j8613N4999r5612J18658j28416
985g4747J26640j00424P5740k9476r651N5468r2648J13807j31293J19521j06412
996e3475P0686l1729r873N6050q5537J16463j20145J22051j00864P0739l4516
1007a50j3997M9017r1412J12356j25164J19576r7958P4714k9827o590N3040q5115
1019d1510J10054j24806J16182j04605O8713l5563j1176M9728q1548J10887j18929
1030f2573J21912j00414P6258l6969p695M5919q7610J05264j21528J15900j00736
1041e2272P4951l4627o40M6318p6987J08517j21052J17498j03375O9881l9593
$$ plain form
1052 -11381 -15528 25262 -53845 53300 -64260 56759 -43080 33230 -1926 -5584 38194 -41873
1064 -41873 57790 -60348 52199 -50379 23063 -15909 -14713 28417 -45177 59351 -53971
1075 -53971 61197 -39323 32967 -8716 -11849 24290 -51381 48154 -64442 50825 -47205
1086 -47205 31023 -8196 -3913 34653 -38961 59397 -55993 53481 -47614 25907 -17259
1097 -17259 -13679 23137 -45049 53568 -55772 59698 -39270 36234 -8128 -4799 26807 -43768
1109 -43768 48377 -62935 49706 -49554 28302 -13005 -5903 28434 -36571 55920 -51012
1120 -51012 56594 -45429 29014 -17148 -12127 20913 -46498 46114 -56024 54155 -40352
1131 -40352 34588 -7473 -582 26390 -37542 48760 -56961 47804 -49351 25642 -16224 -6660
$$ packed form
1052a1381m147M0790p9107J07145j17560J21019r9839P6310l5156l658M3778q0067
1064d1873R9663j18138J12547j02578P3442l8972J196M3130p3594J04528j13322
1075e3971J15168j00520P2290m1683l133L6139p5671R9535j12596J15267r8030
1086d7205P8228l9219M283L8566p3614R8358j15390J09474j01095P3521m3166
1097a7259L580L6816o8186R8617j09340J15470r8968P5504m4362L329L1606p0575
1109d3768R2145j11312J12641r9260P7856m1307P102L4337o5005R2491j06932
1120e1012J07606j02023P4443m6162N021L3040o7411R2612j02138J10179r4507
1131d0352P4940m2061O891K6972o3932Q6302j05721J04765r7155P4993m1866R564
$$ plain form
1143 -6660 25111 -33903 53837 -49852 58321 -40588 33505 -14681 -6390 19762 -42187 45215
1155 45215 -56741 50326 -44858 34931 -10716 845 26599 -34555 49138 -53488 49993
1166 49993 -49019 28201 -18917 -7337 19112 -37212 47540 -49714 53648 -40062 35332 -13095
1178 -13095 -2248 18927 -40151 41827 -55328 46387 -45930 30497 -13350 234 23752 -29348
1190 -29348 49332 -47728 52719 -43243 30358 -18261 -5799 17251 -34956 45353 -47726 51960
1202 51960 -38927 35985 -11629 2295 21185 -34117 42605 -52983 45901 -46616 28957 -19082
1214 -19082 894 18531 -29392 45932 -45707 51089 -42408 31052 -20367 -3403 12823 -35204
1226 -35204 38533 -51958 47594 -41941 34329 -15193 3433 18209 -28810 42898 -50228 46890
$$ packed form
1143f660L1771n9014Q7740j03689J08173r8909P4093m8186Q291K6152o1949Q7402
1155D5215j01956J07067r5184P9789m5647J1561K5754o1154Q3693j02626J03481
1166D9993r9012P7220m7118J1580K6449n6324Q4752r7254J03362r3710P5394m8427
1178a3095J0847K1175n9078Q1978r7155J01715r2317P6427m3847J3584K3518n3100
1190b9348P8680r7060J00447r5962P3601m8619J2462K3050n2207Q0309r3079R9686
1202E1960r0887P4912m7614J3924J8890n5302P6722r5588R8884r2517P5573m8039
1214a9082J9976J7637m7923P5324r1639R6796r3497P3460n1419J6964J6226m8027
1226c5204P3737r0491R9552q9535P6270m9522J8626J4776m7019P1708r3126R7118
$$ plain form
1238 46890 -44469 29240 -19243 -1555 14399 -28349 44337 -43458 52228 -38546 35256 -15532
1250 -15532 3048 14258 -30281 36626 -49121 44921 -41825 33418 -16079 6140 17722 -25398
1262 -25398 42425 -44741 45332 -42655 29204 -23678 -729 10452 -28841 38086 -45152 48691
1274 48691 -39272 34906 -18030 3590 13008 -28345 35015 -48471 41629 -44070 30067 -19564
1286 -19564 4419 14982 -23780 39630 -41217 46891 -39391 31072 -20965 1804 9650 -27323
1298 -27323 37027 -44130 45618 -38133 35890 -14467 7426 14740 -24228 36721 -43070 41994
1310 41994 -41938 29192 -21307 3599 11372 -23331 38028 -39776 45119 -39306 31462 -20310
1322 -20310 3733 7526 -27309 32259 -44622 41504 -40695 32671 -18307 7298 12053 -21882
$$ packed form
1238D6890r1359P3709m8483J7688J5954m2748P2686q7795R5686r0774P3802n0788
1250a5532J8580J1210m4539O6907q5747R4042q6746P5243m9497K2219J1582m3120
1262b5398O7823q7166R0073q7987P1859n2882K2949J1181l9293O6927q3238R3843
1274D8691q7963P4178n2936K1620R418m1353O3360q3486R0100q5699P4137m9631
1286a9564K3983J0563l8762O3410q0847Q8108q6282P0463n2037K2769P846l6973
1298b7323O4350q1157Q9748q3751P4023n0357K1893P314l8968O0949p9791Q5064
1310D1994q3932P1130n0499K4906P773l4703O1359p7804Q4895q4425P0768n1772
1322b0310K4043L793l4835N9568p6881Q6126q2199P3366n0978K5605M755l3935
$$ plain form
1334 -21882 33412 -42331 42279 -42009 29359 -22523 5155 8277 -21173 34698 -37304 45807
1346 45807 -37307 34042 -17303 8585 7815 -22059 32052 -41501 39156 -37935 31929 -19286
1358 -19286 9108 10850 -17891 34114 -36918 41209 -38565 29526 -21981 5474 4948 -21958
1370 -21958 29914 -38668 41689 -36055 32093 -20993 7419 6730 -21300 29129 -40585 37363
1382 37363 -41183 29813 -22555 6869 7114 -16711 31439 -35496 42293 -37735 32645 -22563
1394 -22563 7893 3247 -20040 28278 -37352 39464 -35850 33102 -19444 11504 6843 -17119
1406 -17119 29135 -35776 36260 -39292 30354 -22367 7518 3568 -16371 29353 -33578 37840
1418 37840 -36343 31969 -19747 9381 3333 -18616 25255 -36238 35186 -37824 32174 -21823
$$ packed form
1334b1882N5294p5743Q4610q4288P1368n1882K7678L122k9450N5871p2002Q3111
1346D5807q3114P1349n1345K5888p70k9874N4111p3553Q0657p7091O9864n1215
1358a9286K8394J742k8741N2005p1032P8127p9774O8091n1507K7455n26k6906
1370b1958N1872o8582Q0357p7744O8148n3086K8412o89k8030N0429o9714P7948
1382C7363p8546P0996n2368K9424K45k3825M8150o6935P7789q0028P0380n5208
1394b2563L0456m646k3287M8318o5630P6816p5314O8952n2546L0948m661k3962
1406a7119M6254o4911P2036p5552O9646n2721K9885l950j9939M5724o2931P1418
1418C7840p4183O8312n1716K9128o048k1949M3871o1493P1424p3010O9998n3997
$$ plain form
1430 -21823 9990 3221 -15802 27220 -32675 35919 -38956 29021 -24432 8384 3341 -16794
1442 -16794 25781 -33498 37227 -34265 32683 -20899 11514 2083 -16373 24933 -35001 35303
1454 35303 -35710 30260 -21590 11103 3640 -12800 26753 -30915 36191 -34344 30402 -23507
1466 -23507 8964 849 -15486 23095 -31279 34341 -35049 31542 -22372 11651 2170 -14640
1478 -14640 22191 -31478 33626 -36132 30358 -23979 10357 924 -13337 23958 -29829 35289
1490 35289 -34431 30076 -21209 9996 -883 -12127 21333 -31193 34145 -34045 30810 -21640
1502 -21640 13751 937 -11244 22347 -30150 33334 -33804 29376 -23093 11947 -1398 -10366
1514 -10366 20979 -28282 35914 -33257 30761 -21364 11858 -1314 -12654 19493 -29329 32830
$$ packed form
1430b1823L1813o769j9023M3022n9895O8594p4875O7977n3453L2816n043k0135
1442a6794M2575n9279P0725p1492O6948n3582L2413r431j8456M1306n9934P0304
1454C5303p1013O5970n1850L2693p463j6440L9553n7668O7106p0535O4746n3909
1466b3507L2471q115j6335L8581n4374O5620o9390O6591n3914L4023r481j6810
1478a4640L6831n3669O5104o9758O6490n4337L4336r433j4261L7295n3787O5118
1490C5289o9720O4507n1285L1205j0879j1244L3460n2526O5338o8190O4855n2450
1502b1640L5391j2814j2181L3591n2497O3484o7138O3180n2469L5040j3345q968
1514a0366L1345m9261O4196o9171O4018n2125L3222j3172j1340L2147m8822O2159
$$ plain form
1526 32830 -34293 29318 -22911 11659 -270 -11045 19939 -29363 31755 -33341 28370 -23310
1538 -23310 10536 -2831 -10874 19382 -28898 31836 -32807 29287 -21644 13658 -1971 -9675
1550 -9675 17606 -28274 31312 -34220 29451 -23199 13914 -1820 -7624 19787 -26621 33174
1562 33174 -31484 29941 -22876 13751 -3724 -8583 19606 -27134 31718 -32474 30158 -22572
1574 -22572 15137 -1134 -8056 18625 -26053 30565 -33042 28293 -23810 12240 -2922 -7984
1586 -7984 17814 -26385 30462 -31778 28784 -22579 13881 -3528 -7997 17179 -26570 29541
1598 29541 -31671 28371 -22211 14774 -3786 -6127 17463 -24887 30417 -32202 29801 -23936
1610 -23936 14646 -4115 -6067 16330 -24010 30900 -30635 31140 -22086 15838 -3561 -4882
$$ packed form
1526C2830o7123O3611n2229L4570j1929j0775L0984m9302O1118o5096O1711n1680
1538b3310L3846j3367q043L0256m8280O0734o4643O2094n0931L5302j5629p704
1550i675K7281m5880N9586o5532O3671n2650L7113j5734n804K7411m6408N9795
1562C3174o4658O1425n2817L6627j7475m859K8189m6740N8852o4192O2632n2730
1574b2572L7709j6271o922K6681m4678N6618o3607O1335n2103L6050j5162n062
1586g984K5798m4199N6847o2240O0562n1363L6460j7409m469K5176m3749N6111
1598B9541o1212O0042n0582L6985j8560k341K3590m2350N5304o2619O2003n3737
1610b3936L8582j8761j952K2397m0340N4910o1535O1775n3226L7924j9399j321
$$ plain form
1622 -4882 16624 -25101 29126 -31772 29833 -22886 15188 -4093 -3707 17041 -23733 30050
1634 30050 -31438 28603 -23085 14905 -5422 -6361 15157 -24034 28050 -29573 28614 -23252
1646 -23252 15452 -5653 -4315 14337 -24317 28028 -30433 27656 -23393 16152 -5748 -4069
1658 -4069 14706 -22321 29762 -30022 29964 -24405 16550 -5832 -4238 14482 -21239 27599
1670 27599 -29557 29814 -23714 16758 -5721 -2673 14313 -22000 27813 -29163 28805 -23219
1682 -23219 15996 -7331 -2402 14143 -21354 27441 -29480 27626 -24157 16882 -7870 -2670
1694 -2670 13114 -21604 27008 -29523 28081 -24330 17292 -6952 -2147 12600 -21468 26524
1706 26524 -29240 27827 -23832 16576 -7670 -1986 12044 -19989 27596 -28819 29034 -24548
$$ packed form
1622d882K1506m1725N4227o0898O1605n2719L8074j9281L86K0748m0774N3783
1634C0050o1488O0041n1688L7990k0327r39K1518l9191N2084n7623N8187n1866
1646b3252L8704k1105J338J8652l8654N2345n8461N8089n1049L9545k1900J679
1658d069J8775l7027N2083n9784N9986n4369M0955k2382J594J8720l5721M8838
1670B7599n7156N9371n3528M0472k2479L048J6986l6313M9813n6976N7968n2024
1682b3219L9215k3327M929J6545l5497M8795n6921N7106n1783M1039k4752N200
1694b670J5784l4718M8612n6531N7604n2411M1622k4244M805J4747l4068M7992
1706B6524n5764N7067n1659M0408k4246N684J4030l2033M7585n6415N7853n3582
$$ plain form
1718 -24548 17562 -7603 -1513 11877 -19732 26933 -27627 29707 -23938 18093 -7370 -342
1730 -342 11781 -20420 26245 -28781 28408 -24454 18480 -8834 -354 11367 -19302 25242
1742 25242 -28403 28160 -24570 18063 -7996 -638 11046 -18878 24589 -27655 28718 -25132
1754 -25132 18231 -9281 -666 11000 -18877 24993 -27857 27695 -23334 17564 -9163 -359
1766 -359 9030 -18919 25306 -27466 27882 -25001 18713 -8855 -126 9949 -17887 24648 -27544
1779 -27544 28039 -25088 18425 -10236 405 8917 -18293 25425 -28173 28087 -25320 18300
1791 18300 -10546 196 9161 -17720 23989 -27984 27746 -26118 18485 -11158 1241 8226
1803 8226 -16741 22710 -26523 26619 -25200 18527 -10412 1372 9145 -16657 24134 -27149
$$ packed form
1718b4548M2110k5165O090J3390l1609M6665n4560N7334n3645M2031k5463P028
1730c42J2123l2201M6665n5026N7189n2862M2934k7314Q480J1721l0669M4544
1742B5242n3645N6563n2730M2633k6059P358J1684k9924M3467n2244N6373n3850
1754b5132M3363k7512Q615J1666k9877M3870n2850N5552n1029M0898k6727Q804
1766c59R389k7949M4225n2772N5348n2883M3714k7568Q729J0075k7836M2535n2192
1779b7544N5583n3127M3513k8661J0641Q512k7210M3718n3598N6260n3407M3620
1791A8300k8846J0742Q965k6881M1709n1973N5730n3864M4603k9643J2399O985
1803H226k4967L9451m9233N3142n1819M3727k8939J1784P773k5802M0791n1283
$$ plain form
1815 -27149 28004 -26023 18951 -10603 2676 8161 -16783 23558 -26860 27998 -24926 18217
1827 18217 -11670 1049 6813 -16758 21994 -27297 27540 -25559 18239 -11404 1761 7460
1839 7460 -16020 21663 -26262 26990 -24151 18899 -11461 2610 6676 -15555 22468 -27079
1851 -27079 27140 -24353 20461 -11856 3897 6660 -15182 22040 -26293 26642 -25795 19611
1863 19611 -10289 3740 7649 -13935 21929 -25362 26925 -24085 20800 -12221 3146 5678
1875 5678 -14446 21915 -25624 26784 -24418 19921 -13675 3608 5355 -14257 21178 -26189
1887 -26189 26681 -24917 19572 -12664 3307 5011 -13771 20617 -24719 27330 -24379 20117
1899 20117 -12509 4641 5886 -13191 20337 -24824 26114 -24339 19951 -13431 5071 4006
$$ packed form
1815b7149N5153n4027M4974k9554J3279N485k4944M0341n0418N4858n2924M3143
1827A8217k9887J2719N764k3571L8752m9291N4837n3099M3798k9643J3165N699
1839G460k3480L7683m7925N3252n1141M3050l0360J4071M066k2231L8023m9547
1851b7079N4219n1493M4814l2317J5753K763k1842L7222m8333N2935n2437M5406
1863A9611k9900J4029L909k1584L5864m7291N2287n1010M4885l3021J5367K532
1875E678k0124L6361m7539N2408n1202M4339l3596J7283J747j9612L5435m7367
1887b6189N2870n1598M4489l2236J5971J704j8782L4388m5336N2049n1709M4496
1899B0117l2626J7150J245j9077L3528m5161N0938n0453M4290l3382J8502j065
$$ plain form
1911 4006 -12345 20043 -23588 27396 -25887 20409 -13236 4483 4278 -13573 20235 -24201
1923 -24201 26401 -24365 20644 -12793 5867 4241 -12824 19090 -24543 25978 -24405 19659
1935 19659 -13262 4734 4405 -12550 19221 -23744 26864 -25462 20211 -14497 6049 4646
1947 4646 -11999 18599 -23914 25953 -24574 21345 -13914 6119 3594 -11785 18304 -24818
1959 -24818 25279 -25377 21614 -15222 6094 2374 -11692 19644 -23025 26493 -24074 20237
1971 20237 -15071 7286 2579 -10796 18073 -23104 25769 -24567 21897 -13608 5821 3209
1983 3209 -10979 18063 -23738 25669 -24561 20679 -14475 7796 2637 -10996 19398 -22317
1995 -22317 25440 -24247 21163 -15705 7279 1592 -10175 17633 -23263 24390 -22538 21517
$$ packed form
1911D006j6351L2388m3631N0984n3283M6296l3645J7719k05j7851L3808m4436
1923b4201N0602n0766M5009l3437J8660j626j7065L1914m3633N0521n0383M4064
1935A9659l2921J7996l29j6955L1771m2965N0608n2326M5673l4708K0546j403
1947D646j6645L0598m2513M9867n0527M5919l5259K0033k525j5379L0089m3122
1959b4818N0097n0656M6991l6836K1316l720j4066L1336m2669M9518n0567M4311
1971B0237l5308K2357m707j3375K8869m1177M8873n0336M6464l5505J9429k612
1983C209j4188K9042m1801M9407n0230M5240l5154K2271n159j3633L0394m1715
1995b2317M7757m9687M5410l6868K2984n687j1767K7808m0896M7653m6928M4055
$$ plain form
2007 21517 -14569 8424 786 -9197 16746 -23191 24573 -25210 21275 -16777 9055 837
2019 837 -9730 17561 -21685 24878 -24612 22373 -16349 7320 435 -9615 16021 -22774
2031 -22774 25066 -24599 21017 -16105 8550 194 -9482 16748 -22338 24834 -23630 21447
2043 21447 -16200 8162 360 -8449 15804 -21760 24364 -25373 21671 -16490 7853 241
2055 241 -9297 16069 -21409 24717 -24654 20896 -16614 9133 -1432 -8217 16325 -21469 23739
2068 23739 -23882 21624 -16284 7730 -1846 -7652 14835 -21420 24104 -23393 22829 -17166
2080 -17166 9034 -462 -7277 14459 -20107 23397 -24872 22069 -16056 8743 -1107 -7533 14937
2093 14937 -19995 24092 -23341 21342 -17195 8050 -1468 -6328 13874 -20506 24157 -23699
$$ packed form
2007B1517l6086K2993p638r983K5943l9937M7764m9783M6485l8052K5832q218
2019H37j0567K7291l9246M6563m9490M6985l8722K3669o885j0050K5636l8795
2031b2774M7840m9665M5616l7122K4655q356r676K6230l9086M7172m8464M5077
2043B1447l7647K4362p802q809K4253l7564M6124m9737M7044l8161K4343p612
2055B41r538K5366l7478M6126m9371M5550l7510K5747j0565o785K4542l7794M5208
2068B3739m7621M5506l7908K4014r576n806K2487l6255M5524m7497M6222l9995
2080a7166K6200r496o815K1736l4566M3504m8269M6941l8125K4799r850o426K2470
2093A4937l4932M4087m7433M4683l8537K5245r518m860K0202l4380M4663m7856
$$ plain form
2105 -23699 21277 -15858 10463 -2428 -6737 14981 -19179 22598 -24346 21600 -17268 9963
2117 9963 -1914 -6332 14257 -19449 23063 -23299 22389 -16883 10714 -1371 -6011 12948
2129 12948 -20125 23297 -23743 21976 -16084 10622 -1283 -5733 14713 -18509 22754 -23701
2141 -23701 22264 -16592 10846 -2762 -5298 12558 -19357 23985 -22838 21726 -16213 10318
2153 10318 -3218 -5751 13223 -20624 20908 -23157 21440 -16488 9995 -3302 -4498 12506
2165 12506 -18793 21592 -22988 22333 -17563 10555 -3569 -5311 11120 -18964 21110 -23494
2177 -23494 21137 -16465 11500 -3581 -4680 11758 -18217 21706 -23531 21796 -17120 10945
2189 10945 -4884 -3767 12274 -17732 21731 -22277 21996 -17741 11780 -4028 -3526 10949
$$ packed form
2105b3699M4976l7135K6321j2891m309K1718l4160M1777m6944M5946l8868K7231
2117I963j1877m418K0589l3706M2512m6362M5688l9272K7597j2085m640J8959
2129A2948l3073M3422m7040M5719l8060K6706j1905m450K0446l3222M1263m6455
2141b3701M5965l8856K7438j3608k536J7856l1915M3342m6823M4564l7939K6531
2153A0318j3536k533J8974l3847M1532m4065M4597l7928K6483j3297j196J7004
2165A2506l1299M0385m4580M5321l9896K8118j4124j742J6431l0084M0074m4604
2177b3494M4631l7602K7965j5081j099J6438k9975L9923m5237M5327l8916K8065
2189A0945j5829J117J6041l0006L9463m4008M4273l9737K9521j5808N02J4475
$$ plain form
2201 10949 -17516 20824 -22849 21183 -16243 11544 -4269 -4050 10830 -18325 20619 -22943
2213 -22943 21476 -17017 11419 -4466 -4142 10934 -16621 21295 -22569 22470 -17021 11433
2225 11433 -3697 -3252 10979 -17028 20014 -22779 21323 -17977 12091 -4842 -2270 10966
2237 10966 -15642 21272 -21424 21249 -17739 12129 -5814 -2832 10594 -16283 19765 -22069
2249 -22069 21451 -16616 12350 -5192 -1484 9348 -16304 19334 -21226 19978 -18853 11955
2261 11955 -5719 -2401 9452 -15382 18839 -22232 20220 -17718 12219 -5629 -2534 10249
2273 10249 -15044 19419 -21083 20810 -16799 12758 -5661 -1194 8890 -14831 20501 -20273
2285 -20273 20484 -17474 13025 -4711 -1360 8795 -14614 19110 -21485 20697 -17755 12879
$$ packed form
2201A0949k8465L8340m3673M4032l7426K7787j5813K19J4880k9155L8944m3562
2213b2943M4419l8493K8436j5885L24J5076k7555L7916m3864M5039l9491K8454
2225A1433j5130M45J4231k8007L7042m2793M4102l9300L0068j6933K572J3236
2237A0966k6608L6914m2696M2673l8988K9868j7943K982J3426k6877L6048m1834
2249b2069M3520l8067K8966j7542L708J0832k5652L5638m0560M1204l8831L0808
2261A1955j7674L318J1853k4834L4221m1071M2452l7938K9937j7848L095J2783
2273A0249k5293L4463m0502M1893l7609K9557j8419M467J0084k3721L5332m0774
2285b0273M0757l7958L0499j7736L351J0155k3409L3724m0595M2182l8452L0634
$$ plain form
2297 12879 -6772 -1983 8031 -14346 18199 -20195 20581 -18217 12808 -7485 -203 7369
2309 7369 -14098 17027 -20331 19987 -18328 12626 -7517 -662 6376 -14679 17512 -20284
2321 -20284 20445 -18096 14051 -6619 -335 7144 -14111 17052 -19490 21259 -17168 13083
2333 13083 -6534 186 6663 -12890 17777 -18953 20225 -17821 12589 -6966 -1452 6923 -13151
2346 -13151 18583 -18519 19195 -18985 12675 -7120 1025 6422 -13062 15076 -20498 17892
2358 17892 -18006 10889 -7434 499 6107 -13592 16198 -19263 18766 -18911 13181 -7871
2370 -7871 269 5907 -14252 16255 -19813 19799 -17196 13711 -7842 1844 5358 -11567 16107
2383 16107 -19525 18322 -17125 11949 -7443 1499 5581 -11051 16529 -18831 19233 -18545
$$ packed form
2297A2879j9651M789J0014k2377L2545l8394M0776l8798L1025k0293P282P572
2309G369k1467L1125l7358M0318l8315L0954k0143O855P038k1055L2191l7796
2321b0284M0729l8541L2147k0670O284P479k1255L1163l6542M0749l8427L0251
2333A3083j9617O720O477j9553L0667l6730L9178l8046L0410j9555N514Q375k0074
2346a3151L1734l7102L7714l8180L1660j9795Q145N397j9484K8138l5574L8390
2358A7892l5898K8895j8323P933N608j9699K9790l5461L8029l7677L2092k1052
2370g871Q140N638k0159L0507l6068L9612l6995L0907k1553R686L514j6925K7674
2383A6107l5632L7847l5447K9074j9392Q942M082j6632K7580l5360L8064l7778
$$ plain form
2395 -18545 13137 -7175 1296 6120 -11720 16363 -18625 18351 -16924 11573 -8171 1329
2407 1329 3793 -11932 14870 -18385 17757 -18461 11888 -8681 858 4923 -11833 15785 -18776
2420 -18776 17044 -16502 13038 -9157 -100 3496 -11760 13870 -17493 19362 -16210 13218
2432 13218 -8204 2489 5000 -9695 14602 -17046 18096 -16838 13711 -7983 3438 4159
2444 4159 -9929 14997 -17239 17975 -16788 14362 -8635 1521 4401 -8905 13092 -18002
2456 -18002 16059 -16548 13377 -9422 2493 3141 -8693 15701 -17065 18343 -18478 13507
2468 13507 -9427 2659 2049 -9330 14700 -17580 17837 -16975 13982 -9562 3072 3665 -8194
2481 -8194 14248 -17452 19490 -16936 13747 -7966 4359 3645 -8269 13147 -15264 18144
$$ packed form
2395a8545L1682k0312Q471M824j7840K8083l4988L6976l5275K8497j9744R500
2407A329K464j5725K6802l3255L6142l6218L0349k0569R539M065j6756K7618l4561
2420a8776L5820l3546K9540k2195R057L596j5256K5630l1363L6855l5572K9428
2432A3218k1422J0693K511j4695K4297l1648L5142l4934L0549k1694J1421P21
2444D159j4088K4926l2236L5214l4763L1150k2997J0156K880j3306K1997l1094
2456a8002L4061l2607K9925k2799J1915O48j1834K4394l2766L5408l6821L1985
2468A3507k2934J2086o10j1379K4030l2280L5417l4812L0957k3544J2634N93j1859
2481h194K2442l1700L6942l6426L0683k1713J2325p14j1914K1416k8411L3408
$$ plain form
2493 18144 -16176 14281 -8202 3188 3680 -8031 12522 -16624 18023 -16305 13574 -8508
2505 -8508 3669 2281 -8395 12178 -17158 17456 -15765 12905 -8939 3408 1559 -8243 12250
2518 12250 -15997 16553 -16221 13857 -8745 3828 2421 -8182 12286 -15738 17393 -16383
2530 -16383 13916 -9334 4091 2077 -6893 12657 -14355 17292 -16006 15440 -7872 5601
2542 5601 1655 -6019 12501 -14459 16742 -14966 14037 -8894 4163 1595 -5922 11187 -13664
2555 -13664 16133 -15897 14137 -8585 4753 504 -6872 12666 -15593 15944 -16551 13929
2567 13929 -10215 3878 1073 -6626 11706 -14512 16082 -15685 12774 -9381 3975 1962
2579 1962 -6555 11445 -14483 15514 -15482 14595 -8090 4918 1346 -5000 11491 -13682 16285
$$ packed form
2493A8144l4320L0457k2483J1390M92j1711K0553k9146L4647l4328K9879k2082
2505h508J2177j388j0676K0573k9336L4614l3221K8670k1844J2347j849r802K0493
2518A2250k8247L2550l2774L0078k2602J2573j407j0603K0468k8024L3131l3776
2530a6383L0299k3250J3425k014q970J9550k7012L1647l3298L1446k3312J3473
2542E601l946p674J8520k6960L1201l1708K9003k2931J3057k568p517J7109k4851
2555a3664K9797l2030L0034k2722J3338m249p376J9538k8259L1537l2495L0480
2567A3929k4144J4093k805p699J8332k6218L0594l1767K8459k2155J3356k013
2579A962q517J8000k5928K9997l0996L0077k2685J3008l572o346J6491k5173K9967
$$ plain form
2592 16285 -14698 15680 -9545 5588 597 -4278 11548 -14187 16154 -15052 14210 -9633
2604 -9633 5121 1254 -6203 10848 -13281 15828 -15052 13685 -10499 5846 179 -5387 10709
2617 10709 -13885 16282 -14882 13976 -9869 5580 202 -5670 10874 -14448 15673 -16680
2629 -16680 13220 -9821 6503 243 -4498 9828 -13282 16925 -15119 14176 -10581 7155
2641 7155 -91 -4653 10601 -13089 15667 -15585 15117 -10537 6623 788 -3587 11406 -13274
2654 -13274 16503 -14316 12611 -9336 5476 -480 -4503 9335 -13800 15213 -14752 14358
2666 14358 -11355 6259 -968 -5154 9076 -13825 14841 -15996 13123 -10893 5215 -1244
2678 -1244 -4242 7322 -13497 15457 -16392 13322 -11430 6353 -986 -4384 8681 -12775 15139
$$ packed form
2592A6285l0983L0378k5225J5133m991m875J5826k5735L0341l1206K9262k3843
2604i633J4754l867p457J7051k4129K9109l0880K8737k4184J6345n667n566J6096
2617A0709k4594L0167l1164K8858k3845J5449n378n872J6544k5322L0121l2353
2629a6680K9900k3041J6324o260m741J4326k3110L0207l2044K9295k4757J7736
2641G155p246m562J5254k3690K8756l1252L0702k5654J7160n835m375J4993k4680
2654a3274K9777l0819K6927k1947J4812n956m023J3838k3135K9013k9965K9110
2666A4358k5713J7614p227m186J4230k2901K8666l0837K9119k4016J6108o459
2678a244k998J1564k0819K8954l1849K9714k4752J7783p339l398J3065k1456K7914
$$ plain form
2691 15139 -13611 13811 -10766 6964 -719 -3968 8974 -12523 15331 -14276 13156 -10248
2703 -10248 6799 -2663 -3497 8456 -12260 14802 -16363 13496 -11085 5525 -1873 -3745 7747
2716 7747 -13374 13920 -14968 13401 -11762 5863 -1980 -4455 7302 -13017 13957 -16114
2728 -16114 13923 -11436 6617 -2573 -3419 7821 -12565 14424 -15875 13680 -11998 6494
2740 6494 -2643 -3774 7861 -11674 13604 -13777 13465 -11698 7589 -2226 -3085 8528 -11153
2753 -11153 14162 -14900 13484 -11627 6584 -3281 -3622 6909 -12414 14416 -15547 12729
2765 12729 -11770 6100 -3305 -3380 6603 -11298 13850 -15174 12539 -12830 7331 -3618 -3075
2778 -3075 6769 -11182 12597 -15372 13085 -11939 8095 -3629 -3694 6678 -11100 13529 -14486
$$ packed form
2691A5139k8750K7422k4577J7730p683l249J2942k1497K7854k9607K7432k3404
2703a0248J7047r462q34J1953k0716K7062l1165K9859k4581J6610p398j872J1492
2716G747k1121K7294k8888K8369k5163J7625p843k475J1757k0319K6974l0071
2728a6114L0037k5359J8053r190q46J1240k0386K6989l0299K9555k5678J8492
2740F494r137j131J1635j9535K5278k7381K7242k5163J9287r815q59J1613j9681
2753a1153K5315k9062K8384k5111J8211r865l41J0531j9323K6830k9963K8276
2765A2729k4499J7870r405p5R983j7901K5148k9024K7713k5369K0161j0949N43
2778c075R844j7951K3779k7969K8457k5024K0034j1724o5J0372j7778K4629k8015
$$ plain form
2791 -14486 14145 -11415 7548 -2745 -1387 6945 -10498 12997 -15474 13349 -11097 7374
2803 7374 -2672 -1794 7132 -10684 12660 -15303 13629 -11384 6582 -4732 -1472 6463 -11863
2816 -11863 12074 -15274 13156 -12103 7359 -3731 -2307 6056 -11374 12614 -15517 12675
2828 12675 -11991 6619 -4229 -2466 5860 -10818 12116 -14848 14038 -12924 7870 -4235
2840 -4235 -725 5811 -9915 12697 -14838 14126 -11442 8091 -3072 -411 4880 -10617 13146
2853 13146 -14507 14408 -11495 8304 -3569 -1113 5670 -9886 13060 -13928 13435 -12458
2865 -12458 8974 -4222 -325 4884 -10184 13034 -14433 13704 -12563 8719 -4535 -1693
2877 -1693 3413 -9540 13055 -14725 13373 -13387 8684 -5665 -639 4649 -10178 11340 -14484
$$ packed form
2791a4486K8631k5560J8963j0293J358Q332j7443K3495k8471K8823k4446J8471
2803G374j0046Q78Q926j7816K3344k7963K8932k5013J7966j1314L260P935j8326
2816a1863K3937k7348K8430k5259J9462j1090J424Q363j7430K3988k8131K8192
2828A2675k4666J8610j0848J763Q326j6678K2934k6964K8886k6962K0794j2105
2840d235L510O536j5726K2612k7535K8964k5568J9533j1163K661N291j5497K3763
2853A3146k7653K8915k5903J9799j1873K456O783j5556K2946k6988K7363k5893
2865a2458K1432j3196L897N209j5068K3218k7467K8137k6267K1282j3254K842
2877a693N106j2953K2595k7780K8098k6760K2071j4349N026N288j4827K1518k5824
$$ plain form
2890 -14484 13848 -12579 9502 -4945 390 4970 -8941 12853 -13319 14332 -12331 9567
2902 9567 -4523 -474 6225 -8647 11627 -14523 13076 -12049 9951 -5355 -397 4896 -8719
2915 -8719 13448 -12532 13942 -12338 8899 -5558 -378 4245 -8811 12604 -13193 13592
2927 13592 -12309 9400 -5922 1181 5007 -7858 11880 -12727 14769 -12014 10147 -4966
2939 -4966 565 4425 -8967 12293 -12923 13436 -11183 9546 -4963 953 3951 -8230 11730
2952 11730 -13258 14417 -11647 10842 -4760 3060 4200 -8024 11761 -13120 13235 -12345
2964 -12345 10691 -4867 1387 3874 -8282 11888 -12868 14190 -11743 9534 -5138 1659
2976 1659 4248 -6761 11357 -12628 14089 -12544 10430 -4945 1768 3448 -8033 11472 -12397
$$ packed form
2890a4484K8332k6427K2081j4447N335M580j3911K1794k6172K7651k6663K1898
2902I567j4090M049O699j4872K0274k6150K7599k5125K2000j5306M958N293j3615
2915h719K2167k5980K6474k6280K1237j4457N180M623j3056K1415k5797K6785
2927A3592k5901K1709j5322P103L826j2865J9738k4607K7496k6783K2161j5113
2939d966N531L860j3392K1260k5216K6359k4619K0729j4509N916K998j2181J9960
2952A1730k4988K7675k6064K2489j5602P820J140j2224J9785k4881K6355k5580
2964a2345K3036j5558O254K487j2156K0170k4756K7058k5933K1277j4672O797
2976A659K589j1009J8118k3985K6717k6633K2974j5375O713J680j1481J9505k3869
$$ plain form
2989 -12397 14112 -11795 10455 -5549 2242 3654 -6265 11173 -12597 13709 -12036 10929
3001 10929 -5541 2099 3258 -6088 11792 -12411 14345 -12599 9882 -5759 2813 3480 -7019
3014 -7019 10867 -12793 13778 -11964 10608 -5694 2848 3714 -7327 10969 -12616 13333 -12385
3027 -12385 10597 -6537 2415 2565 -7013 10856 -12479 14590 -11218 10110 -6592 2816 2469
3040 2469 -6837 9508 -13159 13837 -12425 12013 -7053 1992 1262 -6211 10417 -11900 13917
3053 13917 -12963 11181 -6037 3445 1498 -5633 9801 -11883 12437 -11606 11002 -5869
3065 -5869 3566 1454 -5780 9901 -12006 13302 -11499 10589 -6594 2739 803 -5421 9666
3078 9666 -11041 12586 -11666 9673 -7679 3260 1686 -6513 8862 -11921 12294 -12069
$$ packed form
2989a2397K6509k5907K2250j6004P791J412r919J7438k3770K6306k5745K2965
3001A0929j6470P640J159r346J7880k4203K6756k6944K2481j5641Q572O67j0499
3014g019J7886k3660K6571k5742K2572j6302Q542Q66j1041J8296k3585K5949k5718
3027a2385K2982j7134Q952J50r578J7869k3335K7069k5808K1328j6702R408l47
3040B469r306J6345k2667K6996k6262K4438j9066R045p30p473J6628k2317K5817
3053A3917k6880K4144j7218R482j947p131J5434k1684K4320k4043K2608j6871
3065e869R435k112p234J5681k1907K5308k4801K2088j7183R333j936o224J5087
3078I666k0707K3627k4252K1339j7352J0939j574q199J5375k0783K4215k4363
$$ plain form
3090 -12069 11382 -5343 3344 1267 -5063 10277 -12219 11926 -12951 11334 -7480 3156
3102 3156 742 -4165 10047 -11242 12704 -12192 9887 -8072 4052 70 -5331 9000 -11526
3115 -11526 13416 -12966 10090 -7340 3711 419 -5849 8981 -11350 12903 -13131 10015
3127 10015 -8071 3879 449 -5631 8621 -11441 12691 -11759 10375 -6956 3072 1171
3139 1171 -3999 9087 -12452 12520 -11673 10404 -7732 3925 -192 -4328 8101 -11420 12465
3152 12465 -11689 10109 -7440 4278 629 -4615 8427 -10617 12330 -11442 10515 -8030
3164 -8030 4139 176 -4152 7678 -10980 11959 -12255 10527 -7017 4223 -108 -3973 7315
3177 7315 -10851 11927 -12170 11001 -8112 3479 -26 -4050 7411 -11368 12637 -11467
$$ packed form
3090a2069K3451j6725Q687k077o330J5340k2496K4145k4877K4285j8814J0636
3102C156k414m907J4212k1289K3946k4896K2079j7959J2124l982n401J4331k0526
3115a1526K4942k6382K3056j7430J1051l292o268J4830k0331K4253k6034K3146
3127A0015j8086J1950l430o080J4252k0062K4132k4450K2134j7331J0028j901
3139A171n170J3086k1539K4972k4193K2077j8136J1657m117m136J2429j9521K3885
3152A2465k4154K1798j7549J1718l649n244J3042j9044K2947k3772K1957j8545
3164h030J2169l963m328J1830j8658K2939k4214K2782j7544J1240m331l865J1288
3177G315j8166K2778k4097K3171j9113J1591l505m024J1461j8779K4005k4104
$$ plain form
3189 -11467 10339 -7508 4337 -244 -3520 6318 -10669 10331 -11785 10499 -8378 4170
3201 4170 -456 -3180 7407 -10311 11478 -11024 12045 -7853 4296 -1176 -3799 6823 -9818
3214 -9818 12149 -12387 11818 -8520 4661 -422 -2782 6002 -10129 11359 -11685 10418 -9221
3227 -9221 4956 -1002 -2642 6816 -9798 11547 -12233 10765 -8489 4264 -2086 -2399 6137
3240 6137 -9784 12331 -10626 11312 -9260 4138 -1390 -3609 6474 -9172 10812 -12379
3252 -12379 10167 -7782 4159 -1315 -3439 6503 -9935 11731 -12094 10661 -8138 5003
3264 5003 -663 -2058 6421 -9275 11249 -12333 10454 -9036 5405 -1413 -2206 5738 -9466
3277 -9466 10238 -12091 10114 -8734 4509 -1394 -2543 6508 -9137 11504 -11077 10623 -7783
$$ packed form
3189a1467K1806j7847J1845m581l276R838j6987K1000k2116K2284j8877J2548
3201D170m626k724J0587j7718K1789k2502K3069j9898J2149n472k623J0622j6641
3214i818K1967k4536K4205k0338J3181n083k360Q784j6131K1488k3044K2103j9639
3227i221J4177n958j640R458j6614K1345k3780K2998j9254J2753o350l13Q536
3240F137j5921K2115k2957K1938k0572J3398n528k219J0083j5646J9984k3191
3252a2379K2546j7949J1941n474k124R942j6438K1666k3825K2755j8799J3141
3264E003n666j395Q479j5696K0524k3582K2787j9490J4441o818p93P944j5204
3277i466J9704k2329K2205j8848J3243n903j149R051j5645K0641k2581K1700j8406
$$ plain form
3290 -7783 5536 -1689 -1891 5088 -7226 11785 -10540 11240 -7964 5190 -2179 -2339 6426 -8960
3304 -8960 10942 -11508 10523 -7751 5687 -1507 -1973 5901 -9516 10647 -11237 10614 -9486
3317 -9486 5625 -2865 -2215 5753 -9148 10964 -11802 10749 -8622 4995 -1975 -2122 3789 -8202
3331 -8202 10419 -10720 10534 -8096 4810 -2265 -342 5152 -7277 10640 -9760 10933 -9369
3344 -9369 5305 -2012 -1557 5405 -7990 10065 -10493 11214 -8300 6722 -2824 -412 4623
3357 4623 -7840 10369 -10506 10569 -8955 5438 -1944 -1200 3624 -8358 10156 -10266 9428
3370 9428 -8972 6040 -2579 -924 3920 -7862 9091 -9791 10344 -8275 6844 -2185 -613
3383 -613 4308 -6672 10080 -9563 10223 -8258 5975 -2932 -624 4788 -7124 9041 -9738
$$ packed form
3290g783J3319p225k02O979j2314J9011k2325K1780j9204J3154p369j60Q765j5386
3304h960J9902k2450K2031j8274J3438p194m66P874j5417K0163k1884K1851k0100
3317i486J5111q490O50P968j4901K0112k2766K2551j9371J3617o970j47N911j1991
3331h202J8621k1139K1254j8630J2906p075J923N494j2429J7917k0400K0693k0302
3344i369J4674p317M55O962j3395J8055k0558K1707j9514J5022r546K412N035
3357D623j2463J8209k0875K1075j9524J4393p382P44M824j1982J8514k0422J9694
3370I428j8400J5012q619J655M844j1782J6953j8882K0135j8619J5119r029J572
3383f13M921j0980J6752j9643J9786j8481J4233q907K308N412j1912J6165j8779
$$ plain form
3396 -9738 9522 -8418 6894 -2508 -49 5368 -6661 9773 -9755 10685 -7536 6730 -1915
3409 -1915 -820 4602 -6281 8516 -10426 9940 -7641 6095 -2857 -83 4694 -6314 8493
3422 8493 -9785 10077 -7877 6620 -2837 -1054 3266 -5821 8383 -8656 9538 -8106 6535
3435 6535 -2700 571 3818 -7252 9257 -8785 9955 -7642 5843 -3760 -1226 3835 -7147
3448 -7147 8748 -9075 8540 -7285 7111 -3061 586 4871 -4400 8784 -10139 9735 -9320
3461 -9320 5487 -2388 -277 3077 -7282 7848 -10113 9729 -8875 5742 -4035 -523 2725
3474 2725 -5498 8258 -8787 8832 -8457 6584 -3614 548 2056 -5226 7945 -9354 9598
3487 9598 -8422 5420 -2974 224 3469 -6482 9111 -8381 8907 -7978 6608 -3236 306
$$ packed form
3396i738J9260j7940J5312r402K459N417j2029J6434j9528K0440j8221J4266q645
3409a915J095N422j0883J4797j8942K0366j7581J3736q952K774M777j1008J4807
3422H493j8278J9862j7954J4497r457J783M320r087J4204j7039J8194j7644J4641
3435F535r235L271L247j1070J6509j8042J8740j7597J3485r603K534N061j0982
3448g147J5895j7823J7615j5825J4396j0172L647M285r271J3184j8923J9874j9055
3461i320J4807p875K111L354j0359J5130j7961J9842j8604J4617r777L512L248
3474B725q223J3756j7045J7619j7289J5041j0198M162J508p282J3171j7299J8952
3487I598j8020J3842q394L198L245r951J5593j7492J7288j6885J4586r844L542
$$ plain form
3500 306 3340 -5714 8359 -8605 9274 -8473 6482 -3750 -93 2157 -5899 8760 -8518
3513 -8518 9834 -8879 7314 -4105 -114 2576 -4943 7558 -9445 9470 -8201 6400 -3734
3526 -3734 1713 1132 -5736 7715 -9019 8968 -8387 6442 -3809 1028 2477 -4883 7207
3539 7207 -9395 8626 -8028 6552 -4247 927 1913 -5613 7620 -8936 8031 -8285 6857
3552 6857 -4169 1444 1900 -5066 6781 -8277 8343 -7896 5327 -4614 1293 2145 -5036 6594
3566 6594 -8113 9513 -7786 6854 -4471 435 2231 -4298 6620 -8915 7824 -8531 6627
3579 6627 -3734 860 1662 -5425 7186 -8069 8986 -7719 5609 -3513 1594 1805 -4737 7705
3593 7705 -8135 8332 -8916 6585 -4365 1758 760 -4266 6066 -7598 9036 -8475 6705
$$ packed form
3500C06L034r054J4073j6964J7879j7747J4955j0232L657K250q056J4659j7278
3513h518J8352j8713J6193j1419L991K690p519J2501j7003J8915j7671J4601j0134
3526c734N447n81o868J3451j6734J7987j7355J4829j0251M837J449p360J2090
3539G207j6602J8021j6654J4580j0799N174R86p526J3233j6556J6967j6316J5142
3552F857j1026N613M56o966J1847j5058J6620j6239J3223r941N907Q52p181J1630
3566F594j4707J7626j7299J4640j1325M906J796o529J0918j5535J6739j6355J5158
3579F627j0361M594Q02p087J2611j5255J7055j6705J3328r122N107K11o542J2442
3593G705j5840J6467j7248J5501j0950O123r98n026J0332j3664J6634j7511J5180
$$ plain form
3606 6705 -3724 1392 854 -5212 6781 -7149 8091 -8083 6328 -4691 1357 1034 -4402 6605
3620 6605 -7290 8586 -7402 6762 -5299 1791 862 -4621 6635 -8512 8454 -8077 6584
3633 6584 -4697 2274 1228 -3909 5905 -7461 8225 -7385 7028 -4579 879 1065 -3382 5949
3647 5949 -7826 7649 -6805 7225 -4601 1155 1534 -4219 6021 -7314 7584 -8762 7368
3660 7368 -4534 2304 1311 -3526 5324 -7191 8662 -6799 6190 -5318 1430 1143 -3729 5294
3674 5294 -7599 7725 -7234 6643 -4572 2756 118 -3670 5735 -7688 8334 -7812 5732
3687 5732 -4013 1570 76 -2991 5738 -6337 7466 -7758 6185 -5028 2072 1484 -3283 5302
3701 5302 -7111 8210 -8152 6918 -4973 2511 304 -2519 5894 -7906 7931 -8351 6568
$$ packed form
3606F705j0429N116n38o066J1993j3930J5240j6174J4411j1019O048l23n436J1007
3620F605j3895J5876j5988J4164j2061P090r29n483J1256j5147J6966j6531J4661
3633F584j1281O971j046n137R814j3366J5686j5610J4413j1607N458J86m447R331
3647E949j3775J5475j4454J4030j1826N756L79n753J0240j3335J4898j6346J6130
3660G368j1902O838r93m837Q850j2515J5853j5461J2989j1508O748k87m872R023
3674E294j2893J5324j4959J3877j1215P328k638l788R405j3423J6022j6146J3544
3687E732r745N583j494l067Q729j2075J3803j5224J3943j1213P100n88m767Q585
3701E302j2413J5321j6362J5070j1891P484k207k823Q413j3800J5837j6282J4919
$$ plain form
3714 6568 -5435 1644 888 -3741 4412 -6787 8504 -9070 7061 -5475 2424 139 -2973 4552
3728 4552 -7005 7606 -6992 6600 -5121 2035 204 -2522 4187 -6951 7590 -7394 6778
3741 6778 -4069 2408 -696 -2646 4660 -6829 7523 -7861 6222 -4618 1986 65 -2735
3754 -2735 5476 -6270 7677 -7074 6216 -5057 3418 -979 -2984 4988 -5974 7208 -8317
3767 -8317 6269 -5111 2427 -183 -2557 3445 -7225 8382 -7955 6042 -4287 2692 -680
3780 -680 -2183 4342 -6303 7578 -7276 6691 -4994 2067 200 -3425 4858 -6167 7427
3793 7427 -7731 7574 -4270 2742 -176 -3020 5273 -6452 6562 -7618 6313 -4313 3008
3806 3008 -727 -2394 4637 -6349 7708 -7719 6747 -5351 3862 -930 -1241 4713 -5790 6994
$$ packed form
3714F568j2003P079p56m629Q153j1199J5291j7574J6131j2536P899k285l112P525
3728D552j1557J4611j4598J3592j1721P156j831k726O709j1138J4541j4984J4172
3741F778j0847O477l104j950P306j1489J4352j5384J4083j0840O604j921k800
3754b735Q211j1746J3947j4751J3290j1273Q475m397k005P972j0962J3182j5525
3767h317J4586j1380P538k610k374O002j0670J5607j6337J3997j0329O979l372
3780f80j503O525j0645J3881j4854J3967j1685P061j867l625Q283j1025J3594
3793G427j5158J5305j1844P012k918k844Q293j1725J3014j4180J3931j0626P321
3806C008l735j667P031j0986J4057j5427J4466j2098R213m792l11N954j0503J2784
$$ plain form
3820 6994 -6225 6263 -4895 3098 -298 -2354 3940 -5578 7494 -7612 6584 -5427 3394
3833 3394 -750 -1579 4565 -6027 8054 -7534 6463 -4858 2863 -775 -1385 4800 -6512 7185
3847 7185 -7327 7582 -5559 4251 -629 -2074 4329 -6829 6141 -7073 6953 -4938 2928
3860 2928 -600 -1328 3865 -6055 7381 -6834 6969 -5704 3525 -379 -1749 3751 -6599 7161
3874 7161 -7315 7523 -6505 4109 -867 -1147 3391 -4962 7263 -7683 6820 -5352 3241
3887 3241 -1372 -1198 3074 -5183 7261 -6458 6249 -5751 3463 -1694 -900 2722 -5907 6672
3901 6672 -7579 6482 -5006 3690 -794 -1283 4006 -5448 6715 -6843 6671 -5905 4975
3914 4975 -632 -1700 3292 -5620 6344 -7499 7009 -5867 4006 -2452 -957 3828 -5580 6439
$$ packed form
3820F994j3219J2488j1158P993l396k056O294r518J3072j5106J4196j2011Q821
3833C394m144q29O144j0592J4081j5588J3997j1321P721l638o10O185j1312J3697
3847G185j4512J4909j3141R810m880j445O403j1158J2970j3214J4026j1891P866
3860B928l528p28N193r920J3436j4215J3803j2673R229l904j370N500j0350J3760
3874G161j4476J4838j4028J0614m976k80M538q353J2225j4946J4503j2172Q593
3887C241m613J74M272q257J2444j3719J2707j2000R214n157P94L622q629J2579
3901F672j4251J4061j1488Q696m484m89N289r454J2163j3558J3514j2576J0880
3914D975n607j068M992q912J1964j3843J4508j2876R873o458J495M785r408J2019
$$ plain form
3928 6439 -6881 7467 -6168 3117 -1196 -1593 2440 -4533 6799 -6214 6410 -5487 4627
3941 4627 -2182 -510 2933 -6223 6390 -7701 7409 -4616 4481 -1620 -853 2563 -5281 6795
3955 6795 -7073 7295 -5034 4493 -591 -1309 3253 -4976 7249 -7603 7141 -5203 4530
3968 4530 -1038 -715 2397 -5302 7700 -6795 6984 -6104 4172 -1221 143 2424 -4624 6896
3982 6896 -7804 6774 -5020 3949 -1929 326 2452 -4364 5592 -6858 6563 -5800 2937
3995 2937 -1801 -689 3625 -3833 6698 -7386 6598 -5758 4300 -2543 -939 4027 -5147 5503
4009 5503 -6567 7577 -5807 4236 -2463 -175 3558 -5043 6247 -6732 6770 -6532 3681
4022 3681 -2462 452 2593 -4986 5802 -5978 6704 -5920 2666 -1444 -654 2235 -3515 5560
$$ packed form
3928F439j3320J4348j3635R285m313l97M033o973J1332j3013J2624j1897J0114
3941D627o809J672L443r156J2613j4091J5110j2025R097o101P67L416p844J2076
3955F795j3868J4368j2329R527n084p18M562q229J2225j4852J4744j2344R733
3968D530n568L23L112p699J3002j4495J3779j3088J0276n393J364K281p048J1520
3982F896j4700J4578j1794Q969n878K255K126o816R956j2450J3421j2363Q737
3995B937m738J112M314p458J0531j4084J3984j2356J0058o843J604M966r174J0650
4009E503j2070J4144j3384J0043o699K288L733q601J1290j2979J3502j3302J0213
4022C681o143K914K141p579J0788j1780J2682j2624Q586m110P90K889n750R075
$$ plain form
4036 5560 -6631 8011 -5627 4209 -3010 -815 2263 -4462 6667 -7407 6219 -6031 4125
4049 4125 -2053 -113 2520 -5009 5396 -6261 7655 -5523 4284 -2719 581 1938 -4778 5409
4063 5409 -6483 5795 -5668 4416 -2988 162 2416 -4641 5583 -5966 6083 -6717 3962
4076 3962 -2825 728 1548 -4219 5188 -6764 7509 -5812 3497 -2012 390 2628 -5528 5703
4090 5703 -5751 6780 -6382 5176 -3642 1413 1237 -5830 6253 -5645 6250 -6316 5219
4103 5219 -4109 1135 1620 -3472 5905 -6680 6436 -6630 5099 -3401 -63 1116 -3388 5093
4117 5093 -6320 6719 -5968 3906 -2740 194 2064 -2830 6231 -4690 6776 -5984 4915
4130 4915 -3704 608 1383 -2819 4674 -6707 6645 -6372 4528 -1846 91 1694 -2305 3554
$$ packed form
4036E560j2191J4642j3638R836p219K195L078o725J1129j4074J3626j2250J0156
4049D125o178J940K633p529J0405j1657J3916j3178R807p003L300J357o716J0187
4063E409j1892J2278j1463J0084p404L150K254p057J0224j1549J2049j2800J0679
4076C962o787L553Q20n767R407j1952J4273j3321R309n509K402K238q156J1231
4090E703j1454J2531j3162J1558q818N055j76p067J2083j1898J1895j2566J1535
4103E219r328N244M85n092R377j2585J3116j3066J1729q500L338J179m504Q481
4117E093j1413J3039j2687R874o646K934J870m894R061j0921J1466j2760J0899
4130D915q619M312P75m202P493j1381J3352j3017J0900o374J937J603l999N859
$$ plain form
4144 3554 -5790 6233 -4367 3570 -2467 1775 1986 -2542 4708 -6265 6533 -5529 3969 -3371
4158 -3371 1267 1695 -4281 5072 -6349 5684 -6439 4004 -2044 296 905 -2933 5414 -5957
4172 -5957 5713 -5381 4955 -2632 1214 1280 -2718 5036 -6099 6754 -5523 4306 -3543 340
4186 340 1567 -3814 4722 -5285 6143 -7134 4922 -2179 1460 1731 -2784 5145 -5929 6437
4200 6437 -5717 4771 -3425 1066 359 -3351 4370 -5098 6065 -5685 5505 -3685 1272 795
4214 795 -2574 5342 -5234 5615 -5910 3899 -2083 974 165 -1886 4712 -5294 6460 -6067
4228 -6067 5340 -3460 1027 631 -2472 5169 -5586 6901 -6098 3717 -3836 1147 -282 -3933
4242 -3933 4465 -5313 6058 -5596 4888 -2961 409 740 -2810 3141 -5195 6075 -5944 4473
$$ packed form
4144C554r344J2023j0600P937o037M242K11m528P250j0973J2798j2062R498p340
4158c371M638M28n976R353j1421J2033j2123J0443o048K340O09l838Q347j1371
4172e957J1670j1094J0336p587L846O6l998P754j1135J2853j2277R829p849L883
4186C40J227n381Q536j0007J1428j3277J2056p101L639K71m515P929j1074J2366
4200F437j2154J0488q196M491p07l710P721r468J1163j1750J1190r190M957m77
4214G95l369P916j0576J0849j1525R809n982L057q09k051O598j0006J1754j2527
4228f067J1407q800M487l96l103P641j0755J2487j2999R815p553M983j429l651
4242c933Q398r778J1371j1654J0484p849L370L31l550N951q336J1270j2019J0417
$$ plain form
4256 4473 -2456 1023 681 -3824 5011 -5944 5567 -5531 4817 -2665 2001 1221 -2424 4572
4270 4572 -6193 6529 -6408 4093 -3169 2384 11 -1197 3562 -3671 5086 -5424 4387 -4004
4284 -4004 650 -525 -2581 4877 -4279 5608 -5073 5129 -3541 2000 1279 -2929 3960 -4818 6635
4299 6635 -5265 4995 -4229 2380 1123 -3166 5206 -5602 6323 -5972 5394 -1825 1914
4312 1914 -395 -3667 3135 -5343 5340 -6335 5047 -3151 2068 191 -2608 3377 -5393 5511
4326 5511 -5423 5252 -4124 1825 -440 -1566 4417 -4860 5700 -5430 4634 -2678 1220 620
4340 620 -1363 3823 -5526 5991 -5156 4450 -3909 1541 80 -2010 4763 -5949 6240 -5660
4354 -5660 4455 -2792 2344 386 -1738 3312 -5112 4506 -5371 4973 -4098 1781 -122 -1729
$$ packed form
4256D473o929L479l42m505Q835j0955J1511j1098J0348p482M666p80l645O996
4270D572j0765J2722j2937J0501p262N553k373j208M759p233Q757j0510R811q391
4284d004M654j175k056P458r156R887j0681J0202q670N541p21m208O889q778J1453
4299F635j1900J0260r224O609j257m289Q372j0808J1925j2295J1366p219L739
4312A914k309l272O802q478J0683j1675J1382q198N219j877k799N985q770J0904
4326E511j0934J0675r376N949k265j126N983r277J0560j1130J0064p312L898o00
4340F20j983N186r349J1517j1147R606q359N450j461k090O773j0712J2189j1900
4354e660J0115p247N136j958k124N050q424R618r877J0344r071N879j903j607
$$ plain form
4368 -1729 3716 -4680 4236 -6094 4392 -3697 1450 -597 -2039 3246 -4821 5192 -4786 5341
4382 5341 -2167 1642 -1209 -1245 3725 -5601 4682 -5746 4435 -3317 2059 -225 -1271 2800 -4259
4397 -4259 5362 -4988 3996 -4045 1415 58 -2414 3214 -3485 6076 -5489 4372 -4249 1251
4411 1251 502 -1109 3280 -4362 4967 -5071 4235 -3261 2332 -417 -1294 1400 -3856 4214 -4983
4426 -4983 3691 -4967 874 -1033 -673 2983 -4762 5165 -4981 4799 -3595 2856 591 -1629 3641
4441 3641 -4291 3286 -4751 4360 -3424 1726 -491 -1165 2898 -3860 5158 -4788 5880 -3897 1105
4456 1105 -326 -651 2738 -4585 4080 -5290 4467 -2954 1690 121 -944 3015 -3975 3272 -4691
4471 -4691 4314 -3509 1664 -346 -1719 2344 -4472 4245 -4858 4325 -4241 2137 -560 -1212 3253
$$ packed form
4368a729N445q396Q916j0330J0486q089N147k047j442N285q067J0013r978J0127
4382E341p508L809k851l6M970r326J0283j0428J0181p752N376k284j046M071p059
4397d259R621j0350Q984q041N460j357k472N628o699R561j1565R861q621N500
4411A251p49j611M389p642R329j0038R306p496N593k749q77K694n256Q070r197
4426d983Q674q658N841j907L60L656p745R927j0146R780q394O451k265k220N270
4441C641p932P577q037R111p784N150k217o74M063o758R018r946J0668r777N002
4456A105j431l25L389p323Q665r370R757p421M644j569j065L959o990P247p963
4471d691R005p823N173k010j373M063o816Q717r103R183q566O378k697o52M465
$$ plain form
4486 3253 -4086 5400 -4968 4447 -3732 2054 -325 -207 2116 -3880 4564 -5208 4410 -3348 2944
4501 2944 -702 -811 2995 -3643 4323 -4546 4641 -4660 2164 -598 -1279 2419 -2646 4700 -5820
4516 -5820 4184 -3521 984 -744 -1066 1618 -4120 4419 -4416 3676 -3417 2290 373 -1705 2088
4531 2088 -3270 3915 -4068 4291 -3039 1945 -1303 -1410 3018 -3725 3577 -4914 4619 -2484 2388
4546 2388 -285 -823 1723 -3326 3877 -4002 3732 -3629 3034 -860 -780 2559 -3501 4179 -4862 3888
4562 3888 -3820 2373 -1356 -731 2452 -3078 4179 -4481 4624 -3697 1719 -52 -1332 1709 -2627
4577 -2627 3726 -3823 4416 -3491 2245 -726 -583 2188 -2642 4319 -4947 4006 -3127 1814 -1397
4592 -1397 -396 1918 -2700 3102 -4489 3582 -2785 3002 -547 -1137 1570 -3166 3698 -3274 3976
$$ packed form
4486C253p339R486j0368R415q179N786k379J18K323n996Q444r772R618p758O292
4501B944l646j09L806o638P966q869R187r301O824k762o81L698n065P346j0520
4516e820J0004p705M505j728l22K684n738Q539q835Q092p093N707j917k078L793
4531B088n358P185p983Q359p330M984l248j07M428o743P302q491R533p103M872
4546B388k673n38K546n049P203p879P734p361O663l894Q0L339o060P680r041Q750
4562C888p708O193l729O25L183n530P257q660R105q321N416j771j280L041m336
4577b627O353p549Q239p907N736k971J43K771m830O961r266Q953p133M941l211
4592a397J001K314m618N802p591Q071o367N787l549n90K707m736O864o972P250
$$ plain form
4607 3976 -2787 3125 -816 -1808 1900 -3176 3687 -5078 4633 -2856 1392 -212 -348 1929 -3840
4622 -3840 4103 -3563 4177 -2644 2250 -1620 -1056 1993 -2684 3470 -5395 4001 -3050 2674 -1635
4637 -1635 -457 1985 -3281 3562 -4467 4031 -2976 2675 -1807 457 2056 -2025 4611 -3671 4090
4652 4090 -4052 2547 -736 -426 1143 -2631 4295 -3687 3888 -4250 2330 -1218 -491 2164 -2171
4667 -2171 3954 -4704 4689 -3017 2344 -1178 575 1877 -3288 3536 -4402 3865 -3907 3113 -1323
4682 -1323 654 1984 -3223 3823 -3641 4771 -3790 2718 -2689 -380 931 -3006 2999 -3473 4252
4697 4252 -3583 2956 -1849 -148 817 -2489 3885 -4384 3789 -3661 2740 -1612 418 2249 -2414
4712 -2414 3806 -3620 3593 -4064 3053 -1681 143 888 -2891 3777 -3629 3065 -3515 1865 -1593
$$ packed form
4607C976o763N912l941r92L708n076O863q765R711p489M248j604j36K277n769
4622c840P943p666P740o821M894l870N64L049m677O154q865R396p051N724m309
4637a635J178K442n266O843q029Q498p007N651m482K264J599m081O636q282P761
4652D090q142O599l283L10J569l774O926p982P575q138O580l548P27K655m335
4667b171O125q658R393p706N361l522J753J302n165O824p938Q267p772P020m436
4682a323J977J330n207P046p464Q412q561O508n407K309J311l937O005o472P725
4697D252p835O539m805J701R65l306O374q269Q173p450O401m352K030J831m663
4712b414O220p426P213p657P117m734J824P45l779O668p406O694o580N380l458
$$ plain form
4727 -1593 926 404 -2043 4392 -4297 4181 -2260 4361 -1179 -697 1900 -2643 3297 -3967 3703
4742 3703 -4153 2549 -1302 -501 1046 -1893 2701 -3678 4347 -3404 2825 -1808 -406 1573 -3089
4757 -3089 2927 -3074 3528 -2906 1971 -495 184 750 -1210 2365 -4449 4089 -3174 3641 -1519
4772 -1519 -536 1768 -2570 2611 -3212 4361 -2658 2879 -1071 427 1047 -1926 3341 -3196 4249
4787 4249 -3561 2966 -1969 -343 722 -2689 3730 -3714 2721 -3254 2833 -782 279 625 -3725
4802 -3725 3275 -3229 4011 -2032 2887 -1592 661 1017 -2105 3867 -2485 4097 -3064 2752 -1809
4817 -1809 141 316 -2910 3212 -3809 3780 -4042 2721 -1687 576 400 -2543 2449 -3913 3367
4832 3367 -2362 2427 -989 -312 541 -2491 2405 -3092 3824 -3702 2649 -794 517 1437 -1196 3755
$$ packed form
4727a593K519n22k447O435q689Q478o441O621n540M82K597m543N940p264P670
4742C703p856O702l851Q01J547k939M594o379Q025p751O229m633J402J979m662
4757c089O016o001O602o434M877k466O79N66j960L575o814Q538p263O815n160
4772a519R83K304m338N181n823P573p019N537l950J498O20k973N267o537P445
4787D249p810O527m935J626J065l411O419p444O435n975O087l615J061L46m350
4802c725P000o504P240o043M919m479K253L56l122N972o352O582p161N816m561
4817a809J950J75l226O122p021P589p822O763m408K263j76k943M992o362P280
4832C367n729M789l416O77Q53l032M896n497O916p526O351l443J311R20k633M951
$$ plain form
4848 3755 -4044 3886 -3232 3065 -1943 381 805 -1761 2599 -4754 3323 -2876 3140 -1833 276
4863 276 1331 -911 4047 -4400 3861 -4535 2289 -1269 481 676 -2945 2182 -2888 2816 -3649
4878 -3649 2625 -1497 248 282 -1835 2853 -3745 5095 -3818 2697 -1937 389 319 -988 2497 -3488
4894 -3488 3506 -2937 2264 -1816 779 1178 -1489 3077 -2951 3105 -3136 2677 -1739 1118 896
4909 896 -1742 2976 -3762 3695 -3976 2376 -1574 316 -39 -2446 4050 -3641 3210 -2530 2368
4924 2368 -1907 -228 721 -1605 2298 -3315 3582 -2971 2807 -1850 738 538 -1959 3105 -2930
4939 -2930 3233 -3794 3270 -2129 109 1427 -2192 2163 -3541 3009 -3558 3325 -2683 766 181
4954 181 -1623 3666 -3058 3309 -2543 3491 -2974 1172 170 -2342 3231 -3022 4449 -2348 3415
$$ packed form
4848C755p799P930p118O297n008K324M24k566M360p353Q077o199O016m973K109
4863B76J055k242M958q447Q261q396O824l558J750J95l621N127n070N704o465
4878c649O274m122J745L4k117M688o598Q840q913O515m634K326p0j307L485n985
4894c488O994o443N201m080K595L99k667M566o028O056o241N813m416K857k22
4909H96k638M718o738P457p671O352l950J890l55k407O496p691O851n740M898
4924B368m275J679R49k326L903n613O897o553N778m657K588k00k497N064o035
4939b930O163p027P064n399K238J318l619M355n704O550o567O883o008L449n85
4954A81j804N289o724O367n852O034o465M146j002k512N573o253P471o797N763
$$ plain form
4969 3415 -2252 -606 877 -2529 3105 -3419 3332 -4035 3603 -1252 978 197 -2310 3298 -4204
4984 -4204 3981 -3169 2705 -2544 689 523 -1749 2661 -3691 3461 -3818 2370 -2199 1117 -191
4999 -191 -1579 2358 -3359 4401 -3232 3056 -2534 2084 1283 -1830 2590 -2736 2661 -3738 3425
5014 3425 -2523 362 173 -1666 3389 -2402 2556 -3619 2998 -1858 1016 152 -1186 1829 -3693
5029 -3693 3694 -3231 2932 -2080 419 -203 -870 2456 -3507 3203 -3021 3145 -2506 1347 479 -1027
5045 -1027 2916 -2839 4195 -3708 3388 -2177 843 -310 -950 2624 -3113 3142 -2856 2699 -1787
5060 -1787 2173 515 -2258 2046 -2697 3462 -3286 2541 -1987 976 606 -1859 2413 -2805 2832
5075 2832 -3858 2573 -2497 2189 89 -1987 1773 -3179 3511 -3929 2425 -1673 1178 334 -1190
$$ packed form
4969C415n667J646J483l406N634o524O751p367P638m855K230p81k507N608p502
4984d204Q185p150N874n249L233j66k272M410o352P152p279O188m569L316j308
4999a91j388L937n717P760p633O288n590M618q01l113M420n326N397o399P163
5014C425n948K885j89j839N055n791M958o175O617m856K874q64j338L015n522
5029c693P387o925O163n012K499o22o67L326n963O710o224O166n651L853q68j506
5045a027L943n755P034p903P096n565L020j153o40L574n737O255n998N555m486
5060a787L960j658k773M304m743O159o748N827m528K963l70k465M272n218N637
5075B832o690O431n070M686k100k076L760m952O690p440O354m098K851q44j524
$$ plain form
5090 -1190 2607 -3117 3020 -2954 3140 -2723 1112 -647 -1811 2233 -3293 3227 -3785 3535 -2280
5105 -2280 1983 1147 -717 2881 -3748 3161 -3163 2556 -2818 889 -272 -1208 3217 -2535 2986
5120 2986 -3620 2480 -1765 286 -149 -895 1170 -2469 3430 -3666 3412 -2083 2014 -572 -597 1579
5136 1579 -2458 3351 -3840 3587 -2348 584 247 -677 2110 -3391 3587 -3565 2814 -2430 2374
5151 2374 -60 -1013 1857 -2679 3659 -3427 3538 -2172 24 253 -633 2681 -2976 5006 -2741 2713
5167 2713 -2890 1526 -200 -715 1839 -2475 2826 -3096 3323 -1688 1212 -964 -927 1999 -3050 3680
5183 3680 -3255 3383 -1443 1563 -206 -1312 2417 -2666 3163 -3917 3276 -3063 1655 -671 -1116
5198 -1116 3126 -3616 3103 -3063 2362 -1685 2438 65 -1037 1733 -1717 2946 -3723 3221 -1744
$$ packed form
5090a190L797n724O137n974O094n863L835j759j164M044n526O520p012P320n815
5105b280M263q36j864L598o629O909o324N719n374L707j161r36M425n752N521
5120B986o606O100m245K051m35p46K065l639N899p096P078n495M097k586k5K176
5136A579m037N809p191P427n935K932l37r24K787n501O978p152O379n244M804
5151B374k434r53K870m536O338p086O965n710K196K29q86L314n657P982p747N454
5167B713n603M416j726n15K554m314N301n922O419n011K900k176L7K926n049O730
5183C680o935O638m826L006j769j106L729n083N829p080P193o339M718k326m45
5198a116M242o742O719o166N425m047M123k373j102K770l450M663o669O944m965
$$ plain form
5213 -1744 892 -1034 -997 2018 -2347 2882 -3455 1504 -3061 993 71 -531 2665 -2440 3533 -4148
5229 -4148 2948 -2542 1137 -323 -476 443 -2570 2379 -3346 3987 -2338 633 -469 -462 2171 -2350
5245 -2350 3317 -3420 3107 -2146 1567 -402 -716 1409 -2685 3757 -2691 3041 -1806 1351 -496
5260 -496 -424 1912 -2941 3245 -2674 2950 -1172 1446 -641 -967 1939 -3538 2457 -2880 3134 -2259
5276 -2259 1578 -186 -829 1177 -2046 3188 -2746 3486 -2079 2019 -706 -530 1650 -2218 2781
5291 2781 -3322 2460 -2820 1890 -782 -635 1720 -1944 2851 -2798 2704 -1880 2474 -1352 364
5306 364 2505 -2367 3422 -3863 3381 -3394 2206 -558 -1277 490 -2271 2739 -3970 2980 -2566
5321 -2566 1604 -984 -1066 1350 -2150 2337 -2789 3524 -2637 1696 -358 686 2359 -2731 2758
$$ packed form
5213a744K636j926L7L015m365N229o337M959m565M054r22o02L196n105N973p681
5229d148P096n490L679j460j53R19l013M949n725P333o325K971j102PK633m521
5245b350N667o737O527n253L713j969l14K125m094O442o448N732m847L157j847
5260d96P2K336m853O186n919N624m122K618k087l26K906n477N995n337O014n393
5276b259L837j764o43K006l223N234n934O232n565M098k725J76K180l868M999
5291B781o103N782n280M710k672J47K355l664M795n649N502m584M354l826J716
5306C64K141m872N789p285P244o775N600k764p19J767k761N010o709O950n546
5321b566M170k588q2K416l500M487n126O313o161M333k054J044J673n090N489
$$ plain form
5336 2758 -3715 3208 -3489 1447 -54 -90 525 -1749 3500 -3823 3078 -2849 1753 -953 -1048 1486
5352 1486 -2181 3296 -2748 2932 -3139 1368 -641 233 1042 -1987 2979 -3282 2930 -2900 2293
5367 2293 601 599 638 -1336 2332 -3165 2969 -3232 1369 -367 -583 1136 -2583 2706 -3659 2769
5383 2769 -719 765 -906 142 219 -2603 2104 -2352 2425 -2698 2569 -515 300 1028 -3354 2710
5399 2710 -3209 2876 -2324 2079 -307 292 1218 -1204 1894 -3262 2834 -3345 997 -929 -352 114
5415 114 -1193 2628 -2187 3551 -3112 2400 -537 547 1415 -2491 3261 -1961 2178 -2855 1837
5430 1837 -1203 -505 1511 -1202 2549 -3561 2552 -1351 1704 -377 -37 782 -1662 2435 -2838 2940
5446 2940 -2691 2680 -1423 14 1310 -2031 1780 -2530 4019 -2169 2762 -443 130 1709 -2587
$$ packed form
5336B758o473O923o697M936j501l6O15k274N249p323O901n927M602k706r5K534
5352A486l667N477o044N680o071M507k009Q74Q09l029M966o261O212n830N193
5367B293j692kL9j974L668n497O134o201M601j736k16J719l719N289o365O428
5383B769l488J484j671J048P7k822M707m456M777n123N267l084Q15P28m382O064
5399B710n919O085n200M403k386N99R26k422L098n156O096o179M342j926N77M66
5415A14j307L821m815N738o663N512k937J084Q68l906N752n222M139n033M692
5430A837l040O98K016k713L751o110O113l903L055k081L40Q19k444M097n273N778
5446B940n631N371m103J437J296l341L811m310O549o188M931l205N73J579m296
$$ plain form
5461 -2587 2320 -3039 2631 -2173 1701 -1148 -281 723 -3080 2621 -3349 2732 -3194 1808 -793
5476 -793 559 883 -2140 2138 -3210 2936 -2730 1736 -1029 -3 1219 -1712 2429 -3015 3015
5491 3015 -1583 1627 -625 -707 2321 -999 2036 -4073 3268 -2514 2334 -714 144 1267 -2775 3303
5507 3303 -3218 2280 -2356 1466 -770 -1327 1008 -1630 2318 -2330 1887 -2216 2471 -1180 -446
5522 -446 950 -1973 2316 -2496 2653 -2574 2872 -1028 500 739 -1931 2438 -3296 2313 -2863
5537 -2863 935 -46 -91 -318 -817 2107 -1696 3983 -3339 1437 -820 1076 709 -1305 2303 -2798
5553 -2798 3307 -2680 2091 -1728 -318 -458 -1398 2995 -2327 2545 -2738 2332 -394 501 1058 -1597
5569 -1597 2290 -2450 2658 -1451 1793 -1162 -774 136 -1598 2063 -2786 2879 -2253 1537 -391
$$ packed form
5461b587M907n359N670m804L874k849Q67J004l803N701n970O081n926N002k601
5476g93J352L24l023M278n348O146n666M466k765J026J222k931M141n444O030
5491C015m598L210k252q2L028l320L035o109P341n782M848l048Q58J123m042O078
5507C303o521N498m636L822k236n57K335k638L948m648M217m103M687l651P34
5522d46J396k923M289m812N149n227N446l900J528K39k670M369n734N609n176
5537b863L798r81m5k27m99K924l803N679p322M776k257J896l67k014L608n101
5553b798O105n987M771l819J410j40r40M393n322M872n283N070k726Q95N57k655
5569a597L887m740N108m109L244k955L88R10j734L661m849N665n132L790j928
$$ plain form
5584 -391 336 86 -1478 1797 -1994 3052 -2775 749 -1027 535 -295 -337 2687 -2591 2782 -3071
5600 -3071 2418 -1629 737 1235 -1548 2300 -3251 2161 -2861 1618 -1806 -18 747 -707 2129
5615 2129 -2470 2118 -2665 2052 -1199 161 719 -1133 2208 -2737 2491 -2136 2228 -489 247
5630 247 590 -783 2591 -2700 2101 -2816 2206 -1598 382 522 -704 3146 -2444 2126 -1795 2214
5646 2214 -1766 462 1183 -1339 1576 -2340 2744 -2250 1382 -1208 1071 1086 -2002 1723 -2389 3034
5662 3034 -2021 1565 -1969 397 420 -1597 1853 -2209 2840 -2400 1966 -1312 411 516 -1102 2308
5678 2308 -2389 2103 -1997 2070 -135 18 -86 -1137 1627 -2672 3119 -2536 1824 -684 187 281
5694 281 -1604 1739 -2632 2965 -1612 1769 -1037 755 569 -1117 578 -2121 2516 -2521 2318
$$ packed form
5584c91P27k50j564L275l791N046n827L524j776J562q30m2L024n278N373n853
5600c071N489m047K366M98k783L848n551N412n022M479l424J788P65j454K836
5615B129m599M588m783M717l251J360N58j852L341m945N228m627M364k717P36
5630B47L43j373L374n291M801m917N022l804J980J40j226L850n590M570l921M009
5646B214l980K228P21k522K915l916N084m994L632k590K279J5l088L725m112N423
5662C034n055L586l534K366K3k017L450m062N049n240M366l278J723J05j618L410
5678B308m697M492m100M067k205J53j04j051K764m299N791n655M360k508Q71R4
5694B81j885L343m371N597m577L381k806J792j86j686J695k699M637n037M839
$$ plain form
5709 2318 -142 618 411 -654 1916 -1152 1457 -2789 1626 -1200 593 544 -1072 2133 -1734 2260
5725 2260 -1504 1983 -1923 1513 939 -438 2320 -1958 3130 -2408 1759 -2429 39 424 -1269
5740 -1269 1192 -2551 2634 -1657 2199 -203 362 -397 -684 1622 -2162 2003 -2017 1857 -1825 -74
5756 -74 1107 -1399 1110 -1160 3192 -2870 2104 -1049 717 -260 -998 1931 -1702 2716 -2439 1937
5772 1937 -1092 1111 53 -837 1613 -2359 2582 -797 1896 -1068 939 -201 -1030 1477 -1980
5787 -1980 1267 -1322 1210 -1832 1742 548 -973 1112 -1504 1603 -2212 1969 -929 1947 568
5802 568 -1688 1563 -2673 2645 -1831 2250 -1145 417 131 -907 1585 -2036 2180 -2560 1906
5817 1906 -1823 -56 -314 -475 1243 -1422 2627 -2719 2598 -1612 1310 -584 -10 2212 -3022 2125
$$ packed form
5709B318k460P60k07j065K570l068K609m246M415k826J793m9j616L205l867L994
5725B260l764L487l906L436n74j377K758m278N088n538M167m188K468L85j693
5740a269K461l743N185m291L856k402N65p59k87K306l784M165m020L874l682J751
5756g4J181k506K509k270M352o062M974l153J766r77p38K929l633M418n155M376
5772A937l029K203j058q90K450l972M941l379K693k964K007j140q29K507l457
5787a980L247k589K532l042L574j194j521K085k616L107l815M181k898K876j379
5802E68k256L251m236N318m476M081l395J562k86j038K492l621M216m740M466
5817A906l729J767k58j61J718k665M049n346N317m210K922j894N74K222n234N147
$$ plain form
5833 2125 -2513 1613 -2071 1716 258 -778 799 -1892 2810 -2208 1579 -1414 444 -733 -1139
5848 -1139 1128 -2130 2957 -1935 2380 -1934 110 -364 -465 992 -2610 1999 -2392 2647 -1853
5863 -1853 -183 -368 -1107 2331 -699 2124 -2158 1660 -1926 857 -1499 -1478 1330 -967 2598 -1752
5879 -1752 1982 -1664 595 143 -1417 914 -1433 2986 -2146 2050 -1855 1219 265 -800 1830
5894 1830 -2168 1763 -2729 1733 -2555 1312 135 -272 1654 -2511 1908 -1994 2443 -731 1710
5909 1710 112 -852 1741 -2180 2020 -1500 2650 -1641 1249 -1218 -540 1234 -2201 1797 -2129
5924 -2129 2282 -1642 739 -358 -627 1866 -2242 2636 -1952 1822 -2385 1210 -559 -164 738 -1032
5940 -1032 2469 -2796 2062 -2438 1040 -2156 -1027 1149 -1873 3115 -2427 1861 -1709 1930 1111
$$ packed form
5833B125m638M126l684L787j458j036J577k691M702n018L787k993J858j177m06
5848a139K267l258N087m892M315m314K044m74j01J457l602M609m391N039m500
5863a853J670j85p39L438l030K823m282L818l586K783k356K1K808k297L565m350
5879a752L734l646K259m52j560K331k347M419n132M196l905L074r54j065K630
5894A830l998L931m492M462m288L867j177m07J926m165M419l902M437l174K441
5909A710j598r64K593l921M200l520M150m291K890k467O78J774l435L998l926
5924b129M411l924K381j097k69K493m108M878m588L774m207L595j769L95R02j770
5940a032L501n265M858m500L478l196J129K176l022M988n542M288l570L639q19
$$ plain form
5955 1111 -479 1559 -1243 1636 -2309 2199 -972 1468 -170 -131 43 -2672 1168 -1862 2596 -2425
5971 -2425 1157 -758 240 1396 -2286 2194 -1955 2193 -1052 1557 -410 -92 1006 -1377 1889
5986 1889 -1879 2296 -2348 630 -1501 -434 296 -1056 3180 -1643 758 -1524 758 -376 -1053
6001 -1053 942 -1949 2533 -2818 2609 -1676 836 -370 -7 1000 -1417 1620 -1533 2978 -2459
6016 -2459 1750 -456 -279 1612 -2498 2644 -2542 2560 -1605 474 -144 -1181 858 -1954 1896
6031 1896 -2964 2950 -1017 634 -1331 -738 921 -2034 2373 -2150 2115 -2746 799 -76 -354 1063
6047 1063 -2062 1192 -2647 2377 -2519 1639 -379 -944 1830 -1905 1229 -2095 1207 -2057 909
6062 909 -296 -39 619 -2373 1258 -2152 1526 -1829 662 220 -300 1892 -1407 1849 -1317 2561
$$ packed form
5955A111j590K038k802K879l945M508l171K440j638L9J74k715L840l030M458n021
5971b425L582j915R98J156l682M480m149M148l245K609j967L18J098k383L266
5986A889l768M175m644K978k131J067P30j352M236m823K401k282K282j134o77
6001a053J995k891M482n351N427m285K512j206L63J007k417L037l153M511n437
6016b459M209k206J77J891m110N142n186N102m165K079o18j037K039k812L850
6031A896m860N914l967J651j965N93J659k955M407m523M265m861L545q75k78J417
6047A063l125L254l839N024m896M158k018n65K774l735L134l324L302l264K966
6062I09j205K57O58k992L631l410L678l355K491m42n20K192l299L256l166L878
$$ plain form
6078 2561 -1677 1818 -727 -460 851 -1721 1400 -1441 1515 -1271 804 -741 -76 658 -1563 1631
6094 1631 -1493 1968 -1378 1044 -1348 -74 635 -2289 1833 -2802 2697 -2290 925 -1453 215
6109 215 813 -1218 1287 -1078 1598 -2040 2102 -698 -134 710 -1214 1608 -2321 2263 -1439 1374
6125 1374 520 521 1265 -1892 2510 -2117 1963 -1568 521 -1845 282 1360 -1371 1165 -2274 1275
6141 1275 -2110 1462 -1260 -221 1007 -1030 1936 -2469 2015 -1049 2048 124 -1143 58 -1548
6156 -1548 2380 -2044 1518 -2304 1166 -844 -136 1045 -963 1681 -1975 2101 -2257 1275 -600
6171 -600 819 459 -1182 2562 -1727 2461 -1152 1053 2 -508 911 -1922 2104 -2677 2075 -1820
6187 -1820 1842 -574 -1089 232 -1210 1396 -1810 2098 -1364 1044 -1212 1332 364 -392 1602 -1999
$$ packed form
6078B561m238L495k545K67J311k572L121k841K956k786K075j545O65P34k221L194
6094A631l124L461l346K422k392J274P09k924M122m635N499m987L215k378J668
6109B15N98k031K505k365K676l638M142k800N64Q44j924K822l929M584l702K813
6125A374q54JP44l157M402m627M080l531K089k366K127J078k731K536l439L549
6141A275l385L572k722J039J228k037K966m405M484l064L097j924j267J201j606
6156a548L928m424L562l822L470k010P08J181k008K644l656M076m358L532j875
6171f00J419l60j641L744m289M188l613K205j051n10J419k833M026m781M752l895
6187a820L662k416n15J321j442K606l206L908l462K408k256K544r68p56J994l601
$$ plain form
6203 -1999 1388 -1832 1289 -1478 17 698 -1262 1484 -1787 2877 -1271 861 -800 717 940
6218 940 -1237 2245 -1839 1868 -1375 1702 -1668 429 1331 -888 884 -2588 1890 -2007 2156
6233 2156 -719 450 455 -1280 1323 -1228 1569 -1917 891 -1405 -328 545 -1241 869 -2200 1562
6249 1562 -1564 1842 -840 82 365 -1351 1176 -3091 989 -2171 1545 -1503 1127 1239 -1902 1110
6265 1110 -1497 3348 -1217 957 -1615 -37 841 -994 1294 -1915 2185 -1716 1891 -1294 -19
6280 -19 642 -393 1772 -796 2918 -1937 1474 -934 40 303 -185 1679 -1958 2690 -891 1208
6296 1208 -949 681 914 -118 999 -1545 2182 -2207 483 -606 996 710 -730 1986 -1630
6311 -1630 1817 -2283 1501 -846 599 -4 -1424 2549 -664 1906 -1815 1949 -606 693 -274
$$ packed form
6203a999L387l220L121k767J495O81j960K746l271M664m148K132j661J517K23
6218I40k177L482m084L707l243L077l370K097R02k219J772l472M478l897M163
6233B156k875J169Nj735K603k551K797l486K808k296J077Q73j786K110l069L762
6249A562l126L406k682R22K83j716K527m267M080l160L716l048K630J12l141L012
6265A110k607M845m565K174k572J578Q78j835K288l209M100l901L607l185J275
6280a9O61j035K165k568L714m855L411k408R74K63m88J864l637M648l581K099
6296A208k157J630K33j032J117k544L727m389K690j089J602k86j440K716l616
6311a630L447m100L784k347J445o03j420L973l213K570l721L764k555J299r67
$$ plain form
6326 -274 -703 673 -1495 1099 -2138 1664 -290 -311 324 -558 937 -1464 2246 -1858 1109 -854
6342 -854 671 -403 -759 1093 -2306 1642 -1048 920 -1122 -402 288 -711 713 -1002 1943 -1336
6358 -1336 1549 -1192 329 -206 -432 2131 -1072 1971 -2092 1389 -1157 744 3 -773 1784 -2279
6374 -2279 2595 -2307 1791 -88 545 309 -1799 1407 -1409 1534 -2458 2112 -659 834 208 -425
6390 -425 1092 -1850 2083 -1698 1355 -1025 267 -214 -582 1275 -1661 1184 -1502 1476 -2160 571
6406 571 -285 -118 1942 -1467 1875 -2007 1961 -2018 312 590 -1190 606 -2203 2249 -1726 2044
6422 2044 -1707 1505 850 -801 669 -1721 1066 -1980 1656 -1138 1129 -297 -392 1115 -1680 1652
6438 1652 -2131 1577 -1239 -138 245 -1230 1367 -1121 1871 -1658 1761 -772 476 193 -747 940
$$ packed form
6326b74m29J376k168K594l237L802j954k1O35q82J495k401L710m104K967j963
6342h54J525j074l56J852l399L948k690J968k042P20O90r99J424j715K945l279
6358a336K885k741J521n35k26K563l203L043m063L481k546J901p41p76K557m063
6374b279M874m902M098j879O33k36k108L206k816K943l992M570k771J493o26o33
6390d25J517k942L933l781L053k380J292m81l68J857k936K845k686K978l636K731
6406E71q56J67K060l409L342l882L968l979K330K78j780J796k809M452l975L770
6422B044l751L212o55j651J470k390K787l046L636k794K267j426r5J507k795L332
6438A652l783L708k816J101L83j475K597k488K992l529L419k533J248k83r40J687
$$ plain form
6454 940 -1456 2407 -3325 2245 -1613 986 -203 142 1473 -1108 1961 -1538 747 -433 744
6469 744 507 -504 491 -2345 2155 -1965 1825 -913 248 -1237 -674 336 -2255 1153 -1946 2164
6485 2164 -1265 698 389 -2180 1259 -1052 2615 -1472 1838 -722 897 40 -628 1341 -1544 1929
6501 1929 -1933 513 -738 659 -573 -347 575 -676 2089 -1647 1418 -887 756 -531 -964 391
6517 391 -447 2074 -1466 1839 -1194 902 287 -513 1118 -407 1255 -1662 365 -1418 1059 -1252
6533 -1252 -1010 1697 -1153 1339 -1574 1851 -867 1463 -497 -1018 645 -1965 2211 -1423 550
6548 550 -600 1009 -1026 -787 1702 -1399 2060 -1560 1349 -1135 474 826 -1152 1044 -1645 1366
6564 1366 -2304 2101 -1006 1993 205 -689 1402 -1148 1202 -1285 1991 -1490 871 160 -653 1638
$$ packed form
6454I40k396L863n732N570l858K599j189L45J331k581L069l499K285j180J177
6469G44k37j011R95k836M500m120L790k738J161j485N63J010k591L408l099M110
6485B164l429J963l09k569L439k311L667m087L310k560J619q57o68J969k885L473
6501A929l862K446j251J397j232K26R22j251K765l736L065k305J643j287m33J355
6517C91q38K521l540L305l033K096o15q00J631j525J662k917K027j783K477k311
6533a252K42K707k850K492k913L425k718K330j960n21J663k610M176l634J973
6548E50j150J609k035K39K489l101L459l620K909k484J609L52j978K196k689L011
6564A366l670M405l107K999j788q94K091k550K350k487L276l481K361p11q13K291
$$ plain form
6580 1638 -2241 1118 -523 1812 -830 764 -790 -74 44 -995 1134 -1154 2100 -528 18 -796
6596 -796 -315 689 -1739 1647 -1268 1684 -1180 259 8 -603 529 -1876 507 -170 1767 -1315
6612 -1315 568 -429 -332 796 -639 874 -1196 1911 -2238 44 -198 -518 544 -831 1693 -1405
6628 -1405 856 -1595 -154 -549 -56 231 -265 1226 -1569 1107 -999 1127 -1071 384 1016 -2040
6644 -2040 1046 -1246 1565 -1578 627 -425 -552 1494 -800 1375 -741 1525 -415 957 -948
6659 -948 -458 896 -1909 900 -1172 1487 -1447 880 -339 442 1478 -1375 983 -1824 1262 -1824
6675 -1824 606 60 943 31 -1644 1507 -1302 885 -1121 389 -362 265 532 -577 1015 -1787
6691 -1787 444 -2474 1271 -112 -88 840 -1396 1291 -1462 1957 -1759 912 -164 -441 630 -215
$$ packed form
6580A638l879L359j641K335k642J594j554P16J18j039K129k288L254k628N46q14
6596g96M81J004k428L386k915K952k864J439k51o11J132k405K383o77J937l082
6612a315J883r97R7J128j435J513k070L107m149K282k42l20J062j375K524l098
6628a405K261k451J441l95M93K87m96J491k795K676k106K126k198J455O32l056
6644b040L086k292K811l143K205j052j27K046k294K175k116K266j940J372j905
6659i48M90J354k805K809k072K659k934K327j219P81J036k853K358k807L086l086
6675a824K430n46Q83r12j675L151k809K187k006J510p51O27K67j109J592k802
6691a787K231k918L745j383K4R28k236K687k753L419l716K671j076k77J071q45
$$ plain form
6707 -215 895 -1319 1246 -844 1327 -840 20 1001 -1456 953 -818 1926 -1635 575 -106 -617
6723 -617 1393 -2245 1393 -1515 1380 -918 579 -347 139 758 -636 728 -1404 1415 -1686 597
6739 597 -79 259 1197 -524 1352 -720 338 -2173 1394 -877 -268 -14 -1296 1294 -1656 2212
6755 2212 -742 102 -164 -21 547 -1704 1559 -1407 1121 -2044 677 -346 577 1095 -1222 2375
6771 2375 -1430 920 -1317 424 423 -879 360 -1119 672 -681 1979 -1475 927 -761 -600 1153
6787 1153 -961 440 -1266 1542 -1248 588 -701 -766 -534 -938 682 -906 2145 -1979 1740 -670
6803 -670 -491 1214 -739 722 -1179 509 63 1486 -324 289 428 -712 2158 -1640 1298 -1974
6819 -1974 357 2 827 810 -823 1152 -1718 1157 -1781 762 -1154 -261 521 -1524 840 -1466
$$ packed form
6707b15J110k214K565k090K171k167Q60R81k457K409j771K744l561K210o81n11
6723f17K010l638L638k908K895k298J497r26M86O19j394J364k132K819l101K283
6739E97o76L38R38j721J876k072J058k511L567k271O09K54j282K590k950L868
6755B212k954Q44k66J43N68k251L263k966K528l165K721j023R23N18k317L597
6771B375l805K350k237J741jj302J239j479J791j353K660l454K402j688J61J753
6787A153k114J401j706K808k790J836j289o5K32m04J620j588L051m124L719k410
6803f70J79J705j953J461j901J688m46J423j810O13J39j140K870l798K938l272
6819a974K331l55Q25j7j633J975k870K875k938K543j916Q93P82k045K364k306
$$ plain form
6835 -1466 1071 -1285 782 -383 397 513 -675 1139 -1390 1295 -811 184 -996 -188 578 -1127
6851 -1127 663 -1044 1815 -2303 582 -1197 273 -351 -200 1502 -1259 1264 -1206 1329 -601
6866 -601 747 571 -637 1259 -1062 752 -1289 466 328 55 321 -141 1290 -1282 1410 -570
6882 -570 1275 -1076 -657 190 -1028 2084 -1127 1146 -1102 807 -721 130 266 -885 778 -689
6898 -689 1986 -2214 70 -644 1477 306 113 1036 -1471 1240 -1697 1244 8 145 555 -1270
6914 -1270 1114 -810 2069 -977 1168 -913 443 316 -418 778 -1938 1901 -112 644 -582 650
6930 650 364 -923 1474 -2015 1286 -880 1366 -39 -80 1230 0 915 -1115 644 -2378 962
6946 962 -493 565 624 -1226 717 -482 934 -1564 1407 -931 400 -218 478 1539 -638 2214
$$ packed form
6835a466K537k356K067j165P80J16j188J814k529K685k106R95j180Q08P66j705
6851a127J790j707K859m118K885j779J470o24J51J702k761K523k470K535j930
6866f01J348j76j208J896k321J814k041J755j38k73K66m62J431k572K692j980
6882e70J845k351M19Q47j218L112l211K273k248J909j528Q51J36j151J663j467
6898f89K675m200K284p14K121j171j93R23k507K711k937K941j236J37M10j825
6914a270K384j924K879l046K145k081J356j27p34J196k716L839k013P56j226J232
6930F50k86j287K397l489L301k166K246j405m1J310j230R15k030J759l022L340
6946I62j455J058N9j850J943j199J416k498K971k338J331o18O96J061k177K852
$$ plain form
6962 2214 -1563 1191 599 612 418 -1133 642 -823 1944 -460 1931 -846 77 85 -930 1143 -1366
6979 -1366 1610 -57 482 -827 3 1074 -658 278 -1474 1423 -862 1023 -473 409 -453 -277
6995 -277 1567 -242 1227 -942 1640 -1115 195 976 -1013 967 -1800 1098 -1147 617 13 -529
7011 -529 -588 -171 388 -1320 574 -1656 932 -988 902 650 60 1636 -1458 668 -1330 934 -1601
7028 -1601 539 -584 -1572 1061 -397 1935 -1497 1125 15 979 372 -442 1591 -983 869 -1388
7044 -1388 245 -477 606 687 -817 961 -1081 1486 -1286 1101 -127 96 273 180 945 -1473 727
7061 727 -1724 1355 -1239 556 185 -546 693 -1677 1931 -1847 584 -96 -633 61 -950 403
7077 403 -910 2626 767 -318 167 453 162 -1387 -119 -1146 1291 -1337 2643 -876 1391 -629
$$ packed form
6962B214l777K754n92J3j94j551J775j465K767k404K391k777R23Qj015K073k509
6979a366K976j667N39j309Q30J071j732R36j752K897k285J885j496Q82q62J76
6995b77J844j809J469k169K582k755J310P81j989J980k767K898k245J764o04n42
7011e29n9M17N59j708J894k230K588j920J890k52n90J576l094K126j998K264k535
7028a601K140j123r88K633j458K332l432K622j110R64o07q14K033k574J852k257
7044a388J633p22J083Q1j504J778k042K567k772K387j228K23J77r3P65k418K200
7061G27k451L079k594J795l71p31J239k370L608l778K431o80n37O94j011J353
7077D03j313L536j859j085M85K86k91j549J268j027K437k628L980l519K267k020
$$ plain form
7093 -629 -413 64 -1503 1617 -1322 1492 -648 12 -653 -1070 -932 -2075 1293 -631 1101 -354 906
7110 906 -91 -691 702 -849 1951 -1064 2205 -473 -305 -677 -666 -38 -1549 1840 -812 1599 -869
7127 -869 150 -416 -619 1101 -606 2823 -1250 592 -143 1412 -968 75 -307 -1502 631 -1149
7143 -1149 1095 -823 -218 55 -777 1406 -2297 686 -969 630 -1186 160 452 -419 460 -1810
7159 -1810 1753 -727 1126 -1510 1101 -396 -474 374 -123 1833 -2342 163 -1771 1052 -1171 -280
7175 -280 737 -974 897 -1513 1913 -1114 575 -10 -786 199 -1155 370 -1675 1908 -1116 823
7191 823 -491 -473 515 -1344 1846 -1093 -377 -663 854 -1123 164 1325 -1155 1075 -1617 1721
7207 1721 -1215 105 -623 -290 1438 -257 393 -1502 715 -1307 605 -98 224 766 -651 1150
$$ packed form
7093f29K16M77j567L120k939K814k140O60o65m17J38j143L368j924J732j455J260
7110I06r97o00J393j551K800l015L269k678J68l72J1O28j511L389k652K411k468
7127h69J019n66k03J720j707L429m073J842p35J555k380J043l82j195K133j780
7143a149K244j918O05K73q32K183l703K983j655J599j816J346K92q71Q79k270
7159a810L563k480J853k636K611j497p8Q48m97J956m175K505j934K823k223Q91
7175b80J017j711J871k410L426l027J689n85p76R85j354J525k045L583l024J939
7191H23j314J8R88j859L190k939P16k86J517j977J287J161k480K230k692L338
7207A721k936J320p28L33J728j695O50j895K217k022J912p03L22N42j417J801
$$ plain form
7223 1150 -854 746 -1267 -423 399 -299 -394 -727 1482 -1893 68 -715 1029 -531 -169 477 312
7240 312 849 -1097 2373 -348 -183 -194 522 1180 -880 738 -1357 1040 -1041 215 -926 -362 823
7257 823 -350 1150 -1095 559 -1988 1356 -1068 -812 529 -816 693 -879 1977 -1414 -545 -702
7273 -702 -414 502 -1310 1138 -1153 761 -1405 560 -370 -744 757 -849 1557 -2063 843 21
7289 21 696 -1324 359 -223 -1305 1648 -1324 1871 -698 190 -233 -550 99 -476 1453 -1108 1086
7306 1086 -391 599 -929 -453 -112 -818 1003 -1842 1123 -1382 1431 -363 14 684 16 1488 -1080
7323 -1080 1564 -1093 1187 -176 987 1854 -1220 1216 -788 1063 -1302 728 -466 47 1433
7338 1433 -205 824 231 1402 -714 278 285 309 -505 -982 1006 -918 1481 -1412 1338 -709 -3
$$ packed form
7223A150k004J600k013Q44Q22o98r5l33K209l375J961p83J744j560L62O46j65
7240C12N37j946L470k721J65j1P16O58k060J618k095K397k081J256j141N64J185
7257H23j173J500k245J654k547L344k424K56J341j345J509j572K856l391Q69j57
7273g02K88R16j812K448k291J914k166J965r30l74J501j606K406l620K906q22
7289B1O75k020J683n82j082K953k972L195k569Q88m23l17O49n75J929k561K194
7306A086j477R90j528M76L41p06J821k845K965k505K813j794L77O70o68J472k568
7323a080K644k657K280j363J163Q67l074K436k004J851k365K030j194N13J386
7338A433j638J029n93J171k116R92PK4q14m77J988j924K399k893K750k047P06
$$ plain form
7355 -3 1398 -675 1328 -653 1265 -1615 53 -107 -496 1375 -370 1146 -1436 976 -1003 760
7371 760 -249 943 530 -912 745 -1539 945 -1795 49 -114 764 887 85 1107 -1372 287
7387 287 -220 1488 -556 -452 199 -706 922 -621 1189 -1114 522 -413 -453 600 -1455 1879 -578
7404 -578 -80 -1008 -299 -28 -8 848 228 799 -826 712 -1239 1059 438 -28 -142 -204 617 -1432 1167
7423 1167 -798 844 -474 -39 569 -468 353 -736 949 12 592 -419 172 721 -967 1157 -1466
7440 -1466 702 -1220 519 -525 56 485 -1145 955 -985 907 -166 682 -448 465 -433 -229
7456 -229 1197 -1107 1216 -799 962 -169 563 -182 -1313 496 -997 -57 -1475 735 -810 -211
7472 -211 -67 -160 904 -1303 1092 -549 1296 -126 -337 -335 -359 632 -620 1093 -1633 -50 -687 -329
$$ packed form
7355cJ401k073K003j981J918k880J668j60l89J871j745J516k582K412j979J763
7371G60j009J192m13j442J657k284K484k740J844j63Q78J23q02J022k479J659
7387B87n07J708k044J04O51r05J628j543J810k303J636r35m0J053k055L334k457
7404e78M98r28P09K71K0Q56o20N71j625J538j951K298o21m66j14o2Q21k049K599
7423A167j965J642j318M35O08j037Q21j089J685r37N80j011N91N49j688K124k623
7440a466K168j922J739j044N81M29j630K100j940J892j073Q48j130R13q98K04
7456b29J426k304K323k015J761j131P32p45j131J809j493R40j418K210j545N99
7472b11J44r3J064k207K395j641J845j422k11Kk4R91j252J713k726J583o37L58
$$ plain form
7490 -329 -481 -967 766 -478 -90 -1416 1574 292 -68 -933 -791 166 -703 1709 -1283 1516 -158
7507 -158 -421 818 324 840 -952 1356 -1246 126 -222 634 2256 -356 668 -1262 1172 -549
7523 -549 1129 -603 -268 73 -1006 1595 -1033 1087 -555 582 -126 578 -691 -986 240 -127 1699
7540 1699 -1508 -82 -674 973 211 -962 1193 -1235 499 -1146 1496 -1156 -892 54 237 677
7556 677 -1530 667 -788 615 -205 419 279 1086 336 -2060 2632 -915 307 -134 859 -588 795
7573 795 292 -1066 2035 -895 1078 15 3 232 -721 263 -638 516 -481 1111 -372 319 208 472
7591 472 280 -447 580 -389 767 -456 -372 325 138 965 -1308 1188 -1161 8 -541 531 450 -561
7609 -561 1538 -1806 1361 -759 833 -327 449 405 -624 295 -800 659 -773 424 -234 838
$$ packed form
7490c29j52m86J733j244L88j326K990j282l60q65J42R57q69K412k992K799j674
7507a58k63J239m94N16j792K308k602J372l48Q56J622k612J024j930K434j721
7523e49J678j732L35L41j079K601k628K120j642J137p08P04j269k95J226l67J826
7540A699l207J426n92J647p62j173K155k428J734j645K642k652K64R46J83M40
7556F77k207K197j455J403q20O24j40Q07p50k396M692l547J222m41R93j447J383
7573G95n03j358L101k930J973j063j2K29r53R84r01J154r97J592j483O91j11K64
7591D72j92p27J027r69J156j223Q4O97j87Q27k273K496k349J169n49J072q1j011
7609e61K099l344L167k120J592j160P76m4j029R19j095J459j432J197o58J072
$$ plain form
7625 838 959 -332 370 -1038 798 -1601 1595 -660 -155 314 -580 253 -2193 451 -1636 663 -27
7642 -27 104 -315 -471 726 -349 -216 -456 745 -1221 -185 732 -298 1022 -554 1155 -1637 1534
7659 1534 -529 904 555 -800 329 -1538 1040 -722 469 -321 320 -1435 -259 482 -1341 811
7675 811 -1015 421 -493 1445 -214 -1430 1120 -659 84 -790 -118 -336 628 -255 -519 -32 -934 0
7693 0 -1076 816 -737 1016 31 247 75 259 1087 -1625 701 -1302 -260 -375 691 320 -983
7710 -983 -295 -1386 873 513 178 -623 -1240 1091 -346 1538 -523 76 -820 529 441 -131 881 -727
7728 -727 529 -912 467 -513 -106 300 -283 -504 -1312 1735 -1215 1736 66 381 69 -514 1297
7745 1297 -1003 -336 -991 402 -998 1057 -672 -90 1477 -1080 2066 -550 1108 -408 -346 137
$$ packed form
7625H38J21j291P02j408J836k399L196k255N05M69q94Q33k446K644k087K299o90
7642b7J31m19j56J197j075J33k40J201j966J036R17j030J320j576J709k792L171
7659A534k063J433l49j355J129j867K578j762J191p90O41j755J176P41j823K152
7675H11j826J436r14J938j659j216K550j779P43q74O72k18R64q83k64M87r02R34
7693@j076J892j553J753r85K16j72J84Q28k712K326k003J042j15J066l71j303
7710i83O88j091K259l60l35q01o17K331j437J884k061N99q96J349q8n72J012j608
7728g27J256j441J379r80M07M06n83k21q08L047k950K951j670L15l12n83J811
7745A297k300O67o55J393j400K055j729N82J567k557L146k616J658j516O2M83
$$ plain form
7761 137 -315 84 -446 783 -518 1601 -356 -181 -363 -371 1715 -1580 561 -794 629 -651 289
7778 289 663 314 501 -1162 1234 -985 577 -161 1111 59 -101 -130 -968 873 -684 397 -773
7795 -773 719 -742 -282 142 73 806 -1213 813 -944 119 -1554 -41 197 -1270 488 -101 918
7812 918 -617 801 -184 2 676 -1733 368 -142 92 -1204 1128 -97 -1142 411 -777 470
7828 470 -795 336 223 85 167 -487 358 -755 1449 -1065 274 519 17 307 -194 317 -893 345
7846 345 -564 909 -315 1026 -608 -668 736 -1815 -100 -1096 164 -707 -355 35 -299 596 -573
7863 -573 -101 -975 588 -824 1421 788 352 722 -983 652 4 295 80 65 -534 814 -764 -1058
7881 -1058 1408 -148 -197 -237 416 -408 92 276 -887 1207 -694 1109 -180 -43 -259 260 814 -79
$$ packed form
7761A37m52L99n30J229j301K119j957J75j82qK086l295K141j355J423j280R40
7778B89L74l49J87j663K396k219J562p38J272j052j60k9q38J841j557J081j170
7795g73J492j461M60M24o9P33k019K026j757J063j673J513K38j467J758n89J019
7812I18j535J418r85J86O74k409K101n10K34j296K332j225j045J553j188J247
7828D70j265J131j13j38Q2o54Q45j113K204k514J339K45n02K90n01N11j210J238
7846C45r09J473j224J341j634o0J404k551J715r96J260q71L52L90l34Q95j169
7863e73M72q74J563j412K245o33m36L70j705J635o48K91k15j5n99J348j578k94
7881a058K466j556m9m0O53q24N00J84j163K094j901J803j289J37k16N19N54q93
$$ plain form
7899 -79 440 -470 -84 -236 293 -65 -174 1035 -50 786 253 331 -889 352 959 258 1033 -1337 98
7918 98 29 1065 -1391 224 -186 736 407 -867 710 -1114 1090 -215 604 527 -126 274 425 696
7936 696 -1170 1698 -919 876 -696 61 610 311 909 -1041 700 -111 515 -925 -530 995 -279
7953 -279 934 132 452 -267 865 -1 -371 565 -1066 581 -1858 173 -811 451 -486 -12 67 -654
7971 -654 1129 -536 1207 -351 -117 318 -219 53 -1329 848 -911 768 -634 72 191 -502 1184
7988 1184 -833 1049 -1388 1681 -99 400 -865 -53 57 -1 179 -529 1085 -963 780 106 -106
8005 -106 416 -1645 1272 213 533 -309 51 844 -660 424 -1205 1973 -673 1139 -685 -33 -823
8022 -823 135 622 -311 982 95 751 198 322 -230 -372 569 412 2140 -1337 310 -1302 171 813
$$ packed form
7899g9N19r10L86j52N29l58j09J209j085Q36n33P8j220J241O07p01P75k370J435
7918I8o9J036k456J615m10R22l29j274J577j824K204j305Q19p7o53M00J51K71
7936F96j866K868k617J795j572P57N49k99N98j950J741q11O26j440L95J525j274
7953b79J213q02L20p19J132q66l70R36j631J647k439K031r84J262r37M74P9p21
7971f54J783j665J743j558K34M35n37K72j382K177j759J679j402P06J19o93J686
7988A184k017J882k437L069j780M99j265Q12J10n8J80p08J614k048J743o74k12
8005a06N22k061K917j059L20q42L60P93j504J084j629L178k646J812j824O52p90
8022h23R58M87r33J293q87O56n53J24n52j42R41j57J728l477J647j612J473O42
$$ plain form
8040 813 1430 1195 -537 193 -1744 1706 367 520 -19 -215 -372 243 1235 -744 469 -632 1245
8057 1245 1021 373 52 -440 1240 -265 562 -846 623 36 -947 507 649 638 -1111 1872 82
8074 82 914 384 -579 850 -903 117 -529 -110 -1128 592 -554 -143 508 491 175 -1068 -142 -939
8092 -939 572 155 2 931 -222 1020 -520 1238 -1529 494 236 5 171 -141 1768 -1786 451
8109 451 -82 826 7 813 871 -781 1337 -1765 2110 -2329 -20 -624 -174 874 -1001 487 -1474
8126 -1474 -368 -1014 -857 -1581 1208 728 -590 1224 -1199 509 -174 873 -822 -219 738 -1458 1972
8143 1972 -819 -62 174 254 -3 -618 -311 -601 1206 256 1367 -1248 1010 -609 153 839 -325 38
8161 38 -486 1552 31 729 -658 1040 -313 -143 -788 -751 222 -1313 323 -399 809 1517 -349 604
$$ packed form
8040H13O17k35j732P30j937L450j339J53n39j96j57O15R92j979J213j101J877
8057A245k24o48l21m92J680j505Q27j408J469n87r83J454J42j1j749K983j790
8074H2Q32n30r63J429j753J020o46M19j018J720j146M11O51j7l16j243R26p97
8092i39J511m17j53R29j153J242j540J758k767K023k58k31J66l12J909l554K237
8109D51n33R08q19Q06N8j652K118l102L875m439K309o04M50J048j875J488j961
8126a474J106o46J57p24K789m80j318J814k423J708o83J047j695O03R57k196L430
8143A972k791P57K36Q0k57o15L07k90J807r50J111k615K258j619P62O86j164L63
8161C8n24K038j521O98j387J698j353J70o45L7R73j535J636p22J208P08j866R53
$$ plain form
8179 604 -1873 331 -708 520 24 -438 486 -106 752 -168 1051 -871
$$ packed form
8179F04k477K204j039J228m96m62R24n92Q58r20J219j922
8191h71
$$ Imaginary data points
##PAGE= N=2
##DATA TABLE= (X++(I..I)), XYDATA
$$ plain form
0 0 0 0 0 0 0 0 0 0 0 0 0 0 -108 108 -108 108 -108 216 -216 219 -324 333 -433 540 -648 756 -864 973
28 973 -1086 1297 -1467 1649 -1890 2160 -2401 2711 -3042 3424 -3810 4248 -4739 5255 -5826
43 -5826 6446 -7121 7859 -8666 9549 -10513 11571 -12745 14019 -15448 17033 -18795
55 -18795 20792 -23055 25651 -28660 32192 -36416 41562 -47995 56311 -67491 83411 -108116
$$ packed form
0@%%%%%%%%%%%%j08K16k16K16k16L24m32M35n43O57p66R73j188J404j620J837
28I73k059K383k764L116l539M050m561N112n753O466p234Q058q987R994j1081
43e826J2272j3567J4980j6525J8215k0062K2084k4316K6764k9467L2481l5828
55a8795L9587m3847M8706n4311O0852o8608P7978q9557J04306j23802J50902j91527
$$ [...]
8191e28
##END NTUPLES=NMR FID
##END=
