##TITLE=1H_SAM-30.TD.DMSO/TFA
 DMSO, 108 sc, 
 25.11.2020
##JCAMPDX= 6.0         $$ Bruker NMR JCAMP-DX V2.0
##DATA TYPE= NMR FID
##DATA CLASS= NTUPLES
##ORIGIN= UXNMR, Bruker Analytische Messtechnik GmbH
##OWNER= root
$$ XWIN-NMR		Version 3.5
$$ Wed Nov 25 13:36:31 2020 Russian Standard Time (UT+4h)  she@DPX200
##.OBSERVE FREQUENCY= 200.1315066352
##.OBSERVE NUCLEUS= ^1H
##.DELAY= (6, 6)
##.ACQUISITION MODE= SIMULTANEOUS
##.ACQUISITION SCHEME= undefined
##.AVERAGES= 108
##.DIGITISER RES= 18
##SPECTROMETER/DATA SYSTEM= spect
##.PULSE SEQUENCE= zg30
##.SOLVENT NAME= DMSO
##.SHIFT REFERENCE= (INTERNAL, DMSO, 0, 15.7039)
##AUDIT TRAIL= $$ (NUMBER, WHEN, WHO, WHERE, WHAT)
$$ ##TITLE= Audit trail, XWIN-NMR		Version 3.5
$$ ##JCAMPDX= 5.01
$$ ##ORIGIN= Bruker BioSpin GmbH
$$ ##OWNER= she
$$ F:/spectra/data/she/nmr/H-F/1/audita.txt
$$ ##AUDIT TRAIL=  $$ (NUMBER, WHEN, WHO, WHERE, WHAT)
(   1,<2020-11-25 13:34:13.45 +0400>,<she>,<DPX200>,
      <continue with go, POWCHK disabled, PULCHK disabled
       configuration hash MD5:
       00 E9 B6 7A A2 85 ED C7 34 08 36 98 17 FE 4E 26
       data hash MD5: 16K
       81 14 D4 72 61 3B 97 BA EE 6C 6B 3F C8 F6 1D 90>)
$$ ##END=
$$ 
$$ hash MD5
$$ 45 8A 7B 4D AB F3 AB C4 59 2E 36 45 51 A3 7E 92
##$RELAX= 
##$RELAX= 
##$RELAX= 
##$RELAX= 
##$RELAX= 
##$RELAX= 
$$ Bruker specific parameters
$$ --------------------------
##$DU= <F:/spectra>
##$EXPNO= 1
##$NAME= <H-F>
##$PROCNO= 1
##$TYPE= <nmr>
##$USER= <she>
##$AMP= (0..31)
100 100 100 100 100 100 100 100 100 100 100 100 100 100 100 100 100 100 
100 100 100 100 100 100 100 100 100 100 100 100 100 100 
##$AQSEQ= 0
##$AQ_mod= 1
##$AUNM= <au_zg>
##$AUTOPOS= <>
##$BF1= 200.13
##$BF2= 200.13
##$BF3= 200.13
##$BF4= 200.13
##$BF5= 200.13
##$BF6= 200.13
##$BF7= 200.13
##$BF8= 200.13
##$BYTORDA= 1
##$CFDGTYP= 0
##$CFRGTYP= 5
##$CHEMSTR= <none>
##$CNST= (0..31)
1 1 145 1 1 1 1 1 1 1 1 1 1 1 1 1 1 1 1 1 1 1 1 1 1 1 1 1 1 1 1 1 
##$CPDPRG= <>
##$CPDPRG1= <>
##$CPDPRG2= <>
##$CPDPRG3= <>
##$CPDPRG4= <mlev>
##$CPDPRG5= <mlev>
##$CPDPRG6= <mlev>
##$CPDPRG7= <mlev>
##$CPDPRG8= <mlev>
##$CPDPRGB= <>
##$CPDPRGT= <>
##$D= (0..31)
0 1.2 0 0 0 0 0 0 0 0.06 0 0.03 0 0 0 0 0.0002 0 0 0 0 0 0 0 0 0 0 0 0 
0 0 0 
##$DATE= 1606296459
##$DBL= (0..7)
120 120 120 120 120 120 120 120 
##$DBP= (0..7)
150 150 150 150 150 150 150 150 
##$DBP07= 0
##$DBPNAM0= <>
##$DBPNAM1= <>
##$DBPNAM2= <>
##$DBPNAM3= <>
##$DBPNAM4= <>
##$DBPNAM5= <>
##$DBPNAM6= <>
##$DBPNAM7= <>
##$DBPOAL= (0..7)
0.5 0.5 0.5 0.5 0.5 0.5 0.5 0.5 
##$DBPOFFS= (0..7)
0 0 0 0 0 0 0 0 
##$DE= 6
##$DECBNUC= <off>
##$DECIM= 32
##$DECNUC= <off>
##$DECSTAT= 4
##$DIGMOD= 1
##$DIGTYP= 9
##$DL= (0..7)
0 120 120 120 120 120 120 120 
##$DP= (0..7)
150 150 150 150 150 150 150 150 
##$DP07= 0
##$DPNAME0= <>
##$DPNAME1= <>
##$DPNAME2= <>
##$DPNAME3= <>
##$DPNAME4= <>
##$DPNAME5= <>
##$DPNAME6= <>
##$DPNAME7= <>
##$DPOAL= (0..7)
0.5 0.5 0.5 0.5 0.5 0.5 0.5 0.5 
##$DPOFFS= (0..7)
0 0 0 0 0 0 0 0 
##$DQDMODE= 0
##$DR= 18
##$DS= 0
$$ [...]
##$SUBNAM2= <"">
##$SUBNAM3= <"">
##$SUBNAM4= <"">
##$SUBNAM5= <"">
##$SUBNAM6= <"">
##$SUBNAM7= <"">
##$SUBNAM8= <"">
##$SUBNAM9= <"">
##$SW= 16.9725356469052
##$SWIBOX= (0..15)
0 0 2 0 0 0 0 0 0 0 0 0 0 0 0 0 
##$SW_h= 3396.73913043478
##$TD= 16384
##$TD0= 1
##$TE= 0
##$TE2= 300
##$TE3= 300
##$TEG= 300
##$TL= (0..7)
0 120 120 120 120 120 120 120 
##$TP= (0..7)
150 150 150 150 150 150 150 150 
##$TP07= 0
##$TPNAME0= <>
##$TPNAME1= <>
##$TPNAME2= <>
##$TPNAME3= <>
##$TPNAME4= <>
##$TPNAME5= <>
##$TPNAME6= <>
##$TPNAME7= <>
##$TPOAL= (0..7)
0.5 0.5 0.5 0.5 0.5 0.5 0.5 0.5 
##$TPOFFS= (0..7)
0 0 0 0 0 0 0 0 
##$TUNHIN= 0
##$TUNHOUT= 0
##$TUNXOUT= 0
##$USERA1= <user>
##$USERA2= <user>
##$USERA3= <user>
##$USERA4= <user>
##$USERA5= <user>
##$V9= 5
##$VALIST= <valist>
##$VCLIST= <CCCCCCCCCCCCCCC>
##$VD= 0
##$VDLIST= <DDDDDDDDDDDDDDD>
##$VPLIST= <PPPPPPPPPPPPPPP>
##$VTLIST= <TTTTTTTTTTTTTTT>
##$WBST= 1024
##$WBSW= 4
##$XGAIN= (0..3)
0 0 0 0 
##$XL= 0
##$YL= 0
##$YMAX_a= 1032591
##$YMIN_a= -1240056
##$ZGOPTNS= <>
##$ZL1= 120
##$ZL2= 120
##$ZL3= 120
##$ZL4= 120
##$ABSF1= 10
##$ABSF2= 0
##$ABSG= 5
##$ABSL= 3
##$ALPHA= 0
##$AQORDER= 0
##$ASSFAC= 0
##$ASSFACI= 0
##$ASSFACX= 0
##$ASSWID= 0
##$AUNMP= <proc_1d>
##$AZFE= 0.1
##$AZFW= 0.1
##$BCFW= 1
##$BC_mod= 2
##$BYTORDP= 1
##$COROFFS= 0
##$CY= 11.3945322036743
##$DATMOD= 1
##$DC= 2
##$DFILT= <>
##$DTYPP= 0
##$F1P= 15.9154993809931
##$F2P= -4.1035820241983
##$FCOR= 0.5
##$FTSIZE= 0
##$FT_mod= 4
##$GAMMA= 1
##$GB= 0.15
##$INTBC= 1
##$INTSCL= 1
##$ISEN= 128
##$LB= 0.24
##$LEV0= 0
##$LPBIN= 0
##$MAXI= 10000
##$MC2= 0
##$MEAN= 0
##$ME_mod= 0
##$MI= 1.114404
##$NCOEF= 0
##$NC_proc= 0
##$NLEV= 6
##$NOISF1= 3.799351
##$NOISF2= 2.8
##$NSP= 1
##$NTH_PI= 0
##$NZP= 0
##$OFFSET= 15.70392
##$PC= 1
##$PHC0= -11052.23
##$PHC1= 13.00088
##$PH_mod= 1
##$PKNL= yes
##$PPARMOD= 0
##$PSCAL= 0
##$PSIGN= 0
##$REVERSE= no
##$SF= 200.130013532006
##$SI= 16384
##$SIGF1= 3
##$SIGF2= 2
##$SINO= 400
##$SIOLD= 16384
##$SREGLST= <1H.CDCl3>
##$SSB= 0
##$STSI= 0
##$STSR= 0
##$SW_p= 3612.71676300578
##$SYMM= 0
##$S_DEV= 0
##$TDeff= 0
##$TDoff= 0
##$TI= <>
##$TILT= no
##$TM1= 0
##$TM2= 0
##$TOPLEV= 0
##$USERP1= <user>
##$USERP2= <user>
##$USERP3= <user>
##$USERP4= <user>
##$USERP5= <user>
##$WDW= 1
##$XDIM= 8192
##$YMAX_p= 0
##$YMIN_p= 0
$$ End of Bruker specific parameters
$$ ---------------------------------
##NTUPLES= NMR FID
##VAR_NAME=  TIME,          FID/REAL,        FID/IMAG
##SYMBOL=    X,             R,               I
##VAR_TYPE=  INDEPENDENT,   DEPENDENT,       DEPENDENT
##VAR_FORM=  AFFN,          ASDF,            ASDF
##VAR_DIM=   8192,          8192,            8192
##UNITS=     SECONDS,       ARBITRARY UNITS, ARBITRARY UNITS
##FACTOR=    0.0002944,     1,               1
##FIRST=     0,             0,               0
##LAST=      2.4114304,     0,               0
##MIN=       0,             -1240056,        0
##MAX=       2.4114304,     1032591,         0
$$ Real data points
##PAGE= N=1
##DATA TABLE= (X++(R..R)), XYDATA
0 0 0 0 0 0 0 0 0 0 0 0 0 0 0 0 0 -107 108 -108 108 -108 188 -216 216 -240 324 -324 431 -467 540 -647 743
31 743 -830 934 -1053 1179 -1305 1475 -1639 1832 -2037 2262 -2507 2776 -3057 3376 -3725 4109
47 4109 -4526 4975 -5481 6033 -6642 7325 -8084 8940 -9906 11014 -12302 13804 -15598
60 -15598 17769 -20445 23862 -28347 34496 -43431 57463 -82570 139716 -529005 172297
71 172297 502693 -1240056 907847 -274991 -375281 354681 -392873 573370 -786938
80 -786938 349030 433323 -1021433 801256 -308892 -52071 51802 -262473 649787 -893413
90 -893413 447960 279037 -741333 587455 -324655 219373 -259136 -94505 634604 -917468
100 -917468 511939 124098 -481132 387193 -310709 427765 -470584 29194 585883 -855894
110 -855894 491711 12257 -229858 163341 -253765 531926 -589466 139485 474247 -686526
120 -686526 394194 -71942 21289 -62631 -185299 574231 -640427 191478 336765 -482625
130 -482625 277626 -150481 240477 -226012 -142140 579517 -607448 193204 215964 -261583
140 -261583 136432 -188326 383060 -331981 -91356 514932 -506009 155017 98584 -59842
150 -59842 -427 -198809 456185 -386416 -51930 414228 -382721 117387 -12774 107089
160 107089 -95298 -203242 475782 -379669 -24715 296111 -231608 67090 -100356 239379
170 239379 -150205 -196184 446682 -315419 -24188 180032 -83662 9718 -163878 318467
180 318467 -181859 -183945 386830 -241435 -17302 66524 42547 -26542 -206184 351425 -180855
191 -180855 -159824 296534 -148573 -15383 -29145 138800 -43157 -226709 342868 -145819
201 -145819 -143471 206237 -56765 -16595 -102332 202310 -47511 -227633 308443 -102568 -112647
212 -112647 106215 24697 -7189 -165583 235038 -35220 -216133 247088 -48053 -84328
222 -84328 16256 85167 8821 -205421 233020 -11690 -202540 180207 -1112 -54737 -57679
233 -57679 118220 24878 -220968 206704 8006 -163896 99861 33152 -17451 -116778 131609
244 131609 44673 -214999 161129 30689 -121434 25873 56473 24484 -159994 127616
254 127616 71198 -204220 118221 49901 -75960 -32404 68208 58626 -181642 111595 85253
265 85253 -171465 64703 60085 -29201 -78133 67068 84726 -181145 81067 92084 -128568
276 -128568 16198 56160 20523 -112459 56049 109264 -172812 54777 86638 -81690 -21081
287 -21081 44717 59879 -130371 38831 118106 -146028 21299 77563 -38002 -50986 26580
298 26580 89559 -128822 11669 119848 -109115 -8500 60479 13061 -75832 7954 115606
309 115606 -125385 -4299 110046 -69716 -30729 36717 53007 -87523 -11276 124491 -106702
320 -106702 -20532 89698 -33784 -38895 7532 78246 -78295 -33988 120401 -75615 -32611
331 -32611 60034 7674 -48328 -18840 99323 -74274 -43824 103760 -46600 -38223 30749
342 30749 39969 -49753 -36325 107920 -60827 -48396 86858 -23281 -34310 2314 59908
353 59908 -37891 -55360 104220 -40124 -51805 58238 7861 -34752 -24432 77514 -33695
364 -33695 -62125 91201 -20691 -47703 29120 30446 -27611 -45812 81634 -22273 -66144
375 -66144 73604 -6390 -35288 828 41481 -11178 -60615 75904 -7039 -59710 45320
386 45320 12956 -24745 -24087 53742 -3294 -65277 65137 4665 -48942 21884 22549 -10513 -44050
399 -44050 53648 7413 -66259 53805 8353 -33591 1088 27551 5003 -53043 47692 15333
411 15333 -58121 31957 19333 -20414 -21639 33818 12562 -58118 39900 19926 -46481 14743
423 14743 18910 -3581 -34737 31364 21884 -59267 32395 18621 -33367 242 18970 7517
435 7517 -40747 25130 25469 -47306 16429 21930 -16942 -15878 18840 17939 -44181 20161 26183 -38951
449 -38951 5656 16755 -194 -25305 14355 26141 -44903 15316 24755 -24911 -2533 11777
461 11777 10099 -28697 7417 28942 -34188 1996 23448 -10431 -13290 10862 20066 -30890 5200
474 5200 28338 -27037 -279 14540 897 -18257 4869 25219 -29359 2532 23630 -19013
486 -19013 -6347 8317 8549 -16223 -1449 24118 -19694 -4729 18989 -8192 -9825 4027 16707
499 16707 -17863 -3894 24465 -16788 -4951 13553 2860 -11408 840 20971 -16613 -4105
511 -4105 21066 -9668 -5838 7766 6952 -9391 -4294 19861 -10416 -9106 15686 -3185 -9344
524 -9344 1972 11569 -10848 -7321 19340 -7620 -6453 10322 3025 -7056 -3941 11666 -7238
537 -7238 -7306 11967 -3811 -6954 4387 4997 -4465 -6000 10956 -1403 -9337 10358 1803 -7040
551 -7040 366 9519 -4680 -8270 12434 -2967 -7969 6040 2740 -7017 -1647 8410 -4556 -6607
565 -6607 9911 -850 -6408 4278 1749 -2735 -4075 5136 13 -8516 5571 2426 -3887 -65
579 -65 5224 -122 -5678 5890 1415 -5571 1736 2988 -4218 -2310 4970 -860 -5467 3581 1940
594 1940 -6157 1393 1362 -1973 -4175 2341 1294 -6191 1956 2549 -3914 89 3901 -2115 -2560 2297
610 2297 1403 -3815 934 4604 -2976 688 3067 -913 -2505 365 2594 -1495 1278 1967 365 -804
626 -804 -354 3109 -1605 -983 3868 -991 -2236 2667 304 -1346 555 3656 -1980 -794 4670 -3176
642 -3176 -533 1759 -1336 7 -498 838 -770 1093 297 -954 -70 570 3 182 -1040 1696 359
659 359 -1320 927 -1115 832 -264 1030 -389 -1700 2613 -2263 210 1611 -350 1056 -175
674 -175 788 -430 -655 1853 -932 -414 477 -1622 1072 21 415 137 -1008 438 -1242 -474 -1228
691 -1228 782 267 -2976 2340 -1449 259 1540 -1949 246 -664 -369 -11 -1367 -98 318 158 442
708 442 -2229 1426 -1188 -1147 2306 -1343 770 179 496 149 284 -177 -1562 1521 -1434 527 1443
725 1443 -1473 81 470 -693 407 -315 926 688 24 1753 -484 299 787 -943 1472 -488 206
742 206 330 -244 -700 626 943 -2555 2344 -35 -956 1502 -869 1030 697 -2198 1454 -158 -55
759 -55 958 -1529 1321 -824 570 382 -2035 1381 -382 -840 1048 -93 -1207 680 515 -1289
775 -1289 1664 -310 -1359 1498 -751 -1374 514 -818 166 -1308 -883 2040 -1676 2094 541 -295
791 -295 349 -1310 1582 -956 393 583 -462 -2214 1745 -631 -1605 2097 685 -2279 431 991
807 991 -1358 89 -1001 605 -313 -430 2115 -1644 -24 567 -60 -88 -928 1219 -944 -1220 1964
824 1964 1115 -2145 1805 1118 -1578 739 393 -825 -377 1703 -369 -101 -263 523 195 -1645 2211
841 2211 -615 -477 117 237 24 -285 1446 -240 -1387 1278 1567 -3491 1616 278 -2311 -668 1131
858 1131 -1900 -933 1136 -559 -860 68 1683 -996 -937 2699 -646 -1234 469 219 -905 -578 1109
875 1109 446 -1509 1185 961 -3369 1087 2145 -2215 -824 1563 848 -1886 1566 428 -1041 -227
891 -227 1228 -291 -322 1317 -802 -1834 577 1006 -2284 -922 1159 804 -2523 1617 2249 -2929 659
908 659 2357 -1347 -282 2169 389 -2959 896 2122 -1979 182 2036 -15 -1255 977 105 -1188
924 -1188 721 2349 -1259 -1398 1603 972 -2029 725 1892 -2981 8 2160 -819 -1429 773 884
940 884 -2075 1397 1544 -2569 -358 1905 186 -1437 1007 1339 -1478 -749 1997 -1122 -1602 1299
956 1299 1146 -2053 -454 1764 -1837 -1108 2557 -217 -2820 570 1219 -2292 39 1473 -1852 162
972 162 2306 -872 -1591 -320 1178 -1013 -1233 2078 -556 -2219 1398 1768 -2256 -1930 2816 -1850
988 -1850 -499 2485 -456 -2653 1388 2498 -1829 413 1029 -527 -1675 2631 466 -1016 -67 1337
1004 1337 -1301 -1394 2481 -373 -1004 -342 1690 -1408 -679 2553 -1395 -1198 1605 -274 -2033 1143
1020 1143 1919 -1586 -685 1234 256 -2343 1719 346 -1145 -650 1165 89 -1023 1488 697 -1438
1036 -1438 559 2865 -1129 -1096 2123 -1411 -2383 2009 1038 -2095 203 1505 -859 -696 2125 -98
1052 -98 -2268 1787 52 -887 179 1335 264 -853 114 1467 -1219 -901 2577 311 -700 1963
1068 1963 319 -2263 815 1799 -1652 -758 1836 -388 -2010 625 556 -2197 432 598 -702 -897
1084 -897 726 376 -730 -476 392 -682 -566 1443 560 -1461 950 301 -1377 -16 1181 -1129 -338
1101 -338 1073 -223 -1690 2442 1183 -1232 932 147 -1573 -851 528 815 -1796 -304 1509 -528
1117 -528 -1381 1528 212 -1672 314 943 -830 -718 920 -524 -1169 1092 1534 -1380 514 400 -1512
1134 -1512 26 565 -373 -834 20 258 -1513 -206 644 -687 -876 1519 -351 -1169 540 -133 186
1151 186 -274 605 327 -291 -24 533 -1660 240 1128 -265 1058 275 281 277 670 381 373 -1095 62 -55
1171 -55 -962 1079 -667 125 -488 282 -252 -179 1179 -595 -1317 -37 913 -1149 -295 915 -1080 919
1189 919 666 -327 329 1031 -49 185 -251 -50 72 -1191 143 311 36 -699 1000 103 -145 -11 -16
1208 -16 268 308 132 -888 122 -324 -333 81 -19 -180 590 723 -432 431 -132 9 576 -749 797 580
1228 580 -268 -721 571 -662 -460 154 -1352 -457 -376 668 -261 -181 673 5 807 190 369 -354 -186
1247 -186 -310 1940 375 -797 587 -216 705 15 283 36 -386 278 175 727 -138 -799 152 -85 205
1266 205 -280 349 -1272 984 -512 -421 -561 360 -55 611 403 -419 1107 -548 -330 -793 556 623 -216
1285 -216 -389 -84 -602 620 147 265 1084 -264 -86 -44 -834 549 851 -1494 -317 -74 -630 1020
1303 1020 -204 -864 407 70 380 -939 54 -281 378 487 604 -177 829 55 -523 815 -924 332
1321 332 -7 27 -123 -102 -118 1507 -125 209 757 -1060 123 216 -547 -229 17 -523 -1237 39 72 -321
1341 -321 -386 435 -447 -979 648 -831 -1060 311 880 -489 -1068 905 -644 -146 -178 139 -570 115 210
1360 210 -542 187 880 424 -79 -28 1015 -766 -103 1023 -37 -497 654 -359 -1378 543 224 -460
1378 -460 770 1108 -225 252 848 699 -1018 -319 1031 433 -1059 477 640 -338 -352 1015 -406 -614
1396 -614 184 -286 -434 1430 -529 -1206 107 469 -1008 -1227 -293 681 -828 -79 1248 -1421 9
1413 9 1342 -200 -97 558 791 -1656 -447 1230 -1374 -997 1115 532 -1427 950 -375 -756 -641
1430 -641 1137 -1199 -1306 516 674 -1009 -411 1826 -1016 -87 413 522 -448 -411 2212 -1112 -153 1418
1448 1418 -592 -2028 2148 886 -2199 387 1293 -1106 -1074 1551 -97 -1462 703 1031 -1536 47
1464 47 2127 -1041 -107 1696 223 -2104 -600 1129 -1714 -1275 3154 1423 -2292 2174 1269 -1861
1480 -1861 369 1848 -867 -1351 2859 1259 -1886 79 1879 -1460 76 2241 -1483 -2621 1222
1495 1222 883 -2378 -968 2127 -1281 -2185 1960 1201 -2247 1445 1821 -2176 -161 2881 -813 -1490
1511 -1490 2132 1334 -1828 57 2398 -1124 -2322 2755 259 -1875 1137 2369 -1464 -855 3190
1526 3190 -1012 -2000 2244 1533 -2945 101 1652 -2102 -1264 3593 224 -3255 2345 2072 -2569 -50
1542 -50 3215 -346 -2839 3349 784 -3316 759 3141 -2668 -1092 3515 191 -2810 2552 3261 -4121
1558 -4121 506 2641 -1776 -3151 2592 766 -3800 612 2657 -3213 -1547 3401 -874 -3743 2089
1573 2089 2382 -3531 -435 4158 -1673 -2277 2822 354 -3911 2222 2698 -3842 -1595 4579 -1302 -3514
1589 -3514 4274 1462 -3982 1060 4383 -2147 -2514 3709 982 -4443 1544 3185 -3812 -1818 6110
1604 6110 -1563 -3349 3302 2215 -4223 200 5738 -4239 -2381 3731 486 -3504 2249 3580 -4953
1619 -4953 717 4161 -2024 -3116 4761 503 -3793 -272 3864 -3110 -2005 5225 -486 -4473 2314
1634 2314 3548 -4253 -499 5683 -1863 -3056 4506 -92 -4930 1645 4696 -4049 -1899 5253 -1485
1649 -1485 -3938 4200 2633 -5111 235 4159 -2742 -3250 4987 1030 -4747 2077 4566 -4108 -2749
1664 -2749 5673 -2445 -4509 4158 2547 -5985 1804 4667 -3438 -2636 5332 469 -6272 2423 2928
1679 2928 -3321 -588 5051 -902 -4475 5004 2817 -4588 1544 4574 -3250 -2693 5936 337 -5099
1694 -5099 2629 4068 -4131 -762 5981 -2918 -5118 4342 2359 -5242 1267 4749 -3240 -2563 5817
1709 5817 -447 -5793 2745 2886 -5316 -643 6467 -1501 -4336 5446 1497 -5546 2155 4971 -4878
1724 -4878 -1814 6029 -1385 -5124 3708 3462 -5503 -433 4605 -2486 -2984 5573 818 -5673 2521
1739 2521 4948 -5093 -2280 6096 -1689 -6168 6066 3075 -5794 595 5608 -3495 -3614 5826 -105
1754 -105 -6197 2975 4598 -6037 -1046 6289 -1747 -4800 5554 3239 -5714 692 4793 -4331 -3982
1769 -3982 6091 446 -5543 3111 4570 -6274 -1889 5968 -2670 -5198 5223 1787 -6305 1860
1783 1860 5189 -4197 -2955 5863 -673 -5744 3715 3640 -6413 -204 5905 -2292 -4149 5855 1363
1798 1363 -6713 2006 4681 -4760 -2080 5530 -420 -5194 4014 3746 -5657 -609 5644 -3019 -3953
1813 -3953 5348 772 -5675 2239 4958 -4532 -1787 5869 -828 -5969 4394 3149 -7030 1374
1827 1374 5105 -3656 -3641 5992 420 -7069 2325 3501 -5897 -1662 5635 -2184 -5896 4047 1860
1842 1860 -5495 848 5404 -4555 -2844 5459 64 -6481 3109 4242 -5553 -856 7070 -2758 -4096
1857 -4096 6133 2124 -6805 1572 5647 -4726 -2336 5904 -581 -5169 3481 3026 -5452 -1197 5719
1872 5719 -2237 -4231 4746 1636 -6400 2518 5362 -4759 -3141 4797 -1650 -5527 4179 2929 -5496
1887 -5496 -34 6292 -3046 -3283 5543 250 -5732 1985 3905 -4792 -1264 6327 -783 -4100 4682
1902 4682 2205 -5907 45 4843 -2846 -3326 5211 599 -5060 3292 3433 -5155 -1248 5855 -1795
1917 -1795 -4089 3770 2187 -6376 322 5103 -3927 -2308 6136 177 -5140 3237 3593 -5270 -491
1932 -491 4584 -1396 -3957 4883 2078 -5285 1978 4236 -4344 -2421 4376 -1362 -4223 2904 2845 -5172
1948 -5172 -352 5274 -2888 -2530 3608 2195 -4829 1435 4368 -4665 -1557 5868 -716 -5576 3713
1963 3713 3393 -5158 217 5385 -2887 -2094 5331 680 -4715 1841 3115 -3611 -2017 5425 -1411
1978 -1411 -3464 3876 2401 -4664 308 4195 -2601 -2886 4507 472 -4726 2123 4404 -4192 -1111
1993 -1111 4524 -1406 -3498 3940 920 -4807 1598 4117 -3050 -2841 4309 -305 -4169 2150 2833
2008 2833 -4245 -422 4622 -1689 -3995 2572 1526 -5003 1490 3253 -1875 -1694 4061 -120 -2894
2023 -2894 2464 2192 -3906 847 4862 -1549 -3128 3548 690 -3475 1365 2760 -2412 -1682 3941
2038 3941 116 -3318 2522 2837 -3196 1011 3979 -1446 -2759 3004 445 -4670 1381 4027 -3607
2053 -3607 -218 4092 -1738 -2425 3025 1911 -3010 -92 2665 -2031 -1982 2989 -294 -3211 2369 2825
2069 2825 -3166 -901 4471 -1479 -2683 2659 1762 -3902 1780 2713 -2064 -909 3499 1139 -3494
2084 -3494 1887 1331 -3154 337 3888 33 -2789 2711 1462 -3250 392 3090 -1747 -1640 4093
2099 4093 -390 -2668 2090 1687 -2931 -118 2707 -2204 -1252 2583 729 -2388 1126 2296 -1296
2114 -1296 -1659 3080 -688 -3243 1620 708 -1360 456 2284 -1852 -973 2547 1167 -3752 1032 2397
2130 2397 -2164 -65 3209 -1244 -2349 1794 1359 -2627 542 2097 -1540 -931 1790 400 -1862
2145 -1862 -57 2037 -1784 -1012 1952 -1235 -2537 2442 1276 -3301 869 2212 -1354 -1077 1591
2160 1591 261 -2027 996 1678 -2256 -246 1469 -1306 -2341 1710 -129 -2483 552 1642 -1578
2175 -1578 -758 2037 72 -1937 1670 1383 -3015 467 2322 -929 -439 2045 375 -2100 827 803
2191 803 -1727 -961 1352 -9 -1913 508 733 -1712 -910 1212 -883 -464 1869 569 -1588 639
2207 639 2256 -1660 -836 840 673 -1596 1072 1498 -1154 206 1539 -836 -997 952 341 -1348
2223 -1348 22 1378 -453 -135 752 -956 -1558 1291 229 -1445 -68 1903 -436 -803 1067 6
2239 6 -819 30 750 -1121 825 988 -678 -1054 574 -233 -1508 187 1128 -1027 -1094 -87 -450 -1227
2257 -1227 764 293 -1580 -294 591 -255 -765 1388 739 -1273 386 218 -290 -916 636 390 4
2274 4 1424 364 -1573 -325 635 -268 -344 1152 341 -553 -334 560 -1337 -955 1075 55 -324 -274 410
2293 410 -204 -411 745 -313 -123 686 -1007 -272 531 1148 308 -1102 -293 282 -947 446 -38 -900
2311 -900 -314 577 -449 -922 443 488 -398 1722 191 -1313 752 -448 -232 736 274 -174 -1474 -890
2329 -890 192 -374 -339 1249 518 41 740 214 -169 -828 1111 -238 -251 1246 820 -873 6 96 -1175
2348 -1175 -190 507 -91 -315 522 984 -288 -474 402 -471 -505 255 -138 -398 -153 271 -96 -490 795
2367 795 569 -482 784 1269 -1251 -981 98 -1682 -752 897 921 603 664 1292 -127 512 155 -770
2385 -770 488 -231 285 -130 467 579 -1180 59 -1035 -97 -223 38 512 237 -1314 -1038 -285 -60
2403 -60 -957 -289 177 -309 258 -555 88 283 -575 378 -145 -6 -805 642 -407 491 508 -108 425 -298
2423 -298 177 542 -232 417 -575 -52 -3 -410 -508 -208 -376 119 712 -591 -29 -387 5 482 575 437 -489
2444 -489 181 -618 637 1017 458 54 -121 524 -133 -686 -69 -177 1170 -398 -656 -70 -275 91 881
2463 881 177 -29 -134 629 261 -748 -520 -417 87 -302 -393 56 -98 -434 -223 870 -848 -1052 -275
2482 -275 -899 -163 677 268 -71 -960 413 -142 -446 81 77 25 -893 -128 13 509 76 -1142 -348 -206
2502 -206 1112 -957 -262 -398 400 -267 20 451 -846 -213 339 65 32 210 316 -40 224 -1000 -663
2521 -663 534 -467 533 341 156 -253 -1445 -609 569 -783 806 417 1251 -727 -313 -379 32 -1188
2539 -1188 293 388 -689 725 695 257 256 149 -1502 1180 210 -367 596 558 325 -780 -222 44 -1168
2558 -1168 181 265 862 -293 -162 -461 -651 247 -535 516 -366 293 219 -550 -410 -1438 -539 70 -1577
2577 -1577 -798 -878 -1023 -682 745 657 -485 858 -249 -430 -507 380 362 237 -485 357 -625 -5 -93 919
2597 919 -688 -515 450 1428 117 -158 115 -795 -45 884 188 127 879 -509 548 -208 -139 211 -783
2616 -783 -418 -486 613 -499 -690 194 95 473 335 117 591 -301 -1008 1058 -640 153 -116 104 42 696
2636 696 -540 431 1511 87 -213 228 -45 -496 -144 -669 -495 811 -1331 526 456 -345 -90 -747
2654 -747 627 -294 -156 648 -366 -507 -75 411 840 -824 125 -112 -45 467 -336 -76 -637 737 337
2673 337 124 776 -780 -324 321 -493 580 261 893 393 -326 -661 518 -213 -427 395 1058 -295 608
2692 608 -49 -175 567 -169 130 -504 298 -89 -278 -368 152 53 215 -661 -456 -403 -193 386 -172 -1260 443
2713 443 883 -310 134 30 -360 -781 131 656 98 509 869 -247 179 -832 152 297 -342 328 -289
2732 -289 -1041 -613 88 422 -134 422 -17 -738 -593 -393 440 272 -601 905 -44 -310 -2086 359 -627
2751 -627 -135 -380 571 -127 -560 134 409 107 266 -457 -380 699 378 219 -946 596 126 555 -625
2770 -625 -169 -79 -399 369 207 -83 -164 -263 228 -194 -82 -183 -510 488 -745 145 -36 1446 245 1190
2790 1190 476 -210 570 -1260 46 362 158 -138 -148 23 1179 -346 192 -326 315 -159 304 -497 -217
2809 -217 -165 994 499 259 -829 169 -156 103 -1100 -290 410 727 -1253 377 319 -595 1515 1232 357
2828 357 550 914 532 1150 143 -312 -102 461 -150 -121 347 -55 341 165 43 93 -145 447 -878 -610
2848 -610 -218 208 321 -126 541 -349 469 -335 69 289 453 -613 -189 727 44 -56 615 -66 470 -58
2868 -58 -540 -98 -467 592 654 687 -773 -862 -723 -512 465 -359 -229 -96 18 29 -463 -172 4 -74 190
2889 190 -107 654 381 -313 -483 101 -322 -662 229 -76 -312 750 -304 729 235 438 -344 1365 -438
2908 -438 473 -1416 -537 645 776 -462 -803 -1105 115 268 -700 230 367 -119 326 228 419 -1238 -203
2927 -203 -10 -1304 564 -686 -137 -123 -646 -398 -58 216 -342 -480 -252 655 464 -826 1 134 -608
2946 -608 -573 -375 576 -552 334 429 -469 94 222 695 -998 64 35 842 238 -364 550 -456 -998 145
2966 145 -506 56 -632 -176 -675 -403 57 -376 416 441 63 -103 301 382 -120 -644 13 -346 7 1390
2986 1390 131 -165 530 68 218 -434 114 207 155 33 190 766 -987 -78 1076 -408 -284 -511 -222
3005 -222 657 -487 -237 -496 86 -585 -108 -37 -649 -226 826 -283 181 449 -412 341 -347 -153 416
3024 416 38 -400 -46 180 -226 -620 -21 107 -837 -873 1028 -167 -482 -384 317 -579 -529 495 633 758
3044 758 -307 546 -226 -543 273 -110 961 579 -155 214 -895 128 -2 -530 522 48 -219 -103
3062 -103 214 179 684 -55 -29 -163 -636 269 407 106 -420 145 -491 256 54 -156 189 -1516 356 237
3082 237 -533 636 -793 204 52 -313 837 -185 0 -239 -62 153 725 -255 306 -305 -704 -111 156
3101 156 -422 -697 807 287 -448 169 81 205 8 700 219 -410 136 399 187 776 8 -446 844 -319
3121 -319 -95 695 -476 788 -160 55 520 289 131 357 678 117 -1019 -45 124 405 -74 -474 652
3140 652 -264 -667 -1286 -350 -229 -693 -194 8 -776 -92 -422 -961 505 274 -140 -560 994 350 474
3159 474 551 829 183 230 197 155 44 -94 63 -225 530 -178 -223 262 504 -95 -108 145 233 402 -170 827
3181 827 -233 513 -621 232 -305 225 1578 -243 637 -294 221 335 425 488 -310 59 600 -173 -250 253
3201 253 169 -587 382 -332 -51 -5 396 90 463 -1282 390 -113 105 -10 550 127 858 -1157 -316 -766
3221 -766 -112 -74 -289 438 60 837 838 -38 -728 19 193 325 -509 -482 141 -344 -583 -387 199 -82 477
3242 477 -491 274 -505 556 366 -758 -402 165 773 133 284 -506 -453 -762 -164 -694 -386 574 -677
3261 -677 213 961 -96 49 311 375 232 -750 -623 -943 5 85 -843 330 -207 65 -810 -315 -211 -111
3281 -111 -334 693 -736 -191 -205 -210 -184 233 184 -37 526 302 35 -215 1147 -501 1092 359 583 432
3301 432 -284 572 428 -99 344 338 499 447 803 -628 341 125 -449 -1395 283 -401 -346 -197 592 -10 -22
3322 -22 338 417 -268 -1228 271 -55 -428 1076 400 -16 535 -136 -967 392 177 367 71 116 384 -751
3342 -751 -48 244 -243 -20 283 38 -240 -949 -778 -167 453 -946 -397 408 -288 104 401 361 91 -231
3362 -231 -1359 1001 -470 -184 754 883 635 232 1320 -432 -263 -319 314 -17 -102 395 -530 43 519
3381 519 -455 -124 939 538 -29 795 -314 -1736 -25 1022 -335 -37 202 379 -214 398 31 -435
3399 -435 -1121 -100 380 -526 17 146 10 -158 -61 10 -745 -24 459 -161 1190 -519 86 64 -320 -274
3419 -274 -94 -554 297 200 164 1005 -628 -276 540 -24 -207 714 -6 -912 -992 -345 178 -184 718 76 -403
3440 -403 199 1125 25 -957 689 346 -666 150 248 18 -798 1132 -366 -155 116 -344 193 76 1037
3459 1037 75 -474 -612 142 -147 -284 -166 -83 -598 733 -352 -559 -286 137 384 -312 129 -582 -780
3478 -780 -262 -417 -106 -432 276 183 427 771 -13 -323 1 -221 -1751 638 361 383 -130 600 -442 -387
3498 -387 -411 112 -536 -664 -371 526 -405 582 -202 -434 775 98 -1351 364 772 49 -624 522 -425
3517 -425 -358 -829 320 74 355 816 60 -510 -1444 648 -139 -881 706 -190 118 151 444 71 260 396
3537 396 -211 93 263 775 -602 -908 454 73 -602 354 114 12 785 -411 -5 246 301 50 -399
3556 -399 -452 -197 -592 695 -219 -311 -632 -340 -484 -816 481 361 -704 -1264 227 -217 587 -904 -67
3575 -67 -185 56 171 -629 193 643 225 -321 -477 -310 611 -451 -29 -165 -366 -20 197 46 321 -94
3595 -94 3 471 73 -297 -90 666 505 -12 24 1251 -528 -237 510 125 -283 30 -446 -480 -694 172 71
3616 71 79 66 50 -652 732 764 -461 -281 71 -764 -96 311 -542 -466 -271 115 425 203 28 -226 -408 3
3638 3 -28 -154 -197 1143 -23 -529 5 1321 -1028 -409 708 600 -365 -148 170 252 -329 523 -280 -1169
3658 -1169 826 -687 45 260 482 -88 -471 170 207 241 714 -1174 345 340 -159 578 -722 1023 -589
3677 -589 -880 -291 470 -396 429 -309 -287 -54 1153 -6 -764 304 -171 -191 -65 198 -300 -298 1000 653
3697 653 -1084 -163 -488 430 -402 498 513 -389 -129 862 -626 801 -713 -788 -680 -318 1207 -642 788
3716 788 194 59 212 -312 -293 -463 921 818 -665 1324 1230 -593 -118 209 151 -574 -465 330 499 1345
3736 1345 -292 725 -939 -285 -561 -678 -138 547 -228 277 581 73 -365 126 32 -58 1033 252 4
3755 4 -1032 595 -55 -556 -53 -604 206 464 -274 -349 -1099 95 201 888 842 -150 -296 -700 111 412
3775 412 -741 289 582 65 -71 204 252 54 -39 217 -956 -185 94 -293 -119 36 -493 -88 307 184
3795 184 291 -376 -12 -636 603 413 2 241 -157 -143 -512 224 252 -1168 226 164 1269 -281 651
3814 651 -517 -248 -763 -459 -159 217 -62 -944 485 -135 814 300 -733 -858 -406 119 -104 493 -292
3833 -292 17 -82 574 -427 -166 216 -493 552 308 722 -64 851 675 383 -262 362 -698 -440 715
3852 715 -106 80 459 314 167 -754 293 -328 144 -796 -452 -172 -58 1004 26 -31 -198 -221 -412 103
3872 103 1000 84 65 198 373 -501 -309 -502 -622 101 -195 4 -242 -127 746 343 109 108 -540 234 -439
3893 -439 -232 -617 814 203 -795 318 445 394 -249 -81 581 680 -79 148 464 6 165 -321 -631 789
3913 789 769 -1012 -944 583 -95 79 -188 -492 89 279 220 43 198 94 -6 -620 -135 189 -752 302
3933 302 -438 288 329 -83 -89 -1096 -540 261 276 -385 -540 -61 195 -232 824 27 825 1251 292 -255 777
3954 777 -356 -290 268 -241 -821 -214 273 -97 552 244 -102 -643 511 611 -254 -510 -411 -857 -635 212
3974 212 -49 -506 -631 -1005 914 330 -71 -389 332 227 887 408 -131 -282 -474 -473 206 310 -596 1374
3994 1374 294 512 -168 586 72 -306 167 -625 -656 -430 -1199 268 226 294 -678 -89 331 -679 585
4013 585 -842 350 447 344 1166 667 81 -660 -359 -1052 755 697 -136 181 243 450 270 446 266 176
4033 176 325 15 752 396 -748 -506 52 -296 372 -253 -365 298 -139 -170 -606 102 55 -377 -755 522
4053 522 -718 -205 871 31 -71 -255 -419 339 635 128 373 -501 640 -308 486 836 597 -184 -19
4072 -19 788 537 -216 -254 -174 713 354 -473 -298 211 -453 48 700 1149 176 -201 261 -163 -370 900 8
4093 8 127 -170 103 121 -4 284 163 591 410 804 213 -2 -125 -49 -1135 -1089 -344 58 998 -746 113
4114 113 -1055 131 673 -605 -512 183 -736 -835 -421 391 343 423 1261 64 -114 601 -344 -1115 -211 952
4134 952 206 -111 -139 -302 -90 213 415 88 -1643 -65 69 81 652 -411 266 -323 -67 344 237 -631
4154 -631 654 774 309 609 412 330 -271 303 110 304 9 394 -173 302 -599 -1 -633 503 610 -1218
4174 -1218 1236 -287 -1016 -66 554 -230 -1078 -478 -462 -1353 -144 549 -205 -1323 -853 -852 327 -59 -966
4193 -966 438 -712 493 444 562 516 7 798 -118 60 14 -593 -633 -865 377 224 -1094 -980 -268 -15
4213 -15 460 -108 567 39 35 -145 390 -247 1021 40 -846 129 -748 229 170 47 729 -427 576 320
4233 320 -1312 -116 745 -1365 -90 233 -612 351 -49 -475 219 721 -99 -216 -128 50 -718 -158 -63
4252 -63 -595 -155 -575 359 34 -150 148 915 -598 -34 -790 312 -31 -651 374 -266 -655 -311 -201
4271 -201 -840 185 127 65 -946 -123 333 54 780 -247 1150 190 326 849 182 158 -582 -605 -70 -15
4291 -15 -308 855 -1265 -93 -104 -44 -344 -523 51 983 -546 410 -441 440 -274 410 -456 19 817 260
4311 260 -497 -165 -856 -262 653 102 593 70 -18 -278 -288 -271 125 498 -127 -393 678 70 746 446 -424
4332 -424 -598 -255 363 -96 275 -271 -777 -6 -241 1149 -724 -178 -510 118 533 15 -567 129 548
4351 548 -498 -235 51 -187 258 -489 -362 399 -261 -344 -451 441 -520 417 -139 361 -1377 15 -215
4370 -215 -147 -948 412 365 947 449 -106 8 -74 -252 317 866 -288 -161 20 886 24 112 368 -382 -399
4391 -399 -288 398 44 -275 -14 -90 -813 -274 483 402 1047 6 -32 267 -553 -1271 -273 -572 -588 -331 224
4412 224 -458 483 70 13 -104 -87 -30 -494 122 -422 -1021 277 224 149 747 -1 -931 -121 239 -825 -673
4433 -673 -641 -429 -934 63 675 194 12 433 -614 379 298 872 -38 245 159 -255 -70 -1215 -259 -977
4453 -977 199 190 -184 -339 -21 -364 207 506 730 582 -292 -920 -285 -590 -691 -81 123 213 -88 -249 351
4474 351 333 494 450 -385 634 -299 -303 588 -17 108 79 -259 -153 167 276 106 -859 222 -544 35 600
4495 600 -870 391 -23 -548 -75 -801 72 1134 -58 -381 -641 668 -483 -225 187 565 1195 216
4513 216 -176 -17 29 291 -59 547 832 -381 -137 -344 169 317 -90 282 -294 133 43 -270 161 -3
4533 -3 678 -157 -33 110 300 191 -269 -252 440 -115 -365 -273 -278 196 535 219 -105 343 -53 -209 528 215
4555 215 712 381 -372 239 -174 -284 139 142 -141 -444 -612 253 50 -1319 -400 532 107 164 -744 -781 -153
4576 -153 -385 -329 670 -172 162 -361 573 1393 -6 79 -644 -64 297 132 480 187 23 238 565 -40
4596 -40 245 278 166 -10 -40 -320 537 81 1030 120 -279 -25 -359 790 -473 797 163 248 -495 -440 157
4617 157 616 121 -404 -129 -354 -154 506 649 4 87 -56 198 20 -367 271 -384 18 -301 -411 874
4637 874 416 117 814 578 441 1448 -399 104 -383 234 122 557 -587 -279 205 797 -249 -74 -831
4656 -831 -131 243 136 -204 -1017 -227 -464 -798 629 574 -30 -325 -404 -552 -63 727 146 178 -691 -511 -543
4677 -543 -201 -291 -1012 651 302 -710 -747 -92 732 4 269 -704 -59 236 -476 -496 -295 -166 380 211
4697 211 564 -588 87 -149 -51 579 -28 -193 121 233 -759 265 147 -583 -213 -188 -60 -931 -126 -271
4717 -271 -465 431 127 -488 34 -462 206 322 292 -820 -735 -328 -306 259 16 -16 386 534 -366 -3 417
4738 417 54 421 531 -811 124 584 787 41 -481 78 951 -1010 -519 -335 640 -31 -288 -355 -291 -70
4758 -70 231 99 585 148 404 379 -195 136 230 -420 -683 201 409 -201 -428 -616 242 -180 1144 101
4778 101 -681 -880 348 99 -8 -615 908 -578 296 -123 -8 1057 98 -285 -443 103 248 467 -302
4797 -302 625 -331 234 -113 55 189 675 510 -4 493 442 594 -562 -250 -242 -1115 -153 328 -358 510 47
4818 47 -5 -565 -152 -70 550 -513 704 10 -327 -266 -153 766 281 -9 -510 842 -362 86 -438 -28
4838 -28 -93 -32 -703 358 616 332 -342 -143 -317 -45 38 496 295 -317 34 328 -284 -223 128 360 -173
4859 -173 1243 1310 528 1090 8 826 217 252 -170 -189 -422 -626 -455 -969 -168 21 -115 -313 45 50 -590
4880 -590 351 -110 -44 -132 234 -701 -551 -337 -394 -713 -296 -775 223 -20 298 -438 242 -962 908 -63
4900 -63 203 300 -183 -611 -238 1891 -407 -300 -214 686 -965 -302 560 -385 -416 1141 -524 -203 -48 108
4920 108 324 591 -543 -680 -24 765 -31 284 1320 -235 -6 265 -18 594 817 136 -849 1390 -964
4939 -964 -243 -583 -770 -400 -5 124 169 -787 -63 -740 504 388 41 229 -232 -91 -394 -521 -516 -90 102
4960 102 411 -88 -345 -604 475 -327 -377 196 -497 -1145 -492 909 -534 870 223 -581 -26 -475 757
4979 757 963 1029 239 -589 -147 -176 442 -315 -601 522 1 -511 -177 541 -156 -263 307 -518 570 -707
4999 -707 401 469 704 703 -55 11 426 -144 -38 23 -650 450 333 -163 -240 -142 926 244 -25 -287 -651
5020 -651 820 342 339 355 -26 -41 658 -561 217 688 874 -350 1021 -690 120 -40 -373 -860 -145 -781
5040 -781 -475 -413 -508 34 626 -893 -541 77 -368 598 -600 1236 407 -324 -442 -47 -540 -172 212 586
5060 586 639 -84 -217 132 201 -22 47 736 -656 568 156 -326 862 -465 91 -122 74 373 574 200
5080 200 530 -73 -70 -36 -263 291 -1088 761 216 560 29 174 -752 -176 355 517 160 -141 233 149 -359
5101 -359 -259 615 -24 1051 651 -14 609 838 397 329 -211 -483 -534 -15 -125 -679 -455 -161 -756 632
5121 632 -197 -340 -637 787 1092 193 322 -70 133 185 544 -412 157 79 -460 570 -437 511 1055 -229
5141 -229 200 -754 216 10 766 -328 -675 550 367 -12 636 513 725 -201 -4 433 13 135 373
5160 373 121 -282 -544 824 -293 517 626 -860 455 77 18 -667 397 -546 127 361 37 -422 283
5179 283 310 181 -1006 -633 -694 -231 -65 829 985 -720 30 197 -332 -594 658 151 1062 320 -662 -8
5199 -8 -70 -295 31 793 -366 816 166 3 -230 -201 102 -835 487 269 -440 -96 -211 34 45 908 -288
5220 -288 101 365 600 145 286 -753 -104 75 337 -696 -502 112 -571 84 791 951 154 -842 -239
5239 -239 131 -14 152 588 422 160 -707 -378 242 -210 457 -172 -1081 -591 -324 420 93 434 178 825
5259 825 -659 -52 -155 -741 514 320 -810 -973 -316 139 5 -331 437 662 -368 -604 -94 136 842
5278 842 115 -77 -78 -1429 657 265 -220 196 452 219 358 -27 109 -435 504 535 452 -39 33 92 -306
5299 -306 -295 -157 -661 701 1085 761 -1394 -911 -1057 -383 -21 -530 611 -258 574 -448 -178 -170 -48 960
5319 960 755 900 -547 135 194 -342 277 -133 -546 -359 339 -124 -306 234 68 194 -274 -53 954 -175
5339 -175 601 -60 39 -484 202 -563 -515 -977 536 71 189 -307 463 -615 -1046 -53 -280 526 -142 1425
5359 1425 -161 -138 -48 -135 743 -754 503 66 896 -612 -424 -1 275 -493 131 655 892 -844 21
5378 21 278 -193 254 -322 -899 -77 1323 406 796 -40 1387 723 263 31 586 -429 -58 -519 172
5397 172 173 -617 -157 -343 -22 -364 -661 -524 -382 482 -421 -813 -2 -197 901 -382 493 -245 260 736
5417 736 -247 152 -897 125 -200 -234 -175 -17 -461 244 -231 -259 723 -280 -237 656 -264 121 -249 -68
5437 -68 -2 116 931 -743 142 262 -94 1259 -48 640 383 -407 521 -488 765 -367 -186 -723 -655
5456 -655 -294 119 138 -376 173 631 15 1096 -111 845 -365 643 416 -185 114 938 42 674 -376
5475 -376 215 390 -269 42 336 636 -913 223 227 1210 437 511 -852 -821 4 -201 -302 -147 72 712
5495 712 463 -723 227 -202 418 58 66 -32 641 183 528 -571 -513 -84 710 440 409 176 -330 1394 -388
5516 -388 -361 -293 912 924 574 -1159 197 128 1055 22 -802 38 -229 -128 226 0 -690 -1433 54 394
5536 394 270 598 308 -484 635 476 690 -247 171 -1613 526 -906 -977 -167 858 281 -1046 -537
5554 -537 -16 159 -125 -820 -679 376 46 -98 541 123 204 -175 149 -340 -212 76 79 358 -654 22
5574 22 -1001 -96 -349 -62 -363 86 -449 505 548 -698 -215 454 -1049 -199 -168 -453 -276 -73 268 -517
5594 -517 -299 322 266 308 137 672 997 -108 -345 -227 -630 -186 -28 437 424 313 -193 -12 -382 -172 221
5615 221 -378 1094 -116 274 456 46 117 387 233 -198 -620 -15 -564 -499 -1090 195 751 -138 -190 814
5635 814 404 -1192 -31 459 215 136 180 -762 720 290 274 154 -214 -16 -378 578 -255 121 241 480
5655 480 411 951 1221 -254 -490 -150 -1362 -429 -732 -278 -903 -339 38 492 101 138 223 843 314 85
5675 85 362 -608 -133 -343 166 53 -94 -486 151 409 -361 -23 -402 1106 67 42 -272 228 -678 -96
5695 -96 -673 -627 -147 213 23 878 -419 -414 1095 -839 -471 1214 -728 -555 303 208 336 -258 688 4
5715 4 412 -109 -478 821 493 -257 350 187 543 -631 754 546 394 47 -588 269 463 -392 194 689
5735 689 368 -350 464 -146 -306 577 714 428 444 -167 369 286 -464 609 215 600 -198 308 -365 136
5755 136 180 -225 233 -107 82 554 -243 -397 -391 506 553 -191 -26 266 -228 -845 -54 -371 -57 -88 305 -287
5777 -287 214 -197 -178 379 713 289 14 -28 -441 292 198 389 -626 702 -40 -519 51 -74 -2 -103 -352
5798 -352 50 -177 201 -315 143 -296 -189 52 191 313 90 -345 -313 957 316 270 -903 513 354 -117
5818 -117 208 734 810 90 47 -172 -177 240 1201 -40 192 -213 439 33 66 48 413 350 -294 -162 371 512
5840 512 37 -117 706 349 -690 -138 -146 465 -576 596 -839 -108 319 -221 13 16 272 -461 88 -656
5860 -656 749 57 585 331 -251 -899 301 -82 257 39 313 -174 164 -856 23 251 -154 688 -538
5879 -538 516 348 32 24 460 323 -168 445 86 -363 -132 931 796 211 -146 62 -132 -203 122 -177
5899 -177 -253 -107 206 216 315 37 65 650 1019 42 632 -189 223 58 -687 -725 18 -316 465 134 169 242
5921 242 -30 205 -891 614 190 265 -196 -70 262 479 -521 369 383 -15 -114 -337 238 -1004 -122 176
5941 176 401 1316 -485 33 -215 77 -799 -159 590 93 377 -75 -99 -25 -227 1653 276 69 209 -615
5961 -615 -566 481 38 527 -490 246 -380 380 676 842 891 98 1053 -63 202 -142 405 254 539 -151
5981 -151 883 -542 462 -179 -534 597 -626 -199 377 -473 99 299 -153 138 -706 -454 63 165
5999 165 -122 226 815 -148 358 230 268 -103 459 400 160 272 509 134 316 28 18 588 -648 -160 -233
6020 -233 527 -442 328 -670 456 14 -696 113 -288 216 -339 218 -119 108 -74 -259 228 -632 341 120
6040 120 633 284 -184 -354 -604 603 412 134 -174 -533 -230 98 -312 645 -750 -160 -541 8 870
6059 870 -497 733 -177 109 61 25 -174 1110 -244 614 -668 101 431 598 -59 405 -587 1077 154
6078 154 848 992 583 -723 918 401 588 482 -967 1126 -216 459 -1105 779 437 161 647 -261
6096 -261 507 -821 414 -498 -7 195 -646 -490 -258 212 -876 688 451 -688 -281 -571 296 -64
6114 -64 47 -175 -327 -1107 179 -175 -116 -447 -495 -496 -15 147 222 -762 -365 106 -537 -819 -346 -172 -641 166
6136 166 -12 464 -896 -134 -601 49 573 641 29 343 -723 -312 -3 378 -47 -72 838 161 452 -498
6156 -498 -868 141 -570 280 913 780 -194 -682 145 16 -1249 35 -162 887 -80 -333 52 716 181
6175 181 113 666 567 -81 319 -89 -745 -692 -269 387 -469 -86 219 -854 -863 -333 15 465 -31 690 -354
6196 -354 -32 314 -515 28 -1064 61 -48 -261 345 298 -50 -779 -351 -1057 535 662 739 201 357 1111
6216 1111 -148 592 -397 -254 201 191 592 -83 -158 -827 192 -415 -348 -401 379 -397 -545 399 -417 55
6236 55 -1201 -124 351 1009 -443 -413 -8 459 331 287 164 -918 -453 668 843 735 163 73 -421 -283
6256 -283 -463 230 -633 -550 -1176 -1266 289 198 273 -282 -16 622 321 455 -994 510 -92 19 42 -235 -300
6277 -300 -812 -237 907 -470 -254 -291 -384 -887 4 275 -116 122 56 5 595 294 617 -674 -250 181
6297 181 -269 262 335 -407 -903 12 -495 158 603 -547 -369 102 1077 -66 -172 -268 269 -289 400 178
6317 178 176 -52 403 387 660 -31 434 307 -1024 71 -636 358 -975 318 865 316 -78 -895 -485 134
6337 134 -695 -63 -93 292 252 246 186 -405 -357 116 -185 -110 -184 -608 271 -187 -780 716 85 762 -207 -590
6359 -590 -501 -25 291 -630 -169 -319 180 -163 -167 -57 -73 292 -480 246 -609 346 -441 -82 -273 421 -191
6380 -191 -742 134 230 -506 720 344 132 325 419 228 -313 244 -871 -41 -329 -154 -1552 1102 153
6399 153 -351 -1482 523 -79 70 -411 -252 -469 438 -184 208 513 -672 695 -851 -287 -258 -831 301
6418 301 502 190 -1236 -649 708 -95 303 -288 -780 -130 944 632 780 324 367 486 87 263 -1401
6437 -1401 628 -15 -312 24 230 372 209 -320 -820 148 -267 367 1018 -1071 -557 -323 206 -87 -163
6456 -163 137 477 194 671 482 -474 -422 414 508 131 700 -556 359 375 72 -93 -486 -10 339 -842
6476 -842 169 309 73 646 588 270 62 -502 -672 484 -317 -1333 8 -388 826 670 -77 -714 138
6495 138 46 -116 401 442 1169 -374 533 -588 -836 -1137 383 60 -1201 561 -109 607 90 50 -65
6514 -65 -455 554 344 -33 189 -539 46 654 -277 613 506 -296 142 -1014 -65 689 327 -92 185 12
6534 12 -317 112 -330 -128 550 530 -124 772 -232 784 128 875 594 -163 461 -303 536 206 599 98
6554 98 -135 287 175 -64 -246 -80 -497 410 -294 719 843 162 384 -1095 -560 -462 166 -460 102 -114
6574 -114 -161 -47 -119 -57 -480 207 688 408 532 -159 708 123 -110 -696 1039 430 462 974 174 329 192
6595 192 -649 47 730 -84 42 -349 647 179 -369 340 -100 -631 1294 748 -578 454 150 -269 358
6614 358 -578 195 -208 -17 364 413 -706 896 -105 -79 -333 198 -227 61 -115 -752 -108 27 873 -382
6634 -382 -203 612 198 252 673 -258 226 -349 -236 -776 -741 -361 462 286 216 658 -183 240 -395 332 515
6655 515 154 13 783 -65 336 -286 -311 -315 -5 -240 -1072 201 -286 777 796 645 347 275 -333 814 662
6676 662 578 -101 166 -309 134 -188 258 133 22 -105 139 -422 72 195 469 590 -460 -528 620 -193
6696 -193 -77 -100 -31 370 -562 50 -194 -72 -155 232 -34 -456 404 -477 556 -363 -258 -241 800 -212
6716 -212 -263 72 -58 -278 -531 862 664 244 137 1053 501 275 478 822 -757 -126 1090 288 -156
6735 -156 -523 -446 204 482 -289 318 340 -210 176 169 -480 896 -374 369 52 679 -957 -226 454 269
6755 269 -857 223 478 801 579 -440 1043 399 -77 292 -25 145 -322 -322 -320 30 -39 -745 661 -143
6775 -143 417 59 490 -170 46 88 256 -570 -1146 511 -327 -1145 40 58 56 463 -495 -1023 77 69 258
6796 258 276 -543 828 -294 1000 116 210 377 -703 -264 -551 376 -327 494 656 385 136 133 417 -170
6816 -170 961 -400 187 118 -167 -252 813 -1088 -142 423 312 218 -585 -70 202 -39 176 942 -243
6835 -243 218 686 -313 584 987 0 -1079 984 413 -21 -574 -675 1 -306 7 -122 604 15 -359
6854 -359 -189 -763 -474 172 -487 856 -318 92 882 -391 306 443 -490 402 348 -470 -89 1043 -8
6873 -8 -577 270 -197 -30 268 -256 533 -1008 143 -368 -324 -195 -300 -550 -449 801 25 25 -1258 -221
6893 -221 180 627 396 -350 -640 -397 -313 156 98 -929 521 -136 -156 160 -514 417 207 161 -838 649
6913 649 566 -21 -40 -274 -989 365 -58 43 -639 1026 838 -275 -67 -180 -82 462 -390 -610 58 -168
6933 -168 -239 -542 -115 -36 599 -71 -32 23 349 168 157 -1013 71 169 722 1182 157 3 -124 -231 -409
6954 -409 -222 -159 -706 -151 -754 91 105 264 513 455 81 195 -63 -104 -839 503 -288 -539 213 -221 90
6975 90 -423 925 189 443 164 -837 -325 -308 -397 274 273 -1 131 359 -527 298 -376 -238 -537 -631 33
6996 33 351 412 335 -98 1002 131 480 -6 -925 1030 -847 -283 139 375 7 -166 356 506 200 738
7016 738 -765 -8 -122 495 411 250 -472 -80 992 349 -170 -426 -377 39 -378 24 297 -429 -23 -179
7036 -179 597 -214 -665 214 -386 -849 13 367 -321 -448 146 -290 -569 -384 -295 -5 -345 208 -610 -54
7056 -54 -8 5 -123 285 707 109 119 12 550 177 255 -208 280 -327 -37 -1649 628 590 -345 76 -2 -209
7078 -209 -675 480 452 -871 -929 -882 673 277 -642 541 -546 -364 -632 -241 -134 -37 446 380 -475 -512
7098 -512 -26 44 -183 326 75 -728 -447 126 328 -1013 -569 -120 -232 -567 -269 -590 -747 563 -60 671
7118 671 116 384 20 -323 -110 -70 -781 524 407 -38 216 385 172 669 -106 -619 -432 624 -135 65
7138 65 292 -7 261 -390 71 -247 694 -676 -225 -103 -635 817 141 -37 13 773 -472 505 -791
7157 -791 132 1215 -677 171 1352 9 -81 -64 366 111 -15 246 280 463 -389 116 248 -643 -191 504
7177 504 109 -352 -426 -671 613 -581 -246 -168 560 -403 -105 -1117 -195 -568 756 402 416 323 -232 -26
7197 -26 25 196 45 637 -818 -358 273 -623 -1289 -110 -576 -901 723 -68 -271 -119 673 -13 -35 -272
7217 -272 -171 241 -354 -754 -314 -220 -774 -61 -677 51 172 -435 -83 11 84 735 314 14 684 347 -270
7238 -270 -33 -456 -21 409 279 -254 353 140 85 615 -732 265 -254 -22 -740 385 504 -85 59 -562
7258 -562 -138 -242 -44 172 282 -185 291 709 -72 -951 -251 626 38 68 84 -286 -64 91 379 -168 282
7279 282 -293 97 582 -492 112 498 27 345 -190 430 -676 113 454 588 -288 -1499 478 -813
7297 -813 333 881 -329 179 279 -109 935 -447 -388 21 515 83 164 237 1120 38 539 287 976
7316 976 85 142 304 374 49 237 782 913 414 -177 -495 501 15 -468 407 -331 -634 57 241 -362 -1336
7337 -1336 -92 76 -1036 -401 949 -671 322 912 -107 -221 -411 3 812 605 206 -13 0 659
7355 659 286 -137 -572 -266 -604 1327 328 -556 -592 411 1653 770 -1117 467 -328 1137 -88 379
7373 379 -1053 -62 54 -223 -337 -495 -505 175 386 182 612 695 -435 -442 1394 -415 412 -69 52 -423
7393 -423 690 -268 -455 -243 135 -56 190 -337 -1187 -593 -802 64 -21 -352 380 -596 26 814 -501 562
7413 562 -5 426 168 -291 742 -712 130 -285 770 -328 287 575 398 234 748 -90 -875 -731 -204
7432 -204 -762 2 610 -72 -307 -166 -384 389 312 -118 -848 92 312 133 58 -116 563 338 -814 -164
7452 -164 -266 272 -423 -514 750 458 1572 295 -519 305 -239 159 -974 -808 -138 868 -242 -439
7470 -439 -491 1042 109 80 190 -7 -37 82 493 -439 83 114 643 -606 396 -88 710 -183 -328 163
7490 163 -423 -890 243 381 753 -347 -359 179 72 -149 -68 95 -73 -787 142 264 1400 62 -368
7509 -368 454 -86 -265 388 -216 425 -116 106 438 52 282 -873 373 -518 -585 -120 132 -528 -563 147
7529 147 -610 341 -219 -914 -74 324 -673 -611 -230 225 48 -282 756 553 -837 -37 -42 -515 261 -1310
7549 -1310 -76 313 -352 -114 -1176 -255 64 408 372 -133 -153 392 -169 155 58 -212 216 -513 -544 -449 -553
7570 -553 -290 427 -596 -677 -276 328 -158 -171 477 -181 -2 -201 581 393 197 -669 -609 437 -224 -595
7590 -595 -931 75 158 -429 -22 -232 -46 723 101 -383 -166 87 511 -58 657 -126 345 150 -280 31
7610 31 394 -121 874 -52 -2 310 -188 -709 82 514 182 610 -304 112 -451 -665 -170 -556 783 81
7630 81 264 -178 278 120 508 232 320 -559 -1152 722 -771 -4 836 658 -185 782 552 620 -15 -126
7650 -126 -157 223 -495 -1003 -263 673 230 -83 -816 331 767 -75 163 -514 428 21 251 259 -451 322 -92
7671 -92 197 -383 -699 299 11 90 -686 411 -541 660 -322 433 614 -62 526 51 -418 90 -221 -537
7691 -537 -728 441 362 -46 -360 142 16 518 46 894 -528 -151 285 -115 266 -624 563 64 774
7710 774 -219 286 -71 -511 592 920 -183 1288 295 200 238 23 -518 540 49 513 776 285 942
7729 942 -610 661 1083 319 178 -1013 460 -275 -294 765 -97 342 -1031 -44 -1043 -315 -1120 -235
7747 -235 599 335 -256 -33 -516 -367 -404 -294 190 -690 567 -335 -104 269 -250 333 555 714 787 -371
7767 -371 172 304 250 -534 -34 -126 -303 -695 7 -286 -708 -249 -457 -391 -525 -64 -38 75 -566 -482 -265 321
7789 321 19 112 -15 26 1430 144 233 -60 594 -640 440 -615 -155 266 456 -306 -229 150 22 244
7809 244 320 -440 -302 232 458 -341 29 479 542 372 -83 129 -272 -584 287 294 -299 120 -71 44 1007
7830 1007 235 -715 48 368 -280 -373 -146 746 222 -42 49 639 683 42 -297 1017 190 308 1378 175
7850 175 811 779 -11 -115 -140 912 427 51 368 368 1191 376 -552 208 405 -704 5 46 -769 -757 116
7871 116 986 -92 -480 547 -103 427 -165 -1112 179 -888 -234 -620 134 113 115 -154 148 358 508 -233
7891 -233 218 424 -211 -800 202 704 236 231 -916 451 -207 503 408 -401 -64 -885 152 152 57 640 246
7912 246 202 -1050 571 -357 562 378 829 -80 40 528 -72 -91 134 -659 12 -670 -282 485 -453 180
7932 180 412 164 285 90 127 786 -132 386 -308 -62 -402 -85 -431 -87 592 20 306 581 -127 -632
7952 -632 -160 708 -475 -40 79 118 258 49 222 164 -348 15 686 -975 -819 -75 -65 -140 -527 134 -57
7973 -57 -299 -90 128 -88 -612 -673 -233 151 640 -820 260 134 357 -661 -543 89 64 791 -231 -21
7993 -21 79 -745 92 127 456 613 141 -60 -1188 -661 -559 -438 959 -383 -187 -1374 360 -532 264
8012 264 13 -1628 153 -542 73 220 298 847 92 84 -100 21 -754 138 -334 -511 -3 45 107 266 38
8033 38 -535 -327 -24 288 89 -164 157 -621 299 -132 244 30 467 365 -308 -659 -830 -58 22 -868 170
8054 170 -326 -852 309 -443 -410 -225 -119 50 563 -1006 -6 57 -165 429 -201 -115 407 629 335 170
8074 170 688 10 46 583 82 654 307 -975 114 363 -504 -175 274 632 -29 424 616 338 35 -33
8094 -33 -607 -758 -478 676 273 -736 943 65 -196 93 395 -314 -83 -343 -212 170 -135 -123 -235 6
8114 6 836 -735 -346 44 -652 -6 42 300 112 195 504 878 -719 -164 285 -715 -140 952 -1197 -57
8134 -57 -151 -480 -200 -145 -530 -13 -1028 -111 568 -18 -651 665 -108 72 438 158 -159 534 364 435 -882
8155 -882 334 -511 -38 -39 236 -272 233 -177 -702 506 -1226 -270 -274 -178 -232 167 558 -514 352 -174 390
8176 390 264 -659 616 -1162 -48 43 325 212 315 -613 184 431 240 -654 877
8191H77
$$ Imaginary data points
##PAGE= N=2
##DATA TABLE= (X++(I..I)), XYDATA
0 0 0 0 0 0 0 0 0 0 0 0 0 0 0 35 -108 108 -108 108 -169 216 -216 324 -324 432 -455 540 -648 756 -865 988
30 988 -1186 1305 -1513 1727 -1943 2188 -2476 2777 -3103 3457 -3861 4295 -4773 5283 -5855
45 -5855 6471 -7143 7878 -8677 9557 -10533 11599 -12776 14083 -15531 17169 -19006
57 -19006 21102 -23512 26317 -29640 33639 -38560 44781 -52966 64260 -81092 109286 -170062
69 -170062 618325 -327871 99893 189208 -41633 500359 -921377 1032591 -303437 -472959
79 -472959 767377 -496685 311201 -328911 239705 301264 -913944 960522 -384200
88 -384200 -256780 432754 -359543 420330 -600542 435315 195487 -821242 851443
97 851443 -375892 -63796 135023 -165897 419430 -726541 566694 72834 -639025 654771
107 654771 -315667 109116 -150291 40434 371550 -775391 616699 -37974 -448379 439133
117 439133 -251176 248542 -369786 189979 335008 -738874 589366 -84935 -244959 207655
127 207655 -161622 334519 -508640 275180 267756 -621634 457029 -100342 -47083 -24426
137 -24426 -58471 380776 -579723 313602 204419 -465755 322427 -102013 121874 -202027
147 -202027 19216 395178 -583934 308398 139600 -306841 169201 -92089 228980 -319247
157 -319247 70250 357132 -511957 253188 79575 -139954 29025 -77631 302043 -381192
167 -381192 83833 305904 -406638 173493 22845 15364 -91100 -65770 350838 -392046
177 -392046 84982 252172 -281181 90623 -13899 132426 -173634 -54562 350113 -354999
187 -354999 60384 185561 -153771 14261 -49330 212456 -217270 -57718 324310 -290295
197 -290295 29408 111708 -33288 -52045 -80181 268476 -233574 -60513 275770 -209738
207 -209738 -1332 51070 63984 -87753 -102055 287889 -205756 -71029 222262 -119292
217 -119292 -28061 -9346 139853 -105289 -124159 283932 -164326 -78396 153668 -30817 -48641
228 -48641 -61207 193851 -109092 -133129 252787 -113991 -75458 87682 34303 -49054 -104405
239 -104405 210259 -87573 -141738 205857 -62922 -66274 19967 84861 -36292 -139038 207508
250 207508 -55083 -138344 145798 -5647 -57144 -39830 124761 -24752 -158002 190149
260 190149 -23983 -124440 88942 33817 -35507 -88831 140029 -1042 -166207 159929
270 159929 994 -97921 32511 59660 -5978 -125870 136483 20250 -159401 114447
280 114447 29122 -71689 -19543 75829 17880 -143858 120150 39295 -138857 71248 42397
291 42397 -36110 -63504 79317 42587 -153051 100371 48342 -105596 25598 48164 6390
302 6390 -99124 74040 68209 -148869 68344 62673 -75344 -14550 48410 36486 -117833
313 -117833 57140 82503 -131484 37949 59528 -37703 -46380 42826 62000 -121289 42644
324 42644 79799 -95909 9248 44677 8049 -69962 24678 85191 -115779 20132 78388
335 78388 -67601 -14563 31642 37770 -80851 9804 95885 -101015 4694 67664 -33529
346 -33529 -34146 19692 59960 -84114 1701 88869 -75802 -10219 48321 3412 -46021 472
358 472 81275 -80169 -15163 84934 -53584 -22308 28090 30822 -51901 -17411 90162 -68933
370 -68933 -23945 69343 -24634 -30737 9127 51425 -52290 -25876 82639 -49079 -29016 44150
382 44150 3160 -31708 -15607 66809 -43652 -38891 76144 -31595 -28413 24521 24971 -26365
394 -26365 -29451 73438 -33314 -38728 59801 -10851 -28885 2636 38619 -25036 -38416 66647
406 66647 -22816 -37065 38270 5139 -19809 -18438 50116 -16189 -48070 62347 -12153 -33431
418 -33431 20225 18607 -14385 -31549 51293 -9617 -44769 45923 2033 -26783 2591 28404
430 28404 -8939 -35919 49425 -2914 -39040 30281 7277 -14534 -16024 33177 529 -45140
442 -45140 43965 2672 -33074 14799 13910 -6728 -26588 32216 6301 -42228 30123 10292
454 10292 -23861 316 18036 546 -31074 29158 9610 -34286 19350 12037 -8833 -14891
466 -14891 19409 11930 -38813 23626 13837 -28004 5870 12503 -2442 -20462 19486 12960 -34521
479 -34521 16066 13368 -22342 -1419 11768 3186 -24176 14326 13657 -27249 9354 9561 -7937
492 -7937 -10423 9696 12679 -26532 11040 16401 -21284 2648 11385 -717 -14069 8928 14304
505 14304 -24322 4344 16383 -15284 -2601 9121 5010 -16977 4733 15159 -18933 2975
517 2975 12213 -4390 -9405 5825 11525 -17156 2885 16199 -13097 -2384 11129 -1868 -8181
530 -8181 4481 12667 -13568 -545 14395 -7248 -2784 6447 4631 -8990 446 12322 -9211
543 -9211 -2010 8162 -1754 -6144 1083 9855 -8902 -2817 13276 -7109 -5882 9183 660 -7069
557 -7069 1658 9135 -7934 -4200 11264 -5745 -5400 5668 1696 -6229 -115 7926 -4626 -2437
571 -2437 5896 -449 -4380 798 5285 -4240 -3982 7266 -1589 -6469 6119 1930 -2870 -434 5005
586 5005 -1614 -5611 7563 -931 -3937 4329 1569 -3808 -73 3152 -855 -2825 3070 776 -4202
601 -4202 355 1413 -2659 -2770 3570 477 -5121 3734 843 -3004 -896 2749 -552 -2705 3932
616 3932 550 -3178 2047 1641 -2189 -1077 -91 2504 -1226 115 3407 -2964 1364 2461 292 -732
632 -732 -47 4060 -3253 -933 2349 -1704 -594 2041 -229 -1631 2112 1193 -1793 1210 309 -1371
648 -1371 1142 -892 623 359 57 458 -2931 737 -1027 -1033 315 -2710 1533 -743 -431 1697 -1113
665 -1113 547 418 -906 -1009 468 1300 -691 -532 894 -1786 1583 -766 118 -48 -1113 1827 -1845
682 -1845 133 320 -486 1563 -1592 2003 -161 -2373 2364 -1085 -1010 1907 -1110 5 -187 453 722
699 722 -486 1005 -982 816 -722 -873 858 -2005 947 -1473 842 -354 -147 1491 -1951 227
715 227 672 -1768 2194 -101 -2403 1994 -2047 869 273 198 -369 -132 841 -1195 -28 -477 -1004 619
733 619 -129 723 -638 166 634 -539 1394 -378 -51 1226 -1691 666 384 -1979 2113 -660 -317
750 -317 225 -595 -75 -164 238 -426 17 -389 195 532 -700 63 -509 40 -744 -272 235 -1502 -113 1150
770 1150 -1964 1075 732 -3307 1826 -750 -544 1519 -633 -338 -921 659 -1020 -498 765 -242
786 -242 -404 -975 1049 388 -297 212 -117 -652 36 -393 647 -2463 360 1398 -2316 2531 752 -1296
804 -1296 904 -298 943 -1269 -271 792 -909 -579 265 77 -652 660 456 -1244 159 252 -187
821 -187 -1542 -152 1542 -2255 82 3509 -3364 1471 944 -1146 889 1513 417 -1099 242 985
837 985 462 -1043 1096 -1093 -440 1685 123 -431 -585 1368 -116 -1420 403 1367 -2500 -818 3363
854 3363 -3118 -124 2332 -1054 -804 585 157 -1667 794 1436 -882 -1561 1831 -911 -188 850
870 850 501 -407 -1458 2138 -290 -1582 916 2671 -1882 -656 3970 -1893 -1542 2861 -708 -2273
886 -2273 647 906 -1186 -1134 1310 -1005 -1844 2033 58 -830 -55 909 -545 -2281 1210 -239 -1993
903 -1993 454 1903 -1929 -599 2984 -1312 -2195 2826 -138 -2940 1015 1138 -1618 -618 1512 573
919 573 -3187 1464 882 -1450 -108 1387 245 -2206 1320 1339 -2409 -591 2630 -1411 -670 2374
935 2374 259 -2809 1683 1443 -2940 -685 905 -1476 -1056 1371 251 -2816 1913 154 -1604 -1120
951 -1120 1853 839 -1781 993 917 -1998 -359 1581 -1254 -1343 1891 159 -1098 -162 927 -2683
967 -2683 -451 1684 -1406 -752 1969 1188 -1758 854 1190 -678 -71 1466 402 -2307 765 2771
983 2771 -2815 -886 3644 -1266 -1958 1189 681 -1555 -836 3273 -2858 -592 2469 -211 -2397 1604
999 1604 890 -3497 851 799 182 -1016 1098 502 -1713 1155 1887 -708 -1432 2310 -1088 -2202 1423
1016 1423 1105 -1973 -590 2314 -805 -1234 1705 227 -872 -252 2392 -1348 -460 1563 403 -792
1032 -792 900 1216 -1980 -686 2129 -1558 -1357 2799 -86 -1864 11 1214 -1589 -1410 1890 -2032
1048 -2032 -1551 1528 1131 -2113 153 1170 -1707 31 921 -1000 -1421 -244 962 -176 -541 1583
1064 1583 -33 -2369 2355 -158 -1328 56 1778 -353 -2040 2167 -40 -1339 1155 632 -1086
1079 -1086 590 1472 -1104 -828 532 687 -919 231 749 -297 -696 1293 -330 -1309 1442 -161
1095 -161 -1094 -185 1666 -706 -1078 2098 -253 -1050 1517 840 -1539 -268 389 -491 -633 -339 573 -991
1113 -991 -883 1388 -606 -927 1106 791 -1412 552 445 -997 -1630 1206 -2 -2097 2155 756
1129 756 -1691 821 986 -1732 -106 1016 -378 159 -8 106 -290 540 806 -509 -505 966 -114 -1140
1147 -1140 223 -227 732 -1006 824 -220 -1434 886 667 -757 86 809 -664 19 479 -847 21
1164 21 523 -365 -121 77 481 1157 -415 18 1205 -306 312 1067 262 -915 430 -86 -179 -21 978
1183 978 -695 -684 1295 -332 1208 541 -602 -969 781 -679 -166 350 -207 300 -361 -629 200 -605
1201 -605 -189 1178 -8 -911 448 477 141 -118 602 -888 274 810 83 -942 -377 -1006 -314 -673
1219 -673 -683 139 -798 -1815 -1221 100 -277 372 -34 -439 274 -440 178 -165 -340 -154 -669 -369 -497 -658
1239 -658 959 -430 -210 180 302 937 445 -287 113 -431 -780 996 -202 178 -8 50 1022 333 552
1258 552 -268 -724 356 -233 697 267 -39 -173 896 -43 519 18 -924 322 106 -105 124 771 -100
1277 -100 2 -230 331 -353 -1020 -634 -390 -313 -729 -401 -404 663 -512 -496 -27 421 744 423 93 106 -324
1298 -324 -493 -593 -739 -54 310 -472 427 -586 -77 -1005 -269 -765 80 737 -768 -104 425 -213 -315
1317 -315 242 153 308 623 -370 78 -85 -80 102 -266 -721 915 321 -1545 482 -487 -583 -131 -452 -594
1337 -594 -177 254 46 46 263 322 -172 1157 -98 -658 -345 366 629 81 96 -1816 -140 -302 402 1561
1357 1561 161 -246 -363 -659 -120 536 508 -136 -502 -263 -706 378 55 -1025 -132 433 -361 399 283
1376 283 56 644 239 819 -164 -72 81 -659 -542 925 368 27 107 235 -102 -256 541 -181 -321 358
1396 358 -266 -1201 865 459 -1925 -517 1456 167 -813 998 802 -903 -1148 1090 -441 -545 832
1413 832 268 -1413 -633 1359 -1440 -984 1176 -426 -906 515 953 -1637 1143 250 -1064 -832 1527
1430 1527 182 -1515 1150 560 -1065 -393 1021 -272 -1354 1645 479 -1417 319 1097 -1121 -990
1446 -990 1887 -171 -1416 489 460 -1720 -565 2033 -1530 -611 -41 775 -1188 429 1975 -1132
1462 -1132 -180 1693 -258 -1669 1453 1771 -366 -708 2170 -611 -1769 1308 767 -1940 713 2102
1478 2102 -1876 -260 2102 -497 -1778 140 259 -1739 123 1450 -963 -1415 2452 255 -2252
1493 -2252 1281 -102 -2098 -445 1825 -44 -3623 1784 980 -2725 377 3070 -1714 -838 2736
1508 2736 -196 -2236 1382 1544 -1695 115 3116 621 -2606 3312 1357 -2853 441 2238 -1283
1523 -1283 -1759 3349 446 -3512 2059 2302 -3488 -491 2471 -1931 -1834 2161 1538 -2972 859 2478
1539 2478 -2195 -1085 3154 -1137 -3292 3127 1159 -2314 -51 3868 -1226 -2407 2912 522 -4574
1554 -4574 575 3155 -3605 -1255 3862 -1196 -2678 2999 1773 -4280 -96 2572 -2811 -2453 2693
1569 2693 190 -3773 1105 2085 -2215 -1271 4389 -78 -3063 2298 1721 -4410 116 2877 -1979 -2240
1585 -2240 5126 141 -4644 2561 3139 -3493 -130 4199 -2013 -3039 4563 2084 -4484 1443 4188
1600 4188 -3352 -2555 4814 86 -3673 2161 3072 -4219 976 5068 -2728 -3734 4428 1315 -4154
1615 -4154 2040 3255 -2757 -1252 4941 -678 -4649 3508 2648 -3662 -763 4243 -2549 -3078 3793
1630 3793 770 -5286 1836 3786 -3361 -2239 4879 -2306 -4877 3909 3043 -4922 207 5177 -3149
1645 -3149 -3194 4276 1053 -4244 2054 3956 -4695 -735 4505 -2378 -5101 3451 2143 -5110 475
1660 475 4785 -3089 -2966 5003 494 -5615 2392 3221 -4871 -576 5554 -2131 -3708 3785 3023 -4865
1676 -4865 1210 4844 -4815 -3941 4654 -1418 -5324 3448 3630 -4973 -639 5267 -2984 -3886 5035 1526
1692 1526 -5362 1653 5630 -4210 -3004 6003 -969 -5845 3930 2993 -6800 -106 5163 -3554 -4603
1707 -4603 4838 844 -6995 2554 4017 -4627 -2244 5925 -958 -5613 3885 3239 -5599 -866 5857
1722 5857 -3574 -4120 6189 971 -6204 2807 4782 -5582 -1448 6177 -1118 -4386 4313 1962 -5805
1737 -5805 1266 5074 -3635 -3041 5371 800 -6413 2868 4497 -5284 -1889 6030 -1991 -4842 4902
1752 4902 1675 -6029 1323 5847 -4573 -1984 6824 87 -5294 2692 3038 -5277 -134 5785 -2389
1767 -2389 -4780 4164 2217 -6204 1501 5176 -4971 -2910 6519 -502 -6064 3490 3683 -5246 -735
1782 -735 5632 -3899 -3400 5384 1392 -6053 3136 5350 -5433 -2152 5532 -1127 -5582 4878 2666
1797 2666 -5865 -766 6230 -3174 -3738 6536 962 -6265 2839 5090 -5640 -1819 6459 -2661 -4317
1812 -4317 5284 2533 -5422 1046 4780 -4151 -2943 6366 324 -5703 3400 3994 -5929 -1864 5741
1827 5741 -2190 -4558 4681 2239 -6116 1135 5129 -4222 -2827 6506 -793 -5901 3881 3722 -4752
1842 -4752 -836 5596 -2188 -5218 4141 1901 -6642 1652 5647 -4105 -1660 5794 -937 -6524 3800
1857 3800 2577 -5406 -179 6062 -3727 -4272 5800 1193 -5057 1855 4999 -5608 -1682 5115 -1653
1872 -1653 -5452 3911 3419 -6191 517 5527 -3040 -3610 5315 473 -7203 2675 4281 -5031 -1982
1887 -1982 6482 -2113 -4535 4803 1146 -5180 924 5143 -3801 -3152 5655 865 -6020 2037 4112
1902 4112 -4526 -169 6020 -2267 -4472 5312 1383 -5605 -50 4572 -4587 -1798 4839 -563 -4711
1917 -4711 4286 2783 -5170 -1745 5454 -2056 -3747 4948 976 -5806 1112 5329 -3973 -2548 5387
1932 5387 -1113 -4882 3912 3307 -4956 -313 4843 -2906 -3743 4795 516 -5125 2306 3654 -4920
1947 -4920 -1569 4588 239 -4757 4448 2471 -4723 762 4726 -3441 -3738 4631 700 -4719 1719
1962 1719 4579 -3814 -1538 5346 -1681 -4889 5072 2380 -5628 1480 4894 -3288 -3293 4336 269 -4803
1978 -4803 3873 4230 -4492 -794 5048 -1576 -3952 3307 2356 -4630 1024 4021 -3093 -2212 3578 -529
1994 -529 -4265 3415 2920 -4845 367 3638 -1811 -3310 3135 1786 -4196 1102 3613 -3825 -2510
2009 -2510 5166 -1638 -4277 2227 2923 -3902 -484 4739 -2407 -3130 3820 1294 -4768 2076 3692
2024 3692 -3744 -1682 3459 -382 -3420 3074 2638 -3959 63 4610 -3560 -2765 2793 -359 -4167
2039 -4167 1213 3219 -3481 -1021 3554 -333 -3819 2829 1658 -4272 1670 3900 -3094 -1457 3910
2054 3910 -77 -2983 2005 3253 -2504 -626 3612 -1585 -2362 2573 1483 -3578 416 3726 -2329
2069 -2329 -2012 3226 -820 -2881 2307 2691 -3321 -278 3106 -1675 -1591 2464 1347 -3136 2021 2522
2085 2522 -2260 -1082 3240 -416 -2654 2151 1718 -2728 -403 3264 -1700 -2286 3265 604 -2105
2100 -2105 732 1492 -2613 -1306 2592 -729 -3089 2100 1911 -2361 1112 2933 -1286 -1635 3029 601
2116 601 -2874 762 1744 -2234 -491 2890 -64 -1737 1848 1942 -2888 1052 2304 -2033 -1584 2565
2132 2565 19 -2262 2236 1946 -2328 -304 2037 -1071 -2756 1641 620 -2009 942 2575 -1648
2147 -1648 -1767 2230 697 -3173 1239 1579 -2651 504 1992 -1017 -2473 1610 700 -1524 314 833
2163 833 -2160 -1281 1877 -561 -2761 1459 1262 -2653 -429 1356 -1419 -1790 1492 -32 -2111 204
2179 204 1746 -1418 -1508 2044 -810 -1966 2240 125 -1743 61 1134 -1455 -1095 1835 -302 -2257
2195 -2257 1198 817 -1711 321 2215 -287 -1559 1327 -178 -2554 336 1217 -1584 -1512 1557 17
2211 17 -1728 1083 1013 -1240 -1190 1802 -189 -1341 1209 228 -1099 366 596 -941 -570 1191 -81
2228 -81 -834 873 748 -810 -675 846 -637 -727 1700 -430 -131 -94 963 -1280 -969 915 -181 -875
2246 -875 1319 867 -842 -214 874 -567 -975 533 88 -1448 676 375 -732 200 1191 -785 -455
2263 -455 1809 696 -1572 -104 338 -244 -1652 1144 -512 -1128 -747 797 -1023 -295 774 -1215
2279 -1215 -143 738 637 -1230 -104 1345 -350 -917 1127 -41 -1296 1177 1230 39 -505 1503
2295 1503 -15 -546 1259 80 -930 144 52 -504 773 -145 277 463 -744 402 -898 401 -13
2312 -13 1409 -383 1615 -397 -615 668 406 -407 -477 883 -62 -166 -83 244 -450 303 877 -634 -288
2331 -288 148 498 -34 -88 140 -513 423 560 -881 -203 482 -172 3 355 487 -373 -512 -371 1011 -397
2351 -397 767 457 -375 -478 301 -137 -286 515 -487 -392 201 551 -125 -755 240 -33 155 922 905 -263
2371 -263 152 48 -338 -613 -89 270 -573 -285 -600 -112 -570 -99 -646 -193 -832 -55 -1205 -538 -432 1383
2391 1383 38 -332 -257 -533 -326 -21 -722 -664 318 -226 -733 559 56 384 156 140 -199 -247 -497 -103
2411 -103 -939 -180 -259 194 -357 244 339 -803 183 240 -35 175 1063 748 -650 -827 -227 -565 -304 330
2431 330 -26 -1108 45 43 -369 201 289 518 89 -298 -1094 -712 416 995 53 -158 890 -951 267
2450 267 584 -580 -235 158 -311 353 -23 -147 330 -576 729 415 -387 91 -506 346 -620 -18 164
2469 164 -431 -208 1239 -99 149 252 343 973 542 -343 -224 -325 -665 -1076 434 -123 -740 -373 80
2488 80 -369 34 497 -327 -327 -559 -261 -539 -490 133 405 -272 521 -159 524 -409 699 562 -576 140 -676
2509 -676 -642 209 844 -539 813 -220 -594 1508 882 -645 -57 -453 148 697 452 -936 406 45
2527 45 -735 -129 -651 -874 890 -505 -169 -718 -128 -392 -457 -449 2 -96 356 553 -596 562 -1252 -31
2547 -31 225 -114 693 -115 -550 164 788 -938 786 281 -430 369 5 -97 -481 -273 426 778 -238
2566 -238 -190 819 263 -1426 -1098 -929 -89 524 944 862 140 -663 301 -171 -131 -43 641 496 -96 -724 -768
2587 -768 410 187 493 50 -1021 -131 -719 344 -367 493 793 -165 -159 1216 298 522 150 586 -297
2606 -297 -242 182 -851 86 432 402 246 883 -699 411 -162 -50 89 -68 -236 461 -205 92 -122 272
2626 272 -79 -29 -631 283 -143 -440 -103 -447 -602 -353 107 391 -583 -99 201 -525 -170 -75 -103 407 34
2647 34 -371 -270 494 -625 83 -557 -28 -50 -328 483 799 -260 563 921 -486 -747 1053 -148 -63
2666 -63 442 157 -379 -836 477 -594 265 518 -324 -473 388 -526 803 -85 352 472 397 536 418 163
2686 163 195 -21 -664 -168 897 -528 -839 3 19 160 -1255 -933 153 997 -156 542 315 604 623
2705 623 34 -760 287 -639 118 -651 -139 -26 -94 -281 324 651 135 -226 501 -668 195 -354 -617 -719
2725 -719 -249 654 218 52 -355 94 116 619 355 575 207 -33 -36 -169 261 409 427 715 442 -201 163
2746 163 -126 187 -66 -303 89 139 59 -313 86 297 220 -444 266 40 279 -158 479 -27 -676 -317 -142
2767 -142 207 -159 -1377 -202 -92 282 237 186 -619 463 512 -115 -70 143 288 -764 -339 -370 254 -527
2787 -527 -764 -193 -47 838 -289 -273 -982 -225 132 -541 388 202 81 -369 -569 -98 -755 49 546 405
2807 405 -670 -523 197 -187 -147 -57 465 -1206 92 -177 -504 224 -287 192 -1030 106 353 -839 -388
2826 -388 -120 679 -281 31 -504 534 -261 -287 -450 -121 130 104 -67 -49 -186 -65 -202 -1111 -875 283
2846 283 -35 43 492 130 158 -31 454 -394 -433 234 -263 -776 -509 -588 305 87 802 243 330 409 -560 338
2868 338 -486 -384 196 -896 -497 5 -151 -264 -797 -2 199 -7 -528 -126 263 -310 866 1582 -656
2887 -656 -363 -490 248 439 211 -1071 -8 181 -19 -546 755 -829 424 253 404 -70 -774 -105
2905 -105 123 169 -870 42 0 358 -429 448 332 -258 -279 746 -663 5 747 264 416 -564 -355 254
2925 254 406 -610 512 120 -201 -552 -588 -53 644 -49 382 -62 -134 845 -181 -205 -131 -568 9 293
2945 293 -351 -378 -155 384 -582 -51 -509 -846 39 -520 196 -10 54 108 -602 683 -302 21 -60 -562 -31
2966 -31 -198 364 -824 606 -188 11 982 -242 -191 -833 288 -130 -308 -201 38 -396 542 -47 -506
2985 -506 290 746 -268 -205 311 -445 -311 868 963 423 -71 -500 -586 450 456 -387 739 -393 -558 -489
3005 -489 -181 921 -1161 -105 -465 38 -340 -804 -345 -72 368 725 -1161 301 359 450 -321 -156 -526
3024 -526 -713 296 484 1035 282 -145 -247 -79 -421 -723 181 -573 343 -349 357 313 266 -376 466 131
3044 131 197 240 189 72 989 -315 -179 94 -165 -663 -68 -194 -264 285 433 -262 -527 283 53 8 412
3065 412 -175 -562 740 198 -478 -457 66 262 -485 190 655 -143 319 987 -443 -44 -552 800 901
3084 901 -567 -992 188 8 216 819 2 -499 681 85 -574 541 -862 -361 616 -419 -661 111
3102 111 -434 -239 414 409 -399 289 -152 -976 -7 161 191 -201 925 -498 1362 142 -581 -88 -592 -251
3122 -251 -59 -275 2 848 -16 -224 -690 796 -372 -1131 291 100 860 -49 301 178 200 -139 239
3141 239 11 -720 -658 -18 -390 -172 -233 109 -862 -593 424 -500 471 75 148 310 -173 -409 -340 -190 1261
3162 1261 -78 266 637 -568 423 -674 -137 -1230 566 577 -302 474 -473 292 -459 -179 6 -267
3180 -267 285 -203 1039 -1048 -453 -101 -3 338 116 -263 531 522 188 -464 585 293 -602 -162 -145 1069
3200 1069 169 -370 418 -439 186 334 -55 3 -306 -134 379 831 184 841 -92 -330 -92 -685 183 -144
3220 -144 970 617 -592 -420 -872 -213 -261 1940 -422 846 -1437 -622 -486 -199 8 -895 269 89
3238 89 -89 0 -144 -473 236 -8 -276 -725 490 -125 681 307 -618 -137 667 -10 -511 392 -468 822
3258 822 -433 44 64 217 47 206 1397 -616 -331 196 40 403 -464 -443 -36 326 772 811 381 668
3278 668 412 -564 -280 471 219 -88 -112 4 -332 -165 -354 666 -1287 377 -197 454 410 -985 -465
3297 -465 -102 208 -588 -233 -467 161 -79 -97 -252 -490 454 3 1462 -137 1251 310 -617 786 293
3316 293 -776 -861 718 -282 -72 659 667 -1324 -264 105 -1066 -211 -384 69 224 460 579 -1076 -428
3335 -428 274 -157 -230 294 -133 220 287 -216 -507 -794 -90 -91 -267 65 357 555 -562 -456 -28 91 -40
3356 -40 -329 -731 29 43 -462 -36 -1065 121 1059 -210 373 586 436 358 99 -260 -453 1117 -745
3375 -745 261 860 -524 -534 131 -125 -781 379 453 -307 -272 -950 -453 -157 -284 -1136 -273 594 -131 -835
3395 -835 -515 -26 -294 -603 -128 408 -540 261 236 -566 -149 -132 30 -845 451 218 315 767 -58 -226 -967
3416 -967 178 779 -30 -6 189 215 -1156 304 -606 112 480 114 -53 -618 97 -416 -792 -166 -194 -715
3436 -715 -407 -467 707 951 -391 -65 -387 648 -148 392 492 -362 -378 351 1674 -29 -1212 174
3454 174 452 39 746 -280 -29 -688 355 -290 -193 -216 465 358 83 140 412 -486 -230 516 -748 -362
3474 -362 994 182 42 855 -628 313 -165 -223 441 -195 -876 135 -62 74 460 -165 927 -69 -180
3493 -180 -184 596 270 738 -57 27 -71 -393 911 -21 -683 138 20 -96 1350 138 -570 -567 458 -588
3513 -588 155 485 -180 -423 -545 -173 -999 -476 562 1183 -486 1097 546 -960 87 -425 -71 -848
3531 -848 -592 480 -174 -1165 497 -406 -1420 -5 -235 -395 228 552 -445 -515 870 -333 -732 628
3549 628 55 -35 -613 383 598 -491 -572 -91 -334 180 -268 11 -23 -181 1069 -254 368 746 -362 -502
3569 -502 -392 115 -196 377 -166 -132 -208 -1118 13 -166 -380 145 89 276 725 515 19 604 226 234 345
3590 345 -197 217 -317 634 510 -92 -257 -202 -1229 137 318 -625 -261 963 -154 -694 230 -572 164
3609 164 469 834 -462 931 808 452 -722 -215 -411 -73 433 572 1079 -415 -116 -103 -1114 258
3627 258 1322 -29 -50 -222 197 111 -101 389 -1486 900 1390 -399 496 -265 565 -547 -291 -215 -585
3646 -585 -674 407 -217 -412 788 -337 782 434 399 -111 -391 -469 -372 -184 264 264 -33 -920 914 -19
3666 -19 -559 304 1026 -334 405 128 155 494 -33 -110 -23 462 358 -432 -294 342 -414 366 -27 -780 -408
3687 -408 -191 515 228 388 354 -105 -880 193 -109 -41 183 -1312 305 -417 831 -592 -605 -73 482
3706 482 -44 533 -1012 278 -560 730 222 -626 -738 632 89 119 860 91 -224 -438 646 99 444
3725 444 -214 -731 163 473 615 -266 -306 15 -690 -60 526 28 -293 -74 161 113 452 612 -754 253
3745 253 218 -111 17 86 -302 -560 -201 -179 -185 -947 -565 -638 -869 -378 13 549 -416 -510 -18 -614 706 231
3767 231 -721 -15 304 -363 -905 792 -441 35 -670 -315 348 -106 536 165 -269 -963 418 -976 16
3786 16 -31 -436 -698 120 14 -574 215 219 285 -994 -259 -594 -37 -40 178 -584 -168 -77 -844 882 861 -201
3808 -201 -841 -742 1473 -531 -655 164 -944 144 -77 -126 -260 377 -147 -656 -501 1247 -751 79 -290
3827 -290 -1126 283 -112 290 924 -357 -337 518 -535 1203 -218 -189 -608 -51 263 -282 858 -1135
3845 -1135 243 -895 951 1241 -803 1041 355 -469 -731 -88 54 752 433 155 -80 -119 166 283
3863 283 157 249 -118 168 -475 -159 -808 -501 -508 -375 -280 -314 488 154 -134 -1177 788 460 455 330 -121 211
3885 211 687 -794 -142 220 -222 597 526 -530 186 461 445 -300 -117 75 505 -426 279 236 79 532
3905 532 -152 -24 -743 -119 -31 107 856 -311 68 687 -143 295 -81 307 -333 -660 -376 280 -52 80
3925 80 492 -161 24 433 567 -590 695 66 -691 1029 607 -154 -136 133 641 922 953 -71 584 792
3945 792 -1079 563 164 -644 -305 -24 -116 -13 -559 518 -199 68 154 164 186 121 -281 -93 388 -185 -124
3966 -124 -474 369 -67 20 -448 -540 163 936 -484 383 -622 -82 -473 742 -678 -241 -532 443 -360
3985 -360 -585 742 55 553 707 168 3 436 565 -545 -348 435 782 164 -64 -173 147 -480 212
4004 212 327 -430 417 -391 393 -81 -382 4 -632 486 -194 -497 338 -506 6 693 -468 440 -1233
4023 -1233 637 926 87 321 -920 315 -158 -571 317 6 -112 80 -286 571 -203 478 -380 -447 260
4042 260 -900 -2 -354 -139 -573 635 -424 -462 -560 -779 151 433 -399 -949 -25 -45 339 158 -693 -138
4062 -138 162 -1183 -657 -108 96 299 -344 743 -483 156 -274 -1466 10 -519 -336 -97 -334 -739
4080 -739 -364 -364 -723 -318 -62 287 -365 -152 68 244 -135 395 -28 729 529 988 -396 -73 125 431
4100 431 -899 -891 -70 545 -69 -225 291 -989 137 381 -447 900 382 -452 -23 -266 -113 -120 -675 -259
4120 -259 0 -97 -125 159 1005 811 613 -112 -473 731 -13 122 300 -544 253 137 -378 -239 -502 -770
4140 -770 52 140 -751 899 241 147 91 -406 -700 835 379 65 -471 -587 32 81 1289 -224 100 728
4160 728 95 -33 88 -517 12 87 64 244 521 98 579 -72 -1087 578 -754 -402 115 69 -450 1856
4180 1856 87 645 538 -418 744 -756 -985 682 395 -281 -395 -283 -259 -891 1382 618 -676 539
4198 539 -10 -33 458 -204 -299 -172 -231 1317 885 -436 450 -849 -291 -681 -153 163 -153 191 -821 11
4218 11 1705 837 -1328 -49 235 253 411 494 318 -131 306 -293 -257 301 168 -122 -290 -1170 0 481
4238 481 -18 -852 -1158 107 131 -492 -180 1518 48 343 126 255 945 -314 159 -222 -286 -800 254
4257 254 469 -832 -1088 -304 378 207 -527 85 50 -1006 -664 -820 -749 -1023 344 348 -124 -103 232 98 -561
4278 -561 349 -525 142 107 -424 40 17 417 456 -897 -28 565 330 114 -220 -652 521 -261 800 670
4298 670 -248 457 -836 -456 527 -284 -642 -1120 -268 -709 173 95 668 -525 292 656 285 377 110 -348
4318 -348 -25 310 554 -25 686 400 1101 475 125 -503 -449 -376 -703 426 509 155 -217 803 328 -122
4338 -122 -81 547 106 515 503 598 -355 -364 -463 234 -479 -485 143 -196 -341 236 -229 110 -1 -609 -609 577 184
4361 184 -389 98 445 -403 -161 1129 -845 175 -561 -19 75 619 -206 -346 6 1009 159 321 -516
4380 -516 127 72 -50 896 -22 628 -278 -812 1175 904 96 460 -642 -528 344 61 -181 630 188 227
4400 227 768 -388 19 -893 56 -217 -329 182 581 845 -221 61 463 -250 -74 204 540 -166 -84 143
4420 143 718 65 661 243 173 -827 -459 -911 -223 -591 -178 98 -939 -903 768 896 203 227 174 46
4440 46 636 332 -485 -734 -804 -633 -36 -183 -133 -183 100 911 -291 372 -536 -297 -325 388 -59 303 -554
4461 -554 -1 -414 443 -1536 250 909 -749 249 461 106 1026 510 18 -358 90 391 458 -610 -442
4480 -442 318 -622 -200 196 -1 -937 309 -893 -110 300 209 32 1075 -364 -376 -966 -183 -304 -255 2
4500 2 91 643 583 -127 345 -192 704 -450 635 -629 -448 480 -570 -146 -331 1125 -20 -25 669 692
4520 692 92 -902 322 859 -917 187 100 118 510 -1469 -191 -518 -440 773 -314 -117 371 517 -954
4539 -954 -251 -321 -417 526 410 -1062 -952 670 -198 -265 -403 -672 100 -27 508 578 -993 -703 -384 -231
4559 -231 -545 589 -192 -446 -766 -209 14 -339 -148 -202 -123 402 697 620 -606 774 1177 -755 -140 294
4579 294 487 -395 -108 -93 222 443 420 -306 -216 -686 90 -209 -200 375 -754 597 -597 563 -1332 309
4599 309 152 914 333 15 60 282 577 -260 62 -255 -523 -1110 329 -811 546 661 -370 594 -120
4618 -120 -893 398 -266 417 -29 331 447 513 -40 519 -77 256 464 262 198 -209 997 530 315 12
4638 12 397 -263 377 -415 1172 157 -158 -1223 -225 -1056 346 -421 -535 1706 -668 336 -33 -761
4656 -761 -90 486 451 621 61 955 -763 -289 324 192 692 355 35 -318 -40 397 -207 226 632 -78
4676 -78 610 94 349 225 -299 208 -303 427 246 1494 -347 356 481 454 492 -867 -406 -639 -468 228
4696 228 -689 -778 178 -3 -26 182 -452 133 808 -355 -366 870 429 512 -18 4 201 -384 -467 -133 1042
4717 1042 -461 -58 573 495 332 646 -215 -268 832 -319 557 -152 -267 -94 -444 448 118 -335 -523
4736 -523 1198 827 12 75 226 -1491 -328 -606 137 -472 11 -539 262 135 -335 -31 -195 -436 -340 -275
4756 -275 -306 -189 -524 15 -781 -157 -531 -71 91 -124 908 189 129 -499 227 378 -197 -821 143 482
4776 482 -529 -592 -357 196 309 -657 -573 -188 -142 -341 -336 630 -195 517 -303 -77 294 -546 839 105 262
4797 262 -76 461 -18 -511 654 878 -484 244 306 -612 425 960 -1378 -385 605 6 119 242 193
4816 193 424 -203 36 -530 -54 230 308 170 -189 -652 -534 -80 -285 -267 -39 -228 -323 742 320 397 -237
4837 -237 -255 986 -269 -379 706 -493 140 -460 -1068 -161 -60 -73 586 -192 391 364 -388 -63 957
4856 957 -610 190 -443 -424 -110 274 958 -136 -348 67 -165 -470 280 -23 170 -122 -438 -1289 73
4875 73 -1032 52 13 420 66 -62 251 -472 -546 1114 371 -393 601 -183 278 -524 -13 -233 -339 417
4895 417 332 179 -412 798 610 742 -457 -548 -21 76 -154 -672 453 -32 -391 769 -505 8 -960
4914 -960 424 907 -100 -445 -103 -241 643 -274 14 209 -237 1316 -627 677 -328 441 988 -832
4932 -832 537 1058 -325 -267 -414 -140 630 -202 128 312 -193 -188 -600 -179 -367 632 1 911 125 -534
4952 -534 189 1180 -146 419 -349 439 227 687 244 -44 416 -524 -47 -801 -166 989 -638 392 22
4971 22 123 878 -114 502 -42 -1027 -354 -19 -51 464 541 -31 -309 -240 131 357 558 685 -961 186 -774
4992 -774 780 -460 1044 -152 -700 -960 -521 -99 850 -401 195 592 9 293 580 -171 197 379
5010 379 -280 -890 -599 -598 -341 179 -314 143 -771 -376 433 -461 -784 629 79 143 451 -962 81 636
5030 636 428 378 -504 -465 -145 386 -455 210 -19 -340 435 -425 446 358 33 290 -200 77 585 1121 -348
5051 -348 -137 -576 -700 -458 -367 474 -500 239 -359 985 -130 -141 203 -403 -363 409 -310 673 526 -547
5071 -547 299 -923 -134 255 -221 682 -707 358 695 -372 -722 385 730 -563 556 -389 -413 -169
5089 -169 -139 -725 401 631 -137 454 115 177 -637 -832 -175 486 802 209 -480 -57 264 294 -343 -225 -840
5110 -840 -302 372 297 204 -751 533 237 -99 8 57 -858 -391 189 400 -17 -25 301 -355 -15 177 455
5131 455 786 222 1008 -164 -837 550 447 1198 -440 -470 220 -764 -82 -886 -782 570 -426 68 -289
5150 -289 780 828 -549 112 -16 -726 417 -672 21 177 -275 -83 458 -588 -19 811 -472 389
5168 389 -609 -1498 255 -83 717 173 -655 -21 -998 -202 -433 -154 -135 46 111 193 13 429 310 293 -769
5189 -769 330 50 809 -327 -67 -235 171 -514 -182 531 -834 -94 224 418 455 71 693 -310 457
5208 457 27 168 772 391 -385 -1133 451 -67 -278 -405 -437 1205 1173 -13 -329 222 965 43 38 -213
5228 -213 -78 717 -286 298 514 -620 66 -375 353 236 -40 555 -767 658 -47 90 103 -163 -384
5247 -384 -624 -243 94 211 -313 277 802 801 -261 -251 -534 -286 763 96 911 131 -1014 -160 126 381
5267 381 -221 -1109 567 638 1028 392 223 442 -160 -241 -273 855 -191 614 -85 682 469 -421 -441 315
5287 315 582 -316 -460 -813 -59 602 -927 414 -439 511 -5 178 -844 700 -395 -276 -500 15
5305 15 21 -829 -509 123 -315 -166 1512 -57 -69 808 752 170 -638 -63 415 407 -162 -144 748 -115 -334 -906
5327 -906 377 461 -98 -720 341 -1063 18 559 291 424 -510 -229 534 59 205 271 -935 -482 269
5346 269 1160 -219 139 596 156 397 166 301 -520 28 -331 77 889 617 167 -425 -59 56 351 -150
5366 -150 120 -272 -867 -455 166 922 -449 482 -883 -59 710 200 1056 -2 -106 319 -257 88 -204
5385 -204 -230 -1674 -483 61 54 48 314 -34 85 124 543 278 36 23 338 -445 -329 -304 -537 380 86 -417
5407 -417 299 84 321 150 -660 -10 1204 871 35 -198 -324 -856 234 130 232 623 194 -30 -603
5426 -603 32 -533 -217 -128 885 39 -14 -1017 -82 79 643 688 -93 -929 -434 -35 -7 217 732 -565
5446 -565 -365 75 -284 236 480 406 -244 -164 63 -402 585 196 520 735 -492 275 -313 -67 103 354
5466 354 -60 -172 335 -718 129 832 -310 -753 626 -166 175 -1567 -551 995 261 876 395 221
5484 221 270 164 -231 -244 -445 -476 -247 963 606 -36 219 -711 30 146 -232 -469 -364 -127 -424 -296 -38
5505 -38 -389 156 -5 14 921 -140 -1133 -69 86 -284 1189 1058 -224 87 -641 -182 -639 -1084 324
5524 324 -371 -47 -309 -266 -24 -138 71 353 640 912 -333 -99 -32 602 -338 -902 -355 942 1437 747
5544 747 -552 498 -217 1278 588 957 -228 17 -820 -164 -979 -575 321 322 838 595 92 -585 -83
5563 -83 -76 -746 -176 -73 -338 13 777 265 581 -459 -401 -8 -702 -294 254 693 -470 194 -521 -88 -425
5584 -425 263 184 154 316 -360 121 -275 -60 -320 837 413 373 612 -256 1316 469 496 -122 1059 735
5604 735 311 -87 30 -227 -633 -222 -419 712 300 50 128 769 -107 224 -127 -360 -415 612 -315 -53
5624 -53 512 73 -520 -555 92 164 -46 -171 -9 125 5 -782 635 571 -426 643 4 -556 -23 -180 31
5645 31 270 670 -4 513 -858 228 90 -386 -598 -83 -591 -834 578 -861 151 409 138 -728 134
5664 134 5 -472 -3 -51 531 85 -254 -772 -366 212 777 90 -707 -73 -286 129 322 377 740 64 -86
5685 -86 -201 553 -166 109 -1112 -21 -348 503 -424 -137 -142 -268 827 112 -466 390 231 -237 -142 -276
5705 -276 -448 -101 -402 -768 -436 -950 -721 346 67 -239 57 -802 552 -122 -93 -78 -972 -296 -639 351
5725 351 -540 -7 -275 -123 82 -1033 139 477 -368 235 -222 553 231 -125 -486 -747 146 -470 -712
5744 -712 -82 505 117 7 -551 227 -211 -456 -619 249 -768 61 -338 -207 14 397 -332 726 219
5763 219 -603 -736 -240 315 234 -246 -261 929 -27 216 525 451 -167 -61 453 44 43 84 -6 -398 192 379
5785 379 -264 -24 589 -466 -178 -318 -628 -407 1153 -490 95 -318 33 -316 -260 437 -479 341 304 -875
5805 -875 1020 -361 -54 -203 -198 305 -519 -15 457 -64 -697 -637 1063 358 889 58 538 -252 -276 -1183
5825 -1183 -1050 -690 -456 -258 -239 -172 529 1013 -305 -468 379 550 753 944 -172 218 371 -109 -565 -330
5845 -330 6 -73 939 -1176 348 -595 371 -67 365 -144 -505 272 -308 37 525 -110 -150 168 -413 -367
5865 -367 -561 270 -716 448 -92 585 -507 -111 99 -954 163 16 -112 311 179 366 -256 -83 -878
5884 -878 -327 115 -530 -402 651 -512 895 144 -76 282 -355 1106 -319 251 -440 -479 -718 -218 -263
5903 -263 590 -61 -9 48 445 115 124 401 -299 -1188 -105 -812 -124 270 -131 -343 874 451 172 650 -251
5924 -251 -31 452 591 -439 319 -494 -148 -633 455 49 -1028 384 672 -1027 94 542 546 170 -892
5943 -892 -298 5 888 -1367 -246 1118 171 771 563 1767 218 555 228 433 510 138 91 867 -283
5962 -283 1177 -968 596 437 256 -61 -292 -393 -557 839 -1212 -29 -506 741 1015 -87 -114 41
5980 41 217 -467 -812 1272 919 -131 1141 -637 -247 567 -423 -297 474 -148 -670 272 -516 115 -893
5999 -893 -509 419 -387 -1008 541 -469 -345 -8 222 29 -23 6 204 -452 419 329 -314 83 -415 1473
6019 1473 299 -314 -671 990 476 -108 37 64 -287 -131 -815 -121 -344 -56 64 458 -8 1036 -672
6038 -672 569 422 -120 -211 55 91 -74 145 -644 -1281 -509 -653 17 231 492 128 -393 -249 698 -17
6058 -17 -389 529 301 375 -406 537 397 -5 -94 169 -527 353 634 -499 400 -287 255 -568 -375 -126 -1111
6079 -1111 104 633 -116 -486 220 406 -128 667 -92 291 394 -494 -275 -1010 275 1006 -252 -433 -283
6098 -283 103 -218 931 18 204 317 -167 -378 -743 -611 10 261 204 -400 172 37 -190 1110 -798
6117 -798 119 -7 -103 -71 641 680 509 148 -243 -249 -140 153 -580 -542 -128 496 -569 593 187 -337 195
6138 195 -672 -368 1017 -241 -763 -489 -275 457 162 823 -172 -996 1086 -66 838 331 397 -492 456
6157 456 -662 -762 -302 -821 449 -394 444 -93 997 118 952 -641 -614 -293 -351 166 720 -159 -180 -187
6177 -187 -1353 54 281 189 -79 430 -443 674 524 123 -343 -984 854 732 -950 381 48 -484
6195 -484 184 235 -138 439 -44 -554 30 642 307 -1074 -203 571 -711 747 468 -336 -1047 -291 -587
6214 -587 38 130 -267 -1161 669 301 -91 -431 255 -140 -281 -286 -372 281 -308 -1214 -337 4 235 555 -738
6235 -738 717 -24 78 -235 275 -518 307 199 516 -196 -296 -57 3 453 -949 -202 392 69 495 236
6255 236 -169 -623 777 178 -284 858 -305 430 -60 269 -242 522 257 -105 382 324 -697 703 1230
6274 1230 -101 230 -944 -476 -107 40 348 338 -100 -16 -46 332 110 38 -407 725 370 -445 158 -18
6294 -18 268 -935 -824 493 588 -315 -225 -417 662 394 202 -291 -192 -53 282 226 -49 -152 655 -913
6314 -913 -350 773 341 -119 -501 -135 300 250 -400 -104 -613 231 472 -84 437 -284 412 -597 398 -331
6334 -331 956 -231 -237 263 46 -157 389 126 -54 -421 -45 505 -41 295 -1140 303 -23 -32 54 -494
6354 -494 -349 -1224 439 -438 19 335 870 74 -178 -546 722 -362 295 672 -409 538 -594 230
6372 230 -387 71 414 25 -114 82 -148 601 885 -189 -418 -144 152 780 -806 101 299 -134 1107
6391 1107 668 210 108 -103 431 787 509 -663 246 710 -49 -7 348 61 135 -327 620 450 -283 273
6411 273 43 1626 201 -200 -1119 -463 -801 -353 382 512 678 -15 983 -547 314 -13 -369 -514 -922
6430 -922 -234 1160 135 324 346 -260 -318 309 -236 266 -790 814 605 381 -3 -821 520 -972 -445
6449 -445 -468 -113 680 -845 -449 152 -455 -952 220 137 -49 -341 -187 713 -135 289 -304 -113 -64 667
6469 667 269 454 458 1072 -434 279 -803 -230 18 308 -181 955 -378 260 361 113 399 -564 -817
6488 -817 154 529 -501 -293 -232 21 306 69 165 998 -65 741 465 -160 -34 -81 -347 -288 -6 451 -63
6509 -63 409 26 -433 -188 -619 -91 -256 -5 -381 -343 -104 744 176 128 -524 -88 -517 -32 117 725 54
6530 54 -5 -974 511 -411 -167 242 -128 255 -399 78 27 155 -288 -271 71 -347 223 539 -533 -433 238
6551 238 -16 343 -594 -218 377 -946 -620 15 -580 -238 -724 261 -708 112 101 -724 -427 278 -437 -555
6571 -555 321 -93 -29 -414 629 -87 -209 47 -70 265 -39 -1238 -289 175 147 111 -45 473 -20 -590
6591 -590 1153 -399 488 1137 867 179 -395 571 -368 -539 99 -418 -196 707 -518 -777 -1128 208 626
6610 626 -1022 519 259 369 -411 130 61 141 -612 114 -23 -377 176 178 -175 853 -418 528 -378 224
6630 224 -67 118 540 -608 193 -196 134 -229 226 -272 39 94 646 145 601 -787 327 -393 736
6649 736 178 89 781 294 115 -349 59 285 -105 -234 500 565 -435 233 -394 177 -522 -344 -638 -847
6669 -847 -850 -749 -236 -255 549 -332 -916 520 233 405 313 -84 -623 -211 236 24 -551 -111 -273 -293 -452
6690 -452 209 41 71 -328 231 92 494 -518 86 -644 -212 326 217 132 565 -531 -67 -136 66 442
6710 442 -250 -462 -357 -735 1 -323 -558 991 1059 542 -610 -275 -183 335 325 -687 -41 -858 -119 -463
6730 -463 -34 -586 -208 237 411 422 -208 -426 -480 -298 -733 -347 -370 194 -309 -659 401 -104 793 -357
6750 -357 340 135 318 -155 -14 -152 288 185 -1245 888 146 -192 -172 603 -724 208 302 162 -222 -251
6770 -251 -382 120 -69 453 261 -94 123 192 -609 265 -524 -238 621 62 201 -122 -10 -210 -72 641
6790 641 773 -19 1334 93 -656 -828 515 357 -446 -588 -101 -599 -824 246 -509 -266 390 -387 -176
6809 -176 1016 -1476 -876 980 363 -532 -110 435 -1587 21 1451 -87 23 419 835 -1120 287
6826 287 1384 89 110 -345 670 285 1346 830 -493 630 685 370 -379 -901 356 36 310 -1695
6844 -1695 172 -258 1299 109 162 175 269 139 40 -494 230 -118 -502 477 -18 -378 627 -141 -328 19
6864 19 -493 113 432 -636 307 -406 -389 784 -246 -162 -487 -842 456 -418 -263 -150 -422 71 324 -930
6884 -930 -290 -144 265 -146 732 -425 -405 -322 -460 802 -609 -536 180 1366 426 47 -29 430 1238 -212
6904 -212 -438 -230 558 624 -586 210 135 148 233 959 277 -707 -79 323 755 -5 -247 -209 433 36 226
6925 226 360 -764 -405 -66 669 41 -468 -417 -1144 49 63 -709 -320 147 -853 318 323 461 -634 26
6945 26 -403 -234 308 138 1309 70 316 -783 82 -392 -781 84 16 -142 -332 -901 332 -47 241
6964 241 457 -42 -848 -60 571 -478 -431 -367 98 -406 -116 -832 -51 -664 -926 -1033 187 323 207 945
6984 945 -126 588 -52 -308 222 169 779 -20 73 -1271 -66 56 -183 -206 -295 264 141 -106 -378 -794
7004 -794 598 225 638 454 -174 405 -94 336 -501 162 -256 15 -430 -561 424 65 42 152 -103 11
7024 11 -548 562 499 -216 -311 716 52 544 532 -87 -419 -143 311 -158 642 -466 872 -208 -356 409
7044 409 -1 -93 139 8 19 628 154 -614 43 224 99 -770 -347 69 -709 -391 363 -455 -400 18 -178
7065 -178 -454 -627 -600 -243 959 -183 -232 259 -195 -120 -195 -442 -18 -122 11 -96 62 -295 45 -272 -306
7086 -306 858 -830 -157 -154 351 -174 -142 -426 871 -160 -668 82 300 91 70 -222 44 74 -31 179
7106 179 843 128 -658 698 -826 194 -217 1003 262 -236 76 -353 398 -661 -957 -527 -7 220
7124 220 -329 320 -4 -470 -11 222 149 442 -255 706 -62 231 618 -62 442 -528 580 -120 -435 316
7144 316 -542 187 465 171 -540 -66 -787 -1122 230 -233 420 -278 -87 -724 266 83 1124 -712 -292
7163 -292 -76 308 276 505 -248 -75 -124 -83 545 -366 73 -704 77 -197 -223 340 218 -185 -250 256 1153 376
7185 376 -28 154 928 267 560 577 282 -417 473 354 732 -361 186 68 475 -381 694 131 280 102
7205 102 -25 -72 341 14 47 -305 440 399 168 -574 -199 676 234 -495 -341 -148 -364 -817 -203 -224 -477
7226 -477 -958 -327 622 776 148 -546 -1105 642 309 670 455 -709 1165 189 314 -472 -471 601 996
7245 996 -100 -133 21 -141 462 -589 1129 421 779 -583 -347 172 93 -208 1086 -95 -1239 566
7263 566 -9 498 -324 131 382 -200 32 520 -82 -61 -24 335 321 -219 -767 -242 759 80 -406 -889 265
7284 265 638 -133 311 -361 -653 -599 205 -94 382 -246 553 494 -1031 225 550 10 362 326 89 349
7304 349 823 327 330 196 -487 848 736 230 494 -238 495 -355 485 784 231 -54 151 -140 231 -1023
7324 -1023 1038 45 -339 -1061 -488 200 -250 -584 -588 -204 -459 774 -50 -434 259 397 406 55 441 62
7344 62 95 736 123 112 -157 -144 1032 51 538 -26 -25 21 -122 -3 316 701 399 30 386 -480 227 1248
7366 1248 -133 220 -292 -366 -238 -796 -530 572 804 410 208 257 -44 201 -23 123 411 -436 -166 -243
7386 -243 80 -495 177 279 -171 157 -578 121 8 -212 -476 -20 33 213 -49 -108 -90 640 327 129 96
7407 96 -209 366 823 -144 -661 227 -598 942 -435 -852 -365 -1096 -607 328 269 55 -211 271 -125 1087
7427 1087 -777 -152 -774 -879 -44 205 147 430 16 1113 -1228 -539 888 198 -355 196 -320 157 23
7446 23 -196 -54 376 464 70 1092 -320 765 -331 -669 312 -290 -663 148 79 559 269 -64 -684 -628
7466 -628 277 199 233 181 130 500 -73 549 1312 224 1402 -540 -258 241 129 58 623 739 426 12 122
7487 122 744 -336 314 414 -250 -199 61 423 -28 -252 114 252 156 -54 125 -510 -162 -136 433 148 -791
7508 -791 -216 -97 -47 568 -460 378 -422 -630 -744 1140 178 643 -1233 66 955 -310 511 -487 115
7527 115 -1020 514 -239 155 -584 -404 166 410 -353 -139 265 144 1195 -288 -668 -54 820 -40 526
7546 526 111 80 -550 863 510 252 1070 -98 875 -298 -603 506 750 175 -409 -435 552 -736 355
7565 355 -73 389 46 17 -451 108 -195 322 -355 -599 -347 -377 -1180 -353 175 411 -141 -427 886 -125
7585 -125 -212 -120 -494 -384 389 -230 -225 338 49 200 -276 -50 529 -47 -32 -784 -139 -135 188 17 637 138
7607 138 65 972 -173 -342 496 474 -133 101 -246 -462 89 -14 372 54 -347 621 -481 74 18 150
7627 150 -535 -455 -282 164 -888 -406 -46 654 876 -429 491 81 -198 -342 -295 -620 -53 -478 19 386
7647 386 703 168 -159 -295 169 -306 -538 -426 186 799 781 479 -897 276 -590 -329 -435 100 -110 473
7667 473 64 -468 353 349 -228 -375 -462 -893 626 -127 -225 -757 11 -862 1221 816 -457 -31 -1 -289 -41
7688 -41 449 707 -543 -486 552 -892 397 91 356 -333 141 769 -320 -209 -55 631 -80 -4 242
7707 242 1130 -646 -207 166 -311 -984 486 648 -943 -636 -875 716 350 153 349 -682 -308 -436
7725 -436 -1269 689 786 78 -323 -42 1424 -770 -149 686 737 1028 805 -209 -797 -438 -490 1239 502
7744 502 463 330 16 629 -909 -108 -548 453 -163 -863 -320 823 115 -319 924 1438 -274 -394 -699
7763 -699 -214 39 245 218 -201 282 77 440 124 939 1370 -287 -216 648 517 -567 -90 -424 -142 -606
7783 -606 -570 -38 -30 710 -828 -100 119 -360 161 -1261 49 -21 -906 -193 28 -64 -902 447 238 653
7803 653 200 -14 -438 -437 380 -826 461 -3 541 278 -50 189 528 155 207 786 847 -412 -758 -531
7823 -531 506 353 -782 358 143 28 409 -439 369 170 47 -470 478 571 604 -546 -596 346 421 317
7843 317 -269 -593 -208 -25 -864 -330 -373 357 546 257 -265 128 -309 -54 -222 -310 1385 -498 -759 -240
7863 -240 10 696 -104 -350 147 246 222 -525 -285 762 36 -143 -624 -245 88 -20 122 11 193 76
7883 76 325 -274 -1171 -262 72 -76 -89 719 -313 142 -858 290 -394 -50 -26 -474 -676 -146 1078 685
7903 685 209 -1055 -105 166 1066 386 -44 -49 -92 310 458 -1075 162 51 384 57 -195 1006 81 -217
7923 -217 -112 229 18 6 -1101 35 -711 -245 -485 654 -149 457 31 342 -58 -815 531 519 -11
7942 -11 -192 511 -402 -888 309 -168 239 613 -341 512 185 -437 650 -697 -476 -717 1088 404 1281
7961 1281 -694 -209 759 -380 -169 57 -658 384 -477 -41 392 -113 -822 394 -251 185 221 -408 209
7980 209 1176 564 -122 -873 107 424 333 405 403 41 -425 -647 9 246 -176 195 -532 86 447 -275 462
8001 462 54 -434 -837 -561 -588 18 1147 167 369 217 582 -130 93 839 221 577 -169 285 417 719
8021 719 187 -394 -1099 129 144 -703 -358 118 1031 -267 409 -240 445 -356 -214 92 -490 -696 -708 -46
8041 -46 -151 39 292 21 -124 748 954 137 653 223 -208 -260 -116 120 -549 -531 -408 -665 -66 -592 217
8062 217 -5 256 -119 1132 179 -430 -139 -488 829 180 305 348 65 -410 -154 -108 21 -12 370 692
8082 692 -370 -453 -235 -62 140 325 -528 -647 -438 -1005 918 -349 -1040 256 -567 -362 14 142 -627
8101 -627 255 199 700 -418 -232 535 -568 551 -948 -464 276 325 -214 -474 0 281 39 -271 -195 691
8121 691 -325 50 343 -1373 166 -341 32 -171 -751 -571 -175 -171 -148 -62 113 386 -331 -10 341 -194
8141 -194 -552 414 -897 -129 -461 95 -145 204 -296 186 -130 192 -427 -89 402 -12 -333 611 366 -179
8161 -179 354 1138 297 776 -55 -498 -26 -78 -238 -341 263 566 -115 -26 -268 -373 -241 -731 -334 -966 -92
8182 -92 -271 231 -336 -378 59 -516 85 605 11
8191A1
##END NTUPLES=NMR FID
##END=
