##TITLE=1H_SAM-30.TD.DMSO
 DMSO, 108 sc, 
 25.11.2020
##JCAMPDX= 6.0         $$ Bruker NMR JCAMP-DX V2.0
##DATA TYPE= NMR FID
##DATA CLASS= NTUPLES
##ORIGIN= UXNMR, Bruker Analytische Messtechnik GmbH
##OWNER= root
$$ XWIN-NMR		Version 3.5
$$ Wed Nov 25 13:15:55 2020 Russian Standard Time (UT+4h)  she@DPX200
##.OBSERVE FREQUENCY= 200.1315066352
##.OBSERVE NUCLEUS= ^1H
##.DELAY= (6, 6)
##.ACQUISITION MODE= SIMULTANEOUS
##.ACQUISITION SCHEME= undefined
##.AVERAGES= 108
##.DIGITISER RES= 18
##SPECTROMETER/DATA SYSTEM= spect
##.PULSE SEQUENCE= zg30
##.SOLVENT NAME= DMSO
##.SHIFT REFERENCE= (INTERNAL, DMSO, 0, 15.7039)
##AUDIT TRAIL= $$ (NUMBER, WHEN, WHO, WHERE, WHAT)
$$ ##TITLE= Audit trail, XWIN-NMR		Version 3.5
$$ ##JCAMPDX= 5.01
$$ ##ORIGIN= Bruker BioSpin GmbH
$$ ##OWNER= she
$$ F:/spectra/data/she/nmr/H-F/1/audita.txt
$$ ##AUDIT TRAIL=  $$ (NUMBER, WHEN, WHO, WHERE, WHAT)
(   1,<2020-11-25 13:12:31.07 +0400>,<she>,<DPX200>,
      <continue with go, POWCHK disabled, PULCHK disabled
       configuration hash MD5:
       00 E9 B6 7A A2 85 ED C7 34 08 36 98 17 FE 4E 26
       data hash MD5: 16K
       5B A6 E1 81 B4 28 53 82 DE 9B 0C 3D 11 FC 69 58>)
$$ ##END=
$$ 
$$ hash MD5
$$ 47 6D CE F8 6B 76 35 15 84 43 61 37 79 CC 14 D1
##$RELAX= 
##$RELAX= 
##$RELAX= 
##$RELAX= 
##$RELAX= 
##$RELAX= 
$$ Bruker specific parameters
$$ --------------------------
##$DU= <F:/spectra>
##$EXPNO= 1
##$NAME= <H-F>
##$PROCNO= 1
##$TYPE= <nmr>
##$USER= <she>
##$AMP= (0..31)
100 100 100 100 100 100 100 100 100 100 100 100 100 100 100 100 100 100 
100 100 100 100 100 100 100 100 100 100 100 100 100 100 
##$AQSEQ= 0
##$AQ_mod= 1
##$AUNM= <au_zg>
##$AUTOPOS= <>
##$BF1= 200.13
##$BF2= 200.13
##$BF3= 200.13
##$BF4= 200.13
##$BF5= 200.13
##$BF6= 200.13
##$BF7= 200.13
##$BF8= 200.13
##$BYTORDA= 1
##$CFDGTYP= 0
##$CFRGTYP= 5
##$CHEMSTR= <none>
##$CNST= (0..31)
1 1 145 1 1 1 1 1 1 1 1 1 1 1 1 1 1 1 1 1 1 1 1 1 1 1 1 1 1 1 1 1 
##$CPDPRG= <>
##$CPDPRG1= <>
##$CPDPRG2= <>
##$CPDPRG3= <>
##$CPDPRG4= <mlev>
##$CPDPRG5= <mlev>
##$CPDPRG6= <mlev>
##$CPDPRG7= <mlev>
##$CPDPRG8= <mlev>
##$CPDPRGB= <>
##$CPDPRGT= <>
##$D= (0..31)
0 1.2 0 0 0 0 0 0 0 0.06 0 0.03 0 0 0 0 0.0002 0 0 0 0 0 0 0 0 0 0 0 0 
0 0 0 
##$DATE= 1606295127
##$DBL= (0..7)
120 120 120 120 120 120 120 120 
##$DBP= (0..7)
150 150 150 150 150 150 150 150 
##$DBP07= 0
##$DBPNAM0= <>
##$DBPNAM1= <>
##$DBPNAM2= <>
##$DBPNAM3= <>
##$DBPNAM4= <>
##$DBPNAM5= <>
##$DBPNAM6= <>
##$DBPNAM7= <>
##$DBPOAL= (0..7)
0.5 0.5 0.5 0.5 0.5 0.5 0.5 0.5 
##$DBPOFFS= (0..7)
0 0 0 0 0 0 0 0 
##$DE= 6
##$DECBNUC= <off>
##$DECIM= 32
##$DECNUC= <off>
##$DECSTAT= 4
##$DIGMOD= 1
##$DIGTYP= 9
##$DL= (0..7)
0 120 120 120 120 120 120 120 
##$DP= (0..7)
150 150 150 150 150 150 150 150 
##$DP07= 0
##$DPNAME0= <>
##$DPNAME1= <>
##$DPNAME2= <>
##$DPNAME3= <>
##$DPNAME4= <>
##$DPNAME5= <>
##$DPNAME6= <>
##$DPNAME7= <>
##$DPOAL= (0..7)
0.5 0.5 0.5 0.5 0.5 0.5 0.5 0.5 
##$DPOFFS= (0..7)
0 0 0 0 0 0 0 0 
##$DQDMODE= 0
##$DR= 18
##$DS= 0
$$ [...]
##$SUBNAM2= <"">
##$SUBNAM3= <"">
##$SUBNAM4= <"">
##$SUBNAM5= <"">
##$SUBNAM6= <"">
##$SUBNAM7= <"">
##$SUBNAM8= <"">
##$SUBNAM9= <"">
##$SW= 16.9725356469052
##$SWIBOX= (0..15)
0 0 2 0 0 0 0 0 0 0 0 0 0 0 0 0 
##$SW_h= 3396.73913043478
##$TD= 16384
##$TD0= 1
##$TE= 0
##$TE2= 300
##$TE3= 300
##$TEG= 300
##$TL= (0..7)
0 120 120 120 120 120 120 120 
##$TP= (0..7)
150 150 150 150 150 150 150 150 
##$TP07= 0
##$TPNAME0= <>
##$TPNAME1= <>
##$TPNAME2= <>
##$TPNAME3= <>
##$TPNAME4= <>
##$TPNAME5= <>
##$TPNAME6= <>
##$TPNAME7= <>
##$TPOAL= (0..7)
0.5 0.5 0.5 0.5 0.5 0.5 0.5 0.5 
##$TPOFFS= (0..7)
0 0 0 0 0 0 0 0 
##$TUNHIN= 0
##$TUNHOUT= 0
##$TUNXOUT= 0
##$USERA1= <user>
##$USERA2= <user>
##$USERA3= <user>
##$USERA4= <user>
##$USERA5= <user>
##$V9= 5
##$VALIST= <valist>
##$VCLIST= <CCCCCCCCCCCCCCC>
##$VD= 0
##$VDLIST= <DDDDDDDDDDDDDDD>
##$VPLIST= <PPPPPPPPPPPPPPP>
##$VTLIST= <TTTTTTTTTTTTTTT>
##$WBST= 1024
##$WBSW= 4
##$XGAIN= (0..3)
0 0 0 0 
##$XL= 0
##$YL= 0
##$YMAX_a= 1050579
##$YMIN_a= -1153054
##$ZGOPTNS= <>
##$ZL1= 120
##$ZL2= 120
##$ZL3= 120
##$ZL4= 120
##$ABSF1= 10
##$ABSF2= 0
##$ABSG= 5
##$ABSL= 3
##$ALPHA= 0
##$AQORDER= 0
##$ASSFAC= 0
##$ASSFACI= 0
##$ASSFACX= 0
##$ASSWID= 0
##$AUNMP= <proc_1d>
##$AZFE= 0.1
##$AZFW= 0.1
##$BCFW= 1
##$BC_mod= 2
##$BYTORDP= 1
##$COROFFS= 0
##$CY= 11.3945322036743
##$DATMOD= 1
##$DC= 2
##$DFILT= <>
##$DTYPP= 0
##$F1P= 15.9154993809931
##$F2P= -4.1035820241983
##$FCOR= 0.5
##$FTSIZE= 0
##$FT_mod= 4
##$GAMMA= 1
##$GB= 0.15
##$INTBC= 1
##$INTSCL= 1
##$ISEN= 128
##$LB= 0.24
##$LEV0= 0
##$LPBIN= 0
##$MAXI= 10000
##$MC2= 0
##$MEAN= 0
##$ME_mod= 0
##$MI= 1.114404
##$NCOEF= 0
##$NC_proc= 0
##$NLEV= 6
##$NOISF1= 3.799351
##$NOISF2= 2.8
##$NSP= 1
##$NTH_PI= 0
##$NZP= 0
##$OFFSET= 15.70392
##$PC= 1
##$PHC0= -11059.95
##$PHC1= 22.80088
##$PH_mod= 1
##$PKNL= yes
##$PPARMOD= 0
##$PSCAL= 0
##$PSIGN= 0
##$REVERSE= no
##$SF= 200.130013532006
##$SI= 16384
##$SIGF1= 3
##$SIGF2= 2
##$SINO= 400
##$SIOLD= 16384
##$SREGLST= <1H.CDCl3>
##$SSB= 0
##$STSI= 0
##$STSR= 0
##$SW_p= 3612.71676300578
##$SYMM= 0
##$S_DEV= 0
##$TDeff= 0
##$TDoff= 0
##$TI= <>
##$TILT= no
##$TM1= 0
##$TM2= 0
##$TOPLEV= 0
##$USERP1= <user>
##$USERP2= <user>
##$USERP3= <user>
##$USERP4= <user>
##$USERP5= <user>
##$WDW= 1
##$XDIM= 8192
##$YMAX_p= 0
##$YMIN_p= 0
$$ End of Bruker specific parameters
$$ ---------------------------------
##NTUPLES= NMR FID
##VAR_NAME=  TIME,          FID/REAL,        FID/IMAG
##SYMBOL=    X,             R,               I
##VAR_TYPE=  INDEPENDENT,   DEPENDENT,       DEPENDENT
##VAR_FORM=  AFFN,          ASDF,            ASDF
##VAR_DIM=   8192,          8192,            8192
##UNITS=     SECONDS,       ARBITRARY UNITS, ARBITRARY UNITS
##FACTOR=    0.0002944,     1,               1
##FIRST=     0,             0,               0
##LAST=      2.4114304,     0,               0
##MIN=       0,             -1153054,        0
##MAX=       2.4114304,     1050579,         0
$$ Real data points
##PAGE= N=1
##DATA TABLE= (X++(R..R)), XYDATA
0@%%%%%%%%%%%%%%%%%%J08k16K16k16K16k17L23m30M32n28O36o62P70r11J020
33E41j183J358j510J683j893K134k393K665k964L308l672M053m485M974n490O042
49C168o658P341q093Q907r816J0831j1958J3231j4675J6328j8241K0484k3165
62a2316K6435l0509L5765m2847N2922o8561R6974k74229J177233m97007j616914
73a153054P74623J079637m27847q82728K77342N65219J60230m57129n79678M82024
83a61361R87431p33824j115704R31416J142621j102031r96570J132450P96604
92H81032j028396n80421P91991M25417m55564l54454L4507N14344K75346p59607
102b55805m28459J005290M53304j190286l88324J303700K05949j264971J2295
$$ plain form
0 0 0 0 0 0 0 0 0 0 0 0 0 0 0 0 0 0 0 0 108 -108 108 -108 108 -109 214 -216 216 -312 324 -338 432 -479 541
33 541 -642 716 -794 889 -1004 1130 -1263 1402 -1562 1746 -1926 2127 -2358 2616 -2874 3168
49 3168 -3490 3851 -4242 4665 -5151 5680 -6278 6953 -7722 8606 -9635 10849 -12316
62 -12316 14119 -16390 19375 -23472 29450 -39111 57863 -216366 960867 463860 -1153054
73 -1153054 -378431 701206 273359 -609369 -332027 233192 393422 -63707 -643385 -161361
83 -161361 826070 92246 -1023458 -92042 1050579 -51452 -1048022 84428 881032
92 881032 -147364 -727785 64206 489623 34059 -320395 -285888 228456 503802 -255805
102 -255805 -684264 321026 774330 -415956 -804280 499420 705369 -559602 -547307
111e47307J017261r2190o79175O444L84928J79485j39003m59981J5376P61878
121D47716l4472j003172J69028J120311l55819j062740M89632Q89843n23363o51003
131e14039M27689M27488k21099k77875m5590K06505L49521k70141n94784M36748
141g5577P00429o13759o90620P50615N76941p96230m08715P33661K32179n51082
151a42158j11576K75322J20438j826k40125k10009M34340L16945o49099k95199
161e02947Q06511J86312q67483k9251Q06012j06884o32248J51829M11153r7577
171A25427j92883n6862M1611K63233J6247m69084Q497O39554j23921p12500K67151
182a93530O73996l74634n46776M08787L70729l35781k14648J89552J03888J7841
$$ plain form
111 -547307 469954 377764 -301411 -294967 89961 269446 130443 -329538 -314162 447716
121 447716 413244 -589928 -420900 699411 343592 -719148 -229516 660327 136964 -514039
131 -514039 -86350 341138 120039 -157836 -203426 3079 352600 82459 -512325 -75577
141 -75577 624852 11093 -679527 71088 648029 -148201 -556916 176745 408924 -142158
151 -142158 -253734 21588 142026 140200 -99925 -309934 124406 441351 -207748 -502947
161 -502947 303564 489876 -377607 -406858 399154 292270 -339978 -188149 223004 125427
171 125427 -67456 -124318 -82707 180526 196773 -272311 -263814 375740 251819 -460681 -193530
182 -193530 480466 105832 -440944 -32157 338572 2791 -211857 -22305 81583 99424
192I9424p7563k35079J54880L87326k82562m55851M27718M27386n33182l27161
202d14664N64271J93775n09873o3190L57243J4j60936k7007k2964J27934J58763
213B03366k82762k07931M32287J77341n47475q3401N89328m2396n31177J31679
223a61141M08168j61419k48704J18314R6213l620O108j49189m5304L18273m537
234A73162m36860J10905M71878k13897m39712K99001L39102l20650k08829K66272
244D0372R1180j47355j8861j7184L0842J58451r7302k58301J98409K98527l10264
255c1486k66310L85083J87861m05969p9411L49783m736k36740L4443J05170j4036
266B3652K4681o8592j12463J85275J40188l02199j05030L85401J8806l99645O7579
$$ plain form
192 99424 21861 -213218 -58338 328988 46426 -409425 18293 445679 -87503 -414664
202 -414664 149607 343382 -166491 -229681 127562 127576 -33360 -60367 -83331 44603 203366
213 203366 -79396 -287327 144960 322301 -225174 -308575 280753 238357 -292820 -161141
223 -161141 247027 85608 -163096 -44782 51431 47811 53919 -95270 -140574 177699 173162
234 173162 -263698 -152793 319085 105188 -334524 -35523 303579 -17071 -225900 40372
244 40372 131552 -15803 -34664 -51848 -21006 137445 40143 -218158 -19749 278778 -31486
255 -31486 -297796 87287 275148 -130821 -210232 139551 134815 -101925 -67482 37688 23652
266 23652 48333 -20259 -132722 52553 192741 -109458 -214488 170913 189719 -209926 -142347
277a42347L51871j26443k62111J47285J42914j02753m1277J1682j9857J06486
287F5450K5712k16744K0588K85984q9646l14163J72574K81298k30616k02598K38871
298C6710J10503j95237k9037R8572m022R466r815j07050O3370J76409j46254j92404
310a88789K24553J63386k76178j00644K82843K6348k37623K4300J64719m9869
320C3046o5297K6754k7233M3432P8979j27698r0253K11704N2733k60216O785K66130
332A48866o6912k30679J11178J59477j13666q1424P5380J8077r124J7576p4704
343d5955j0430J42669k1934j89172P3730K02443j32881j71779J64553J21977j71065
354c7844n5833J33436Q504o7471R609m960J175P3865m6742j14005J03246J23687
$$ plain form
277 -142347 209524 83081 -179030 -31745 111169 8416 -32861 -21179 -41036 65450
287 65450 91162 -125582 -104994 180990 91344 -222819 -50245 231053 437 -202161 36710
298 36710 147213 -48024 -77061 21511 17489 26955 17140 -89910 -26540 149869 3615 -188789
310 -188789 35764 199150 -77028 -177672 105171 131519 -106104 -81804 82915 33046
320 33046 -32251 -5497 -32730 10702 89681 -38017 -128270 83434 136167 -124049 -117264 148866
332 148866 81954 -148725 -37547 121930 8264 -73160 2220 20297 11173 28749 -45955
343 -45955 -56385 86284 64350 -124822 -51092 151351 18470 -153309 11244 133221 -37844
354 -37844 -93677 39759 48263 -19208 -9599 -14559 -13384 60481 13739 -100266 2980 126667
366A26667j59283r7915J93897M6759j89588M03J56027l1241j03591M1039L8803
377B1977j7917J5294k7587n0782Q9104N0969j44375j9769J68744j7078j69590
388a01010N5159J44652p9503j00662P9175N2927n6031p146M572q166M8090N16
400C2573r1065K2362J20096n8441j23894R1562J07666j16956o9920J18202K4846
411E7031q5909j6M2443p860O872p052m6824L8359O8996p4603p2059J11921M8172
424G9471j26569j6975J18953q864r7190K5868N9608k2649k4707P621p827K1574
436H314K8604o3839k1150R2272L111j06703K2241J03434m2751q6600N2655O3150
448E2738n5287k9578L5417M548l00p0l0580M347N8739k3599p1203M3581P4914
$$ plain form
366 126667 -32616 -130531 63366 110125 -79463 -79060 76967 45726 -57865 -16826 21977
377 21977 4060 19354 -8233 -59015 30089 81058 -63317 -83086 85658 68580 -101010
388 -101010 -45851 98801 19298 -81364 -2189 50738 -5293 -12439 -7867 -16033 32057 32573
400 32573 -58492 -36130 83966 25525 -98369 -6807 100859 -16097 -86017 32185 57031
411 57031 -28878 -28894 13549 5689 12561 5509 -41315 -2956 66040 -8563 -80622 31299 79471
424 79471 -47098 -64073 54880 46016 -51174 -25306 34302 11653 -13054 -5433 -13260 8314
436 8314 36918 -26921 -48071 44201 47312 -59391 -37150 66284 23533 -63067 -10412 52738
448 52738 -2549 -32127 3290 7838 7538 7468 -23112 -18765 39974 16375 -54828 -11247 63667
461F3667o3793o4595Q0663L7612p3763j4175N3291j16k4856M62n287J3749K2507
474B5366k9810l6487N2495L5851p3318j8920P7938L424p1086R123N3942j2080
486A6438l6701Q657K1859m619J249j6686j0112M1008M640n6580N854O6016k2315
499A8708n9271K7711N3290l6239l6422L4818J4996j8064l356l308L609K4429j6124
512D777l1468K4524L4297k9134m0923M1678L3712m7164k0285M1694Q926k9675
524i041m484J3745R429l611j2260q234K0135J6468l3989j5432M3514Q321m5876
537b1315k62M0571l416l2433J412K8572m668j5225j20M726J0776Q82k5082J679
551a3903L5671j0968l4222J3057L4218j6714l1288K1669K0360j6847j2165P447
$$ plain form
461 63667 -126 -64721 15942 53554 -20209 -34384 18907 18791 -6065 -5603 -10890 2859 25366
474 25366 -4444 -40931 11564 47415 -25903 -44823 33115 36539 -34547 -25424 28518 16438
486 16438 -20263 -11606 10253 5634 6883 -9803 -19915 21093 25733 -30847 -24993 41023 18708
499 18708 -40563 -12852 40438 4199 -32223 2595 17591 -473 -3829 -7137 -3528 20901 4777
512 4777 -26691 -2167 32130 2996 -37927 3751 37463 -9701 -29986 11708 20634 -9041
524 -9041 -13525 220 9649 6038 -6222 -14456 5679 22147 -11842 -27274 16240 24561 -21315
537 -21315 -21577 18994 15578 -16855 -15443 13129 8461 -6764 -6884 -2158 8618 9500 -15582 -13903
551 -13903 21768 10800 -23422 -10365 23853 7139 -24149 -2480 17880 1033 -11132 -3685
563c685Q727L647j0742j1374J7551J1845j6423j7612K0148K0068k5115j5660K4684
576F059J2312k3795p512J5229Q557r631r588N352R745K139j5602m900K0046O647
590A5058k7696l20K6727l814k0613l98J9868K87j6142o92J1533M206q073q096
604h165M934J6030r333j6282Q745J6251p274j9026R068J7512q684j5392Q149J2558
618I091m898r048k745J2175L065j2356l410J0206P332j2056q787J3557J0507j5408
632b775q055J2082P913r184r046Q374O819m403r508K081J2287l39j3622q73J6183
647G934l566j1567J491J0806J611j1614j305R674M749r943m225P517O276p525
661C13q216P508P006n171r542O260J0730p536p388M505P957l123p982Q32P950
$$ plain form
563 -3685 5042 8689 -2053 -13427 4124 15969 -454 -18066 2082 22150 -2965 -18625 6059
576 6059 18371 -5424 -12936 2293 10850 1219 -8369 -3017 6728 8867 -6735 -11635 8411 15058
590 15058 -12638 -12958 13769 9955 -10658 -11056 8812 9099 -7043 -7735 3798 8004 -69 -8165
604 -8165 -3231 12799 3466 -12816 -4071 12180 4906 -14120 -5052 12460 3776 -11616 -3467 9091
618 9091 4193 -4855 -7600 4575 7640 -4716 -8126 2080 9412 -2644 -11431 2126 12633 -2775
632 -2775 -10830 1252 9165 -19 -9065 -691 6128 1725 -7783 -5702 6585 6246 -7376 -8249 7934
647 7934 4368 -7199 -5708 5098 6709 -4905 -6210 3464 8213 -1730 -5955 1562 7838 313
661 313 -7903 -395 6611 1440 -8102 -1842 8888 1352 -6036 -1531 6426 3303 -4679 -3847 4103
676D103J594j1167J359O624K789q918j811P855L126p291l672N617N684n414q972
691h494Q508O772p500n068L933O722k374p505J767R192l394o792N67O984M57p864
707d089J046N241K066o341l052O344M084p512l451P703J532k921m793K845P447
722F149n278m797K255O944l913n106J783O215j895n794K183K792K747o317k166
737d198O248J315m680j642L946K119l148n314N559M158n015k537K992M095l288
752F10m488K390N449j926m761l0N822j7p142K630M304r37m050m69M091Q70k264
769H2m053N050K233l743j772J501M156l660j997J487M786l126l894K124L052o06
785A620n091L622K478j765k553p12M355K67l980j185M684O03l201j988L642L020
$$ plain form
676 4103 5697 -5470 -4111 2513 5302 -3616 -5427 2428 5554 -1737 -5409 208 5892 478 -8494
691 -8494 14 6786 -714 -5782 -1849 4873 2499 -5006 -3239 5953 2559 -4233 -3666 3318 3775 -4089
707 -4089 -3043 2198 4264 -2077 -5129 1215 5299 -2213 -5664 2039 3571 650 -4143 -1298 6149
722 6149 871 -3926 -1671 5273 1360 -3746 -1963 4252 2357 -3437 -1254 1538 4285 -2032 -4198
737 -4198 2050 3365 -1315 -2957 989 3108 -40 -5354 205 4363 -652 -3189 -197 3898 610
752 610 -3878 -1488 3961 2035 -2726 -2756 3066 3049 -4093 -1463 2841 1904 -2146 -2615 1476 2346 82
769 82 -3971 1079 3312 -431 -2203 -702 3454 -206 -2203 -716 4070 944 -2950 -826 2226 1620
785 1620 -3471 151 2629 864 -1689 -2401 1954 2221 -1759 -2944 1740 2343 -858 -2846 796 3816
801C816m856r19K628K703l179j870O94J957J114l748n67M104Q30m903J66P039
817E009m439l587K033J866l30p80o29J179J350k309J95j238M607k688m130K732
833a159M208l185l573M029J816k473k151M023Q85l306J935k192R59K057k077k533
849b737M306J110l695j523L558K570o076J158L657j394k577J466Q83q83J288j419
865c08o92J817K111m279k230O821r84n759K291N066n233K1J032K006r15k123K201
882H43j705J583J189l058o36M334j832l872L807K443l578j267K281J628m528K994
898F26P53j629k1J336m170L542K232m542j141M071K137n179N58L964j118l149
914a730J540J354k918K265n5q89Q32n41j85l711O089N25n463J667M713l974k206
$$ plain form
801 3816 -1040 -1959 669 3372 193 -1677 -983 974 2088 -1660 -2227 1877 2707 -2196 -2030 5009
817 5009 570 -3017 -984 882 552 -228 -857 322 1672 -637 -442 -1680 2927 239 -3891 -1159
833 -1159 3049 -136 -3709 320 2136 -337 -2488 1535 2420 -886 1049 -1143 -184 1873 -204 -2737
849 -2737 1569 2679 -1016 -2539 1019 3589 -2487 -1329 2328 934 -1643 -177 706 -177 1111 -308
865 -308 -1000 817 2928 -1351 -3581 3240 2256 -3503 -1212 3854 -1379 -1358 -326 1680 765 -1358 843
882 843 -862 721 1910 -1148 -1784 2550 718 -3154 653 3096 -482 -1749 532 2160 -2368 626
898 626 1379 -250 -271 1065 -3105 437 2669 -1873 -3014 1057 3194 -1985 -1427 2537 1419 -1730
914 -1730 -190 1164 -1754 511 456 -433 399 -142 -327 -4038 2051 2576 -2887 -1220 3493 -481 -2687
931b687M764j080j571j18L057l032l5K100j028k111K506P87n376L463L566l442
947b37j450K551K012m250k00M322k996j212L412j573k355N187k781k884K566L380
963C492m285j701M721r19l090J346L459l527p46K582j239o72N72J870l734J125
979g46L206l012k706O011j77o086M474J102l106j352M363k540r69K558j006j255
995a241J278K189m990K27N751k800k516J868K121l328l31L224j968j114K741P89
1011A900m368K418J661l715J494K883j757l355L003J893m114Q35M100l371j961
1026b454M569L9l576N98L041l531J63L877l164j853K690K221n456K199L482l739
1042h94r59K956M19l868K797J234k395n39K837j015k062K883o14k001J236K816
$$ plain form
931 -2687 2077 997 -574 -692 2365 -667 -702 1398 370 -1741 765 1552 -3824 -361 3205 -237
947 -237 -1687 864 2876 -1374 -1574 2748 -248 -1460 1952 379 -1976 3211 430 -2454 112 3492
963 3492 -793 -2494 2227 1308 -1782 -436 3023 -504 -1250 1332 93 -579 -7 1863 -1871 -746
979 -746 2460 -552 -3258 2753 2576 -3510 964 2066 -1040 -2392 1971 -569 -1538 1020 14 -1241
995 -1241 37 2226 -2764 -2537 3214 414 -2102 -234 1887 -1441 -1772 1452 -516 -1630 1111 1900
1011 1900 -2468 -50 1611 -2104 -610 2273 516 -2839 164 2057 -2057 -1222 2878 -493 -2454
1026 -2454 2115 2154 -1422 -824 2217 -1314 -1151 2726 -438 -2291 399 2620 -2836 -637 2845 -894
1042 -894 -1853 1103 1522 -2346 451 1685 -710 -1249 1588 573 -1489 1394 780 -1221 15 2831
1058B831l711j976M235K45m148K058L404l753o34K878k344O4J737o97k225K355
1074C19J621k288o62L073j268k843L076J46j548j53J942j291o82J169p89o03M69
1091c12L363m540n36M073j152k525J466K440k720r2Q15p31j56J685l53j322J762
1108A165q13m53J74J136j060j349J083O03p82K18J499j195r75J242q5j288Q47
1125c3J531k532n5K408k230m98K051M18k163J461M03r29r48J776p89o84Q92O22
1143G01j508m08J580r65o04J464N10k135O36J183j072o47K069k9j343J133M22
1160I87j770K319m20j846P60Q51lk017J477J50k80R6n5P64r98O15o36Q74q09k55
1180a96j4j065J897m08l73L35J128l021J336Q06j558J673p37M54j485P32R25n39
$$ plain form
1058 2831 -880 -2856 1379 1624 -2524 -466 2938 -815 -1449 1429 -915 -851 886 189 -2036 319
1074 319 1940 -348 -1010 2063 795 -2048 1028 1174 -374 -527 1415 124 -558 611 -178 -781 -312
1091 -312 3051 -1489 -2025 2048 896 -1629 -163 2277 -443 -535 280 -451 -607 1078 725 -597 1165
1108 1165 352 -101 73 1209 149 -1200 -117 486 -296 -78 1421 226 -749 493 408 -880 -33
1125 -33 1498 -1034 -1089 1319 -911 -1409 642 1060 -1103 358 761 -168 -1116 660 -129 -813 79 701
1143 701 -807 -1215 365 -600 -1204 260 770 -1365 -729 454 -618 -1265 804 775 -568 565 987
1160 987 -783 1536 1116 -730 30 881 878 -1139 338 488 208 304 249 1013 15 630 -6 868 59 -196
1180 -196 -210 -1275 622 214 -159 176 1304 -1717 -381 425 -1133 540 -197 257 -1228 -496 429 -110
1198a10J007m29L33j825J506j81o09r06K269L47j567R6k9M38q63J087j756P90
1216d02J789k108J955j634J310r74L52L14j260KN49J240j974J48J073j55n46J51
1234a70M37n76M34Q2m47L01k17j15J65m7J0P00j238J21r2K10J73m71L36J274r25
1255e5j366K005m62l55m45o09K515p98n58l5O74o81J11L72N5L29j434J192o5k16
1275A74P8l7K87p78M2M49j32j51O29j065p40J682k148J489J075l34j53o73j78
1294d84L14j4p93J448q27L96M45k94n32L06l43L17N62l78N78j023P90M9p11J360
1314A166j382L85J75j336J098J085j916qJ977j483R72p74o57K2N71l58m03J300
1332D34j144L00R05o83k40L84J076j475N45j66k88P33l89J93K32j95r58Q02j457
$$ plain form
1198 -110 897 468 801 -1024 482 301 -308 -1214 1055 1402 -165 -69 -98 340 -523 564 -1192 -402
1216 -402 1387 -721 1234 -400 910 -64 288 602 -658 -656 -107 1133 -841 -693 380 225 -321 -170
1234 -170 267 -309 125 207 -240 61 -156 -271 -106 -153 -143 557 -681 -560 -652 -442 -269 -740 -404 870 -55
1255 -55 -1421 584 122 -233 -678 -1287 1228 430 -128 -163 511 -170 -59 313 368 697 -737 455 390 174
1275 174 252 215 502 -276 -234 215 83 -68 561 -504 -1244 438 -1710 -221 854 520 367 -306 -484
1294 -484 -170 -184 -977 471 -356 40 485 191 -341 -35 -378 -61 501 123 701 -322 468 517 -194 1166
1314 1166 -216 169 344 -992 106 1191 -725 -733 1244 -239 733 -41 -698 -676 -105 -463 -866 434
1332 434 -710 -410 495 -188 -428 -44 1032 -443 102 -64 -352 381 -8 185 417 222 -736 66 -1391
1351a391J247O33q89O5P32K29k25j065J13O43p93R93m97n63J847j031o80M36m53
1370f49K37J38j73J852j455k65J106j387O5N11J38l76O25O8p67N79Q41j537r48
1389a397K344J34k120K550j372j027O04O91P1q31o1M09m23lK022k771R84P01j082
1408e77J39J504n98j695J11L269k775m47J819N13k983J438O57p80m50J892n20
1425E17j207R7L45k59j69L072k934q04J094J358k120J808N00j500p66K040j695
1442f23j139K915R97l865J278K346k607j345L075k24k505K196J732l016n27L448
1458B136k180k013K760P72k275J044Q56j619q8J863o24k759K329J303l749K169
1474g5K454l098j191L142M29k940J120K131k179r87K940j289l003L296N95k412
$$ plain form
1351 -1391 -144 489 -400 -335 397 626 401 -664 -551 92 -701 292 -205 -768 1079 48 -632 -196 -649
1370 -649 -412 -274 -447 1405 -50 -315 791 -596 -531 -20 118 -258 367 435 -332 247 1088 -449 -1397
1389 -1397 947 1081 -1039 1511 139 -888 -284 407 478 -353 -414 -5 -428 -431 1591 -1180 -196 505 -577
1408 -577 -438 1066 468 -1227 -1116 2153 -622 -1069 750 1263 -1720 -282 375 -405 -855 1037 517
1425 517 -690 -593 -248 -507 -676 2396 -538 -1342 -248 1110 -1010 798 1298 -202 -968 1072 -623
1442 -623 -1762 1153 2150 -1715 -437 1909 -698 -2043 1032 808 -1697 499 2231 -785 -1312 2136
1458 2136 -44 -2057 703 1475 -800 244 1100 -519 -607 1256 632 -2127 202 1505 -2244 -75
1474 -75 2379 -719 -1910 1232 1661 -1279 -159 1972 -207 -1194 1746 457 -2546 750 1345 -1067
1490a067l61M235l366j172L201q74k075J658K204l399K22L107k778k554L278J314
1506A573l284J525K554l592j178N245j500m747M228K383m479l28M785l368l217
1521c400N124M63m135J392M710n420j686N273j553m356M729J407m776J306L145
1536B223j339n155N897J072n192K272K563l735j321N219j682m543N395K218n995
1551b103m2O672n107l191N948j75n212L120L596n603r50O192j724n533N089K712
1567C689o819R44N056l787k504O299n86o035K823L805m777o94P531m709m412O745
1583B569Q47p458J896O823p164l88O074j509n914M576M385p976O30P668n523l571
1599d035N685J279p091L388N195o297j397O737j872o195N472L569q232J400P452
$$ plain form
1490 -1067 -1428 2807 -559 -1731 1470 596 -1479 179 2383 -1016 -794 2313 -465 -3019 259 1573
1506 1573 -1711 -186 2368 -1224 -2402 2843 1343 -3404 824 3207 -1272 -1600 3185 -183 -3400
1521 -3400 1724 2187 -1948 -556 4154 -1266 -2952 2321 768 -3588 1141 2548 -2228 -922 2223
1536 2223 884 -4271 1626 2698 -2494 -222 2341 -1394 -2715 2504 822 -3721 1674 3892 -2103
1551 -2103 -2145 4527 -580 -3771 2177 2002 -3210 -90 3506 -2097 -3047 3145 1421 -4112 977 3689
1567 3689 -3130 -2186 2870 -917 -3421 2878 2292 -3743 -920 2885 -1892 -2586 4945 236 -4176 2569
1583 2569 3416 -4042 -2146 4677 -2487 -2875 3199 1690 -4224 352 4737 -3239 -2609 5059 -464 -4035
1599 -4035 1650 2929 -4162 -774 4421 -1876 -3273 3464 1592 -4603 869 4438 -3794 -2394 5058
1614E058n227l855P015L31p958L661O139q063j285Q227l201n664O775K167o995
1629b875K84P814n543m442P286N01p803M084O547p855j352P967l395o389N949
1644G78L488q633K596P602p593k924Q334j397p043M898M348p428J85P558l245
1659A524o567P512K148j0083L720P004p090k966P743m63q507O553M565r078Q63
1674c122P958m611o616R567J319q851L167P308q322k014Q806k558q040P284L757
1689E032q556P78Q722n423n225Q133j84q524L983P465q646k231J0515l209q407
1704e777P967K067r021K039Q874p855m322Q727J426r966M956O396r068J003P544
1719D990l429p620Q092K375r449L329P184o406n520J0722l11r583N457O917j0447
$$ plain form
1614 5058 -169 -4024 2991 3322 -4636 -975 5164 -2899 -4184 4043 842 -4822 1953 4120 -2875
1629 -2875 -2591 5223 -320 -4762 2524 3025 -4778 -694 5853 -2002 -3354 4613 1218 -5171 778
1644 778 4266 -4367 -1771 5831 -1762 -4686 3648 2251 -4792 106 4454 -2974 -2789 4769 1524
1659 1524 -5043 2469 4617 -5466 -1746 5258 -1832 -4798 2945 2482 -6025 528 5093 -3985 -3122
1674 -3122 4836 225 -6391 3176 4495 -4356 -1189 6119 -2203 -4217 4589 2031 -6009 1275 5032
1689 5032 -3524 -2746 5976 553 -4672 3461 3277 -5247 -1264 6201 -2445 -4676 5839 2630 -5777
1704 -5777 2190 4257 -4764 -2725 6149 -1706 -6028 2699 4125 -5841 -885 5511 -3557 -2554 4990
1719 4990 1561 -6059 2033 4408 -5041 -1712 5472 -934 -6454 4268 3957 -5626 -169 6748 -3699
1734c699%R269n130o196P979L464j0689K907Q957q478l552J0075k230r202Q303
1749A778M302r563K58R488o242n052Q829M93j0528M721Q350r233k355J0110l169
1764B187q127P720M429j0913J487R157n784o342R644M49q850M423P136r827j732
1779d943J0092l672p366P321M338j0468J795R330p059n111R806n77r141N624N910
1794E879q799j200J0092m407q127R265K125r782L209R132q671m314R381q05r019
1809f041O353N577r801p0J0528n651p273R138K026j1211N196Q026r020l232J0697
1824E242j915r201O512N329r620o66R656m674o663Q742J492r746L943P882q498
1839b185l105J0867k886r558P884M962j0495K190Q601o454n367R016Q90r976M714
$$ plain form
1734 -3699 -3699 5570 440 -5756 2223 5687 -5002 -2095 6862 -1616 -5168 4907 2677 -6525 1778
1749 1778 6080 -3483 -3225 6263 21 -5031 3798 4291 -6237 -1516 6834 -2399 -4754 5356 2187
1764 2187 -5940 1780 6209 -4704 -3217 5940 156 -6186 3458 3907 -4943 -520 6616 -3211 -4943
1779 -4943 5149 1477 -5889 1432 5770 -4698 -2903 6427 -632 -5743 4063 3486 -5655 -31 5879
1794 5879 -2920 -4120 5972 1565 -6562 2703 4828 -4954 -1745 7387 -1284 -5598 3783 2978 -6041
1809 -6041 312 5889 -3912 -3982 6546 895 -6378 2760 4786 -6425 -1229 6797 -2223 -5455 5242
1824 5242 3327 -5874 638 5967 -3653 -4319 5337 663 -6000 2742 4234 -5512 -1569 6313 -2185
1839 -2185 -5290 5577 2691 -6867 1017 5979 -4516 -2326 6275 -179 -5546 3470 4360 -5616 -902
1854i02P142r008j742J0673m261p816O851M064q938J026R009p514m064J0001J10
1869D631j0768O380O671r933q12Q744l627o831P377K448r517L550Q007p204m876
1884e760J0216q65r171O223M366p544j392R736n186o146Q306K568j0664L429P502
1899E618q437k310J0322l204q129O554M955r757L18R999n685n114P906O19q869
1914e214M226O604p615l263R840l176p963Q219L391r327J281Q208n162n986R065
1929C128M91p993L025P318q166j930R171l090q567P717L059r028K933O291n122
1944g63m990Q382R30q458L815O412q209j135R376m320n118N789K812q697K679
1959a495O373o538l530Q872r27p496N652M136q495M25P195m075n021O440L186
$$ plain form
1854 -902 6240 -2768 -4510 6163 1902 -5914 937 5001 -3937 -2911 6098 -1416 -5480 4521 4631
1869 4631 -6137 243 6914 -3019 -3831 4913 1286 -5545 1832 4280 -5237 -1687 6320 -884 -5760
1884 -5760 4456 3591 -5580 643 5009 -2535 -3927 5809 623 -5523 2783 5351 -5313 -1884 5618
1899 5618 -2819 -5129 5193 1989 -6140 414 5369 -4388 -4070 5929 244 -4870 3036 3655 -5214
1914 -5214 -988 5616 -1999 -5262 4578 1402 -6561 1658 5049 -4278 -2997 5211 49 -5937 3128
1929 3128 3619 -4374 -1349 5969 -2197 -4127 5044 1954 -6613 1104 4163 -4865 -1932 4359 -763
1944 -763 -5753 2629 3559 -4899 -1084 5328 -2881 -4016 5360 1040 -4078 1711 4523 -4174 -1495
1959 -1495 4878 -1660 -5190 3682 2755 -4741 911 5047 -3448 -3023 4172 97 -4924 1516 4702
1974D702q993L065N157n286k543Q250k764p448O593L904p293l54P594m277n154
1989d847O832J029o576K718N397o986r34O797j150o748N364J815n891J368N912
2004D100m154m312O767Q49p729L702M534n453j692P786l266n489N573J379n804
2019c209J303O899o227k773O259j204m703L580L728o649m99P864l514m752N094
2034A197K980p351J353N849m793k103N578j085n839L902M079o133l98O767l740
2049B63m170N303J424o076J717N482n507j339N600j379n109M576K375n642j73
2064b655N401k347n172N056K485o727L601L643m611j917O370j638m601L819K383
2079C090m668q43N306k924k992M566P19n930L218K580l667p54M104q62m543M323
$$ plain form
1974 4702 -4291 -1226 3931 -1355 -3898 4352 1588 -5860 733 4637 -2656 -3010 4584 307 -4847
1989 -4847 1985 3014 -3562 -844 4553 -2433 -3367 3430 2280 -4468 896 2711 -3180 -1812 4100
2004 4100 -54 -4366 2401 3250 -4479 -777 3757 -1696 -3388 4398 1132 -4357 1216 2595 -3209
2019 -3209 -1906 4993 -1234 -4007 2252 1048 -3655 -75 3653 -2996 -3495 4369 855 -3897 1197
2034 1197 4177 -3174 -1821 4028 -765 -2868 2710 1625 -4214 -312 3767 -2366 -2764 4003 263
2049 263 -3907 1396 2820 -3256 -1539 3943 -1564 -2903 2697 1318 -3791 785 3160 -2482 -2655
2064 -2655 2746 399 -4773 283 2768 -3959 -358 3285 -1326 -3243 3127 1489 -3112 707 3090
2079 3090 -1578 -2421 2885 -39 -3031 1535 2254 -3676 -458 2122 -1545 -2299 1805 943 -3600 723
2095G23K313n878O26N303l378k476M363K98m613J829K977l856q1M728k728l863
2111c713N481P24m320O30M558m416q66L951p21l411J413L631m954k37M604k243
2127A11k965M368R7l972J535K014k574j413M544j55m155K997L88k094O6L958l270
2144e20k518M377l6l344J889J767k252j609M543k301l051L325J717l892Q31L747
2160B673k725j369K474J1l865L339J629k621p47K807n33l271J857K107k858k01
2176a293L595j130k169J816L48l861K328J767l661N46L199o57l659L445K26k900
2192b060J484L034k795j757M123j715k631J756J158j334m91K494q15k007K524
2207I68K45k414P49K921l133p99K225j27k208J301K315l192k69L607k377k031
$$ plain form
2095 723 3036 -2842 -2216 3087 -291 -2767 1596 1894 -2719 -890 2087 -1769 -1850 2878 150 -3713
2111 -3713 1768 2492 -1828 -1198 3360 -1056 -1922 2029 1308 -2103 -690 2941 -2013 -2250 2354 111
2127 111 -2854 1514 1611 -2361 -826 1188 -1386 -2799 1745 1590 -2565 432 820 -1274 -1208 2750 -520
2144 -520 -3038 1339 1303 -2041 -152 1615 -637 -2246 2297 -4 -3055 270 1987 -1905 -1074 2673
2160 2673 -52 -1421 1053 1064 -2801 538 2167 -454 -1201 1606 1073 -2198 -341 1766 -1092 -1293
2176 -1293 2302 1172 -997 819 1167 -2694 -366 1401 -2260 -1714 1485 828 -2831 614 840 -2060
2192 -2060 -576 2458 -337 -2094 2029 314 -2317 -561 597 -737 -1228 1266 451 -1556 968
2207 968 1213 -1201 -452 2469 -664 -1463 762 635 -1573 -272 2043 -1149 -1418 2189 -188 -2219
2223b219K481L53j352L30K254j586j58J288j91l280L028K45j894R7J299j013k31
2240e49J316O09k427O39J992k041l39L152j954j272J074P47k406J449J835j676
2256A49j478J752K61j902P04J341q77l73J803j411j037J555N65j939Q14K79m40
2273b34r63J488P30k190M48K049k625O63K085r79q67J600n21j452J238J46n96
2290B0qK32j53q74J625q57o33J50M36k57l79J398o5q92Q31P63j914l4Q43o97L53
2311a12l8O55o83L56K82l38m79J661n38j640J443m4r39J51j16N13R08j087k99
2330c44J67l7P95j379L7J222l1j327M94P96p55M3R57J74j303Q19K68k46o78J022
2350F94j69j181J129o51l64k18O10J180j693J520j056N17J90J17m45k66Q70j034
$$ plain form
2223 -2219 262 615 -737 -407 1847 261 103 1391 1200 -2080 948 1193 -701 -604 695 -318 -549
2240 -549 767 1376 -1051 -412 1580 -461 -800 2352 398 -874 200 947 -1459 -10 1825 149
2256 149 -1329 423 684 -1218 -514 827 -50 -423 1380 -31 -1068 487 1052 -887 -73 206 -234
2273 -234 -1197 291 1021 -1169 -721 1328 -1297 -634 1451 472 -395 1205 684 -768 470 616 20
2290 20 12 244 91 -783 842 -15 -648 -498 -62 -319 -698 700 635 -257 574 1337 -577 -611 232 -465 -112
2311 -112 -150 505 -178 178 460 122 -357 1304 766 -874 569 525 -414 -263 -379 134 1042 -45 -344
2330 -344 -177 -214 581 -798 -761 461 430 -897 -403 393 -362 -319 638 812 -491 328 596 350 -328 694
2350 694 525 -656 473 -178 -542 -760 -150 1030 -663 857 -199 318 508 625 180 -86 784 -250
2368b50m26Q61j382J103o03K86m02P94L52j02r86J173Q77j639j28Q49j04J4q5
2387B02Q42j583Q87J09m39P39r70L76r16J204j90p19k06P66J323r25q9L12j21
2406F02j227J400n71K03j60N15l17p78J201k141J398P84j060o1J491j101j284
2423a106J05M81Q55o15J326j802N04L88J14J1m80k08M83O30q70K04q9o55N33j21
2443c12O79j01m24K76o7m89m2J16J219j235J166j62p81LR07m62O82j676J64R13
2463C74m17o71JJ503j776J366q15k14K49L44j369J891J41po80r01L76J247q77
2482b35P2P8r7k29k97L18J677j294k41n78J033r3p06J579j724L31Q50J14j163
2501f05P31J33q53O07m47M58l84L74l99L48J32M06n86O0j13J187m54l62k50J026
$$ plain form
2368 -250 -676 185 -1197 -94 -697 -411 -813 -19 333 231 -755 418 1295 -344 -472 377 273 287 202
2387 202 1044 -539 348 457 18 757 -213 163 -753 451 261 -458 -664 102 1425 500 411 723 602
2406 602 -625 775 204 407 247 762 445 -333 868 -1273 125 909 -151 -212 1279 178 -1106
2423 -1106 -1001 -520 335 -280 1046 -756 -252 136 250 261 -219 -427 56 686 -184 20 -69 -724 -191 -312
2443 -312 367 266 -158 118 51 -438 -480 -364 855 -380 786 624 -157 -154 753 291 973 -703 -539 374
2463 374 -43 -714 -713 790 -986 380 -435 -649 -400 -56 -1425 466 607 600 -80 -981 -605 642 -235
2482 -235 -163 -85 -182 -411 -708 -390 1287 -7 -248 -826 207 114 -592 987 -737 -406 444 558 -605
2501 -605 126 259 -594 13 -434 24 -360 14 -385 -37 95 501 -85 -25 -138 1049 595 233 -17 1009
2521A009o67J53m33P66j023O79j69j33k97L6M64k85L0L57m54J61j2M62M44p30
2541C58m71j003J112k10j79K07M53n71O91j557J034j70P31j41j7j248Q54K73N20
2560F66n93p46O57r6j1M14p54M39k98k78J740j248j37q64Q46N67k40R07n1o75
2580B45J5j5M1j46m03L22q99J32P73R2J4m11j55R15j143J000j655P09J128o84
2600a25o50J088o50L35J211j319O62q44J059j067k9N92m83O16l08J82m97m31O12
2619d6Q52n41m01N22p51O82l45R84j266J125j712Q49k02O56K52n34O25j530J292
2638E11J73m64p95P48o66N65M86qo7m87l18r4J189r03J073p30n71J733q62r0K3
2659D46m34j058J647n10N04q00j59J106j277J159p31O83k42k71K96l70K05L64
$$ plain form
2521 1009 342 495 62 828 -195 484 315 182 -115 -79 385 100 130 487 33 194 182 644 1088 358
2541 358 -113 -1116 -4 -214 -393 -186 267 -304 387 -1170 -136 -306 425 284 267 -981 -127 146 666
2560 666 73 -673 -16 -112 -123 291 -463 -24 -322 -600 1140 -108 -245 -1109 -263 304 64 971 920 245
2580 245 260 245 286 140 -263 59 -840 -708 65 157 171 -240 -395 520 -623 377 -1278 -569 559 -125
2600 -125 -775 313 -337 -2 1209 -110 552 -292 767 -300 -329 263 -220 396 88 270 -227 -658 -46
2619 -46 806 265 -136 386 -365 317 -28 956 -310 815 -897 -48 -250 406 658 124 749 -781 511
2638 511 684 220 -575 173 -493 72 558 550 483 -4 -322 -416 773 -130 943 213 -358 1375 513 423 446
2659 446 12 -1046 601 91 595 -205 -364 742 -535 624 -107 576 334 63 359 -11 194 558
2677E58n54P8O01q5j152P86m77P50n20m4j78M57L16o24m82R01l40M65r57O8N31
2698I8Q11k003R77l5j05J56K24O55m96j12N55j095O02p22P37J83O13j491Q00N26
2718H78n28J80n48M18J67j202J56J92O00J78m92L1o9l13q1l36J058m3K92k16k18
2739A04M16j390M38O16q8k27P66j72l72j005J158o2r93J185j48J87Q0j64l96q5
2759a52K82r41J463p00o5L8R7k14N79p20l39R61R73j895O81K55k40q43N98L8L07
2780A63L38m38R97j118N44q77J002q25J69L13J30Q1o31l69O39J34o4k71N36m40
2800A3J40K98J89q29P35O06j676N27j98j31L43k13o10J723j558L90l2J44K60l97
2820b76J120j79q42K97j47jN2O45n30J48m09n06P34o01J12J137n86k92K79j429
$$ plain form
2677 558 4 82 683 598 -554 232 -245 505 -15 -59 -237 220 536 -88 -570 331 -9 456 -501 -433 98
2698 98 909 -1094 -117 -152 -257 -101 123 778 282 170 725 -370 232 -490 247 430 1043 -448 352 878
2718 878 350 530 -18 400 567 -635 -479 -287 313 491 -1 30 -39 -352 -433 -769 289 246 538 322 104
2739 104 520 -870 -432 184 96 -131 635 463 91 -914 244 182 -811 374 226 413 493 329 -67 -152
2759 -152 130 -811 652 -48 -113 -75 22 -192 387 -333 -672 289 1262 -633 48 303 63 -780 -182 -144 163
2780 163 501 63 1060 -58 486 -391 611 -214 -45 268 398 479 -152 -521 118 252 188 -83 453 13
2800 13 153 451 640 -189 546 1152 -524 3 -195 -326 17 -196 -806 917 -641 -251 -283 -139 121 -276
2820 -276 844 665 -177 120 -27 -28 24 669 139 287 -122 -628 106 -495 -383 754 168 -124 155 -1274
2840a274J096m28N58l44K49j021J556j101J54J251o29J70o11L49m14J76K14J54
2858A05j48J01L85q23L21k39N19O42r58R7L17r8l45J30J89n51L75Q4l31j68j72
2879e68O63n61O93k64k70K62k5M2M30M58p53l33K60R7Q34j133j8j84P72m25K2
2900arN47p93m61j34O24K67J80l26P71j562J039q34L39R35k422J892J00O08l63
2920C97j539J60J131k07Q02p2k70o07O38l60o15o33J044j57R01o40K86k44P40
2939G55l94o02J043j174M80L08q68Q28n45Ok32K93N01j053L80O33j156K19M95
2958h3M88J35P4o94K86L32O3k90k4j34l67K56k2Q5k30N79j390P40n45J71J055
2979D85j292L18J93j55Q86j37m13j348J250Q45j146J046l84M00j334P68L33p1
$$ plain form
2840 -1274 -178 -606 -48 -392 -143 -1164 392 -709 -555 696 67 237 -374 -25 -439 -263 -49 105
2858 105 -43 58 443 -380 -59 -298 221 863 -95 2 319 221 -124 6 195 -356 19 103 -228 -396 -568
2879 -568 95 -466 227 -37 -307 -45 -70 -28 402 860 107 -226 34 131 965 -168 -186 -370 402 -23 -1
2900 -1 -10 537 -256 -717 -851 -227 40 220 -106 665 -897 142 -692 -353 582 -1840 52 152 760 397
2920 397 -1142 -982 149 -58 744 672 402 -205 433 73 -542 -1175 -131 -288 613 -27 259 15 755
2939 755 361 -241 802 -372 108 416 -452 376 -169 -163 -395 -102 399 -654 -274 359 -797 -578 -83
2958 -83 405 540 614 -80 206 538 601 311 287 153 -214 42 20 105 -125 454 -936 -196 -741 -570 485
2979 485 -807 -489 -296 -451 435 298 -115 -1463 -213 632 -514 532 148 548 -786 -18 315 244
2997B44q9l72L11p77J168k52NP34q27k91P65L76m79o20M62k75m30R49l09o23R4
3018b36M89l18j051R37l88R18j373J205l82k84P00N83n81n65J420j364j59n65
3036a014N00P94q99j08k75Q74o3o86O69L70N54l08m22o40M37M33n31M10J50K11
3056D56M12p10N3K44R3j006J155n52J40J91M56o13q25J149j960K598j523M38N50
3075G46j145L49k37J054r03J81J97k58K6J89p10m92J308K99m06M4m73M68p33J87
3095c09j47J127j256p6J164l30n0o93R08o74K93j192J270Q47j620Q96m40O61j00
3114B79j272R54M89r49J61Q10j337R66j86L50o7j89P02m95j33j1j98P04l53K13
3134D38m3k74j5r5l38R52m41L69j052J062r30J025N2j709Q08J48M88n53J23O48
$$ plain form
2997 244 155 -217 94 -683 485 233 238 972 145 -146 619 995 516 -104 358 83 -347 602 293 -330 -236
3018 -236 253 -65 -1116 -179 -567 351 -1022 183 -199 -483 217 800 219 -346 1074 -290 -449 -1014
3036 -1014 -514 280 -619 -727 -1002 -128 -191 -877 -208 162 716 408 -14 -654 -217 216 -315 95 245 456
3056 456 868 158 211 455 548 -458 697 145 285 476 932 319 -506 643 -1317 1281 -242 196 746
3075 746 -399 -50 -287 767 -136 45 242 -16 10 199 -511 -1003 305 604 198 242 -231 237 -496 -309
3095 -309 -456 671 -585 -661 503 173 123 -570 338 -336 -43 -1235 35 882 -738 158 -282 379 279
3114 279 -993 -39 450 -499 -338 472 -865 101 -85 265 198 9 711 216 83 72 -126 578 225 438
3134 438 395 121 106 11 -327 625 184 553 -499 563 -367 658 710 -999 -191 -43 445 -108 15 663
3154F63k67M2o56r03R17N01o80L88k08K90j23n58P48J2K24n85O37o20j21L03N51
3175E55K19p82N12o54K28j33P7q34J717r70q35J995j658O45n2m32L67L98O79r14
3195A28L62p24M57o4j50j014O83k72J749j116k2K26m22m40R13q18L96k4M55L42
3215F45j733J485M2l24j1k82J61k97k08M06p74J203J236j838N11r12nJ027m57
3234a25K19Q34q48l61O37l3q31P78j50p79M84P34q22Q32k14n74J039j031P87j33
3254D43m41K01j318J626l91J69n79r1qM50J70j27o47K59K65n72N89k51K83k44
3274b14M83m45o51J593n79n80R89q3n93k93O36L64p14n96j6J334r75J141o11l48
3294a58N00J81r61j40P99r90J056K62q02K52n16L64R33j207K08K79K0J8j00k45
$$ plain form
3154 663 396 438 -218 -1121 -204 297 -383 5 -203 87 -36 -594 154 166 390 -195 442 -178 -299 4 555
3175 555 774 -8 504 -150 78 -55 22 -812 905 -65 -900 1095 -563 82 30 -402 -35 363 1042 128
3195 128 490 -234 223 159 9 -1005 -322 -594 1155 39 17 243 -179 -619 294 -524 -128 -152 303 645
3215 645 -1088 397 439 115 104 -178 -17 -314 -522 -116 -890 313 1549 -289 222 -690 -695 332 -125
3234 -125 94 928 80 -281 356 323 -508 270 120 -659 -175 559 -263 569 355 -219 820 -211 576 443
3254 443 2 203 -1115 511 120 289 -290 -381 -389 61 231 104 -543 -284 -19 -591 -2 -253 30 -214
3274 -214 269 -176 -827 766 187 -393 596 513 -80 -373 263 627 -87 -683 -699 635 -340 801 190 -158
3294 -158 342 523 -438 -578 221 -769 287 549 -253 -1 -517 -153 780 -427 -219 60 80 98 -2 -247
3314b47L59j86m9M33j005j38J506j229J254l32l58j60N49o72J08K2M36M50M7j297
3334e09p0M0J413l39q33L32o10P85M03n39L78l51K35qm54j66J57K78n41R82M7
3355F30j562M23P18J0O18n43n64N58j59L19j20q28m6J3R03j434J073n76O38k6
3375D5j81K51N52j273N84q8L63p8j75P96j385P96o47J78M93J094q92j145P24Q87
3395H99k92J62o19q03O89m58J141q49k73Q60n44n64Q85j89L68k7n26L55M41o57
3415ajq97J190k69n62Q78m27p17R36j61m90N84P20j49o04M65j236M88Q31j041
3435d63R4N35M48R07j223J20l31m26J18j90J5l42P65k39O39j42m85j3n49MM91
3456b67M19n76Q47Q1k81o07J96N22P6l53l61K60J76L51q43m42K230k206P7J068
$$ plain form
3314 -247 112 -74 -123 310 -695 -833 673 -556 698 366 8 -152 397 -275 -167 -145 291 741 788 -509
3334 -509 -579 -539 874 535 -298 34 -576 209 612 73 451 100 335 327 -127 -293 -136 142 -399 583 630
3355 630 -932 -509 209 219 837 294 -270 288 129 448 328 -500 -546 -533 370 -1064 9 -567 71 45
3375 45 -136 115 667 -606 -22 -110 253 175 0 796 -589 207 -440 -262 231 1325 433 -712 12 899
3395 899 607 769 150 -653 36 -422 719 -130 -403 457 -87 -651 234 45 413 386 -140 215 656 -1
3415 -1 -2 -899 291 22 -540 338 -89 -806 130 -31 -521 63 783 634 30 495 -741 -253 578 -463
3435 -463 -369 166 614 1521 298 418 87 -339 -221 -411 -396 -738 27 -212 427 285 -200 -213 -762 -758 -267
3456 -267 152 -424 423 504 223 -384 -188 334 410 57 -304 -44 132 483 -360 -802 1428 -778 -701 367
3476C67l74j11O12n09R19j101l3j91J48k9J017p82n55R48k96M43j58k55K14j098
3496h24J744n79l0l61l68L55N18j321K12R26k94L99m04O69r33K46L44M35l42j093
3516g01J325l34m66M95n81M84n07O75q83O66P16j019j35L41k0k27O33m49K61o58
3536c84P66j65j036P04R43j559R61j07p69J934l76k51j283L75N00M18k75p52l9
3555c95O80l18m00n77Q03M64jP06j145Q81p77J297m94p23M73l33p39J796j237
3574c9k81P1k36M73P2k19L78N5o38M68K01p04J021L08j051j74o1O94n58P25o74
3595a69k64J72K48O42p22N88k31o42l50Q46l42J293j76r67M95l65P02m90o88J034
3615F14k61m72m07K21L04o57J526l95j133M06K18J80N93p78P68R7l57r26P00L91
$$ plain form
3476 367 -7 -118 494 -15 904 -197 -230 -421 -273 -302 715 -67 -622 326 30 473 315 60 274 -824
3496 -824 920 341 311 -50 -418 -63 455 -866 -654 272 -22 377 -27 642 -291 -45 299 734 392 -701
3516 -701 624 290 -176 319 -262 222 -285 390 -493 173 889 -130 -265 76 56 -171 462 13 274 -384
3536 -384 382 217 -819 -115 828 -731 230 123 -646 1288 912 661 -622 -247 253 671 396 -356 -395
3555 -395 285 -33 -433 -1010 -207 257 256 962 -183 698 -79 1218 724 1 474 141 -598 1198 -39
3574 -39 -320 -249 -485 -12 60 -159 219 274 -364 104 305 -399 622 930 -121 -295 -356 338 -220 505 -169
3595 -169 -433 -261 -13 629 -93 495 264 -378 -728 118 -224 1069 893 -74 421 56 758 268 -420 614
3615 614 353 -119 -526 -305 -1 -658 868 473 -660 -254 -36 144 737 -41 727 824 467 -459 241 632
3635F32q42M29o52J376n47n73L32j09l60Q88n44M16q68M1Q05J24j272J238q47
3654c33K86P23J97k92n20l93m55N22l69j78P44R96r21p52O73L97j540P22Q14k42
3674G9j49L69o7q44O34j89l12M11n39O05L07j26O29j244k72J007j93R8J40J47
3694D91j22O71j090p90P99p10J279l86k40L53J29m08m99M85q04J224j80l75J739
3713A566j808k2N83R6j235Q71L9M34n51L56p01R31r47J00J059q12K80N3j031P02
3733c7L40m71k08Q05q67m09L31Q10jj263J358q24R1R32k118J785j99J315j487
3752a17q96J578k88L11j17K09j44j554J72Q07R4L06j205J6K179n52j113r76J412
3771A22K32n12k60R06j307J231K64q62j0J20L04k84j29M56P97j334Q55m06O03
$$ plain form
3635 632 -210 219 -433 943 396 -177 155 46 -314 574 30 446 -422 -381 424 548 -724 514 -333
3654 -333 -47 676 873 581 61 -332 -787 -265 -634 -812 -68 928 7 -745 -72 325 -1215 -493 321 79
3674 79 -70 299 232 -612 22 -167 -479 -68 -607 -2 305 179 808 -436 -708 299 106 204 344 491
3694 491 369 1040 -50 -840 -41 -751 528 142 -98 255 384 -24 -523 -38 -842 382 202 -173 1566
3713 1566 -242 -264 319 415 -820 51 90 524 -27 329 -372 559 -388 -288 771 -41 239 292 -739 -37
3733 -37 303 -168 -376 429 -438 -847 -516 294 293 -970 388 -436 -345 587 -1531 254 55 1370 -117
3752 -117 -1013 565 277 588 471 680 536 -1018 -846 -39 55 361 -844 -828 1351 799 -314 -1290 122
3771 122 354 -158 -418 488 -819 412 676 -186 -196 -76 228 -56 -185 271 1068 -266 589 183 786
3790G86m30k33j112O33O85m18j05K38o01J76j53J054m35N44n74M83q74j00N83
3809A47J49k98m6M28n15J61k33J00J90M01j034O41K54o03O56k99m19K66Q7k72
3829b39p28N17p5Q35R1j000J007j081N13M53O9n43O17p86L5O38p8M08l60P99q22
3850B70N3j200J689q74K47N95m08J10j95qr37N38n8n56J057J29o46P39o12P65
3870F98j692P40O07j99K72l79R34n63J12j24p3j120R10j223R96M1L65m24m96O91
3890G3j08J46k71M98j92j108J850q81M1R75j368O46L68j38j41P20p5j449N7K91
3910f6J232j597N95J2j505J299k32M12J14p37M53k93m80J088j582J208P43M89
3928A153n26o11n06j1P79j6n99L34J122j515J72K45n09k66P34R28l66j66j050
$$ plain form
3790 786 356 123 -989 -356 329 -89 -194 44 -557 -381 -534 520 85 629 55 538 -336 -436 147
3809 147 296 -2 -48 380 -135 26 -207 -107 83 484 -550 91 345 -258 398 99 -320 -54 33 -239
3829 -239 -967 -450 -525 310 401 -599 408 -673 -160 293 362 -181 436 -350 -315 323 245 653 293 1092 270
3850 270 323 -877 812 -62 185 780 372 482 287 279 -658 -120 -178 -734 323 452 -194 545 -67 698
3870 698 -994 -254 353 154 426 47 981 418 530 406 333 -787 123 -1100 -104 -63 302 -122 -618 73
3890 73 -35 111 -160 338 146 -962 888 7 48 1023 -345 301 669 531 390 1110 1035 -414 -357 -66
3910 -66 1166 -431 164 176 -1329 -30 -262 150 264 -473 -20 -313 -793 295 -1287 -79 664 1153
3928 1153 627 16 -490 -501 278 262 -337 -3 1119 -396 -224 21 -488 -754 -20 908 542 376 -674
3947f74K24L93n02P52j353J146j84K5j081N31J041k07K85n15L39k21No69O41O58
3967F34j49j226J30J785j505k29N59n3n82L87J077k86j257J453r86J14k84l11
3985g29J245o69j37n2M25r3M05q52N68p60M08K72m03P80n93O77K97j5j058n9J31
4006b12L27K01N29j124O02k05l08P32j196L67M89k66j83J307q63N60j353K63J513
4025A180r64o25J050j226J110j474J62J050oM93p29K1m62k29K90N9J228l90n23
4044A5m77R94n79n79J112j140N59N76O36j57l71j607L26J490j360Q70J74p40J43
4063a15P81q40l40O79m37q1R24r71p35J615J9j155O36P64r32J22l93j217J635
4082d1K61k98L02m94J85M63Q1r57J344R7j247l12N16j5R44j480R16j05O42j109
$$ plain form
3947 -674 -450 -57 -559 193 -1160 -14 -198 -173 -1254 -723 318 111 396 -119 220 -1 4 -665 -24 634
3967 634 485 -741 -611 1174 -331 -560 -1 -54 -636 -249 828 542 -715 738 -248 -134 -418 -729
3985 -729 516 -153 -290 -342 83 -10 395 -457 111 -649 -241 31 -372 408 -185 492 789 774 -284 -343 -212
4006 -212 115 316 845 -279 323 118 -190 542 -654 -287 202 -64 -247 1060 197 757 -596 -333 1180
4025 1180 216 -409 641 -585 525 -949 -787 263 257 750 21 42 -420 -649 -359 -300 928 538 15
4044 15 -462 532 -47 -626 486 -654 -95 481 1117 960 589 -1018 -692 798 -562 308 482 -258 -115
4063 -115 666 -174 -514 165 -272 -353 571 -400 -1135 480 499 -656 -20 744 -188 -66 -459 -1676 -41
4082 -41 220 -78 224 -270 -85 378 459 -498 846 943 -304 -616 -100 -115 829 -651 265 160 802 -307
4102c07O72q20J299J49o82k23k01K99Q51j111K9o04J72Q4m37R44p13Q14q18P63
4122A60m37L37l05j85K50k64K42R02j42k89N98r81P69r64J75K02pk01M53o21R08
4143F00k38L1r1j7l87j90N75r36J977j157k18Q02p70K86O04r76l90P92q30R05
4163C72P2n73k42Q26j030J120m58J94p5M87n23l25L79J32j346J034j93J638j665
4182a76K51o02J139m72J283j637O30m52k82P6L89k54o22R36m23L82K49m06p20
4201g11J211l15j98l0L13m62j23J27l87M60N1J17k10J032o06k91k86Q0M33q87
4221f82M70Q1m36k19P09J46m05P68p82j37N55P27j112O52j530R01M83q11K85K64
4241g3q50J155R35j737J35J078q86j71m2J207q46k24k65J485j291k44J148p79
$$ plain form
4102 -307 365 -455 844 993 311 88 -113 186 1037 -74 -45 -649 -477 -393 -830 114 -599 215 -603 160
4122 160 -277 60 -245 -430 -180 -444 -202 700 558 269 867 -114 655 -309 -134 68 61 -140 313 -308 600
4143 600 362 393 302 285 -102 -292 283 -653 1324 167 -51 751 -19 267 871 -105 -495 297 -533 372
4163 372 444 -129 -371 455 -575 545 87 281 206 693 170 -155 224 356 -990 44 -149 1489 -176
4182 -176 75 -527 612 140 1423 -214 416 -36 -318 -242 147 -107 -729 207 -216 166 415 9 -711
4201 -711 500 185 -13 -43 270 -192 -315 -188 -575 -115 -64 53 -157 875 269 -22 -308 -228 205 -682
4221 -682 -212 -131 -567 -786 -77 69 -336 432 -350 -487 68 795 -317 335 -1195 -294 189 -622 -337 -73
4241 -73 -923 232 1167 -570 -435 643 -243 -414 -456 751 -95 -319 -584 901 -390 -634 514 -265
4259b65J123q13K6l60k36J045n99K2K30n99J509q73O34l61n56P7K37l13n50J890
4279A268l63p75R02q98p30K00j093J863O41r67l53J31N46j376J175q46J061j30
4297B56n0l11Q56o92l74N45p40J346j587P38N35j111m11J539l90J46j73Q32j572
4316f18M32L41k60L35k71N44j031L76K87l68P89q16O06j71p00O43J31m84j1L19
4336G3l39M46l66o11O38j2l90rL23L9j142Q06J451J36r96r05R93k43l94j60R67
4357C05K87p17K68R24p15m6m97K91l9n17O57K55j152J311o22m46R84q31J07rL55
4378A53J4L8Kj98m70K60K09K38m33J011j237j45P89q40Q15m47L63n78K77M81k35
4399F7q21K78O0J12l6J34N74K88j048M42j63l87K30P50M03j376J02M16L6k01k24
$$ plain form
4259 -265 858 45 71 -289 -525 520 -79 -57 173 -426 1083 210 844 483 -73 4 241 -72 -622 1268
4279 1268 905 130 1032 134 -596 -396 -1489 374 1015 48 -305 -174 372 -1004 171 -675 386 256
4297 256 206 -105 751 59 -315 230 -510 836 -751 -13 522 -589 -1000 539 149 295 122 954 -618
4316 -618 -186 155 -105 230 -41 503 -528 -152 135 -233 556 -260 346 175 -525 118 249 -235 -246 73
4336 73 -266 180 -186 -797 -159 -171 -561 -570 -247 -208 -1350 -544 907 1043 47 -858 135 -108 -502 -662 305
4357 305 592 -125 143 1067 352 306 -191 100 61 -456 201 456 -696 615 -7 -453 531 -300 -193 -202 153
4378 153 167 205 207 9 -461 -201 8 246 -187 824 -413 -558 231 -609 206 -241 122 -456 -179 302 67
4399 67 -754 -476 -416 -304 -340 -206 368 656 -392 50 -113 -500 -270 480 883 -493 -391 25 61 -140 -364
4420c64J014n87r24N96P94p66L21J3p80L38N10L6l40l45N07q6M74r61J88Q75m18
4441I5m8p25J117l9n10M18N8j34J3m0q84P31k77M08L58q85J016p35k62M93k36
4462f8J60m79J025p22L21j73m86L77R8M09j002j06J139j160M82R6M20N9q83M38
4482e5J20k49M86q88l14J833j581N58l23m48L81M12M5jk15j77J0M25J243j496
4502b34J64J57J38k35%l29J366p91J57l87J092j031l28N76K29m77l30R23j65k77
4522B18k94M63L02k16n34j36J056l01k13j151J013k91l69O93n44O80r74J513j279
4541c64P4M4J153q70l35Q36j123N79n94j4M94K90j416J115j78L93J72k26M09L28
4561G67l28k03j57N91r99l30O15L48N80m65q18O50jK37j51q81J275j009M97r1
$$ plain form
4420 -364 650 63 -861 -265 529 -237 84 97 -683 -345 165 201 -139 -484 23 -63 411 -550 -362 513 95
4441 95 47 -678 439 400 -110 308 366 232 245 205 -679 52 -225 183 541 -344 672 -63 -325 168 -68
4462 -68 92 -387 638 -84 237 64 -422 -45 53 462 -540 -646 493 -667 -185 -89 331 390 -493 -55
4482 -55 65 -184 302 -586 -900 933 -648 -90 -413 -861 -480 -68 -23 -24 -239 -416 -406 19 1262 -234
4502 -234 -70 87 225 -10 -10 -339 1027 236 393 6 1098 67 -261 315 544 67 -263 660 495 218
4522 218 -76 387 689 473 -61 -197 859 558 345 -806 207 -84 -453 240 -304 376 -598 915 -364
4541 -364 -290 -246 907 37 -298 538 -585 -6 -600 -614 -120 170 -1246 -131 -309 84 256 30 439 767
4561 767 439 236 79 670 -329 -659 -44 304 884 419 -399 251 250 487 336 -545 730 -279 218 127
4581A27m62Q38K58p61k31N93O36j590J085j475Q11N8N18m57J13r08l90J151o3
4600a49m72K27P5M14J61k73mL22l22J76N11j607R35L08J67K91n02j99l2K46n9
4621B14o93k01M00J54o27J63m53P26R31j299J83L67m15J95Q09k59j55L57q32N62
4641A27J57K63j68m26L50l58N13k82k86J0K80j463J604p48J114m23j85m69m58
4660h48M64R33r28K20m72K90K82j215N50O80K36l49N09k86Q54j278n03J158K67
4679E64q85P24k91k82o0q3J224o64n34J028L48j202q3N16K33j432J160N45r76
4698a50Q45m18j98l0p86J567p53n6N78n29P39r20q4k16P60m9P92o44n49l4m15
4719e50Q10p81M39M38j252J021o10k15Q37O4p57R27l65N58j34L5r58L87K28k28
$$ plain form
4581 127 -335 503 761 0 -231 362 998 -592 493 -982 -171 -113 405 -52 61 -847 -1237 -86 -149
4600 -149 -621 -394 -319 95 256 -17 -21 301 -21 155 666 -941 -6 302 469 760 258 59 27 273 214
4621 214 -479 -680 -280 -126 -753 -590 -1043 -317 614 -685 -502 -135 -550 -355 454 195 40 397 -435 127
4641 127 284 547 379 -47 303 -55 458 176 -110 -100 180 -1283 321 -427 687 264 79 -390 -848
4660 -848 -384 549 -379 -159 -631 -341 -59 -1274 -724 -44 192 -157 352 66 920 -358 -861 297 564
4679 564 -321 403 112 -170 -230 -313 911 247 -287 741 1089 -113 -196 320 553 -879 281 826 -150
4698 -150 695 277 79 49 -737 830 77 21 599 70 809 -111 -195 -411 349 300 1092 448 -101 -135 -550
4719 -550 260 -521 -82 356 -896 125 -485 -700 137 201 -556 371 6 564 430 465 -493 -106 122 -106
4739a06l21K68j279J631M3k92j99k16N34j84M01j92q58J87J252p72j98j34n7J126
4759F34K9n1j180O76N38k59p10L13q39J077L9j43p33k56j65O84m72P49M73l80
4779B4j93M64j32K16l9p69K43L65k2n87N61j6j102J133N43j196L83L20j81N07
4799E22o82N07j207J064q17P33n62p24K225j311J45o40L62M68M43N65j425j60
4817d94o48J178l4r89J368q88N1J576j263M87r16L46K2J321j886J206j019O26
4835D4m65J94J15n30m43J518o87K61k14Q27o89m00M28k84J098j559Q46j430J506
4854A36l42J42P99j08j379J454n75l67O92l53m64K25K99J59o27K2M07k69J26J89
4874A66p01J033l46n09N57J64j54j029N25L25o24J95j34M07N61J5J32l34p81L87
$$ plain form
4739 -106 -427 -159 -1438 193 236 -56 -255 -471 63 -121 280 88 -770 -583 669 -103 -301 -435 -492 634
4759 634 663 612 -568 108 646 387 -323 -10 -849 228 267 124 -609 -865 -1030 -346 -818 -69 404 24
4779 24 -169 295 163 379 340 -429 -186 179 157 -430 131 115 -987 146 689 -507 -124 196 15 522
4799 522 -160 347 -860 204 -613 120 -442 -1166 1059 -252 -107 -747 -385 83 526 1091 -334 -494
4817 -494 -1142 36 2 -987 381 -507 -456 1120 -143 344 -572 -226 -204 1117 -769 437 -582 44
4835 44 -421 -227 -112 -642 -1085 433 -254 7 -207 620 -69 -469 -41 -325 773 -786 60 -1370 136
4854 136 -206 -64 735 627 -752 702 127 -240 452 99 -365 -140 159 318 -309 -287 120 -149 -23 166
4874 166 -535 498 152 -357 200 364 210 -819 -294 31 -593 -398 -532 -125 436 451 583 249 -532 -145
4894a45k72N36P67p34r06O0J172l65K80M72o02l93M50n6o50r55O93P20oM17q31
4915c48m14O32k60O70n24R19q51n4J48L35J59j78M78o44p94R57j28k45l73M4N75
4936A04o8l26M46J49L00j596K63K7l18J068K92m16n34M58k74K48m78O46p6J26
4956D1l78P07J03q06J00J66j21N62o7n05k70P70o61q78J419N92j311P23m03O01
4976C84O52j710K55P86o52N72p10R4L03r5k19N06K38P97o41q77N84l06r7N34o51
4997b53O54j64n06K01l47K30K55R6L80p48K80P07j105J77K2j42p82r8Q74M20k48
5018i7l97M25P24j22j61n68O03l21n54K61j52K33O84r52J532j096L38l38l30K03
5038h5J93m3r91N66Q91j492L23J751j538P97N75j417N83n3Q11j129M88j178J004
$$ plain form
4894 -145 -417 119 886 152 -754 -694 478 113 393 865 263 -130 320 264 -386 -1341 -648 72 66 483 -348
4915 -348 -762 -130 -390 280 -244 675 -176 -230 -82 253 412 234 712 68 -726 231 103 -142 -515 -471 104
4936 104 36 -290 156 305 605 -991 -728 -701 -1019 49 341 -75 -609 -151 -425 -177 -655 -9 -85 41
4956 41 -337 370 473 -333 -233 -67 -188 374 307 -198 -468 302 -359 -1237 182 774 -537 186 -217 384
4976 384 1036 -674 -419 367 -285 287 -423 -329 -26 -121 -340 166 404 1201 560 -317 267 -39 -136 398 -253
4997 -253 401 237 -269 -68 -415 -185 70 166 546 -202 78 785 -320 -143 -121 -263 -1045 -1143 -269 151 -97
5018 -97 -494 -69 655 533 372 -196 407 86 -468 -207 -359 -126 558 -394 1138 42 380 42 -288 -85
5038 -85 108 65 -926 -360 531 -961 -638 1113 -425 372 947 -470 113 60 871 -258 230 -948 56
5057E6j18Q2P9K60o10K29N98o39p12J563r95q9k05k56l12J557k99j21L25j036
5077f43J57K90k65L51k76j2PQ6J103k06j212J312o81J04j99K79M76j14j9p99Q56
5098E95k94j79OQj70N74l12l10r9k25l2j63J294j194Q14n70N80j034l45J130N29
5119F03l43m08m76L84K08J08p66R79j117K44Q53j233J603r09J029j209P56M13
5137G19l90l98J5J59Q64r00J92k96l39k04O41M48n75N15q98M80j58L59K47r93
5157e12J478m21k59m07J098n18q68J56r45R50m72J917j764o4L05J308l78q96M31
5176A39k55l5N29r37J325j026j69J285j068J29p04J55O21J56mj0k77O19j260P14
5196g3M35m59M22M82j053j26M96l47J536j152j68p1M3m09K81N49r18K05O06j113
$$ plain form
5057 56 -62 20 99 359 -251 -22 576 -63 -775 788 -207 -296 -501 -757 -1069 488 189 68 393 -643
5077 -643 -486 -196 -461 -110 -386 -398 -391 -305 798 592 -620 692 11 115 -84 195 671 557 538 -261 595
5098 595 301 122 128 136 -34 540 228 -82 -181 -406 -438 -601 693 -501 313 -257 323 -711 -1056 74 603
5119 603 260 -148 -624 -240 -32 76 -690 289 -828 -584 269 -964 639 -270 759 -450 306 719
5137 719 329 -69 -54 105 969 69 261 -35 -374 -578 63 511 -64 451 -447 33 -125 234 481 -512
5157 -512 966 545 286 -121 977 459 -409 -253 -1198 -248 -720 1197 -567 -631 -326 982 604 -292 139
5176 139 -116 -151 378 -559 766 -260 -429 856 -212 -83 -787 -632 -11 145 141 131 -146 473 -787 -73
5196 -73 362 -97 325 807 -246 -372 124 -223 1313 161 -7 -78 -35 -444 -163 386 -532 -327 279 -834
5216h34J856k71j469O65m57J223j367J571j263N81n77J52R04o18q80M11n02J050
5234A75m01m68J151q05l88L13L04L54jr79N41L57q38N65P97p52J105r72j002R26
5254a8M77q03j01N76k27M2K44O71p70n87O96j24r7r54M58Q09n63l56L40o58N38
5275d07k47Q72N83j526L63j0k02J222l16p21L15J19L5o52J154m31o48O60r42Q55
5295G6M04k49o06r43J302M54o02m16J55N21n51N13J12k50l34R32q6j229O06J91
5315@J449k042M68m36P49k83M09J67pM20p28K5J5j90j3J30M06q77L62O14j017
5336c79J571j192k1R6r07P31O2k47M19m44l53J31Q10N15N3j419N13O6k24J41p56
5357h34L45K2k98L21J285l19n80O49j098L03O41j365J838j364k23Q70k22k69K8
$$ plain form
5216 -834 1022 751 -718 -53 -510 713 -654 917 -346 235 -342 -190 714 96 -784 -373 -875 175
5234 175 -226 -694 457 -348 -736 -423 -119 235 234 -745 -204 153 -685 -120 677 -75 1030 58 -944 -18
5254 -18 459 -344 -445 131 -96 -54 190 861 91 -496 200 76 -21 -975 -517 292 -271 -627 -287 -945 -407
5275 -407 -654 218 801 -725 -362 -372 -574 648 332 -389 -74 45 80 -572 582 151 -497 163 -779 76
5295 76 480 231 -375 -1318 -16 438 -164 -580 -425 96 -455 58 170 -80 -414 518 432 -797 -191 0
5315 0 1449 -593 -125 -561 188 -95 314 481 474 894 166 191 206 16 3 133 539 -338 24 638 -379
5336 -379 1192 0 -21 75 -832 -101 -39 -286 133 -311 -664 -533 277 792 845 -574 -61 5 -219 -78 -834
5357 -834 -489 -467 -765 -444 841 522 -58 591 -507 -204 437 -928 910 -454 -677 193 -29 -298 -270
5376b70M21l02J60j58q72J053O43j029P16N7k06L91j213M09p58O87O55k94m60
5395c70J289j045l26o45J049K91l45J165m01r46m08P66r30J331j172Q81j94K18
5413B08K92J54r18N20J48j082R67k53M8k85k0Q46l55l97p90J039o20P73m17j54
5433b96l41K27Q73l42K1k97J67J33j27K10J103j259J154j351J285q60j481J610
5451D29r9k18l85N91O06k63r36j76K16M76k84N40q96J298j734Q97K0k1J53l19
5471a05N18N33q58n86Q42j60M06j101M2L42Q18n70l70N44K54k41K59o24l46O21
5491B18O3m93Q29o07l79k90J009m0j587J065R57p96L83r87P67l21J55J41M2O07
5511G36r26l0k0M69N92j498P50l29J327j306n05L66L89P46q59l51k14R2O76PJ73
$$ plain form
5376 -270 151 -151 9 -149 -1021 32 675 -354 362 419 213 604 -609 -200 -958 -271 384 90 -370
5395 -370 919 -126 -452 -1097 -48 243 -102 1063 662 -284 -692 74 -856 475 -697 184 -10 208
5413 208 500 654 -264 256 404 -678 289 36 84 -201 -221 625 270 -127 -917 122 -498 275 -142 -296
5433 -296 -637 -410 463 121 142 -155 12 145 18 228 1331 72 1226 -125 1160 300 -1181 429
5451 429 330 112 -273 318 924 661 -275 -451 -235 241 -43 497 -399 899 -835 62 82 61 214 -105
5471 -105 413 946 88 -498 344 184 590 -511 -469 -127 691 121 -249 295 549 308 567 -57 -403 218
5491 218 281 -212 617 10 -369 -659 350 310 -1277 -212 745 -51 332 -655 112 -209 -54 87 129 736
5511 736 -190 -220 -240 229 821 -677 73 -256 1071 -235 -740 -374 15 761 -98 -449 -663 -571 105 112 285
5532B85K25p71N83L01j11j175J141n00K51P47j320P61j08m76N1Q87r94J03M72
5551C52r87K79N19K07O31j205j191J087J119r1j042J088j574J458j038N67L43
5568E22k74j144J107l9q94J277l20n58m9K64N83q75M1R08o37J23j59M47n11Q31
5588F43n37J31j279O35J132k98o90M45K72j157N3L80L30K48l24P46m11o75Q14
5607D58L20l09j99N09p77m9j14l15L76p12N46m46J010m92J63m8N2q77P18Q56n90
5628H0r64Q54j78o61J120O6q20O29K09J81l49o11P66l76J64j42n7J96l25k9P71
5649E24n74j35Q05n06o57J116j54o79J156p20j336J955o07O61r31n98P65K08q03
5668e10J202j841O6J638m69m2n64J356L76r52m77p15R74P7q59P65q4l78P81n08
$$ plain form
5532 285 510 -261 322 623 512 -663 478 -22 229 976 -344 417 309 -167 -116 771 -223 -120 352
5551 352 -635 -356 163 370 1001 -204 -1395 -308 811 720 -322 766 -808 650 -388 179 522
5568 522 248 -896 211 172 -722 555 235 -323 -372 -108 475 -400 -359 549 -88 35 -124 323 -188 643
5588 643 106 237 -1042 -407 725 427 -263 182 454 -703 -650 -270 60 308 -16 730 319 -356 458
5607 458 778 469 270 779 2 -47 -161 -476 -100 -812 -266 -712 298 -194 -31 -79 -27 -904 -186 670 80
5628 80 -884 -30 -208 -869 251 317 -503 126 335 516 167 -444 322 -54 110 -32 -89 107 -218 -247 524
5649 524 -50 -185 620 114 -543 573 419 -260 896 176 -1160 795 188 849 -82 -680 85 293 -510
5668 -510 692 -1149 -1083 555 86 44 -520 836 1212 260 -217 -932 42 119 -740 25 -59 -437 344 -164
5688a64k73L96l5Q33p24J26O97L2j192M97J203j429k84l73N98P87o89M40l29n03
5708c86J56q4L39j00K87r17O86j9R49k37j060P10J35J71L0j631J326O60n76P66
5728A205j725J277m97j08L71m00J041p83M20m81L74k043J172J022j231K89J5J46
5746F4L39P6n01k59K95L70o20J37N72J52o83J118n11j026N16k65j115J223J379
5765A261j254o6k38M67N77p47k40l95O97M95j172N94p26M62J14J65l06M01m36
5784c47J275p08M08r11j24J08m09j10L22R84r59J60N71N6n43O58q26N93KJ156
5804A356j771N24j89N72m7j532J372l08L15r96Q71R1j83n94O43o71Q06L47r51
5823c45R9L23N70o9n82P47k55k55j005J645r15n60L38Q03n91j15Qn41P89l73N52
$$ plain form
5688 -164 -437 -41 -76 757 33 159 856 888 -304 193 1396 -33 -317 -690 -92 695 6 446 117 -386
5708 -386 -230 -314 25 -75 212 -705 -19 -38 911 674 -386 324 459 630 660 -971 355 1015 439 1205
5728 1205 -520 757 260 152 523 123 1164 381 801 320 694 -1349 -177 845 -386 -97 -82 64
5746 64 403 479 -22 -281 14 384 -236 -99 473 625 -58 1060 549 -477 39 -226 -1341 -118 1261
5765 1261 7 -59 -297 170 747 0 -240 -635 62 557 -615 -21 -747 -285 -171 -6 -312 89 -347
5784 -347 928 220 628 -283 -407 -299 -708 -818 -496 488 -471 -311 260 316 -227 431 -395 198 200 1356
5804 1356 -415 109 -80 492 445 -1087 285 -23 292 -704 167 258 75 -519 124 -547 259 606 -345
5823 -345 -246 77 647 578 -4 743 488 233 -772 873 -42 -602 -264 539 -52 -167 -159 -700 89 -284 268
5844B68j95J79m08J50J4j26L10n23M85N98r16L20o03M40m25P13Q6l79p98J037
5864B27k43o83R77j96k28J74P76N28n60j636K002j499J29R9o20J056l46R16o75
5883A98j34K54j32l37J4N5L13L22l20k60j4O71o41j30m65J631j095L95p92j36
5903f03K12J012j38m58j40K19M45L07j187J88K43p31l31J650o16j10p30J13L74
5922b81R01p51m76K47j18J08J13N33j341M98N79l42L89N57l92K53j31k3j928J328
5942b77m63P48m2m53P54r03o1J069o44p05J728l55o72Q77r25K4l40Q27Q09j403
5962d07J470p22k52M3R07j852L66O91J033j522J148o59j966J417L45m99P91M41
5980G73q09P3M21r0l7l3l17J17M48k02l34o41L88K81o2P56m56L01j588N34P32
$$ plain form
5844 268 73 252 -156 -6 8 -118 192 -331 154 752 -164 156 -447 -7 -432 281 367 -12 -810 227
5864 227 -16 -699 278 82 -146 28 804 1332 772 -864 1138 -361 -232 -133 -753 303 -43 873 198
5883 198 64 318 186 -151 -137 -82 231 553 233 -27 -41 630 -11 -141 -606 1025 -70 325 -467 -603
5903 -603 -391 621 483 25 -115 104 549 856 -331 -143 100 -631 -962 688 72 -38 -768 -655 -281
5922 -281 620 -131 -607 -360 -478 -370 -257 276 -1065 -567 12 -330 59 616 224 477 346 323 -1605 -277
5942 -277 -740 8 -34 -487 267 -636 -697 372 -272 -977 751 396 -276 601 -324 -300 -640 187 996 -407
5962 -407 1063 341 89 132 1039 -813 -447 244 1277 -245 903 244 -1722 -305 40 -459 332 773
5980 773 -36 37 458 368 331 298 -19 98 546 344 10 -631 -243 38 -24 732 276 577 -1011 -477 255
6001B55k34o99M70K74O33j422L36J273j549J522j813J177mj47j167O43K31q08
6019a029J579J73o62L37L6j230P15L57l95o02J066n32K31l25O08o07M47L50l01
6038B16m29P7K65K4J7M82M5P39j277p18l06P48J48N07o52m78L75Q34k20k68J09
6059B38q08J021j420R44N91q45p5l20J144n11J217j215K39r0o78O45O98p77M45
6078D43n57J52n60R46p05J80l14q5J74M91P2O54r49k66L74j24J367j287M84K43
6098G33p76l00M58p92M98J9Q02N97j106J131k088j11J170o33P34o33N42q3r19
6117g57J260j65k40p16N07K40r7m06o5M06o19O23m54L52m6N13m10r5k9M36K37
6138D75k36J54k73L88j079L38k26L33O23j209J38n9Q97j697M46J663L7l78j57
$$ plain form
6001 255 21 -678 -208 66 699 -723 -387 886 -663 859 -954 223 219 72 -1095 -452 -221 -1029
6019 -1029 550 723 61 398 434 -796 -81 276 -119 -721 345 -187 44 -281 327 -280 167 517 216
6038 216 -213 -136 129 153 170 652 697 1436 159 -559 -865 -117 31 538 -114 -592 -217 617 397 129 238
6059 238 -570 451 -969 -25 566 -279 -354 -674 470 -41 1176 -39 200 110 -568 77 775 -2 443
6078 443 -114 38 -522 424 -281 -101 -415 -500 -326 165 237 891 -58 -324 50 -74 1293 6 490 733
6098 733 -43 -343 115 -677 -179 -160 642 1239 133 1264 -824 -935 235 -398 336 -297 245 162 -757
6117 -757 503 338 98 -618 -111 129 32 -374 -439 -33 -652 -29 -483 -131 -177 336 -74 -169 -198 238 475
6138 475 239 393 120 508 -571 -233 -459 -126 497 -712 -574 -633 264 -1433 -987 676 713 335 178
6157A78J09L01J76q88R05o62M94m3J21m37M0q3m7n62K18J402j269J115j113j38
6177a83K16p19J197m93J38k37J22Q0q57M41J069j445J050m65o41J592j463M80
6195a18l38N36k53L63j83m79m97L43N01n44N48l19P33M44J62j111N57k84q51J087
6215B97J0o4l71M60j122K29K07M23j255J759m29k18p93O57K46o06M74j71K24m8
6235i1m56J428k98l44K50N20o06n18j033J278j01L98P93m84n71q85K82J062m29
6254A95P43k28n18l85R7K83j23P32j868P29J193j386n94J094q9O00l13l09M95
6273C48l07L66r76P39o52K75K93O92q36L82q9K08o48R63q58M60j611J029j54J75
6293b01j59M45j30j38n89M33J20J046k05o67k77M5k8J160r94M07O51o25k81j58
$$ plain form
6157 178 287 588 764 -124 781 119 613 570 691 254 294 211 164 -398 -180 1222 -47 1068 -45 -183
6177 -183 33 -686 511 18 156 -81 41 121 -736 -295 774 -671 379 -86 -727 865 -598 -118
6195 -118 -456 80 -173 190 7 -472 -969 -626 -125 -669 -121 -440 293 737 899 -212 345 61 -790 297
6215 297 307 243 -128 332 -790 -561 -354 69 -1186 573 144 -74 -867 -210 36 -570 -96 -267 -43 -91
6235 -91 -547 881 583 239 489 1009 403 -115 -1148 130 29 427 1220 736 165 -720 -438 624 195
6254 195 938 710 192 -193 -96 187 64 796 -1072 -343 850 -536 -1130 -36 -125 475 162 -147 348
6273 348 41 407 -569 170 -482 -207 86 778 -58 324 235 443 -205 758 -100 360 -1251 -222 -376 -201
6293 -201 -360 85 -45 -183 -772 -339 -219 827 622 -45 -322 -277 -305 855 -139 268 919 294 13 -145
6313a45J7m52K53n16R87P1m85n21M89O39j29K13K21j190J270l82m0K28m21m51
6333c44J357p58L79l65l65M17n19k71R09p40m80Q13L0N19m60J12m20p01R5J524
6353G32r76J131r80l15M26l2O1J15l84O05k82M18K74K20j474M71k19J28P06n57
6373F8Q1l39M48K72j655Q34L59k76K70n37o7O50o77O49l1n41L29K57J57o21L68
6394bP9N4p2J7p7n90J82K58N74m55n05J08J42P98o27n04Q18o75L72j5p44J070
6416B06q21N47k21M04p79J26J283J86j705J43J047L19j69j329N19K83r2K30O58
6435H35r34L28P00m12k33j06p09P81o09J042m34k27P6K98k13Rl16P93PM08q89
6456A95n08N53n1j55m99N98n6M57o65M26p39N88o31K92N80q17L98o01L95q7n66
$$ plain form
6313 -145 -128 -580 -327 -843 144 215 -270 -791 -302 337 208 421 642 -548 722 340 300 528 107 -344
6333 -344 1013 255 634 269 -96 321 -198 -469 440 -300 -780 33 63 582 122 234 -186 -887 -792 732
6353 732 -244 887 -93 -408 18 -14 47 162 -222 383 101 519 793 1013 -461 10 -209 -81 625 68
6373 68 149 -190 258 530 -1125 -291 68 -208 62 -475 -542 108 -569 80 49 -492 -163 94 251 -370 -2
6394 -2 77 131 59 76 -1 -591 -409 -151 423 -32 -537 -429 -287 511 -116 -620 198 -477 -105 -120 -864 206
6416 206 -615 -68 -289 115 -664 -538 745 931 -774 -631 416 735 566 -763 -244 39 -53 177 835
6435 835 -99 229 929 517 284 178 -531 250 -359 683 249 22 98 396 183 192 -124 669 676 1084 195
6456 195 -313 240 189 34 -465 133 77 534 -131 295 -444 144 -487 -195 385 -432 -34 -635 -240 -327 -893
6477h93J036L36R3m08J15J06J69o72K90l88M83j64n0L25q2j019M50O84o18Q39
6497F32k74k30L74k66o90N25R1j91M59n77k51N60j031J007N66p95K45j74Q67j007
6517a60m09O66J27o29L89k67K71l04N29K85j162Q78r22J78N39n99P14k05K94P8
6537B91p5o46J083P1j172R14P5j431M25Q83q85M25n23J56P76o41O0k36L69K52
6557A71N75j107K45M00p59o50J020L15K98M37l85K48p14J42K5p63Q55m49M37k50
6577I1N4m23J291r81q47K57J169J97q99R27o78K83j038K13k18Q10R4m88N46J0
6597C70j09N97j335N96L73%J8J144j352R06q64j187J247j312N43p0J224k51j030
6616d92P86L13o34Q93r23L6J3j28L77k53K57q5m18k1J26j06o1P45o30k11K42q15
$$ plain form
6477 -893 143 479 572 164 279 385 554 -118 172 -216 267 103 53 378 296 -723 -273 411 -207 632
6497 632 358 128 502 236 -454 71 162 -29 430 -147 -398 162 -869 138 704 -91 154 -20 847 -160
6517 -160 -569 97 224 -405 -16 -283 -12 -316 213 498 -664 214 -708 -530 9 -590 124 -81 213 291
6537 291 216 -430 653 724 -448 466 541 -890 -465 418 -467 -42 -565 -409 367 -274 -214 -450 -81 171
6557 171 746 -361 -116 284 -475 -1125 -105 210 508 945 560 808 94 236 261 -502 353 -96 341 91
6577 91 145 -278 1013 32 -815 -558 611 808 -91 836 158 441 -597 -384 -602 208 302 -186 360 370
6597 370 261 858 -477 119 492 492 510 1654 302 1208 344 -843 404 -908 -365 -435 789 538 -492
6616 -492 294 607 -27 866 -57 -21 -8 -136 241 -12 245 160 -258 -279 -153 -259 -320 425 -205 -416 -174 -989
6638i89Q29L2q51P14R23n74l96k12p11L83K69L07q15Q68j17J07n11Q97l14m6m5
6659b52o22R83J97r46P05q7J333j325o1R47O97k280K49N58j74l79N97j70J25k76
6679a81o51P60LO12K61n88Q38j244K34Q6J090j383M14n08M60L19J325k204K59
6698i8P06k27k31k42n42R77m01l78M39l55r34J494K94M02q58L52n52o76K78J221
6718F69l56l22K27l6M45j892J057m1R18p55m04J497n72q70R35j036P77k09p59
6737g27J145l82m76J147n35k73n81J327p90M06p39Q78m32K22K70l6j159J204n28
6756e9j066J919j506R56m9n43O54o77Q97m05l57K59m35R24L42j218r1j68o83Q22
6776d84J731l41p77p66J303p86K28J99k4j02K13m90L62j40mK06n99l70K404k432
$$ plain form
6638 -989 -160 -128 -979 -265 658 84 -312 -524 -1235 -852 -583 -276 -1091 -223 -340 -233 -744 153 -161 -207 -252
6659 -252 -874 109 306 -640 65 -22 1311 -14 -75 872 1569 -711 -462 96 -78 -457 140 -30 95 -181
6679 -181 -832 -72 -69 543 804 216 1054 -190 44 130 1220 -163 251 -257 203 522 1847 -357 -98
6698 -98 608 381 150 -92 -634 343 -58 -436 3 -352 -1286 208 502 904 46 398 -154 -830 -552 669
6718 669 313 -9 218 182 627 -1265 -208 -249 669 -86 -490 1007 435 -435 500 -536 241 32 -727
6737 -727 418 36 -440 707 172 -101 -682 645 -145 261 -478 400 -32 190 460 424 -735 469 -59
6756 -59 -1125 794 -712 244 195 -348 306 -371 526 121 -236 23 -412 512 854 -364 -455 -623 -1306 -484
6776 -484 1247 906 129 -637 666 -120 108 307 283 181 394 -96 266 126 122 328 -271 -641 1763 -669
6796f69K7L34J93N17j78m88P93k29m22l79M86R9o36N42K53P57n79m05l85Q06l8
6817C99n58K52k55k30M63M97p33j70O40j62J46O7l17P14j809K319q58q97Q47q8
6837B67n96l16J576j392M38k43K91m90O76o0j42J67o3m68K70J10n86M84M23j419
6857a073J589n16m36m6O40k30K7Oj5M60j92r34J287j24l95L21Qk27M51j221K9
6878e91M83j36k49L76o26R77P69j245Q31J10N9r25M16k49L36j23n70k40Q67J0
6898B80n84n15J264l91k66P65n94P38q23N20o58q32Q94k70J256j235O11l78M45
6917B27rk59N33k55K1J26j393J649q18p4j31J72P59k09r23K68J140n98l37L82
6937B71L9k09n00P73l42j027J341l01j67K97j67J5L4O0Q4l07m5L34R1m34M1j8
$$ plain form
6796 -669 -642 -308 -115 402 224 -264 529 300 -122 -501 -15 84 -552 -10 243 1000 421 16 -369 437 399
6817 399 -159 93 -162 -392 71 568 -165 -335 305 143 289 356 39 753 -1056 1263 405 -492 355 267
6837 267 -329 -645 931 -461 -23 -266 25 -465 211 151 9 176 113 -355 -85 25 -561 -77 346 -1073
6857 -1073 516 0 -436 -482 158 -72 -45 -39 -54 406 214 -720 567 443 48 369 377 150 601 -620 -591
6878 -591 -108 -244 -493 -117 -743 234 1003 -242 589 699 758 -167 249 0 336 213 -357 -597 270 280
6898 280 -304 -819 445 54 -212 553 -41 697 -126 394 -264 -1096 -202 -472 784 -451 160 -218 227
6917 227 218 -41 492 237 258 384 -1009 640 -178 -252 -383 -211 548 339 -584 -316 824 226 -111 271
6937 271 310 101 -399 374 32 -995 346 45 -122 175 8 23 57 117 201 -106 -151 183 274 -160 -119 -137
6959a37J678j721N80m26R5R4L7l09M16N85j392J128j223J775j498M91K00J09k18
6978B64l41k54N68J1p44J08Q49n34l71l84J115K89n55n4j054R83o8k03J60N89
6998C74J37m97l02K83l08N99K17M77m25j271j80N1J512L44j753J4P90J00J63j45
7018A80N10r31L46j082J146j098J064j40j22O41j141J395r1n14K16q37K05K59
7036Fp14Q09L3P5r7n35O08m19M86l83K41j95J55P70j340P40n93l4K15j10p96J242
7058A64r86N06N18M49r61R8K71J28j11J90p9l39j52l32M83N91j18n03N97o82j31
7079c99l68R94K58l9j321J960j424P83J86j20j036R84j194l17J231l67K9j80L46
7098Fl77J673k091l86J893l77o65M47N63j036J40j57m77R30nl49J3l89M80m70
$$ plain form
6959 -137 1541 -180 400 -26 69 163 200 -109 307 892 -500 628 -595 1180 -318 173 373 482 264
6978 264 -77 -331 237 248 -496 -388 461 -73 -444 -828 287 576 21 -33 -1087 -104 -172 -375 -215 374
6998 374 511 14 -288 -5 -313 286 503 980 555 -716 -896 -845 667 1011 -742 -728 62 162 325 180
7018 180 690 -241 105 -977 169 -929 135 -5 -127 514 -627 768 677 163 379 -458 -253 6
7036 6 -708 101 134 209 112 -423 185 -234 252 -131 110 -85 70 840 -500 240 -353 -387 -172 -282 -1078 164
7058 164 -822 -316 202 651 -310 -212 59 187 76 266 187 -152 -304 -636 -153 438 320 -183 414 -268 -399
7079 -399 -767 227 485 446 -875 1085 -339 444 630 510 -526 458 -736 -1053 178 -189 -160 -340 6
7098 6 -371 1302 -789 -1175 718 341 -324 123 686 -350 -210 -367 -844 86 81 -268 -255 -644 -164 -634
7118f34O09k69O93m80M44n5J73r43K95J27Q04r27M40m23k05l55O21J21n22P62
7138B76k6O4l87q44R98j88n02L34J140j659Q74K19O69r08o45J102m1k00n77l81
7158f82J385j020r6P89m91J14k23J100r82j59l85J455j289N00l04J26L4j20q7
7177c35L46J6o04O24l52j07n44K40P39l54k92O99l97L01L03l47L15j013O99M53
7197C90jJ41N09j050Q14q92L19n6j10j68N02m52O0N92l48r99P46K9M9K76j387
7218a036K46J868o13n71p00N52L80N60j195M50n93J061n03k25L09J164q59L4P8
7237D07k72M64j373K17J025j055J88m53J024l28k19J70K47O10j21p84j1L79o66
7256e51P52K13o55L8M2Jj0k14K95L9N55m86o6L53o98N54J83r13J730j224J0j24
$$ plain form
7118 -634 -25 -294 399 -81 363 308 481 -462 -167 -40 764 -163 277 -146 -351 -706 -85 36 -486 276
7138 276 250 314 -73 -917 81 -107 -609 -275 865 -794 80 299 968 60 -585 517 476 276 -301 -682
7158 -682 703 -317 -413 376 -115 -1 -224 876 -106 -265 -650 805 -484 16 -288 -162 -128 -248 -335
7177 -335 11 27 -577 47 -305 -412 -956 -716 23 -331 -623 76 -321 -20 283 -64 251 -762 -63 390
7197 390 389 530 1039 -11 803 -89 230 174 64 -104 398 -54 6 598 250 -749 -3 26 75 351 -1036
7218 -1036 -790 1078 465 -106 -806 -254 126 686 -509 -59 -652 409 -94 -319 -10 1154 295 329 407
7237 407 135 599 -774 -557 468 -587 -399 -852 172 -156 -375 -205 42 652 531 -253 -264 115 -551
7256 -551 201 414 -241 -203 -161 -160 -170 -384 -89 -50 505 19 -47 306 -392 162 345 -568 1162 -62 -52 -176
7278a76K95k86l24L25N30q38R79o52r5R0L80n38P07n66m02N36J02o52J03N50m67
7299c99m97P22P67J80O29j476J024p27l15l64oQ03j184J241r03P49n50j33L62
7318g7J521j921L78N2O78o50M2J060j248m50O44j52N88o91O42o84N11k23k57Q9
7338a48O11J23j087J065j82j65n14J093r96J90N12o82R3P90p13J068j324k19N65
7357H0O3K41l87M61j003K33J29lK70K89M72j285jJ74O6Q68R8p06j51J79m87P16
7379C16m32l70M18J93k39n72N62N56J155j990j02N60M52l31k27O73p49K26J66
7398B65O9J18m64L64n87J483r78j160J456j02l42j52l94M24P7P0K33j89l8M69
7418F22k3p64O82j072Q36k50L16o10l68M14m67J12P21m14o27J228q24R85q99J149
$$ plain form
7278 -176 119 -167 -491 -166 364 -474 505 -147 -242 -152 228 -310 397 -169 -571 -35 67 -585 -482 68 -399
7299 -399 -896 -174 593 773 1402 -74 950 223 -92 -456 -462 341 -843 398 -505 244 -306 -439 -77
7318 -77 1444 -477 -99 -47 631 -19 23 1083 -165 -615 29 -123 465 -226 416 -268 243 20 -237 -148
7338 -148 463 586 -501 564 382 217 -297 796 -200 -10 502 -180 -87 703 -10 1058 -266 -485 80
7357 80 143 384 -3 458 -545 -312 -183 -186 84 373 845 -440 -441 -267 -201 667 765 59 -92 87 -400 316
7379 316 -116 -486 -68 125 -114 -686 -124 432 1587 -403 -505 55 507 176 -51 622 -127 99 265
7398 265 334 452 -12 352 -235 1248 270 -890 566 464 122 -30 -424 0 77 147 380 191 153 622
7418 622 599 -165 517 -555 281 31 347 -263 -631 -217 -684 -572 149 -265 -892 336 -488 497 -402 747
7438G47m18q57O18j63k06J16L93n71l18J663j118J45j72M78l93l40N77l69Q27
7457F39j721J354q38J304p80P57K59j064J656j501m02j35N53L44k63J99j197L83
7475d53Q59Q2m07j90O24r87K74M53r13P39j83j61m84N65L3r64J393j72N87r09
7495b14m89O75k82MP92K7K38p53J15j008J790j67M65j019L54l69L87o32p23P98
7515a1l94J102j79q24K07j27O21k81L58l20n63R6Q57M3r15M07r66Q84J27j49J2
7536a5o41j28M40M83j143J935m73j102L22K93n86K35R9k02k88R69n0M6k18J29
7556A05N4k19m2j91K23P76l10J16r58N92J163j356M6M2o54P91N10m66p97M06k65
7577d34O47m43RK74K41Q91j483N8P95N98l85q05J065j284Q02n96m86M10n8J001
$$ plain form
7438 747 329 -528 90 -73 -279 -163 230 -341 -659 1004 -114 31 -141 337 -56 -396 181 -188 639
7457 639 -1082 272 -566 738 -42 715 974 -90 1566 65 -337 -472 81 425 162 361 -836 -453
7475 -453 406 488 81 -109 515 -472 -198 255 -658 81 -102 -263 -747 -182 -149 -1113 280 108 695 -214
7495 -214 -703 -28 -310 -306 486 513 751 -2 113 -895 895 728 1193 174 528 159 546 -86 -809 -11
7515 -11 -405 697 518 -306 -99 -226 395 114 472 152 -411 -315 542 585 -330 77 -889 -5 122 -27 -15
7536 -15 -656 -784 -344 139 -1004 931 458 -644 -322 -29 -615 -380 -281 -483 -771 198 148 194 -24 105
7556 105 159 -60 -102 -293 -70 706 396 512 -446 146 1309 -47 -1 41 -613 178 688 222 -575 -169 -434
7577 -434 213 -230 -221 53 294 1185 -298 -240 555 1153 768 -37 1028 -256 546 -50 -536 -126 -184 817
7597H17j064j97J71J40j51L21J088j259K5L42j58j05J70K13j056J091l17l92m8
7616c69O08p45M22Q1O37o33n67L64P90q25K29L6rN20n66l20m79J238n98P8O89
7637E81n98L84j88J49l09Q58m19jm00O41j124R43n42m6p44J124N66o43O21M28
7657A281j312L89J71o15j4K58j042R17j59p10M56J9M61k68J019j064PJ84K96l68
7677i4m7J40L23m97R4M80M60j158J034j175P80m91L82k00k66K05j45O18p82O50
7697C11n03K09m74J062n16m53J131j181P18k13M64r50q2J234j22j042L84M00j7
7716C60J08m50r92J132J07N74n50j04n99N2p7K41N14l05L13m57n42Q8P51M13j512
7737i35M51R13l85J82j085o16O99J374J8r06k40J001Jm03J19J32j32m16m36R02
$$ plain form
7597 817 -247 -444 -273 -133 -284 37 1125 -134 -109 233 75 -30 140 353 -703 388 71 -321 -369
7616 -369 239 -506 -84 -3 634 1 -566 -202 588 -237 -8 28 19 539 -27 -347 -826 412 -186 -108 581
7637 581 -17 367 179 328 19 877 458 457 57 698 -426 517 -25 -71 -815 309 875 232 853 1281
7657 1281 -31 358 529 -86 -100 158 -884 33 -126 -836 -380 -361 100 -168 851 -213 -206 -22 274 -94
7677 -94 -141 -1 322 -175 -81 399 859 -299 735 -440 340 -151 231 31 -235 -30 -175 443 -339 311
7697 311 -192 17 -457 605 89 -364 767 -414 304 91 555 -395 -477 757 635 -407 -23 377 360
7716 360 468 18 -974 158 265 839 289 185 -414 -362 -439 -198 316 11 324 -133 -675 -587 164 577 -935
7737 -935 -484 429 44 226 -859 -1475 -776 598 616 -290 -530 471 472 69 188 320 188 -228 -664 238
7757B38K96n19k68P19o54M24j48j061J616l12q52L59J089p06k53%K09j20l94P18
7777C81r55M12j56K74o80K69q1J10m07O56M01J86K71k92o75Q20j140N32p6N63
7797D13o17J152m14j383J925j687R30l16J22q83J171o20L82%M4K77p14L32m2P46
7817H18l46m52j52N21j467J386L03j378J041J42m42j22m80j514K346O15p24K41
7835C36o98R33k96L04o93J21P4q95J146q3j81O10n80m1K21p88O05p10K96M88r1
7856G8K56o7l47L19q40Q92o88R64j000P02m99j80J74K08m49J45P59k30k61j94
7876b58l7j29Q09k22k0K61r98M44M35n09l72J53M06J045n72p08l2r3M88n73L62
7897a20N4J10K06p89R03r9o95j53P69m60L97k15M22Q20j14n51l31p16Q01k82L2
$$ plain form
7757 238 534 15 -253 466 -188 236 88 -973 643 331 -521 -162 927 221 -32 -32 177 57 -337 381
7777 381 -574 -162 -318 -44 -724 -455 -536 -426 -833 -177 224 410 681 389 -286 534 -606 -74 -150 413
7797 413 -204 948 534 -849 1076 -611 319 3 125 -758 413 -207 175 175 219 496 -218 114 72 818
7817 818 472 20 -132 389 -1078 308 611 -767 274 416 -26 -148 -628 -2142 204 819 95 336
7835 336 -362 571 275 579 -114 7 81 -814 332 249 68 678 98 57 278 -510 95 -615 -319 169 78
7856 78 334 267 -80 239 -601 291 -397 567 -433 269 -230 -410 -236 -28 -477 -332 427 197 -64 -258
7876 -258 -295 -424 385 163 143 404 -594 -150 285 -224 -596 -443 -37 1008 436 -272 -304 -397 91 -482 -120
7897 -120 -66 44 250 -539 364 265 -430 -583 186 -274 123 -92 330 1150 1036 485 154 -562 239 -43 -11
7918a1K4K42l94L18J80q41J231j411O62J12K51m50J665k996J139Q84j43r06P31
7937B87q42Q54K08m18k8M27n62P38j096J68N58J20o66m03J587j743Q78n04N22
7956H5j082J007r23J295q94R11N61j6j297m15J052K09k24P8J7n59n39J027r34
7975f41K90Q92o41n2J005r63k01P63j495R12l50n82J734j050N2Q0J074j650j31
7994i54K72P01M29J33K88j035Q31o65O0M7p31N32l4j51N88L21k58l58N82j216
8014f18K13O25J8o76o9P67k83p11O71l84k56O39j75N73j4m08P09o07j11n1K48
8035A00l28Q61m86k45Q57q28k83M67n24N00m09K90M05m59O14p49L00l07J420j271
8055g5O05m1j062Q1N11n29R87m94q10N97l07P69r14P04m18P89M24j306M10k13
$$ plain form
7918 -11 13 255 -139 179 359 -482 749 -662 0 112 363 -87 1578 -1418 -279 605 462 -444 287
7937 287 -555 299 507 89 61 488 -74 664 -432 -264 294 414 -252 -655 932 -811 67 -437 85
7956 85 -997 10 -913 382 -512 399 960 944 -353 -768 284 493 269 347 364 -195 -734 293 -641
7975 -641 -351 541 -100 -152 853 -110 -311 452 -1043 -131 -481 -1063 671 -379 -327 -247 827 -823 -954
7994 -954 -682 19 448 581 869 -166 665 0 60 107 -624 -92 -126 -277 311 632 374 16 598 -618
8014 -618 -405 220 238 -438 -507 260 -23 -734 -63 -447 -703 -64 -239 334 320 -88 621 14 -97 -148 100
8035 100 -228 633 147 -98 759 -69 -352 115 -409 91 -318 -28 377 -82 532 -217 83 -224 1196 -75
8055 -75 530 489 -573 -492 19 -510 477 -17 -827 -230 -537 232 -682 22 -396 393 817 -489 -79 -292
8075b92J57m29q3P65k02L81p5p82K06N16k23N44L37n11n05K64o23O30K04k67l54
8096c42p32J269k15J36n75O51p30P74J73m36j39K51o52j18P68M91q23J032P23
8115A506k108R37r2n24j21L78M30M8n58j77O58j182O08M99k90j15M16o52J220
8134H81m66j035R74L63j764J135K89k02j6j23j84j116J624N8m35j89O81n12m25
8153d62L71Q09p23K66l64n76mM79p91O52O09p53O71k09O0L06km38L27o43N9R92
8175F36j093J005p01m8l24m30P00r1N27j19p77l58K167j264K51o17
$$ plain form
8075 -292 -135 -564 -647 118 -84 297 222 -560 -354 162 -61 483 820 309 -196 68 -555 75 279 12 -342
8096 -342 -1074 195 -20 116 -459 192 -538 236 409 -27 -166 85 -567 -685 83 574 -249 783 1506
8115 1506 -602 335 243 -281 -402 -24 406 454 -104 -281 377 -805 -197 302 12 -103 313 -339 881
8134 881 415 -620 354 717 -1047 88 377 175 159 36 -148 -1264 360 418 -17 -206 475 -37 -462
8153 -462 -91 718 -5 261 -103 -679 -683 -204 -995 -343 266 -487 184 -25 35 341 339 -99 228 -415 -356 636
8175 636 -457 548 -153 -201 -525 -955 -255 -346 181 62 -715 -1073 1094 -170 81 -536
8191e36
$$ Imaginary data points
##PAGE= N=2
##DATA TABLE= (X++(I..I)), XYDATA
0@%%%%%%%%%%%%%%r8K06k16K16k16K16l24M32m34N42o48P56q80R89j189J403j616
31h61J832k052K276k589K923l261L677m113M582n109N691o318O997p732Q538r429
47d948J0396j1455J2630j3913J5319j6889J8635k0577K2773k5269K8116l1413
59a6595L5289l9926M5581n2639O1758p4067R1651j18991J67523k79018J017317
70H37883P5004k014251Q60378J176494n27864j066576M24113O56686l7145n30495
80a45773l31963M03447Q27609o29502j059709Q18197J163566j042321j071319
89a067768J123070R13724j112256o72688R12000N04410o53186l60078K40624M20721
99B48573J35110o30033l69179Q94300M53936j098953m34559J259125L04604j310446
$$ plain form
0 0 0 0 0 0 0 0 0 0 0 0 0 0 0 0 -98 108 -108 108 -108 108 -216 216 -218 324 -324 432 -448 541 -648 755 -861
31 -861 971 -1081 1195 -1394 1529 -1732 1945 -2168 2414 -2695 2996 -3322 3675 -4057 4481 -4948
47 -4948 5448 -6007 6623 -7290 8029 -8860 9775 -10802 11971 -13298 14818 -16595
59 -16595 18694 -21232 24349 -28290 33468 -40599 51052 -67939 99584 -179434 837883
70 837883 912887 -1101364 -240986 935508 407644 -658932 -234819 421867 384722 -145773
80 -145773 -477736 -74289 753320 123818 -935891 -117694 1045872 3551 -1067768
89 -1067768 55302 969026 -143230 -815918 96082 600492 -52694 -412772 -172148 248573
99 248573 383683 -246350 -615529 278771 732707 -366246 -800805 458320 762924 -547522
109e47522r2750J165099q1231q48270O4112N29869P4844k49457l10268N8478O13574
120C76478o941q96253Q8679J085244k66655j111452M36733R89529n20888p73389
130e98915M93459N33655l33521l43030R4198K28679J94924k18752m86295L47974
140h7624O65024n28310p11116O91286O44636p87735m95984P76936L18868o57927
150a71946j59783M20389R8843j33305j69058j14032L31467K80444n47260l20947
160d85188P38913K50296q50145j11236Q58149m9214p28950J42276N23353j37798
170A50456k97741K9602J05694J59464k672l66770j6672N62115n8294o92564J97612
181b29770P04614l26834o19660M05641M59930l83359k87889K70261J51524r1019
$$ plain form
109 -547522 -640272 524827 443596 -404674 -340562 189307 264151 14694 -295574 -237096 376478
120 376478 369537 -526716 -438037 647207 380552 -730900 -294167 695362 174474 -598915
130 -598915 -105456 428199 94678 -248352 -154154 74525 269449 50697 -435598 -87624
140 -87624 577400 49090 -662026 29260 673896 -113839 -609823 167113 485981 -171946
150 -171946 -331729 88660 187503 54198 -114860 -228892 102575 383019 -164241 -485188
160 -485188 253725 504021 -346124 -457360 400789 351575 -377375 -235099 288254 150456
170 150456 -147285 -117683 -11989 147475 144803 -221967 -238639 323476 265182 -427382 -229770
181 -229770 474844 148010 -471650 -66009 393921 10562 -277327 -7066 144458 53439
191E3439p5944j33221J07432L21539k16381m31190L56094M54211m88973l83494
201d36488N58858K63990n47694j26921M45504K0234k61464l173O5660O8307J00502
212A47315k02140j93991L61272K00592m96233j38907N81265J8168n71323R5259
222a98723M74627j54618l32372J51253J70286o7228l8839p0113l6766K35758L0183
233A63448l87688N6483M62206j63327m65695K63034L96689l20612k74558L02510
243C2490J47249k15112m5587O6633J5155R1869n7980k14464J45007K86945k57474
254e269k88605L53776K31040m04321j34244L87576L1594k97069K5713J74743l1636
265D3298m0339k0818p6560J26030J34481k46599j30729L51621O5691m01025K8134
$$ plain form
191 53439 -22505 -155726 -48294 273245 56864 -374326 -18232 435979 -52994 -436488
201 -436488 122370 386360 -161334 -288255 157249 177483 -83981 -87154 -21494 46813 147315
212 147315 -54825 -248816 112456 313048 -183185 -322092 259173 277341 -293982 -198723
222 -198723 275904 121286 -211086 -59833 110453 43225 4386 -65727 -102493 133265 163448
233 163448 -224240 -167757 294449 131122 -334573 -71539 325150 4538 -270020 32490
243 32490 179739 -35373 -80960 -14327 828 92697 34717 -179747 -34740 252205 -5269
254 -5269 -293874 59902 290942 -113379 -247623 139953 171547 -125522 -99809 74934 43298
265 43298 2959 -17859 -94419 31611 166092 -80507 -211236 140385 206076 -194949 -166815
276a66815L80148j01206l12712J46219K02811j32343q7828O0605M580M5354L2314
287G1127j66139o719K56153n3616l06155J31811L05853k08084k46063K42701J56326
298A77195k22021o7821J51425P853m4745J227n9364K9860J47359j00595j93476
309a73103J88405J82818k54482j34088K85199O2234k64968L769K02482m2962j16611
320f1307M6078J6339M992N7000q3416r0830J70825P8094k44235k1076K67389l7730
332A02123k54651R3904J98779j19574j19325R8926M7406m6707O473l3530j8448
343d4624J10788l769j69212M6902K00570j04833j92153J52855J48314j71390q9776
354a16328J57393K8116j02037M653L2126q932M2334j9918r9637P6207J20961j31978
$$ plain form
276 -166815 213333 112127 -200585 -54366 148445 16102 -71726 -11121 -6541 38813 71127
287 71127 -95012 -101731 154422 100806 -205349 -73538 232315 24231 -221832 20869 177195
298 177195 -44826 -112647 38778 46631 1886 3113 -56251 -26391 120968 20373 -173103
309 -173103 15302 198120 -56362 -190450 94749 156983 -107985 -104216 98266 55304 -61307
320 -61307 -15229 1110 6102 63102 -20314 -111144 59681 137775 -106460 -127536 139853 102123
332 102123 -152528 -58624 140155 20581 -98744 182 47588 881 7354 -26176 -44624
343 -44624 66164 62395 -106817 -59915 140655 35822 -156331 -3476 144838 -26552 -116328
354 -116328 41065 69181 -32856 -28203 3923 -5009 37325 17407 -82230 -6023 114938 -17040
366a7040j14267J80514P3517j97507k0374J75484j7666j33024M1322P0040l1904
377I095j0169j685l6516N6828N6117j20055l7223J57563K953j72661L6719J61182
389A02148p0558j22772Q0074P7832p1858k6897L2568m815K4340N794p1343Q455
401c7032J09014m0179j25984P6889J18343j06506r1216J22080M6099j03824j1098
412d3414O5227o004j7572L426k8915K1630N9946n6241p3078R4760O3326j26143
424d3052k9109J23207N534j09410J7631Q0156k6410m2875J7313Q703L394K1710
436B6792m3144k7172Q0767J0562r9269R147J07483l4158r6189M9110P5563n5665
448C827m7310M8111J5472j8101k219j3773k53M5450j2582o6895L3671P4224n3792
$$ plain form
366 -17040 -131307 49207 122724 -74783 -95157 80327 62661 -70363 -29041 40999 9095
377 9095 -1074 -2759 -39275 17553 73670 -46385 -83608 73955 76908 -95753 -59034 102148
389 102148 31590 -91182 -11108 66724 -5134 -32031 537 -4278 20062 25856 -45487 -37032
401 -37032 71982 31803 -94181 -17292 101051 -5455 -96671 25409 71508 -32316 -43414
412 -43414 21813 15809 -1763 1663 -27252 -5622 54324 -1917 -74995 19765 83091 -43052
424 -43052 -72161 51046 56580 -52830 -35199 44957 18547 -24328 -7015 1688 5082 26792
436 26792 -16352 -43524 37243 47805 -51464 -42317 65166 31008 -65181 -16071 59492 3827
448 3827 -43483 4628 20100 1999 -220 -13993 -14246 31204 18622 -48273 -14602 59622 5830
461E830p1440P3513N0612p9076k4570O6337N332l9577L683O230O932J5005k1571
474b760l0376M0022L8260o4230k8606P6517J1912p5934M589O3163j2459m5122
486b5024R864L0307o840j0233m752q321K8643J0904n1268p11O3493j4227o4235
499d2400K6222N7082l2243m7325L7809K5612k7307r359Q098L470J3538p342l0173
512b4318K1040L3017k5788l9599L5971L9062m7838k5367M5858J4559l7692o089
524a7184K1462P211r217j1272J5J3669J4848k8250j6665M0940J1802m5944m043
537b2628M3932k237l5533Q74L1376m356k2475N484O819N684k0j9378k96L2068
551A9314o759l4694J2206L2513j3927l4129K0394K6644k0950j6253J2617R859
$$ plain form
461 5830 -65610 7903 58515 -20561 -45131 21206 26538 -13039 -9356 -3126 3806 18811 -2760
474 -2760 -33136 6886 45146 -19084 -47690 28827 40739 -35195 -30606 32557 20098 -25024
486 -25024 -15160 15147 8307 -1926 -6678 -14999 13644 24548 -26720 -27431 36062 21835 -42400
499 -42400 -16178 40904 8661 -38664 -855 24757 -2550 -11909 -3811 -341 13197 5855 -24318
512 -24318 -3278 29739 3951 -35648 323 39385 -8453 -33820 12038 26597 -11095 -17184
524 -17184 4278 11489 2272 -9000 -8985 4684 19532 -8718 -25383 15557 27359 -18585 -22628
537 -22628 21304 19067 -16466 -15592 15784 11428 -11047 -5563 1256 6940 6920 -12458 -12754 19314
551 19314 12555 -22139 -9933 22580 8653 -25476 -5082 21562 612 -15641 -3024 6835
563F835k400p522r648J4786J1321j5481j5567J8027K0322k2839j8032K5372J4942
576B0116k6403r262J9561P903j2741r353Q541R023j367j1969m487J8349O567k4539
590a0061n608K8225j138k4229L505J7561J055j7425r9J3601K125q590o420N491
604b007J2216o099j7426J0861J6124q964j7011P757J8158r700j4776P450J3027
617I610n975j0060l20J1891K445j3471k066J0580P191j2074q692J1829J0916j4684
631b880r447J5416N487r471q007Q551Q788p248p951K888J0180l06j2403j413J7038
646I222k404j5090L694J0151J388j1614j953J1203J833q543m761Q771M804o019
660F82q890Q815P347n690r720M769J1592o986r591N888R396n886o425K246O680
$$ plain form
563 6835 4435 -3087 -12735 2051 13372 -2109 -17676 351 20673 -2166 -20198 5174 20116
576 20116 -6287 -15549 4012 11915 -826 -10179 -1638 7385 6018 -5951 -10438 7911 14478 -10061
590 -10061 -15669 12556 11418 -12811 -9306 8255 9310 -8115 -8214 5387 7512 -1078 -7498 -2007
604 -2007 10209 4110 -13316 -2455 13669 4705 -12306 -4549 13609 3909 -10867 -3417 9610
617 9610 3635 -6425 -6745 5146 7591 -5880 -7946 2634 9825 -2249 -10941 888 11804 -2880
631 -2880 -12327 3089 8576 -895 -8902 -351 8437 1189 -6762 -3874 6306 6000 -6403 -7816 9222
646 9222 6818 -8272 -4578 5573 6961 -4653 -6606 4597 6430 -2113 -6874 1897 6701 682
660 682 -8208 607 7954 2264 -7456 -2687 8905 1919 -7672 -1784 7612 1726 -4699 -2453 4227
675D227Q23j0610Q62Q983J982j0746j207R025J638n920m865O566M433m698p620
690g127P278O992p562n104L438P021k827p266K160P216p68q639K312P505j258
705C371p488o1Q195M99o074l752P784K027n256m679N582L947m895l194K903O840
721E749m823n539L998N517l133o324K758M680M45p691J651N882l27m979j721P492
737C635n28n332j257M255J771k831l427L171N110m980l600L682L957l835l394
752c603K163L622p75n606L283L531j47o449J589N268j118l690j93M673l93k405
768b50l271N107K370n215j129J332L930j697m971K956M427k813m229K454M104
783C105j982m389K864K873j588j410r41L204P49l506k276M601J538m602p7J273
$$ plain form
675 4227 5050 -5560 -4698 4285 6267 -4479 -5686 3339 4977 -943 -5808 758 5191 493 -7127
690 -7127 151 7143 -419 -5523 -2085 4936 2109 -5157 -2997 4219 3451 -5188 -2876 4629 3371
705 3371 -4117 -4178 4017 4516 -1558 -5310 2474 4501 -755 -5434 148 4095 -800 -3994 -1091 5749
721 5749 926 -4613 -615 4902 1769 -4555 -1797 2883 3328 -4363 -2712 3170 2843 -2136 -3857 3635
737 3635 3107 -2225 -3482 773 2544 -287 -3714 -543 4567 -413 -4013 -331 3626 -209 -3603
752 -3603 -1440 2182 1407 -4199 -916 2615 2468 -3981 -2392 2876 1758 -1932 -2125 2548 2155 -250
768 -250 -3521 1586 3956 -1259 -2388 -1056 2874 1177 -3794 -838 3589 776 -3453 -999 3105
783 3105 1123 -3266 -402 2471 883 -527 -1468 1736 2485 -1021 -3297 1304 2842 -1760 -1837 -564
799e64M696n749q83M031l16k013p11J594O91O37l082P30K810O86m675p87O687
816C782k536m766K092L831j603j917J47R08K006k712j220J384L106n96m540K318
832c16K722k420l358L422K942m104j755L052L172n153L70J395r01K360j151l680
848c403M338J596n467N03L856J33l161j500N243j141l414J789K665k649J284r50
864b78j376K183P44j649k512O152j409n902K871N235m024l457M147l97o0q32K70
881b94J171j466K214k993J273J467j85m543K231M319l275l188L923L220o435J643
897i18L469l058j3K193k871n0M091m343j151L351J583l259k595O477j389l727
913b210K323K809l761R0J808j365K2J889r38l420L487K876o389N6N778k938l717
$$ plain form
799 -564 4132 -1617 -2500 1531 1215 -798 -1509 85 776 1413 -1669 -939 1871 2557 -2118 -2905 3782
816 3782 1246 -3520 -1428 2403 800 -1117 -970 -62 1944 -768 -1988 -604 2502 1906 -2634 -316
832 -316 2406 -14 -3372 50 2992 -1112 -2867 185 3357 -1796 -1426 -31 -932 1428 277 -3403
848 -3403 935 2531 -2936 -2433 1423 1556 -1605 -3105 2138 997 -2417 -628 2037 -612 672 -278
864 -278 -1654 529 1273 -376 -2888 3264 1855 -4047 -1176 4059 35 -3422 725 328 268 -564 -294
881 -294 877 -589 1625 -1368 -95 1372 1187 -3356 -1125 3194 -81 -3269 654 3874 -2561 -918
897 -918 2551 -507 -520 1673 -1198 -1248 2843 -1500 -2651 700 2283 -976 -3571 2906 1517 -2210
913 -2210 113 2922 -839 -749 1059 -306 -284 1605 667 -2753 734 3610 -2779 -2723 3055 117 -3600
930c600M129K112l858L66K247r5k321J873m52k369L215J30m409J851M375k557
946F37k518J274L243m751l53M562k725j830K865k2k705K911R46m445K631K448
962B168k835k425N124j83l886R13L967l415k404M821k294j73P34J193j893l74
978i62L412k622k645L933J905p083L473L644n118M41L399o01l395K754L89l017
994b093J685K530l958o09M732j345l038K191K163l260r36L114K60k952P84K842
1010B110l769J303J699k701N76K904j586k985K859J584l806j54N185k554l501
1025b836L756O03l053J714J295j232j284K335j067k300J804L278o005J283N695
1040C986m608j378J813K964n146J207K927k164r81J989j20k335J800Q47k981K686
$$ plain form
930 -3600 529 2641 -1217 -851 1396 1301 -1020 853 401 -1968 1247 1377 -3032 -1181 3194 637
946 637 -1881 -607 2636 -2115 -2468 2094 -631 -2461 404 382 -2323 588 1534 -2911 -280 2168
962 2168 -667 -3092 2032 1849 -2037 -1124 2843 -572 -2976 1845 -449 -622 112 1305 -588 -962
978 -962 2450 -172 -2817 1116 3021 -4062 -589 3055 -2063 -1622 1777 1176 -2219 535 924 -2093
994 -2093 -408 2122 -1836 -2445 2287 942 -2096 95 2258 -1002 -1938 1176 1436 -1516 -732 2110
1010 2110 -1659 -356 1343 -1358 -782 2122 536 -2449 410 1994 -1812 -1966 3219 665 -2836
1025 -2836 920 1523 -1530 184 1479 247 -1037 1298 231 -2069 -265 3013 -2992 -1709 3986
1040 3986 -622 -2000 -187 2777 -2369 -1162 1765 -399 -1380 609 489 -1846 -46 801 -2180 506
1056E06J560k306j248K200P12k611k90K826q45l246M994k591j168J548J024l134
1072b069K038K561m063L9K479P56l257L052l67j594L64P34O2j522J800R3j914
1089h08K55K605j863k053M068r81k501N33K173k116K61K829k721l85J076k77j796
1106a701J250J421j601N49J533o97j638J892R9j519o64K000q93j676J340j48m44
1123h97P19J799k574j93K632j408j129J771R04l135Q32K000k300O68L50O30j72
1140D97j79J65j386Q24J485j968q84J691M08j099J06J594r74j722K020N31q21
1157B88p45J583j557J53J035k028J470L61j00j418Q06m43J4m70R02M88j043J001
1175B97j60J95Q6l01K90n04N06qM74p4L12k077M68K044k074L00j99J847p01q71
$$ plain form
1056 506 2066 -240 -1488 712 1424 -1187 -1477 1349 504 -2742 2252 -339 -1507 41 1065 -2069
1072 -2069 -31 2530 -1533 -1494 985 1741 -1516 1536 1169 -425 -61 673 735 -787 1013 1106 -808
1089 -808 -553 2052 189 -1864 2204 1223 -1278 -745 1428 -688 -427 2402 -319 -704 372 95 -1701
1106 -1701 -451 970 -631 -82 1451 754 -884 1008 1107 -412 -1076 924 31 -1645 -305 -453 -897
1123 -897 -178 1621 -953 -1146 1486 78 -1051 720 1624 -1511 -679 1321 -979 -311 39 669 497
1140 497 318 483 -903 -79 1406 -562 -1446 245 653 -446 -340 1254 280 -1442 578 1109 288
1157 288 -457 1126 -431 -278 757 -1271 199 560 460 -958 -152 -595 -581 -1051 -149 339 -704 297
1175 297 137 332 418 117 407 -97 409 401 875 801 1113 -964 -496 1548 -526 -226 -425 1422 721 -150
1195a50J64j68m45r9N46p25J795o64N33j779L31J795k812J264M49l32J26J106
1213I35j068q0J130l86n55L01k23K58j77p9o76k78K07P94n28j34O74m32J25L6
1233a56J378l81q99R08l54p40N68K0j243K208q85m43k56j97J210j514N79L35M78
1252F16o67l83k66R09j000l59J393n96P01o54K6J95J779j553q19J163K5J23j631
1271i98J257j82J31L60n38O80n79l1J52O11j051J647j430o48Q37o78K55K05M33
1290D33j82M8O75j62m09l68Q72o35L15M99o56j298R29J46l57n18j01N73K44M4
1310I2r09N63J243j47j175Q34j212P51J541j442J50k11n48M16l39J22Q15j742
1328a198R32j74J540l29o43N32n89j15l16N47p62P32%l77R0q3Q21q0m52l68J160
$$ plain form
1195 -150 14 -154 -599 -698 -152 -877 918 254 787 -992 -661 1134 -1678 -414 35 -297 -171 935
1213 935 -133 -213 917 531 -24 277 54 312 135 56 -620 -898 -691 103 -425 -559 115 -317 -192 -156
1233 -156 1222 841 -58 850 496 -244 324 344 -899 1309 424 -19 -275 -472 738 -776 -197 138 616
1252 616 -51 -434 -700 209 -791 -1150 243 -353 348 -306 -280 -85 1694 141 -678 485 510 633 -998
1271 -998 259 77 208 568 30 710 131 100 252 863 -188 1459 29 -619 218 -460 -205 0 433
1290 433 251 299 974 812 403 35 907 272 587 1086 430 -868 61 207 -150 -668 -769 -196 48 92
1310 92 -817 -254 989 842 -333 501 -711 40 1581 139 289 78 -470 -54 -393 -271 544 -1198
1328 -1198 -266 -440 1100 771 128 660 71 -44 -360 187 -575 157 157 -220 -130 -213 608 528 76 -292 868
1349H68n58j043J906o92j369J237j16j454J625l6r87J57j85K67m72J186k47l56
1367b69p20J549p31M70O05r31Np37K082j810m57J727n26l93n72J090n38l15J581
1386A110j033k90LJ669l255K534k01j072L09P52N40j306K90n10M1q34J795j060
1404e18m34K096J25k485J513L92j301o22K403q4k098J902J158l390l20K412j151
1421d02l29K420j175k028K146L90j306p89J728n31j616K328K68j268j33P43q41
1438c95o20J937j015q01J645P27k635o2L107k815j5J683n05k211K373R70k665
1455a297q01L804j042j749J406P82k770J120L031k059j174J715P76k714K36K463
1471A727k726j76L119k440j659L218K2k920J905K400k437j529L261l42m475L727
$$ plain form
1349 868 310 -733 1173 481 -888 349 233 -1221 404 368 -619 -462 -647 -380 -852 334 87 -269
1367 -269 -989 560 -171 299 904 -27 -22 -759 1323 -487 -944 783 257 -136 -708 382 -156 -471 1110
1386 1110 77 -213 -210 1459 -1796 738 537 -535 -226 526 1066 -240 50 -460 -419 -1253 542 -518
1404 -518 -952 1144 1269 -1216 297 689 -612 -1234 1169 1085 -1013 889 2047 -1343 -1663 749 -402
1421 -402 -731 1689 514 -1514 632 1022 -284 -1073 655 124 -1492 836 1104 -164 -297 446 -395
1438 -395 -1015 922 -93 -894 751 1478 -1157 -1219 1888 -927 -942 741 236 -1975 398 1368 -1297
1455 -1297 -2098 1706 664 -1085 321 1103 -1667 -547 2484 425 -749 966 1742 -972 -736 1727
1471 1727 -999 -1175 1944 -496 -2155 1063 1085 -1835 70 2470 33 -1496 1765 1423 -3052 675
1487F75J023l104m56M900l176k396L685N16m142K031L289k826j719L330r69m166
1503c505M110J687l938%M810l448j732K501J428n082L052J754l804J355K961j519
1519F30l513L186J038l439M06O181n133k568N103l3m907K693K990m354K5M608
1535B913k292l224L414K627o505K203N031m982j499L811J155n508J817M198m737
1550a578j232O764l008m572M999J182n825J646N217m672k209N561o83m996M091
1565F85K515o090J098N428l278m668O049R20o143K232N549m802k800O532n65o025
1581c363L892L017n601q21P549m731m068N627J811o884K722N251n813j129N677
1596C136j797n699M731L368o726R52O388m987l194O296Q5o602L182N351o508r32
$$ plain form
1487 675 1698 -1406 -1862 3038 -138 -2534 1151 1667 -2475 -444 2845 19 -1700 1630 661 -3505
1503 -3505 605 2292 -1646 -1646 3164 -284 -2016 485 1913 -3169 -117 1637 -2167 -812 2149 630
1519 630 -2883 303 1341 -2098 -1692 4489 -644 -3212 1891 1858 -3049 -356 2634 -1720 -1695 2913
1535 2913 621 -2603 811 3438 -3067 -864 4167 -815 -2314 1497 2652 -2856 -1039 3159 -1578
1550 -1578 -2810 3954 946 -3626 1373 2555 -3270 -1624 3593 -1079 -3288 2273 1590 -3406 685
1565 685 3200 -2890 -1792 3636 358 -4310 1739 2659 -3484 -1252 4297 -505 -3305 3227 2662 -3363
1581 -3363 529 3546 -2055 -2876 4673 -58 -4126 1501 3312 -3572 -850 4401 -1412 -2541 3136
1596 3136 1339 -4360 371 3739 -2987 -2035 4353 -634 -3828 2468 2553 -4049 -867 4484 -2024 -2956
1612b956O476k640m942O113J821o629J115O851o187l078P498r99o697M083M437
1627D266o858m66P378k566o945O362L316q596K154O637n955k610P181j89q315
1642e206N646L462o190j552Q432l844n381P377M57p617L315O815q000j971Q909
1657D652j749r841P600N071j0224J497P962m764n422Q280m62q430M754O349p362
1672b089k452R225k566p315P555J817r180K096Q369o084n419Q742P20q770M069
1687a282P650q906j993J0728n006o408O099L966r206K530P677n926m842Q580k30
1702C431r432O821M379q689j64R003l959o993P320L141j0138L452O990o928l053
1717d819R411j819q461O724N642j1013m97J1047n521o915P743K895r754L836P468
$$ plain form
1612 -2956 3520 880 -4062 2051 3872 -2757 -1642 5209 -978 -4056 3442 2443 -4254 -171 4266
1627 4266 -2592 -3058 4320 1754 -5191 1171 4487 -4109 -1955 4682 -1273 -3883 3298 3109 -5206
1642 -5206 440 3902 -2288 -3840 4592 748 -4633 2744 3201 -4416 -1101 5714 -2286 -4257 4652
1657 4652 2903 -6938 662 5733 -4491 -2994 4968 204 -5218 3062 2600 -5830 -1076 5273 -2089
1672 -2089 -4541 4684 2118 -5197 2358 4175 -5005 -2909 5460 -624 -6043 2699 3419 -5351 -1282
1687 -1282 6368 -2538 -4531 6197 1191 -5217 882 4848 -4358 -1828 5849 -77 -4919 3661 3431
1702 3431 -6001 820 5199 -3490 -3654 5349 1390 -5603 1717 4858 -5280 -1828 5162 -1766 -4819
1717 -4819 4592 2773 -5688 1036 6678 -4335 -4832 6215 694 -6221 1522 4417 -5337 -1501 5967
1732E967p939k900J0050k375q716O640N015j0061J004R282o906m468R564L9j0504
1747f308M373Q279r591j785R507k354q587Q332L535r791K258Q352p745m873R493
1762C095Q20r444N914N796r074o54Q938l708q144R142K264r957K064R997q037
1777i88m240R415n78r869O314N990r825n90J0462m415p904P926L352j0495M003
1792a442Q499r379l950R875k79j0698P923N552j0548l07J1263m988q107R118J549
1807D081j0328M084Q886q885l858J1748l380r318P919N671j0647J015R273n908
1821C53o476J0368l2j0466M789P353q418l264J1296m110q134Q073L406r323J634
1836b951Q495n681n348R191k03q621M963O161r244j174J0165m019q517Q041L846
$$ plain form
1732 5967 -1972 -4872 5178 2803 -5913 727 5742 -4319 -3315 5967 -939 -5407 4157 4196 -6308
1747 -6308 -1935 6344 -3247 -5032 4475 2121 -6466 1866 5401 -4390 -2132 6220 -1525 -6398 3095
1762 3095 3915 -5529 385 6181 -2893 -3547 5391 1683 -6461 2681 4945 -5012 -2948 7049 -988
1777 -988 -5228 4187 3609 -6260 54 6044 -3781 -4371 6091 1676 -6228 1698 5050 -5445 -1442
1792 -1442 7057 -2322 -6272 3603 3324 -7374 549 6101 -4447 -4754 6509 1521 -6586 2532 4081
1807 4081 -6247 -2163 6723 -2162 -6020 5728 2348 -6970 949 6620 -4027 -3012 6261 353
1821 353 -6123 4245 4213 -6253 -1464 5889 -2529 -5793 5503 1393 -6741 1332 4738 -4585 -2951
1836 -2951 5544 -137 -5485 3706 3503 -5118 -155 6006 -3238 -4412 5753 1734 -6783 1258 5104
1851E104r628K544Q448p607l860Q741k29j0033O725M873r427j01R992m263p412
$$ plain form
1851 5104 -4524 -1980 6468 -1139 -4999 3742 3513 -6520 205 5078 -4349 -4450 5542 1279 -6133
$$ [...]
8191D29
##END NTUPLES=NMR FID
##END=
