##TITLE=1H_SAM_30.248.TFA2
 CD3OD+CF3COOD,108 sc, 
 27.9.2021
##JCAMPDX= 6.0         $$ Bruker NMR JCAMP-DX V2.0
##DATA TYPE= NMR FID
##DATA CLASS= NTUPLES
##ORIGIN= UXNMR, Bruker Analytische Messtechnik GmbH
##OWNER= root
$$ XWIN-NMR		Version 3.5
$$ Mon Sep 27 11:47:13 2021 Russian Standard Time (UT+4h)  she@DPX200
##.OBSERVE FREQUENCY= 200.1314
##.OBSERVE NUCLEUS= ^1H
##.DELAY= (6, 6)
##.ACQUISITION MODE= SIMULTANEOUS
##.ACQUISITION SCHEME= undefined
##.AVERAGES= 108
##.DIGITISER RES= 18
##SPECTROMETER/DATA SYSTEM= spect
##.PULSE SEQUENCE= zg30
##.SOLVENT NAME= MeOD
##.SHIFT REFERENCE= (INTERNAL, MeOD, 0, 15.7039)
##AUDIT TRAIL= $$ (NUMBER, WHEN, WHO, WHERE, WHAT)
$$ ##TITLE= Audit trail, XWIN-NMR		Version 3.5
$$ ##JCAMPDX= 5.01
$$ ##ORIGIN= Bruker BioSpin GmbH
$$ ##OWNER= she
$$ F:/spectra/data/she/nmr/H-F/1/audita.txt
$$ ##AUDIT TRAIL=  $$ (NUMBER, WHEN, WHO, WHERE, WHAT)
(   1,<2021-09-27 11:45:47.93 +0400>,<she>,<DPX200>,
      <continue with go, POWCHK disabled, PULCHK disabled
       configuration hash MD5:
       00 E9 B6 7A A2 85 ED C7 34 08 36 98 17 FE 4E 26
       data hash MD5: 16K
       B1 55 60 EF 8B A4 0A 9F 9B C5 86 58 F6 E0 2B CA>)
$$ ##END=
$$ 
$$ hash MD5
$$ C8 0F BA 28 CF F1 B5 35 9F 58 07 36 5E 34 9F 21
##$RELAX= 
##$RELAX= 
##$RELAX= 
##$RELAX= 
##$RELAX= 
##$RELAX= 
$$ Bruker specific parameters
$$ --------------------------
##$DU= <F:/spectra>
##$EXPNO= 1
##$NAME= <H-F>
##$PROCNO= 1
##$TYPE= <nmr>
##$USER= <she>
##$AMP= (0..31)
100 100 100 100 100 100 100 100 100 100 100 100 100 100 100 100 100 100 
100 100 100 100 100 100 100 100 100 100 100 100 100 100 
##$AQSEQ= 0
##$AQ_mod= 1
##$AUNM= <au_zg>
##$AUTOPOS= <>
##$BF1= 200.13
##$BF2= 200.13
##$BF3= 200.13
##$BF4= 200.13
##$BF5= 200.13
##$BF6= 200.13
##$BF7= 200.13
##$BF8= 200.13
##$BYTORDA= 1
##$CFDGTYP= 0
##$CFRGTYP= 5
##$CHEMSTR= <none>
##$CNST= (0..31)
1 1 145 1 1 1 1 1 1 1 1 1 1 1 1 1 1 1 1 1 1 1 1 1 1 1 1 1 1 1 1 1 
##$CPDPRG= <>
##$CPDPRG1= <>
##$CPDPRG2= <>
##$CPDPRG3= <>
##$CPDPRG4= <mlev>
##$CPDPRG5= <mlev>
##$CPDPRG6= <mlev>
##$CPDPRG7= <mlev>
##$CPDPRG8= <mlev>
##$CPDPRGB= <>
##$CPDPRGT= <>
##$D= (0..31)
0 1.2 0 0 0 0 0 0 0 0.06 0 0.03 0 0 0 0 0.0002 0 0 0 0 0 0 0 0 0 0 0 0 
0 0 0 
##$DATE= 1632728387
##$DBL= (0..7)
120 120 120 120 120 120 120 120 
##$DBP= (0..7)
150 150 150 150 150 150 150 150 
##$DBP07= 0
##$DBPNAM0= <>
##$DBPNAM1= <>
##$DBPNAM2= <>
##$DBPNAM3= <>
##$DBPNAM4= <>
##$DBPNAM5= <>
##$DBPNAM6= <>
##$DBPNAM7= <>
##$DBPOAL= (0..7)
0.5 0.5 0.5 0.5 0.5 0.5 0.5 0.5 
##$DBPOFFS= (0..7)
0 0 0 0 0 0 0 0 
##$DE= 6
##$DECBNUC= <off>
##$DECIM= 32
##$DECNUC= <off>
##$DECSTAT= 4
##$DIGMOD= 1
##$DIGTYP= 9
##$DL= (0..7)
0 120 120 120 120 120 120 120 
##$DP= (0..7)
150 150 150 150 150 150 150 150 
##$DP07= 0
##$DPNAME0= <>
##$DPNAME1= <>
##$DPNAME2= <>
##$DPNAME3= <>
##$DPNAME4= <>
##$DPNAME5= <>
##$DPNAME6= <>
##$DPNAME7= <>
##$DPOAL= (0..7)
0.5 0.5 0.5 0.5 0.5 0.5 0.5 0.5 
##$DPOFFS= (0..7)
0 0 0 0 0 0 0 0 
##$DQDMODE= 0
##$DR= 18
##$DS= 0
$$ [...]
##$SUBNAM2= <"">
##$SUBNAM3= <"">
##$SUBNAM4= <"">
##$SUBNAM5= <"">
##$SUBNAM6= <"">
##$SUBNAM7= <"">
##$SUBNAM8= <"">
##$SUBNAM9= <"">
##$SW= 20.0188988654967
##$SWIBOX= (0..15)
0 0 2 0 0 0 0 0 0 0 0 0 0 0 0 0 
##$SW_h= 4006.41025641026
##$TD= 16384
##$TD0= 1
##$TE= 0
##$TE2= 300
##$TE3= 300
##$TEG= 300
##$TL= (0..7)
0 120 120 120 120 120 120 120 
##$TP= (0..7)
150 150 150 150 150 150 150 150 
##$TP07= 0
##$TPNAME0= <>
##$TPNAME1= <>
##$TPNAME2= <>
##$TPNAME3= <>
##$TPNAME4= <>
##$TPNAME5= <>
##$TPNAME6= <>
##$TPNAME7= <>
##$TPOAL= (0..7)
0.5 0.5 0.5 0.5 0.5 0.5 0.5 0.5 
##$TPOFFS= (0..7)
0 0 0 0 0 0 0 0 
##$TUNHIN= 0
##$TUNHOUT= 0
##$TUNXOUT= 0
##$USERA1= <user>
##$USERA2= <user>
##$USERA3= <user>
##$USERA4= <user>
##$USERA5= <user>
##$V9= 5
##$VALIST= <valist>
##$VCLIST= <CCCCCCCCCCCCCCC>
##$VD= 0
##$VDLIST= <DDDDDDDDDDDDDDD>
##$VPLIST= <PPPPPPPPPPPPPPP>
##$VTLIST= <TTTTTTTTTTTTTTT>
##$WBST= 1024
##$WBSW= 4
##$XGAIN= (0..3)
0 0 0 0 
##$XL= 0
##$YL= 0
##$YMAX_a= 957830
##$YMIN_a= -1084496
##$ZGOPTNS= <>
##$ZL1= 120
##$ZL2= 120
##$ZL3= 120
##$ZL4= 120
##$ABSF1= 10
##$ABSF2= 0
##$ABSG= 5
##$ABSL= 3
##$ALPHA= 0
##$AQORDER= 0
##$ASSFAC= 0
##$ASSFACI= 0
##$ASSFACX= 0
##$ASSWID= 0
##$AUNMP= <proc_1d>
##$AZFE= 0.1
##$AZFW= 0.1
##$BCFW= 1
##$BC_mod= 2
##$BYTORDP= 1
##$COROFFS= 0
##$CY= 11.3945322036743
##$DATMOD= 1
##$DC= 2
##$DFILT= <>
##$DTYPP= 0
##$F1P= 2.36226072786647
##$F2P= -0.459571619588291
##$FCOR= 0.5
##$FTSIZE= 0
##$FT_mod= 4
##$GAMMA= 1
##$GB= 0.15
##$INTBC= 1
##$INTSCL= 1
##$ISEN= 128
##$LB= 0.24
##$LEV0= 0
##$LPBIN= 0
##$MAXI= 10000
##$MC2= 0
##$MEAN= 0
##$ME_mod= 0
##$MI= 1.114404
##$NCOEF= 0
##$NC_proc= 0
##$NLEV= 6
##$NOISF1= 3.799351
##$NOISF2= 2.8
##$NSP= 1
##$NTH_PI= 0
##$NZP= 0
##$OFFSET= 15.70392
##$PC= 1
##$PHC0= -14076.74
##$PHC1= 10.80089
##$PH_mod= 1
##$PKNL= yes
##$PPARMOD= 0
##$PSCAL= 0
##$PSIGN= 0
##$REVERSE= no
##$SF= 200.130013532006
##$SI= 16384
##$SIGF1= 3
##$SIGF2= 2
##$SINO= 400
##$SIOLD= 16384
##$SREGLST= <1H.CDCl3>
##$SSB= 0
##$STSI= 0
##$STSR= 0
##$SW_p= 3612.71676300578
##$SYMM= 0
##$S_DEV= 0
##$TDeff= 0
##$TDoff= 0
##$TI= <>
##$TILT= no
##$TM1= 0
##$TM2= 0
##$TOPLEV= 0
##$USERP1= <user>
##$USERP2= <user>
##$USERP3= <user>
##$USERP4= <user>
##$USERP5= <user>
##$WDW= 1
##$XDIM= 8192
##$YMAX_p= 0
##$YMIN_p= 0
$$ End of Bruker specific parameters
$$ ---------------------------------
##NTUPLES= NMR FID
##VAR_NAME=  TIME,          FID/REAL,        FID/IMAG
##SYMBOL=    X,             R,               I
##VAR_TYPE=  INDEPENDENT,   DEPENDENT,       DEPENDENT
##VAR_FORM=  AFFN,          ASDF,            ASDF
##VAR_DIM=   8192,          8192,            8192
##UNITS=     SECONDS,       ARBITRARY UNITS, ARBITRARY UNITS
##FACTOR=    0.0002496,     1,               1
##FIRST=     0,             0,               0
##LAST=      2.0444736,     0,               0
##MIN=       0,             -1084496,        0
##MAX=       2.0444736,     957830,          0
$$ Real data points
##PAGE= N=1
##DATA TABLE= (X++(R..R)), XYDATA
0@%%%%%%%%%%%%%%j08K16k16K16k16L24m32M32n40O48p56R30j038J188j404J620
$$ 0 0 0 0 0 0 0 0 0 0 0 0 0 0 0 -108 108 -108 108 -108 216 -216 216 -324 324 -432 498 -540 648 -756 864
30H64j841K099k416K742l082L480l917M392m926N512o137O824p576Q395r297J0280
$$ 864 -977 1122 -1294 1448 -1634 1846 -2071 2321 -2605 2907 -3230 3594 -3982 4413 -4884 5396
46E396j1346J2512j3799J5206j6739J8437k0319K2406k4745K7369l0332L3732
$$ 5396 -5950 6562 -7237 7969 -8770 9667 -10652 11754 -12991 14378 -15954 17778
58A7778l7656M2239m7696N4313o2537P3082q7162J07029j37375J89953l06441
$$ 17778 -19878 22361 -25335 28978 -33559 39523 -47639 59390 -77985 111968 -194473
69a94473J068475n91261j367237J770020K72306j132709Q2311Q50233q63919n29830
$$ -194473 874002 282741 -1084496 685524 957830 -174879 -92568 757665 -106254 -636084
79f36084J029731M98676j183878l60401R01690J79326o96028K57742M01296o92006
$$ -636084 393647 892323 -291555 -651956 249734 429060 -266968 -9226 392070 -299936
89b99936k84868J075023J20442j125641K8229R11389l19547m79678O40025R3486
$$ -299936 -584804 490219 610661 -514980 -486751 424638 105091 -374587 265438 358924
99C58924r62121J82467J099532l19997j010168M47221O62061o19725j82851Q61988
$$ 358924 -603197 -420730 678802 358805 -651363 -204142 457919 -161806 -344657 517331
109E17331k87612j033244O14413J021292p66502p20778P79936J93109p27959L95615
$$ 517331 229719 -803525 -189112 832180 65678 -655100 124836 317945 -410014 -14399
119a4399O57431q07856n55656R22231L87270p70178j19383N09452k23207l01026
$$ -14399 643032 -164824 -720480 201751 589021 -181157 -300540 208912 -14295 -315321
129c15321N48614K13993p49190j95129P42579J45990n64228J4737L18499k80612
$$ -315321 233293 447286 -301904 -497033 245546 391536 -172692 -157955 160544 -120068
139a20068j16069N55203M678p04086L5661O47682p9020m15699J82908J32302l57277
$$ -120068 -236137 319066 323744 -380342 -344681 303001 223981 -191718 -8810 123492 -233785
150b33785R0486N30614j94376o03171K14788M98006k16867k29848K46258q1625
$$ -233785 -143299 387315 192939 -410232 -195444 302562 85695 -144153 102105 20480
160B0480l12086L14514L63611l89357l27008L16718J69732j75309O2264O5625
$$ 20480 -291606 22908 386519 -2838 -329846 -13128 156604 -18705 43559 109184
170A09184k66426l8240L47408P3837k74036j03895J06099O6549N2177M6318j20307
$$ 109184 -157242 -195482 151926 225763 -48273 -152168 -46069 20480 72657 118975 -1332
181a332j67035P5571K08680L3760j43651j18354O129J19260J10357k8466j41316
$$ -1332 -168367 -92796 115884 149644 5993 -112361 -106232 13028 123385 94919 -46397
192d6397q0854O5977J31173O1574q3403j60883k9709J66551J31456q0291j57392
$$ -46397 -127251 -61274 69899 131473 48070 -112813 -142522 24029 155485 75194 -82198
203h2198k8581Q7127P4785M1084j8680j65817r3988K20353J78670j87885j62230
$$ -82198 -110779 -23652 51133 92217 73537 -92280 -186268 34085 212755 24870 -137360
214a37360J07868K8067l6785J65114J7344l26542l2672L72746K9033k82550L4173
$$ -137360 -29492 -1425 -38210 126904 144248 -182294 -214966 157780 186813 -95737 -61564
225f1564J12804j56824M4444K95971j32322l73778J44108L41341j36434j91221
$$ -61564 51240 -105584 -61140 234831 102509 -271269 -127161 214180 77746 -113475
235a13475J57908j7030k21211J95059K92067k78887l06998K64673K30052k11873
$$ -113475 44433 27403 -193808 1251 293318 14431 -292567 -27894 202158 -9715
245i715o0798J76707j38766j85665K89875K12644l35000k11906K93856J28295
$$ -9715 -70513 106194 -32572 -218237 71638 284282 -50718 -262624 31232 159527
255A59527k14969L1990J61932k26742j49201L80139J43166m25687r8444L57022
$$ 159527 -55442 -23452 138480 -88262 -237463 142676 285842 -139845 -238289 118733
265A18733j7320k24275J91374R2995l64680m539M64126n1144m33357J01375K84175
$$ 118733 101413 -122862 68512 161507 -203173 -207712 256414 205270 -228087 -126712 157463
276A57463j76632q3722K76075q4994l68277J80896L92163k04458l10199J96221
$$ 157463 -19169 -102891 173184 88190 -280087 -99191 292972 88514 -221685 -25464
286b5464J38302k01918O0344K35562k13118k67091K71073K58824k48847j72788
$$ -25464 112838 -89080 -28736 206826 -6292 -273383 -2310 256514 7667 -165121
296a65121J95046J9002j58447J50250J58404k70546j72921L02157J56791k60218
$$ -165121 29925 48927 -109520 40730 199134 -71412 -244333 57824 214615 -45603
306d5603p3013J85986p0964j24739K27728Q8487l24558o6678L24627K6014k37158
$$ -45603 -118616 67370 -3594 -128333 99395 187882 -136676 -203354 121273 147287 -89871
317h9871N5129J14323j70309q481K72648m9148l08355O5917K51826p1978j25700
$$ -89871 -34742 79581 -90728 -99209 173439 124291 -184064 -118147 133679 61701 -63999
328f3999R6698j1604j46571J05485J93610j30055j97785J03332J33572o2300k2626
$$ -63999 32699 21095 -125476 -19991 173619 43564 -154221 -50889 82683 20383 -2243
339b243M6228q4215p1011J41166J12545j31919j29310Q0379Q8091k5467j522M857
$$ -2243 43985 -40230 -111241 29925 142470 10551 -118759 -38380 49711 24244 22722 27579
351B7579q9965k6804J38466O9305j27274q6945P4006M9282j1598K9951k2485j09247
$$ 27579 -62386 -89190 49276 118581 -8693 -95638 -21632 27650 16052 46003 23518 -85729
363h5729J7786J39288J4230j08717l5022L3084K3052M2625K0904p9770o3241O2838
$$ -85729 -67943 71345 85575 -23142 -58164 -25080 -2028 40597 61501 -18269 -81510 -18672
375a8672P0947j0128l1256m4630k9248O1760P7823m0035q0619o8L4376K3510L7273
$$ -18672 52275 42147 10891 -33739 -62987 -1227 76596 36561 -44058 -44126 -9750 13760 51033
388E1033j3159r7531j6365J09952L8913p1725k9977J1153j2636L1590P2250l7576
$$ 51033 37874 -59657 -76022 33930 72843 1118 -28859 -17706 -30342 1248 73498 35922
400C5922j13292J3458J09059J0605n7810j0539r009k3663N4606P5555n7992j15190
$$ 35922 -77370 -63912 45147 55752 -2058 -12597 -21606 -45269 9337 84892 26900 -88290
412h8290L4956J10655j2261o0546J5432j2111m9059P0924R4452r2067j19828Q1775
$$ -88290 -53334 57321 45060 -15486 -54 -12165 -61224 9700 104152 12085 -107743 -25968
424b5968R7670o2405k7277N3706o3808o1248J33307P5139j55154o8542J26353
$$ -25968 71702 9297 -17980 35726 -28082 -89330 43977 119116 -36038 -104580 21773
435B1773L2016p8541L7983L4570j13474j2054J58767O716j52658j11J02903k5763
$$ 21773 53789 -24752 13231 47801 -65673 -77727 81040 87756 -64902 -65013 37890 12127
447A2127l4797P1315j7143j20602L9981J43140l7731j23599L0971O9454m3288
$$ 12127 -22670 48645 31502 -89100 -49119 94021 56290 -67309 -36338 33116 -10172
458a0172k121P3218m7105j07102O4068J22714o0798r8575N5468L5321n8510L6925
$$ -10172 -12293 60925 13820 -93282 -29214 93500 32702 -65873 -10405 24916 -33594 3331
470C331P7419r0096r6173J08887R2025r6742n1264P2261j9727n1678Q9673M4081
$$ 3331 80750 -9346 -105519 3368 95393 -1349 -52613 19648 -79 -51757 37916 81997
482H1997j29064m3072J26110L0385q8093M391M0944n8402k842J05735j2209j24076
$$ 81997 -47067 -90139 35971 66356 -21737 -17346 23598 -34804 -37646 68089 55880 -68196
494f8196J0088J02765p443n2886J9045j99m8888L5376P9857m4330q8858K9072
$$ -68196 -58108 44657 37214 -15672 3373 3174 -45714 -10338 69519 25189 -63669 -34597
506c4597P0093j5646k5220J7182k0975l9861N3405O3824n9596o9632M5413M8120
$$ -34597 35496 19850 -5370 11812 -9163 -49024 4381 68205 8609 -61023 -15610 32510
518C2510k8913j442K1287m8361k2862P2025L3605o9709l1117M6098L480j2194
$$ 32510 3597 2155 23442 -24919 -47781 24244 57849 -11860 -42977 3121 6601 -5593
530e593L1670p268o1846R905O8185P73m9939n855J6106o121J9448K7986l8353
$$ -5593 26077 18809 -43037 -33132 35053 35826 -14113 -19968 -3862 -9983 9465 37451 -902
543i02m3528L1074M1260q352j9569r502j2393R867L8469M441m5591k0318K7666
$$ -902 -44430 -13356 27904 19552 -17 -9519 -21912 -12045 26424 30865 -14726 -35044 -7378
556g378K6578l53j3599k0719j0536K3876L2005p128m1148j1547L0086J5674l244
$$ -7378 19200 18847 5248 -15471 -26007 -2131 29874 22746 -18402 -29949 137 15811 12567
569A2567m448k0778j9134L3993L4647k5344l5568P726J9270N35J4049M31m2090
$$ 12567 8119 -12659 -31793 2200 36847 11503 -24065 -16339 2931 3466 17515 17946 -24144
582b4144p891N0540J3599l6274j0927J2687p286O555L2052j2753n0114J1534M6694
$$ -24144 -32035 18505 32104 -4170 -15097 -2410 -9696 -3141 28911 16158 -33956 -22422 24272
595B4272p838k4045J0214p504j7209K8040L1613l7728l6046K9463K6801j6017
$$ 24272 16434 -7611 2603 -4901 -22110 5930 37543 -185 -36231 -6768 20033 4016
607D016l651Q191k2050r804L8078J7317l6816k4503K3905J9644j0376K049L151
$$ 4016 365 8556 -13494 -23298 14780 32097 -4719 -29222 -5317 14327 3951 6000 9151
620I151k9351m032M6839J0541m7215j2517L2234L593j2744J7806l876m0770J0138
$$ 9151 -20200 -24232 22607 33148 -14067 -26584 5650 9243 -3501 14305 10429 -30341 -20203
633b0203N4144j1531m5611Q381K2403j0528M257K3033k5878l5966L4237M0272
$$ -20203 33941 22410 -23201 -14820 7583 -2945 1312 24345 -1533 -37499 -3262 37010
645C7010l1768k6292K0250L425j2687K0811J3015l5874j8553L8420J6357k6956
$$ 37010 5242 -21050 -800 2625 -10062 10749 23764 -12110 -30663 7757 24114 -2842
657b842o758J2017r893m27K4739m10l3067n662L3185O582k1625j102R269j5254
$$ -2842 -9600 2417 -7476 -7903 16836 16426 -16641 -22303 10882 17464 -4161 -5263 4006 -11248
671a1248J755L0307n737l5871M524K9148n456j2657J2636p279k1557J8793L0547
$$ -11248 -9493 20814 15077 -20794 -16270 12878 7422 -5235 7401 122 -21435 -2642 27905
684B7905k2382k9789J9144J6610j1755K380Q816j9735j2424L0510J5894k9870
$$ 27905 5523 -24266 -5122 11488 -267 2113 10929 -8806 -21230 9280 25174 -4696
696d696j2003J8199p30k741J4073m512k6508N971K7693p11k0904n49O233j965
$$ -4696 -16699 1500 770 -1971 12102 7590 -18918 -12947 14746 14035 -6869 -7418 -1185 -3150
710c150O892R711j3647j7163J0155K0335m562j4710J5M419l634R764J0638j7257
$$ -3150 3742 13453 -194 -17357 -7202 13133 8571 -6139 -6124 -1705 -5339 4425 15063 -2194
724b194j5484J6746J5940j1404r105N010l010l812J6059N103k2990n208K1055
$$ -2194 -17678 -932 15008 3604 -5501 -491 -3501 -7313 8746 13849 -9141 -14349 6706
737F706r7j0251O642J391j4928M213K2023o733k2111O174J2891o959J987Q559
$$ 6706 6609 -3642 3000 4391 -10537 -6324 15699 8966 -13145 -6971 5920 -1039 948 9507
751I507j2882j1275J7239J2100j4765q026P755q56k307R435L868j6251n292J5987
$$ 9507 -3375 -14650 2589 14689 -76 -8102 -347 -1203 -3510 5925 9793 -6458 -11750 4237
765D237O911j0830o084K590J246J234R448k179j8413J910J8088L27j1563k91L707
$$ 4237 11148 318 -5766 -3176 -1930 -696 8752 6573 -11840 -9930 8158 8485 -3078 -3369 338
780C38m640L794J1749o746j8703Q072J6579o158r107N769j348p837J1446R627
$$ 338 -4302 -508 11241 4495 -14208 -6136 10443 4285 -4822 947 -401 -8238 3208 12835
794A2835j5721r986J5285N328j1107K667P142j2654j684J6408j030j3534k1R276
$$ 12835 -2886 -12872 2413 7741 -3366 -699 6443 -6211 -7895 8513 7483 -6051 -6072 3204
808C204k002l852Q554l455j0875M837J1185k366q793O37N178l817J017N978l154
$$ 3204 1202 -2650 5904 2449 -8426 -3589 7596 5230 -3563 -2926 2252 -1565 -548 5430 2276
823B276j0478M980J1280n229p623K860J100j677M314N867r815q243J0539Q581
$$ 2276 -8202 -3222 8058 2829 -4794 -1934 -834 -2511 1803 7670 -2145 -10388 151 8732
837H732q615l839N721m586k162J0129K197j4226j050J3397j056q016L171J383
$$ 8732 117 -3722 1999 -2587 -4749 5380 7577 -6649 -7699 5698 4642 -3374 -203 1180
851A180p921O157J0490q946r680P291P000m629j426K817m341l177P776L189p097
$$ 1180 -6741 -584 9906 960 -8720 -1429 5571 942 -484 2333 -2008 -5185 2591 5780 -1317
866a317j862L567J872k346J007J271m803j059O445L053q290n83M353m02l521M589
$$ -1317 -3179 388 2260 -86 921 2192 -2611 -3670 2775 5828 -2462 -3045 1308 906 -2615 1974
882A974J374p006K43P164k14o549K443L089n646N53Q340m210p886M217P933m469
$$ 1974 3348 -3658 -3415 3749 3535 -3014 -571 2518 -3128 -2575 5765 1555 -6331 -2114 5819 1350
898A350m856O606l099n930Q388N108r394m174Q385j003k510K572Q27n416j16R063
$$ 1350 -3506 3100 1 -5929 2459 7567 -1827 -6001 2384 1381 -1129 1443 2270 -3146 -3262 5801
914E801k187p602p73O433o33j252J622j439m077M554L023k154m796J973M439k937
$$ 5801 3614 -3988 -4761 1672 1039 -213 1409 -30 -4107 447 3470 1316 -3480 -1507 2932 -5
930ej039K883j908l408L138N589n290m736M352L569n139Q41L575l945k320N801
$$ -5 -1044 1839 -69 -3477 -339 5250 -40 -4776 -424 3145 -1994 -1153 2422 -1523 -3843 1958
946A958J640o594J105N386l234m535P435N41q673L055N639m183j765L883m16m625
$$ 1958 3598 -2996 -1891 3495 261 -4274 3161 3702 -4971 -1916 3723 -460 -2225 1658 1242 -3383
962c383J808N934m052m355M129J195l027J762K528l979j187L588K733l607k036
$$ -3383 -1575 4359 307 -4048 81 1276 -1751 11 2539 -1440 -2627 961 3694 87 -1949
977a949J730J848l039J955K11j824j463M404P55l992j589N026m14k822K235M80
$$ -1949 -219 1629 -1410 545 756 -1068 -2531 1873 2628 -1364 -2953 2073 1659 -1163 1072 1552
993A552m868J129O199j761m857K422L493l851j582L162j809l102O587J566o339
$$ 1552 -3316 -2187 4012 2251 -2606 -184 3309 -542 -2124 1038 -771 -3873 2714 4280 -2059
1008b059r94N664k119j633K596K62k674J98K684j061k311K484P45k850l88K049
$$ -2059 -3053 2611 492 -1141 1455 1717 -957 -759 1925 864 -1447 1037 1782 -1068 -1456 593
1024E93Pj494R14J523j759j025K039R83l040j32J587J279k348j079K625p75j108
$$ 593 600 -894 20 1543 -216 -1241 798 1781 -1259 -1391 196 1475 -873 -1952 673 -102 -1210
1041a210L141j008m217K796M037l420k496L235N21j691M11K713l570k231M620
$$ -1210 1931 923 -3294 -498 3539 119 -2377 858 1379 -312 99 2812 -758 -2989 1631
1056A631M48l830P13J877k484R13K763p44m003K589K395k523j943K712Q0k410
$$ 1631 2079 -1751 -1038 839 -1645 -732 2031 1287 -2716 -127 2268 -255 -2198 514 594 -1816
1072a816J864l44l8q02K579j437p77j069K518j379J98N53K7j113K54J944p43j469
$$ -1816 48 -296 -334 -1136 1443 6 -771 -1840 678 -701 -503 50 77 -1036 -782 1162 419 -1050
1090a050mK421k89k374P49J725j531K6J752k264j143L366P95m228p65M397l6l469
$$ -1050 -1054 1367 1078 -1296 -547 1178 -353 -327 1425 -839 -1982 1384 2179 -2049 -2814 1583 1547 -1922
1108a922L133l51k643J728L081k765k020K121J602k738J009J041j776j722L833
$$ -1922 1211 860 -1783 -55 3026 261 -1759 362 1964 -774 235 1276 -500 -2222 1611
1123A611o3l761J618K377j164j060n20R18R20l61J67p53n29L62J129P46k519L12
$$ 1611 1548 -2213 -595 1782 618 -442 -962 -44 876 515 682 -71 -600 -238 891 1637 -882 -570
1141e70K033j116j461J776N6k585J774J655k899j115L384J131k821K40J998k877
$$ -570 1463 347 -1114 662 718 -1867 -93 1562 -1337 -2452 932 2063 -758 -518 1480 -1397
1157a397J01K740q15l224K599L255k982j548J145P12j643Q57K199l324P28J982
$$ -1397 -1296 1444 629 -2595 4 3259 277 -1271 -126 586 -1057 -200 1999 -1325 -597 1385
1173A385j859J70k06J003r81N81J964k126k281K427J995j976m58Q59l36n6q03
$$ 1385 -474 -304 -510 493 -488 93 2057 -69 -2350 77 2072 96 -362 497 161 105 -698
1190f98R42n73r5K58P09j622j60J056J610j224j125K116j594%P25J495k508k67
$$ -698 244 -329 -424 -166 543 -1079 -1239 -183 1427 203 -922 1194 -400 -400 325 1820 -688 -955
1208i55J882N02l246J753o86M81M45P04j880M10J641Q11k369k70J649n04r66O74
$$ -955 927 1429 -1817 -64 -750 -269 176 880 -1000 -590 1051 1862 -507 -777 872 368 -598 76
1226G6J55o19K92J223r5k065J533o89j134R76j22L11L6J806j500q94l94J434J341
$$ 76 231 -388 -96 1127 1032 -1033 500 -189 -1323 -347 -469 -158 -122 1684 184 -710 -1104 330 1671
1245A671j640K41J051j48j021n41J709j789k84J471k52k081J180K53l64p26J592
$$ 1671 31 272 1323 1175 154 -387 1322 -467 -751 720 468 -1613 -433 -180 -544 -1270 322
1262C22l17j419N60J293j313L80J965q42r33Q54J206l364K543P59j594q72P05
$$ 322 5 -1414 -854 439 -874 -494 1471 629 -304 550 1756 -1608 935 1694 100 -772 -67
1279f7P05o47l23j50M20N95J352j450q03L87P51l8j067Q29n16o7j5r41J140J22
$$ -67 638 -9 -332 -482 -62 533 1885 435 -368 19 770 732 -335 494 -22 -89 -104 -1045 95 217
1299B17q00J174k83o63k73J384k3j681K320k068J01R91m02j424K54K406j384N2
$$ 217 -583 591 308 -355 -628 756 733 -948 1372 -696 -595 396 -6 -1430 -1176 1230 -154 -102
1317a02k36k79k08Q60M33J11j087k37J740j384L4J520k06n77K52q79L35j223J315
$$ -102 -338 -617 -825 35 468 579 -508 -745 995 -389 -355 1165 959 382 634 -245 90 -1133 182
1336A82J001j279q7L98j161J490n74m65Q68k78M30j39j707J286l92J324j187m76
$$ 182 1183 -96 -183 215 -946 544 -30 -495 373 95 525 386 -1321 -35 -427 897 -290 -766
1354g66Q19l64K94L00K01j029R91M46j039n37J057k60n84O70L74j412O24N84j64
$$ -766 53 -311 -17 283 484 -545 446 892 -147 -684 373 113 -471 199 573 -839 -215 369 205
1373B05j412Q51N35p8k03Qr45P55J097j134k89L33N87l16K96m73j147J931r43
$$ 205 -1207 -356 179 101 -102 -94 -1039 -284 813 -321 -610 -277 310 -6 290 -183 -1330 601 -342
1392c42O22o50o85P50R76p55q48l18J619o19K5P52r72n64J042N91K54k061O10
$$ -342 280 -370 -1055 -305 671 -84 -932 -1250 369 -250 -225 527 -445 -1009 33 624 878 -1183 -573
1411e73J736j841J834l12j230k81J142p76N75q5n52k13M54p0k56j72K060j494
$$ -573 1163 -678 1156 844 -386 -667 475 -301 274 189 -363 -576 -122 -192 -448 -620 1440 -54
1429e4J46L5n69j77J061j019O66L53n72j60N19n60L49M41p24J071q82l27K0p93
$$ -54 92 127 -442 -619 442 -577 89 442 -130 -290 229 -331 18 459 -265 806 -76 -403 -383 -1176
1449a176Q02R56j329N71J065j169n39R19r23J291j05n83j14L24Q63p30q5J19J92
$$ -1176 -374 582 -747 -176 889 -280 -819 100 -823 468 363 -220 -334 -10 853 123 38 157 349
1468C49q88P86M27j13o50l53J845n35j383J178k01L64o06k08m34j2K171j902j019
$$ 349 -539 247 674 561 -89 -442 1403 868 -515 663 462 826 220 12 -422 -434 1737 -165 -1184
1487a184N04Q31l7o82J494o23k06J433j499m20O8J023n64L8p95l95J633q75l40
$$ -1184 -680 151 114 -568 926 303 97 1530 31 -389 -321 702 138 176 -619 -1014 619 -256 -596
1506e96J67k7N79j57K07j376J425J44n52M73j130L70O17K75m93L80j55m23l02
$$ -596 -429 -456 123 -34 173 -1203 222 366 -186 287 -843 -473 144 419 -74 306 151 -272 -574
1525e74O62O34j193J110m76O46p66j008J92j03N88l10L27M38m0j19Q65l24j092
$$ -574 88 722 -471 639 163 809 43 -965 -773 -876 -288 -598 -271 167 127 8 873 549 -543
1544e43J415k27j259L50R63r50M75n64m26J81J220l70j7j643J025Q84Q91j114
$$ -543 872 645 -614 -264 699 -251 224 -340 -766 -585 635 265 248 -1395 -370 514 1405 291
1562B91P2o51r0R40%q47l31R25K13p28j052J083L18L47m50n70k04L80Q54n45j067
$$ 291 363 -288 -378 562 562 -285 -616 309 522 -206 -1258 -175 143 490 40 -530 -734 -354 500 -45 -1112
1583a112O17J317j508J03L22m34rJ302o85j018R91P71j359J092m93o03R02k29
$$ -1112 -495 822 -686 -583 -261 -695 -704 598 -87 -1105 -114 657 -702 390 -103 -706 196 -33
1601c3N02k014L50J495p7K34P7o85L11P26j051o4r62J015M34J30K05n77m49R68
$$ -33 469 -1545 -1195 300 223 457 534 -151 160 886 -165 -229 -1191 -176 258 388 593 16 -433 535
1621E35q88O8O37J08n60n31P96mq17J748j241j26K27L40l54J09j93m04J000J117
$$ 535 -353 -285 352 460 -100 -631 165 161 -656 1092 -149 -275 -48 292 -62 47 -146 -550 450 1567
1641A567j969J07M44p56Q86L33o53l93J007l82L3P81j691N30N38j370J090O98
$$ 1567 -402 -295 149 -607 279 612 -41 -434 573 191 224 1005 -686 -156 382 -988 102 800
1659H00p51r18K080k17m89r28Q42o79N02q14k40O71k36N61o0k33m84M86M03J81
$$ 800 49 -869 1211 994 505 -423 419 -260 242 -572 -812 -141 -377 184 124 -109 -593 -107 296 477
1679D77j958J264O17q72R25n45J30O23m46J54j38n51j07j26J118oo92L83R82j308
$$ 477 -1481 -217 400 -472 453 -92 38 661 215 369 231 -320 -427 -553 565 559 -133 250 1232 -76
1699g6M67j126K21Q61K21j902J482j36K92J58r73l04Q15M33j950J393L04l91O18
$$ -76 391 -735 -514 347 568 -1334 148 12 304 462 -511 -815 0 433 -1517 -124 180 -211 407
1718D07n49j03J03Q67o22R87j942K72Q04J82p8p3n53m54K5J503m29m90k01P31
$$ 407 -142 -245 -142 725 103 1090 -852 -580 224 406 328 255 -298 -752 -727 776 347 -143 -344 387
1738C87l39l94K91r50P24J114n47l92k31n83O92M32O64j863P21R94n17n03O68
$$ 387 48 -346 -55 -1005 -281 833 286 -106 -337 -920 -228 204 868 -995 -274 720 203 -300 368
1757C68r85R68k84J6P01p46Q57j038n53J146J06q79R26r65O92k69J86P6n28O57
$$ 368 -617 351 67 83 784 38 895 -143 -696 450 556 -323 603 -362 330 61 247 323 -205 452
1777D52m5M3n41K56L67l90Q83j373J2mk05J110M00r62p0L47k27O22j41j82N14
$$ 452 407 450 -91 165 532 142 1025 -348 -336 -340 -545 565 965 3 -67 280 53 675 534 352 866
1798H66j837J566p79q85P32J481j073K4l90J53L44k71k4R0J39K14Q45j471R61
$$ 866 -971 595 -184 -1069 -337 1144 71 95 -295 -142 202 -69 -93 -3 136 350 1195 -276 685
1817F85j294N43J519j597m76M5N49M95k27k79p19J706j439P02l40K48o6Q8o93
$$ 685 -609 -66 1453 -144 -620 -575 -26 469 242 -37 -756 950 -489 213 -127 121 55 143 -550
1836e50J45k65k72J314m1q38Q50R50j137k65O7J50o25R35M2L69j270k94J200j68
$$ -550 -405 -670 -942 372 331 -507 343 1293 156 -109 -42 108 -517 418 460 829 -441 -735 465 297
1856B97k92o6o49J913j397m00l2J087J37l55J69o13n41P97M29n46N10o87k12o
$$ 297 5 -61 -710 1203 -194 -594 -626 461 598 243 412 -201 -742 55 484 -62 448 -239 -451 -457
1876d57J14j76r7O64O75J2n06J10o89l88N43J237r13l30N75j12J76j666Q79O09
$$ -457 -343 -519 -616 48 723 735 229 339 -350 -738 -195 1042 129 -201 374 262 438 -1228 -349 260
1896B60N09o2q49k90j17M99O34p76o36J106L13n51K82q29L16J211q39r04R35P
$$ 260 769 707 -142 -432 -549 -50 584 -192 -828 278 591 40 322 -507 -191 1020 181 -723 212 219
1916B19l74l71j7O59m14J078j336l36J126O4r15J05O69n09o10Q51n52R07%K32
$$ 219 -155 -526 -543 116 -298 780 -556 -892 234 298 -617 -512 157 -352 -962 -111 -663 244 244 476
1936D76p54J162j163n58J22J445p62k71l86M98O66p04J127J16j601L99K20o52
$$ 476 -278 884 -279 -837 -715 730 -32 -303 -689 -191 475 -229 898 1014 -587 -188 32 -620
1954f20pL70Q3p15L26L47J8RM13l78J069o38q77R84j002R13j015O97N70r53K27
$$ -620 -627 -257 -174 -889 -563 -216 -198 -189 224 -154 915 277 -600 384 -618 295 -720 -23 547 -406 -179
1975a79K34K42m4j313R14Q35n97Q94q03M5p19Q73n52L84K8o13l28L33K83n60K31
$$ -179 55 297 253 -1060 -146 689 92 986 183 228 -491 382 -170 214 242 -371 -699 -366 -83 -643 -412
1996d12R1P03r96O47k27l11m12Q61N25p08l69J77L87P31o62n84M79m7N8k31O99
$$ -412 -321 382 -614 33 -194 -505 -917 -56 469 -239 -608 -431 -44 687 25 -559 -80 -127 -69 -300 399
2017C99J20M83p37q06O21p9l31L52k49j117K110o66Q79j515J445k18J22k03r19
$$ 399 519 1002 265 -541 80 1 -330 22 -227 -1344 766 100 979 -536 909 691 813 610 -309
2036c09l82R21M95q94k29M82j23k87P74p14M91m24L52j86Q1K58K31o84r11J222
$$ -309 -691 230 725 -169 -398 84 -39 -326 448 -266 225 -199 153 -33 48 306 537 -147 -1058 164
2056A64Op00O38j75l58J686j218j92k40O78m32nl47j33n64K276p60k88p9J03J93
$$ 164 170 -530 108 -67 -425 1261 43 -149 -389 289 -143 -148 -495 -628 -1192 1084 324 36 -43 60 253
2077B53j125J016j73m02j4J025n33L74j93k74J403j828J1J30P04J03m10k39k87
$$ 253 -872 144 -29 -431 -445 580 47 421 228 -46 1357 -471 -460 -330 374 477 67 -172 -459
2096d59K81n77J159q03M30n15O52q12R95K76J40j124N77p68J037n05m62l89J281
$$ -459 -178 -755 404 -399 31 -484 168 -644 351 627 767 -357 220 -548 489 -16 -478 -867 414
2115D14o73L28l40K53M55N06q50r33J087m20M85k56n68J23J112r53K54J99k09
$$ 414 -259 69 -271 -18 437 943 93 -840 247 -173 312 56 -512 -389 723 -230 24 223 14
2134A4N66q0K28j087l17N0Q66o43p22J357l16M96j29l88m8k88J266P32j360k13
$$ 14 580 500 728 -359 -676 -626 240 -403 -1125 232 -84 412 283 -105 -153 -441 825 1557 197 -16
2154a6k54Q27j027K30m51L94M09p94J125J88j68j82j49m58P76p00L74Q52k014
$$ -16 -270 557 -470 -240 -691 -297 112 -682 443 631 463 281 132 -326 450 -250 124 976 -1038
2173a038J596l29j75k77N96m1p81k4M51l0n71N73Q07l47q86J47J194k97j141J11
$$ -1038 558 229 54 -223 373 332 -449 -473 -22 -52 -623 -50 757 410 -476 -329 865 568 -573 -462
2193d62k47QQ70j289N56K37L05r2M46K25j160J348j101J293N34r36k57p91O64
$$ -462 -709 -701 169 -1120 -564 -327 -22 -114 332 557 -603 745 -356 937 1471 535 278 -513 151
2212A51N10p45k1N60p64o47Q89M67p96O56N9o53J4P27J55J84k639J296O39m51
$$ 151 661 -84 -105 455 -309 -956 -67 400 -396 260 319 -334 -320 407 562 746 -1893 -597 42 -409
2232d09K72K39j53P7m19m13P98p27O52O7L94K8r62L57R43o42q17Q69k66O06o21
$$ -409 -137 102 -51 26 -393 -806 -8 -735 -83 -16 378 406 -556 -199 744 102 -715 154 -112 494 -127
2253a27J52j082Q60o15J376k30k67L34l82P53j643J685j570J002p37J52Q11j221
$$ -127 25 -1057 -197 -812 564 334 67 401 19 772 -871 814 -756 246 -491 -339 472 -749
2271g49R54k27M72q69J77r37J376L0n27K97j235J306n95O18K36j76L84k04m49
$$ -749 205 -22 450 -419 -242 -1179 197 227 -300 -3 -1238 68 -527 91 327 151 535 331 -118
2290a18nO07L10j000N46o01o91J109k78J056j160J219r12K48M05k85k60l9o06
$$ -118 -123 484 794 -206 340 -261 -952 157 -121 935 -225 994 82 330 735 450 190 151 -455
2309d55K72j138J463k58K91J85N06n43j301J171L26o11M30j31j64j05L55l37j071
$$ -455 -183 -1321 142 -116 175 360 866 323 -978 193 519 -92 338 207 43 -62 293 -44 -1115
2328a115Q95k86J26O98M76J25J07j389j00J007m13m48n01J054J52m90K78k33k76
$$ -1115 -220 -506 -380 318 794 919 1026 -363 -463 544 131 -317 -818 236 388 -102 176 -57 -333
2347c33k2M02J60q51J454j140m11l03O63K34q48R93q91J248j037R91n86K61l59
$$ -333 -355 47 207 -644 810 -330 -741 -1044 -381 -147 -995 -2 -893 355 -682 309 -277 -16 -375
2366c75J003L67j198p23J150l61P46K9m43N72j555J167M74m96j141J543r0o14
$$ -375 628 995 -203 -926 224 -137 609 638 195 767 -788 379 853 357 -784 759 669 55
2384E5j09M90k53j184R79k52q32K93Q28j281N86J016j489Q42n32O00l30K68K70
$$ 55 -54 436 183 -1001 -22 -274 -1106 -813 15 -1266 -680 336 -1153 -311 -843 -243 -573 -305 -35
2403c5M76O38k288R69M03m89R48j300J098M64j551o59J587J95m26l91Q05n41J200
$$ -35 441 1079 -1209 -240 163 -326 622 -678 420 884 -667 -1326 261 456 30 -361 444 -97 1103
2422A103m88j256J153l54J046n21j14n88N54J52j470P44R2J01j540Q42o65J434
$$ 1103 615 -641 512 158 1204 683 569 -19 535 687 -783 -39 53 154 -1386 -544 -1209 225
2440B25k37m2j094O25K58R30j323L05K77J02J024j029J99r12jQ49j94M63J79k7
$$ 225 -12 -54 -1148 -523 -265 665 -658 -353 -76 26 1050 21 220 -692 -693 156 -38 425 604 577
2460E77n77j2Q85j255L48R34j748k19O67N18K00l6j242R08M7Q3o50P08L15n61
$$ 577 0 -12 873 -382 -34 900 -848 -1067 -400 118 318 282 -960 -52 -5 78 -572 136 451 -110
2480a10l10L23O83n34O03n59k43M6j4k05K11j465P88L11L03N79O80m89k70k9l18
$$ -110 -420 -97 586 52 655 96 -147 -101 -115 -320 -109 -1574 -786 -475 -172 407 1087 598 328 299 -19
2501a9o72M18N47L90L97j606L80k10P84r85J457n39n95N66k39r25J008K42j81
$$ -19 -691 -273 274 664 1061 -545 -165 -375 409 -576 881 342 -253 313 74 -851 157 399 218
2520B18n9o39J255j060L17J97P4o32L17j115N80J75R28j051L86J48q6o70K19J803
$$ 218 159 -480 775 -285 32 229 303 -329 -12 -1127 -547 -372 556 -495 -109 39 -47 -717 -498 1305
2540A305j608l44N15K49j073K062r05N86j72j170M31j2K72N0j14Om48R92j076
$$ 1305 -303 -647 -132 117 -956 1106 201 787 615 -555 -124 -136 136 186 72 78 -370 622 -454
2559d54R94N40k94k93q49m5P72R4k31O91j752P42N6j97J345j210K03j17n29J361
$$ -454 540 1080 786 493 -356 -401 371 465 234 925 -827 -85 -29 -226 1119 -91 112 -5 -534 827
2579H27M66j178l80j99M40m6L94n57J71L98n30O6K8j78r04R31M89J17j147L09
$$ 827 1293 115 -265 -464 -24 -70 324 -233 -62 336 -194 -128 -100 -278 -1182 -251 238 355 -792 -483
2599d83L73n29J045j948R85O43M38j18j98k28n2n29P16Q8o07O90J41L42n18j2
$$ -483 -110 -639 406 -1542 -557 86 524 406 208 -20 -72 -601 115 203 -404 286 427 769 251 239
2619B39P12j483M60j057J929j454J057K40r87J152p25j41J06m25Q52r24l81M03
$$ 239 951 -532 -72 -1129 800 -654 403 643 -344 808 83 -58 48 -377 475 -449 -830 -427
2637d27Q94j34LK67o43O9k90J90K50N30o99N97q53Q34q7o35l85N35L52l29n82
$$ -427 467 333 336 603 -40 29 -261 -71 179 709 10 607 -246 588 501 -134 -519 16 368 39 -543
2658e43L50m03K46k60Q53J11j351Q23p81J180q55P77j174J560j67j275M32OK11
$$ -543 -193 -596 -350 -610 243 354 -997 -174 -955 225 -630 147 -1027 533 366 -909 -477 -471 -260
2677b60P68j54J39k82K11J60p63O95m79O52K01p81l10l56j45O03j035P65J40L63
$$ -260 508 354 493 211 422 582 -181 514 35 687 888 107 -203 -559 -704 -101 -1136 -371 -231 132
2697A32p94P30j05N96r16M72l37p22Q19K78Q35l41j269k4L14N42O4k06l22k29
$$ 132 -662 68 -37 559 -357 115 -222 -944 -125 153 988 647 -622 -646 -332 210 274 68 -254 -483
2717d83M11m22O35n29J014j232P41M87j463J002j11K73K19j397j22J894n43k5
$$ -483 -72 -494 141 -388 626 -606 135 622 -841 161 50 323 542 -855 -977 917 374 349
2735C49K4m33j62R41r9j397J627j219J19o90K145k17q08m44M43M30p29o26M90
$$ 349 373 -60 -222 719 620 -777 850 -369 -250 -940 1205 988 180 -264 179 609 -120 -746 -256
2754b56N40n26M8J62P7o82P54l34L20j338J047N1Q13n37l18P65M51j150m9N78
$$ -256 284 -242 -194 -32 45 -637 117 -217 103 -1235 -188 -137 676 139 -179 586 1037 -113 -162 416
2774D16p05N41o55PJ91n74O65P83r61R33r79J35k58J028m17n67kr7P40M50o01
$$ 416 -289 252 -403 -396 -205 -779 -114 669 -292 641 -338 -203 -461 567 150 -417 -419 -516 224 674 73
2795G3r7p67J049m97L67m06N13j339Q66N05j93J27l71p37N36O7Q15r88J89N69
$$ 73 -24 -791 258 -239 128 -278 235 -1104 -238 267 74 201 -170 -907 -371 -304 511 -477 -288 281
2815B81j296N07K21N75J81j322L8R39m25J054n66m66J2Q80n35M30j6j194J067
$$ 281 -1015 -508 -287 288 469 -853 -815 124 -301 753 187 -279 -267 613 78 508 492 -702 365
2834C65k95q95K60J026n09L35p54P7J425r58o72j57K68K86J39J002j170N68p78
$$ 365 70 -825 -565 461 -48 287 -467 -390 1035 77 -595 -752 -484 -198 -59 943 -227 341 -437
2853d37K20L24j83Q8O12j8K70k89o32J83l17K74r3l80L59j16n1J43J75j55L55
$$ -437 -217 107 -76 12 624 606 876 587 -45 138 -179 95 2 -378 -19 -135 -186 -43 132 -23 332
2874C32p74P98L14m83O8j53L8M54j088J697q20k127K722o28m46l45L11m46N75
$$ 332 -442 356 670 187 255 102 140 594 -494 1203 383 -1744 978 350 -96 -441 -130 -576 -1
2893am30L88l54O11J066j599L52P00n97Q1k13J20l97j40K96L59k37o53J222j147
$$ -1 -431 -43 -397 214 1280 -319 33 733 136 217 4 124 -273 -413 -117 242 5 -648 574 -573
2913e73N14M10j055J128j669J521j62j48J023j163n5M31j290J068o16k46Q20J28
$$ -573 -59 351 -704 424 -1245 276 114 -34 989 -174 -229 202 -1088 -20 -636 -882 -62 66
2931F6k12J26Q12r70N45K32o27j05N33r99m5l51R23k08O16n62n28J792l68J38
$$ 66 -146 -20 792 -178 367 599 -28 -133 400 -599 -644 -995 -72 -280 336 -226 -754 1038 670 808
2951H08o05o76L89M07l02N22r22Q15j549R31P44j326J091n64Q98j544P23n2J17
$$ 808 203 -473 -84 323 21 543 -379 436 -1113 -182 562 -764 327 -237 661 -883 -160 -212 -95
2970i5m05Q6P33n08j05k42R8K77O05q64o5P92m95J61O98k92Q1m58k66J08m91J094
$$ -95 -500 -414 319 -189 -294 -536 -438 -161 444 -420 -485 307 -188 -27 671 379 460 2 -264 -156 -647 447
2992D47o83k5j47J057L89j045M90l58l60l24P98r33J196n07l76L73M43M15j909
$$ 447 -236 -261 -408 649 1038 -7 483 125 -235 -559 239 -694 502 -5 -381 -8 435 850 -1059
3011a059J466l48k68P24n44O74j38o80R25j45k88n03P46n78j3p6J44k34k75M03
$$ -1059 407 59 -209 515 -29 645 507 -173 752 607 319 -184 562 -16 -29 -105 39 -195 -470 -67
3031f7l60J07O82q0K84j014J014j015Q18k46M37n29J048j328K44M62p49P16J84
$$ -67 -427 -320 362 282 566 -448 566 -449 369 123 560 31 1079 -249 -5 457 -292 424 608
3050F08k3p38M06j080P5L17J211r7j464R97O07n59J478j254M04q53J80k00K46
$$ 608 585 -153 253 -827 -752 -435 776 679 -785 212 819 260 1738 484 888 35 215 15 261
3069B61j96p32J356p75L7L72L38p86k15M13J88j37q67M02o97K092r27j97N57q28
$$ 261 65 -667 689 -86 -49 323 661 -125 -340 73 261 124 -743 -341 -1038 1054 127 -70 487 -341
3089c41n42J79O68J55R4O08K2P5l49o63M23o98k03J015l94K1q4O70r92J4J574
$$ -341 -883 -704 -36 119 213 821 843 918 569 -94 329 -369 -572 443 49 70 -14 656 -336 -322 1252
3110A252j449N22j24l79q48Q02j136J363m3p40J090N56j196J177o76L06n04o05
$$ 1252 -197 325 201 -178 -1026 -224 -1360 3 -40 -780 310 866 -330 847 171 477 -27 -632
3128f32O69m75M20P73j154M77L36j55K79P0j700J96P64O50l29k41q16J058n32
$$ -632 37 -438 -18 755 -399 78 414 259 538 608 -1092 -896 -132 518 189 -52 -868 190 -342
3147c42m21K79q02J366l90p0M95R96q04l23J035j544J035o25M78l40q91R00o30
$$ -342 -763 -484 -1286 80 -310 -380 115 1111 307 -16 1019 -525 510 -115 363 23 -868 32 -598
3166e98M97r3P20L83o71l35l43J053j220l55O99K47l06l9J233j081j065J699L8
$$ -598 -101 -194 526 909 238 -97 -440 613 -607 -962 -263 -16 -322 -361 872 -209 -1274 425 463
3185D63r52J41Q30r44J54N51j201N66J31O62L9p77k42P3L39J63l15n02Q87O73
$$ 463 -489 -348 482 -462 -308 243 -958 -392 -261 401 440 -337 -579 -506 -167 -4 -319 -821 66 739
3205G39r04l98N4Q60P44j241J477j710M1Q22J2o25m55o75J930o44K58l70R62p11
$$ 739 -165 -563 -509 351 1095 -146 1331 -379 -338 484 496 -129 -584 -1259 671 27 285 -85 877 166
3225A66j39N13l70P9l75j58M71l30K05J61k15m29Nl4M96P08r73K14j24K48k98
$$ 166 27 540 170 249 -126 -284 187 -143 62 223 8 -421 -416 -450 46 754 -219 -5 -129 119 -179
3246a79m47J065K99j2j571R08j307P98J108r17K84o4N09p2p74K34P79P%j069P84
$$ -179 -626 439 738 726 -845 63 -1244 -446 662 -255 29 -35 474 402 -372 -138 641 648 648 -421 363
3267C63KL5p24O32m43k2M76M68l67m25q32J743k013Q28l47l24J212J051j274M18
$$ 363 365 400 -324 308 -135 -157 319 787 420 -5 -837 906 -1107 -279 -626 -950 262 1313 39 457
3287D57l09k90R44j199N05l20O8m37J114p22o0r97N81j21J474j463Q56N36m94
$$ 457 148 -142 802 -397 108 -212 -144 -581 533 -189 -249 -1246 -665 -786 688 -775 81 617 123
3306A23O93r10j14N36N99q10k56k23R00J04j93L32o54r2J23k0L97m74j96N20m40
$$ 123 816 -94 -208 328 927 117 -139 -362 538 642 449 781 127 35 158 138 535 61 -135 385 -55
3327e5m58M16J83k93j69j02J495j053P60o31j15j077J338q3l7j160R40J369j888
$$ -55 -513 -97 86 -207 -376 -478 1017 -36 724 93 -22 -1099 239 156 119 -1041 -101 1268 -620
3346f20M93Q45j120j64J113m98k44M02P04n37J90o52L33q46N38K19O23j79k92
$$ -620 -127 718 -402 -566 547 49 -195 207 911 374 564 -88 245 -601 -63 156 779 600 308
3365C08m80M49q75J024q0o21J026l86R92j407j11QK30M81J53o38oL35r92J965
$$ 308 -172 277 -598 426 346 -275 751 365 1357 -50 -161 -153 77 558 711 73 67 402 -590 1375
3385A375j745n6Q25j2r42j161J931J74j29n37L72K3L56o56J003r91J75n85J63
$$ 1375 -370 -426 399 387 -555 -1716 215 389 260 -277 95 118 474 -182 821 -170 5 -580 -417
3404d17O76M81j342Q54nr4M7m52O48n38M11j10j703J093O04m70J071j965K071
$$ -417 259 740 -602 252 247 153 200 -252 396 -142 269 159 -1544 -451 153 -317 754 -1211 860
3423H60M5o45m90M23l92O91J32L04n83p66Q31o91m08P54j53k6l80L33j13O08m34
$$ 860 905 260 -230 193 -199 492 624 928 345 -421 410 -281 -689 65 -88 -114 -494 -161 -274 334 -100
3444a00q1N20L6J08j669O38J69j27L52O83p04n28N51N34M29j863R28N39q29l25
$$ -100 -181 339 375 483 -1186 -548 -379 -506 -154 529 -175 -703 -152 382 811 -1052 -124 415 -414 -739
3464g39K15Q6L50o26K067j152l64j72q1R9J72R66o48JJ41j076J524J57j152n27
$$ -739 -524 -438 -88 -714 1353 201 -163 -335 -416 -317 -145 821 173 174 315 -761 763 920 -232 -759
3484g59P33J288j369O93o17l69O80o37J07K96l44j26p06J722k33p53l45P62K77
$$ -759 -26 1262 -107 586 -31 -400 280 -357 -250 46 -298 -424 -1130 592 359 -394 -739 23 300
3503C00K04j43k99n84R70j237O61n0k07J242j417J132k70j146K11K92K79N62q0
$$ 300 504 361 62 -522 448 -789 -128 -178 -385 857 -560 572 302 -844 -633 -341 -62 500 420
3522D20j036L29O48q8o00l63M52J190j761J534q81n88Q34k05M00K49n03K51p99
$$ 420 -616 -287 361 273 -327 -690 -238 952 -809 725 -156 -744 90 -115 285 534 31 282 -517
3541e17P88P16j081N11r55P40N40o77Q50n7r33j14K05N13m39J07l47k54K87N71
$$ -517 271 987 -94 417 -538 202 742 65 915 858 -75 -189 16 529 90 197 -150 -404 -117 454
3561D54k95p21J189K59n21j127P94m31J50M35K24m97l25M39K5k61k24O76Oj42
$$ 454 159 -562 627 886 365 -762 32 -399 -249 186 410 -87 -412 27 52 -209 -433 243 249 107
3581A07l04P39j64M45j062K06K96k94j12l47L44j85k49L27Q90j710J732R1r28
$$ 107 -197 542 378 823 -239 -33 263 -31 -143 -490 -146 -331 -580 -253 637 -1073 659 750 -178
3600a78K43P32p83L2N91p86N17M73m04R7m27O33n68L90j183J384l82p91M98J6
$$ -178 65 797 14 46 637 -149 368 841 437 534 107 740 172 562 -621 763 381 -410 88 104
3620A04r28J328j41j9o43O50J13n85M3%o11P72M84l68J560j755L21n42o78Q47
$$ 104 -824 504 363 344 -299 351 464 -121 -78 -78 -689 83 567 199 1759 4 325 -217 -895 -48
3640d8R32p91l1n86K4R54p89Q3L65j70K92j047J223K88p07j16M91o88Q82m02j52
$$ -48 884 93 62 -524 -500 454 -335 -252 113 -57 235 -812 411 699 -8 -124 367 -321 561 159 7
3661GQ1K76K9L79j622J64N12M40L84j792P21Q08m9k21q42k92R29n23M72J38q67
$$ 7 88 364 393 772 -850 -686 -174 266 650 -1142 -421 387 338 117 -725 -1017 -88 -611 -139 -1 -868
3682h68P08J160o51L00j185N13L6k57k86k21J31N32l72j82J78L95M64j008L88
$$ -868 -160 1000 349 649 -536 -23 13 -244 -530 -751 -620 -88 -460 -642 -464 -69 395 -613 -225
3701b25l16P88n78L48k54Q94j545N16J012p24n95P6j71J366n23R2M29j193J016
$$ -225 -541 247 -331 17 -237 657 -888 -372 640 -84 -679 -603 -774 592 69 161 590 -603 413
3720D13l60l11k91P12o68j44k5J303q25L30j220L57M40J108o82Q4M83o96j30k50
$$ 413 53 -258 -549 163 -505 -649 -674 629 -196 134 -1086 -729 -289 819 137 221 704 8 -122 -372
3740c72L86n61N64n44P75k15o67R64P6J08n08M2r4n62K98N2kj63O51M91l72o91
$$ -372 14 -547 17 -527 248 33 -634 330 406 514 6 48 -46 -608 -310 -258 -260 -423 228 719 347 -344
3762c44P4o3Q50j107O14k0K05J20l92l52Q70o21o88R53N79j297M4J247j254J445
$$ -344 -270 -333 517 -590 24 4 209 329 -63 -415 455 -166 -854 99 678 -619 -575 672 -582 863
3782H63j188P49k95q55M13M67J24j27p92J067J11J41n95K29J7o44M65j64O25j415
$$ 863 -325 424 129 -726 -313 154 278 151 -641 426 537 678 83 312 329 -315 150 -14 611 -804
3802h04M09K92P24l48m76L66R4k71M7J24J78j228J574n20P7l90P5K59N37p99k80
$$ -804 -395 -103 621 273 -203 163 257 -14 33 157 335 -893 681 161 238 -152 -77 182 719 -80 -360
3823c60K97K65j24j005J294L89r16J089j012pj17m20M55L25j614J029J145j77
$$ -360 -63 202 78 -927 367 756 -160 929 -83 -90 -207 -627 -172 153 -1461 -432 713 536
3841E36o91J054l58j714K04L99r0J262j6j347K30K74P15p82J52R4n49N91J99n25
$$ 536 -155 899 541 -1173 -969 -570 -660 602 586 -761 -531 -257 458 -324 -172 -78 -627 -36 163 -362
3861c62J156j143P5J242p26n72M82n47M81J222j113q67J456J04k35p56K49m97
$$ -362 794 -349 -274 968 242 -330 152 -395 86 1308 195 -672 784 888 653 -103 146 -351
3879c51L57q0P45j607N03J673j166k03L01J414j106m33M66j73K31j243L64L81
$$ -351 6 -74 671 -936 -433 1240 74 -129 172 1586 480 47 513 340 571 -672 -308 73
3897G3l5Q04j68o78N14o18K65J34q60O73o6j64k78J95L44n34l88Q80J9J025j413
$$ 73 38 842 674 -4 510 -108 157 291 -569 104 38 -126 -404 -209 135 -399 -787 93 112 1137 -276
3918b76O09R54j250J55k98l72N31R4n43P18N32j320Q16q73L93rK65M88r56O03
$$ -276 333 1287 37 192 -106 -478 53 147 -396 322 854 -466 350 -523 -130 -139 126 614 -342 261
3938B61N18r13r97Q46O73o05N65N13r74K20j34q9k22O38L84p77j37J156j187j28
$$ 261 779 -134 -1131 -285 388 -217 348 861 -113 107 -27 -116 -338 300 684 -93 -230 926 -261 -389
3958c89N30L14r07M51n59J087r06P27m7N12j071L35m27J198j523j8M24Q61r0j155
$$ -389 141 455 -452 -1 -560 527 -379 348 301 813 -258 77 -350 848 -675 -693 -269 592 502 -653
3978f53J531j470n29J409J98j124Q46k55M57j50l44m22O70K70M29j378K31R49
$$ -653 878 -592 -1121 288 486 -638 208 -47 410 260 -84 -506 164 434 863 -515 -284 665
3996F65q53O7j85Q62j95j342L20O55n38J997j817j084J292O10o47J37R81j579
$$ 665 -188 -121 -306 556 361 -981 -661 -6 -544 1453 -364 -1448 -156 454 -193 -56 925 -654
4014f54J025P1r7m12L9k29l70K12k01L25N70p21o87J017J113j200o8k73J593j108
$$ -654 371 442 345 -67 -28 -257 -627 -415 -616 -291 279 -442 -1129 -112 1001 -199 -267 -540 1053 -55
4034e5k62o3J090n77r8O67o16L78o12J01J322j401m88J032o06L00p61K95J769
$$ -55 -317 -380 710 133 35 702 86 464 -148 -47 1275 -126 -614 418 -188 112 -649 -354 1415
4053A415j602J098j070l15K92K7O68j09L69o16n88J83R71j860J403J78m41j231
$$ 1415 -187 911 -159 -474 -182 -155 513 404 773 157 -431 -248 723 -1137 266 444 3 -1228
4071a228J721J45J68N29j682m78R69O26n87L37j51o6M33l94p36r4L94m52J17J50
$$ -1228 493 638 806 1335 -347 -825 144 770 183 520 369 303 736 342 -394 -488 -94 -546 -429 -279
4091b79J141p47P50j161M28n29O73j544J003KQ16n69J09L33p62l76P46r38N46
$$ -279 862 115 865 -296 132 -397 276 -1268 -265 -263 553 -16 93 426 -336 -712 34 -904 -358
4110c58Q81p02O52N0L30Kj267M9k51P38k39L79k95Q89n0p23j84P79r60L4O69l29
$$ -358 523 -179 473 523 853 855 -412 -363 -614 124 -115 264 -31 858 808 85 -99 680 -280 -246 423 94
4132I4J21l46L2r25J90O42L04L8O54r03k93K57m04K82m26P00q79M26J93J15R94
$$ 94 215 -131 -99 -1024 -834 -192 112 150 804 -99 -392 -135 -539 -257 -683 17 -862 -436 -243 -128 866
4153H66o4k099J501j71j45m97Q86l08N80m6n55j56p2J20P46L05n47n77Q09j026
$$ 866 802 -1297 204 33 -112 -609 277 -31 549 503 -52 -208 -280 -160 586 891 344 -233 576 -450
4173d50K13L50M41m96j82l17j09K94k88L80N07L90m26P8K57j709J424N5R23l25
$$ -450 -237 113 554 58 -124 -441 -550 -256 -544 -164 343 733 307 385 642 -1067 357 412 1335 1010
4193A010j106J402j296o8N25n99L67j65o97P62M48l86p47K46Q23L00j111N64K95
$$ 1010 -96 1306 10 -58 467 -132 235 70 -627 135 583 197 -550 -304 519 819 -292 272 567
4212E67k70K35J40o33N60r43L76J07l44j33O7j45J12j346J424L2Q75j226P33p00
$$ 567 297 532 672 39 599 -344 32 139 -205 -338 -271 -416 -304 -1650 -226 -194 681 -545 188 -512
4232e12l42r7Q41J023o35L9n30L92j71R44j217P50j20q6L44p59J20M66M4j712
$$ -512 -854 -951 -110 913 278 317 -213 179 8 952 -265 485 365 279 623 -136 -16 450 494 -1218
4252a218J080L80k6n08O50p43l29J103q84O93j7m45M70Q12j616J52J092k54M02
$$ -1218 -138 242 216 -292 358 -385 -714 389 -495 198 181 -264 206 1018 -598 -446 646 392 794
4271G94q85L04j13o86l60O31K49K54j09L99p18O53o32k16P40n08K38Q8J48M86
$$ 794 -91 213 100 -586 -946 -315 -66 188 79 478 -240 413 -219 -435 305 -203 35 123 271 757
4291G57o42M62m31J338j906O57M49j479J2R62P9n58N23O11j053J72m42m2J40m4
$$ 757 115 577 146 1484 -422 235 684 -795 -783 179 258 -300 223 834 -219 -47 -489 -531 -391 -435
4311d35J35n47P47M29J027j391l00J067m74j049J101J6q28M85n66O63M64l6p25
$$ -435 -300 -847 -100 329 1356 -35 -335 732 258 -791 310 326 -502 -17 -583 80 544 508 -217
4330b17J409n99j110m08P18J15K88l61Kk76L05j46O33m2J62n65j121Q37N13m46
$$ -217 1192 593 -517 -925 -207 -92 196 -165 -163 -439 -134 -280 353 311 473 -92 -1213 -376 137 -309
4350c09J263k31q39l74O01k56M38m01p5k57O33j070J103K01k39L87k95j24n92
$$ -309 954 723 -116 -490 111 -145 293 -108 -183 -440 193 -877 226 427 188 575 280 156 -436
4369d36J05M04q2p43L17kl37P73l5N01q45L46m60P93j51P58m94M8N98m17j359
$$ -436 -331 73 -9 -752 -435 -437 -774 -1 -36 465 -380 -34 -494 299 148 906 412 460 1058 641 -718
4390g18P47K04r24N95M32r52j78O08M31L34k64j298N19J089k75j51m41j02J242
$$ -718 29 233 -691 -96 336 -616 -794 -186 245 579 315 -983 -464 625 350 199 -242 -344 898
4409H98q19j473J629Ol38L06o52ON39O99m71n37J005n78m07K86R04m62J51m00
$$ 898 79 -1394 235 241 -97 209 -443 -437 102 801 330 -207 798 220 -187 99 1003 541 692 292
4429B92l34K87p94J486r35o2l16R10l69R7L17j237Q8R92J87o10J008o10m90R57
$$ 292 -42 245 -549 937 2 -60 -376 534 165 262 579 -658 -570 422 609 -1 1007 397 -93 864
4449H64l04j643R83m26J14N14k32m03J381j437N2J307j86j51p91O94q90N76r50
$$ 864 560 -1083 -100 -526 -412 102 -130 -533 848 -589 -537 770 584 433 -358 336 -554 22 -928
4468i28j88K528o93j430P20k23M79L78o22j98p13J108N75m11j130K83O27j08K06
$$ -928 -1116 1412 719 -711 9 -214 265 643 21 -177 -890 218 793 382 -748 -465 162 54 260
4487B60q73L19P4N64o23J026r92j71P47J65lq89M93O05l56p47Q02j324Q38k46
$$ 260 -613 -294 -220 344 -279 747 -245 -416 331 496 493 -396 97 702 346 -401 401 -923 -85 -331
4507c31m55J741o42l15R0N08J14j134Q17o21J74K64k8L94l97Rk74m51O70r13j88
$$ -331 -786 955 313 -2 88 596 710 -424 393 -228 -54 210 182 576 179 188 -86 -537 133 -780 -968
4528i68J383j035M00m17N87P1o25J397o60o06J34J223j234J11n54R67p66J41R80
$$ -968 415 -620 -220 -637 -50 21 -604 793 133 -473 -339 884 -350 -239 -793 174 -592 -451 529
4547E29j006K56k90k38J686k108J147n3o8n8p16R21K36p07J15O73j265J599j237
$$ 529 -477 -221 -511 -749 937 -1171 -24 -77 -145 -203 -919 2 238 -469 -354 319 -946 653 -584
4566e84M10p81J352k57R33j193n82N27R59j295P33M56q93J21o60O84k72N10p51
$$ -584 -174 -955 397 140 1073 -120 -702 -175 784 -511 222 678 -215 -94 -754 -70 -342 168 -583
4585e83k19J246o75j53O06p95L12P73n03L69o05k51qM45O75p47J96j37M31j440
$$ -583 -802 444 -231 -384 222 -573 -261 512 9 378 -227 -478 -486 -41 634 -113 83 -54 377 -1063
4605a063J068J192j464J115l35j286P89j376J621P0l26M46m98j10J23n08J090
$$ -1063 5 1197 -267 848 513 -773 16 -1360 261 331 5 451 -47 -157 -34 -542 548
4622E48j80q4j476P63l43M2O76o29j72Q19k87K72p7N87k30N90l86q54P95r63K40
$$ 548 368 284 -1192 -429 -772 -730 -54 -683 -855 -36 -323 -51 -128 459 229 819 433 -421 374 -589 -349
4643c49K48J69l50M59L25o63qM68n38j129R63N42P6P43k84j726R10n2K30M57q52
$$ -349 -101 68 -282 177 502 -161 -169 299 -239 -1368 -405 137 213 956 672 -1054 -144 -196 34 491 -361
4664c61J039j313N39J57Q3j33p1o52j47O82J0R37q01K91P20p1j305j37J234p97
$$ -361 678 -635 -96 61 144 11 -60 -712 -859 -177 -167 770 -31 260 980 909 -396 -533 701 -96
4684i6q70J280K8k09r90L19K43P67p84M48m94M06j28P93o42o3r53J688l61k46
$$ -96 -966 314 342 133 -857 -538 -295 472 -312 136 -358 48 -80 713 71 8 -945 743 382 136
4704A36K71q09K30k85M54K47m06Q2L5m20O33k06l52o3N10P6n6o96O42K46p47K61
$$ 136 407 -402 -172 -457 -3 244 -162 -80 -45 -465 168 -38 -390 -453 57 133 77 -619 23 269 -478 -217
4726b17%k1N3K57m31M26J1r3L08M82K21n59J72n37l80L59J25n77j01Q82K41j164
$$ -217 -217 -238 -185 72 -359 67 78 -15 293 775 996 437 609 72 -308 51 176 -401 -502 380 621 -543
4748e43N15n84N82O7k63N9Q48j095L37L1L0L39j058J427j812P6J081J04M8J67
$$ -543 -28 -612 -30 37 -226 -167 681 -414 -77 -46 -16 323 -735 692 -1120 -1044 37 141 189 356
4768C56P48r10n59M43m91M48P28q86Q5Q85q81P17o62o16R30P86j461m68P36j37
$$ 356 1104 194 -365 78 -413 35 763 -123 -38 847 -34 683 21 -595 335 1121 -340 -808 -72 -209
4788b09m07N88m42L40k41P73j491J222P2o69Q50m71J212j182M94m44K64Q71k224
$$ -209 -616 -28 -470 -130 -371 402 -1089 133 205 -464 386 -85 1127 -55 439 -5 259 1130 -1094
4807a094J598j514J579M64n40o88j43k65J213j399O83m07q5J018l07O4O40j685
$$ -1094 504 -1010 569 1033 493 -195 -338 -603 610 -789 -106 -513 -598 420 113 177 817 -868
4825h68Q10l83K43R92q54O78l15p64N56O87o25k04M61j034jJ276q39k81M09o36
$$ -868 -58 -441 -198 794 -60 618 303 -461 95 782 157 -47 414 -620 -621 655 -184 -465 -56 -692
4845f92J130j433K105j501J39k80k83J124nN65j09n42K84m93J05j26J12N91j029
$$ -692 438 -995 1110 -391 -252 -532 -815 309 304 869 760 218 502 9 114 -12 100 691 -338
4864c38J474j082O43r28J046n82k96m33P73l37p39K57O6N95m02L44o94M39p1K21
$$ -338 1136 54 697 -231 815 233 -63 -496 277 -60 -799 -542 -476 119 -283 61 -633 -194 -265 -44
4884d4l60R39L06n82n14o64J026p74J087p72Q03O5r60R10j058L51J293j849P24
$$ -44 -404 535 841 259 -255 -919 107 -667 420 -352 451 516 -444 466 -592 -241 1052 -797 -73
4903g3J026j837J415n17K41k63K17n61l90M40O5K54k59l6N16O49k64k68k42O03
$$ -73 953 -884 531 14 255 -8 209 -352 -742 -302 -237 17 -242 -278 238 887 623 355 113 716
4923G16r20l17J37L44P49j82q55O47j30o09M94m20qM01N90p25J69J91p7M18j181
$$ 716 -204 -521 -384 -40 709 527 -328 319 189 -420 74 -346 -354 47 637 -88 81 272 195 613 -568
4944e68J29l42N15m84O60q50Q07n90N29J474j487L40J57j12J80k35m03J574p88
$$ -568 -439 -781 -266 -750 -90 -940 -133 -723 -194 1280 -207 133 290 178 358 123 -280 1294 506
4963E06o03o1L1j99O50J27q29p09K017o13j019J179j45m78j032O17J049p56K14
$$ 506 -97 -158 -127 -326 324 451 -378 -1087 930 317 -702 477 332 -146 -1178 -561 488 -268 -54
4982e4n08O64n59K63L9K94o16R27P20o52Qj306J343p08Q4q7j045J501N7r93o9
$$ -54 -562 102 -457 -194 -155 139 -477 450 1170 518 526 -780 563 -145 -61 -148 -1193 308 365 -628 -697
5003f97l72R67J6l30Q35Q2k41k40L78j13j173J045L07p51P91n39L79Q8j044R91
$$ -697 -1069 -102 -86 -416 419 501 260 20 398 285 -888 157 464 -287 504 -35 344 432 -612 379
5023C79r04l30L41N56j14J89m6m13q72M31K5O80p72M84j71l00L50J18M06j93J235
$$ 379 -525 -855 -514 42 -72 117 71 -342 -1214 -783 -758 -78 -850 -366 -537 -837 -487 -369 37 -156 1079
5044A079k73j498M66J390k15j428n47R43K44l55K12m86M58J22n99M62P03j193
$$ 1079 806 -692 -226 1164 949 -479 -1026 -83 161 -194 18 -468 -10 112 -487 -25 678 -515
5062e15J115n34P6o1L01q38m49Q71P90k39m99j92j14N69j669J699n01m17M23Q43
$$ -515 600 66 142 81 382 -456 -905 -34 756 517 18 -174 -288 281 -1388 311 -190 -607 -184 659
5082F59r69P24k64k76m99j53K08M79q42J514p44j08J2Q00j47j87j72K24m52J080
$$ 659 -310 414 150 -126 -625 -778 -570 -91 -933 581 -163 -271 -259 541 394 207 35 259 -193 887
5102H87r34P51n07j603J212M31o53Q77n37M03l64K91%N78j345R40j16M2m14q4
$$ 887 -47 704 197 -1406 -194 237 -416 461 -76 327 -37 254 254 832 -513 427 311 353 -61 -145
5122a45r1N47j71l67j49K40l72R41k58L7j27J45K0n47N25m17J50P4j13O76j6k2
$$ -145 -236 311 140 -227 -376 -136 -508 433 175 212 85 230 250 -297 228 -189 -39 35 -78 598 582 560
5144E60l94l74P34k84j81l41k88K63M17O79l17m50j28N62j392R31P72p23N75k53
$$ 560 166 -208 526 242 61 -280 -568 -305 112 791 474 24 -104 458 -934 -3 769 46 621 368
5164C68r99J074n11J547j520k99N16o45N49j74M92j636J204n69J187j266J674
$$ 368 -631 443 -68 1479 -41 -340 176 -469 80 -94 398 -1238 -34 -603 584 -682 992
5181I92j359R06j56J72k45m99Q9l49m26O58L58j29J95j44j39J36M56j003N72M97
$$ 992 -367 539 383 555 310 -189 -100 -449 -875 -217 141 12 207 63 -76 60 516 -487 85 582
5201E82q27M74k57m52J064l07J45Q9j09n45N01q90J361j092J27M46j4l77o91N30
$$ 582 -245 229 -28 -480 584 277 422 511 402 -143 358 -532 829 -263 -136 310 296 -81 -772 -242
5221b42K44O66j381k7J103J4N25j94m68m11O30J69k11l73L68p70m45J091L46o38
$$ -242 2 668 -713 -740 363 377 902 708 240 -171 459 628 417 44 412 -358 -803 288 634 -4
5241dQ95j288N38l70m23J013r82K12J049r27Q32q1p63qM7P20q40O82m24n66M04
$$ -4 891 -397 141 -229 -652 361 -621 -409 640 -287 545 464 -299 -307 -260 460 -380 302 -122 -688 -284
5262b84M61p02P17n23J209Q1j052m00M38lN20n30m52J20N11J13m28M91n00N8J01
$$ -284 177 -525 192 -331 878 959 -93 -493 -55 -58 462 -68 -520 -400 111 224 -204 287 -213 -155 -54
5283e4p1j01J776j475n37M32N62p6m20q30J273k72oq81O86L55k59j96O1N32m21
$$ -54 -125 -226 1550 75 -462 -30 532 456 36 -794 479 207 201 -680 6 361 102 -94 -33 499 78
5304G8L83o23L83k6r6P6K56n50j76J057p59m01J178j649L82m60N65J80K65p01
$$ 78 461 -162 221 195 99 175 431 -119 -295 762 3 -398 780 -869 -487 -947 -382 -202 63 -638
5324f38O98K71j25r22l94R09j77N09M94j193R25o27j30J213j383l27O83J014j306
$$ -638 60 331 206 -716 -1110 -201 -378 131 625 -568 357 -270 -400 813 -570 -897 -214 800 -506
5343e06J177q08n52K39L17KO73q74P17j095O32O84j002o49J057kn5N14k46m52
$$ -506 671 -137 -689 -450 -133 -131 542 -332 385 -710 -78 606 -396 -1045 12 10 -45 469 223 -229
5363b29Q00R4o33m59N45Q8j53p82Q30n81J408j364J069n43r9m63J161p64l29N61
$$ -229 571 665 32 -427 118 206 53 -729 101 -480 928 -436 633 90 -9 -472 689 -75 -404 157
5383A57q10N20O45o63L91q98O71l82l25M47N85k0J69m74O71N65j544l61J808j26
$$ 157 -653 -133 512 -151 240 -658 13 -369 -694 -247 338 318 487 13 684 1249 -295 -656 1152 1026
5403A026m31K05L58m35o17P81j504n2J278p27L99m08j40J480j301N40p95J98M66
$$ 1026 595 800 1158 723 106 887 -617 -669 609 -118 281 -127 -267 1213 -88 452 -343 -145 321
5422C21M53q00O37j047J39J90k57q5m03J196r4l73M46o90j11L46ML19k70M36k27
$$ 321 774 -26 611 -436 -297 -107 -364 -449 -852 344 250 -123 323 -367 -478 -132 -128 191 -79 357 130
5443A30j122N44O49n26j02l3J93O76o50j44L61Q95j199K3N72q38J472m33p58N1
$$ 130 -992 -448 201 -325 -427 -460 -267 409 -241 -385 -24 871 -328 -305 267 -571 901 468 -290 -239
5463b39K94o41R92P01K0p27K16k80j441N53P23p7l74M58p4L99k93r08J732j361
$$ -239 55 -586 406 1107 1127 400 616 336 -1105 -552 171 94 -280 178 104 503 210 -698 1034 -327
5483c27M46l12n38P53m20L89q23qJ206p92n25K07J199q48K79j05r5k74Q08K38
$$ -327 119 -193 -731 22 -398 -9 -832 -840 366 -426 -951 -744 455 -393 -114 -219 -314 -588 220 458
5503D58M10l28r02N70o47rJ10M26j315R05N99J75m57j58j91O10L25l30p9j41J322
$$ 458 868 540 -362 208 -439 -448 -338 88 -1227 -322 277 452 -5 -163 -354 256 581 251 172 31 1353
5524A353j143Q76j814M73K55O71J25m64o78J39L49k17Q43r98L82K01k80N95l42
$$ 1353 210 1086 -728 -255 0 671 796 332 -346 -207 142 -75 768 -230 152 353 73 668 326
5543C26o33O41m75M07j13r44J84N82O78j396j61K22L10J163M85j194J069o20j119
$$ 326 -307 334 -141 266 153 -791 -607 -25 653 -743 -904 -682 -372 791 1276 82 1151 531 -588
5562e88M97Q31n34L68p42P50M9m30n37P72j066j74J156j38M46p5k49n88q5P4k94
$$ -588 -91 740 206 574 -168 582 631 201 -336 436 -630 -804 352 214 660 585 336 -252 -337 -263 -557
5583e57M88J90l86P29j323N45P64q07Q27j185O32M87K56p41m97M30M60K87p19
$$ -557 -69 121 -265 464 -859 -314 450 -357 470 -715 -83 404 660 -81 -578 -148 312 599 -120
5602a20q50J109q33J073r34L83q8l48J533j477o10J678j090P86j160Q65J37O19
$$ -120 -970 139 -694 379 -555 -172 -260 -608 925 -552 -1162 516 -574 212 -948 -83 54 673
5620F73r81l89N40L69J61p06N38R6k81M19j347P48N59JM13l50j17q79J57P69p36
$$ 673 -308 -697 -157 212 373 -333 205 301 20 439 -908 -160 399 400 813 463 346 -533 -376 393 -343
5641c43Q0q0l71Q65k00O86r30Q57J33n08q65J584r07j69N11l20J151j311K04k92
$$ -343 -263 -343 -714 151 -49 637 -293 564 697 189 -676 908 1 -168 343 23 1174 -137 67 -225
5661b25L68j71O60o24j70J327j890m80J385k94k02P88k26p87k8O47K5n63Q61j478
$$ -225 143 -28 632 8 -162 1165 -725 -1205 180 -114 -316 472 246 -541 -569 78 103 -460 401 -1077
5681a077J608p08n85Q31n33n43M44P63r31k53q0N73l07J377j609O83R12j096J561
$$ -1077 531 -177 -762 69 -464 -1007 -563 200 -731 -984 -1064 -491 -798 579 -1030 -347 565 -531 1030
5700A030j543N49r65J210r15P5N40Q49j16k75j000M22k18M9O88m27l16L84m20
$$ 1030 -513 36 -929 281 -634 -559 -19 830 714 439 -561 -139 -357 -308 380 -47 -363 21 -399
5719c99O87o4j073J362m12L2j114J680m64m65M25m33O77r72J85J39k07n0N09N75
$$ -399 288 224 -849 513 101 133 -981 699 235 -230 195 -238 439 -533 -348 -209 -416 -466 43 618
5739F18m27j26j224J214J8J64L32l09j387K72L25M83j67m55P99j04o51R32k34
$$ 618 191 65 -1159 55 73 237 569 260 -1127 -855 -530 -47 -214 -669 130 26 -625 307 73
5758G3k62o45r9O24k3O46q68J454j848R24j104J069k67M64o48q1M25K49n19Q37
$$ 73 -189 -834 -933 -309 -332 314 -554 900 -948 -24 -1128 -59 -326 138 -510 -591 -166 83 -436 401
5778D01j339J867n31j852J219K09k21P9R43n77o23J91K08Q02p37j52l00j42J63
$$ 401 -938 929 398 -1454 -235 -26 -247 -168 775 198 -425 -234 -26 776 39 -113 -413 -555 -392
5797c92n40N93j27N87n06N42p8j099J509n57k0O18o9l91J098j525M21k00o93J498
$$ -392 -932 -339 -466 121 -385 157 79 -1020 489 -68 -88 530 461 70 1168 -357 64 -136 -829 669
5817F69j054j33J124p77J000p25J2J93J93k09J33N1n81Rj47l33R15K5j228J029
$$ 669 -385 -518 606 -171 829 104 116 309 502 293 426 477 -104 -95 -242 -575 340 365 -863 166
5837A66o91o3O68L4M79j98p47k53J104o28O9J156k53r79m63k75J591r19j50K54
$$ 166 -525 -588 80 114 593 395 -352 -605 499 -129 -60 1096 843 -136 -599 -874 717 -202 -352 -98
5857i8L59k49J012r05n81o7k68O25L7J487j019k024K330q3o78q92J10J514j55
$$ -98 261 12 1024 119 -462 -529 -797 -172 -135 1352 333 -1691 639 556 -122 -1014 -904 610 455
5876D55q60m47P53l9l35K03m6O41j93q18k33P73P9o16r1J674k54o80r51K26n60
$$ 455 -405 -852 -99 -138 -473 -270 -316 325 132 -686 -919 -146 -67 -683 -774 900 646 -34 -985 -759 -1319
5897a319P99J653j237O0k5m66J156j95o69N07o39R25j415J245L2k84k21J3j71
$$ -1319 -520 1133 -104 -44 -69 -535 621 426 -243 264 -375 550 -865 380 412 128 -93 -80 -251
5916b51J72p40K92K92m10O90K39j560P05j03J436o96q93J183n59k86k23J709j012
$$ -251 -79 -819 -527 -235 -645 45 284 -1276 -571 -674 762 66 -827 356 -203 -489 -712 997 -15
5935a5p81Q60k38K75o61J000M97j694M78Q66o11J64J70n88O5k9J151n10j178M96
$$ -15 -796 64 -174 101 -560 440 937 -757 -279 587 -24 140 310 -278 -213 -242 909 399 -779 -283
5955b83m95K07k59J059o13j95N14k65J29M76n3q35J67Q39r00J44O98n29m72Q50
$$ -283 -778 -571 -830 229 -384 -579 -65 -330 -201 275 222 -613 -446 393 -507 -363 335 -194 -666 184
5975A84k38j73J61r62J045R8k34j3n07P56J022k467J079k02l77J109m00k51K25
$$ 184 -54 -227 -66 -1028 17 115 -119 -132 -639 117 1139 -1328 -249 -451 -828 281 -119 -370 -145
5994a45O80J152j889L1m71n8M37Q69q56m75k3O77L0p0N55l12N72j295N30JL81
$$ -145 535 1687 -202 -171 -642 -700 -263 606 -250 -725 -748 -71 -41 -111 444 132 704 -591 -61 -60 321
6015C21p01j33L0O18o24P53j34J09k72m7p14O0q6J035L79r36L12N89j15j50r75
$$ 321 -380 -513 -483 135 -489 264 130 239 -33 -80 -794 -734 -820 215 594 -342 -30 559 444 294 -681
6036f81L63j22R01p17P62k34n66l34J74J151l47m45j15l81P29r45J371J50n91
$$ -681 -318 -440 461 -256 506 272 -294 -628 -454 697 350 -95 -210 -591 138 -807 564 714 123
6055A23p56M28J97L52l61m01L39l69J126q30l3p06M37O15m90J038k76M57j188
$$ 123 -633 -205 -8 344 -17 -418 -79 -448 678 -152 -185 -891 -454 161 -329 709 433 890 -298
6074b98O52k99J18M89j784J530p60J091n78J34l40k46m28Q10L72k05K9q82N70
$$ -298 354 55 173 662 -1122 408 -352 739 161 295 -45 -291 -719 91 463 258 287 -595 -25
6093b5M21o62L1j360J280p8J211r12%K49N28q17l13J415n52o60J556k857M12P47
$$ -25 396 -266 -235 -1595 -315 -393 818 -94 -94 155 683 -134 -447 968 416 -244 1312 -1545 -1133 -386
6113c86N17j69j097p7J450M83j46p88J340p86j081R88K13p84L45N63l57O8q64
$$ -386 131 -38 -1135 -1212 238 721 575 -213 1127 341 -740 248 461 -323 22 585 228 296 -568
6132e68O30O13j020L8n18R79k85l39N13j29m3L56o56M24n72l2R23R5m95l42Q21
$$ -568 62 675 -345 -307 -825 154 -131 -470 43 -86 -129 227 -429 -5 -577 -609 314 409 -86 -428 393
6153C93K09k38p68J279j440J213j518m3J507j54q79M11M42L10o71K79j33K24O71
$$ 393 602 364 -404 875 -565 648 -870 -913 594 440 -439 -28 414 724 53 332 199 423 1094
6172A094j045j67K51J96m06L50j024L41M06J65m9R05j081M97k43k39j99k77Q20
$$ 1094 49 -118 133 329 -77 273 -751 -410 -4 161 112 1017 -64 433 190 -49 -248 -525 295
6191B95k43p57j09P05Q6M53l12l18O6K77q18J319j063l69m59J157r33J208m00
$$ 295 52 -705 -814 -109 -23 430 118 -200 -134 143 -675 644 -419 -788 -1247 -90 -1023 185 -215
6210b15K14k11L06j91n54P85O64p03o01J321q07m9o60K58R99j17J65j213Q53J16
$$ -215 -1 -212 94 -97 -651 134 798 95 -506 815 8 -41 -701 -443 556 439 604 -609 244 360
6230C60o59M00L76n97j74J38J12j043O47j44P56k91j46k37l84P81O98j004M32
$$ 360 -299 101 477 -120 -294 -156 -44 -1087 -440 -584 172 -119 -265 -502 -886 -105 593 -411 21
6249B1j03k67nJ217l32K23q48j13k53n20J086j378J756l4l2O41r16J86K84N61
$$ 21 -82 -349 -354 863 531 754 -94 -207 -460 -980 106 -1272 484 450 418 1059 143 329 613 1174
6269A174k920K006n67k94Q99r71O27J0O2R12j467K30Q41r55K9j71N76l75K94M25
$$ 1174 -1746 260 -307 -601 298 -673 -46 -36 26 938 -529 -299 542 -413 -384 -555 21 -354 -60 365
6289C65m96k74Q77J15k23J50j433M97R70j662K064j417M78J64Q6O6N40n47l58
$$ 365 -131 -405 472 587 364 514 -919 -422 548 -1114 950 -467 11 175 261 327 867 320 -38
6308c8O27o8j027N38K80m81M91L85j32m53j279P90K29N47k83j592J545J315j563
$$ -38 589 521 -506 32 312 -169 322 707 575 122 -1157 -367 -138 409 126 -1466 79 1394 -169
6327a69Q53l44j03m8m96L27o72R84O50q16p33K32J09M17L71m30j37R3n46N50j47
$$ -169 684 340 237 189 -307 20 -652 332 982 166 -567 -335 -226 191 562 132 -5 88 -458 92 -55
6348e5R45p51P0l40K96k43o60J001M78l14j241O1O76L78r8j684J684j663J902
$$ -55 890 139 209 -131 165 -78 -738 263 741 427 -814 -753 -77 301 203 -1481 203 -1460 442
6367D42L27j475J340m51K0l23J431j291N70j38l89n09J027j038O98o72O28k12
$$ 442 769 -706 634 183 203 -120 1311 20 590 452 63 -446 581 -457 241 -431 197 -15
6385a5J73l18L51L71j717J449O11n06j152L76n8M88l17k7J044o34m56O77q71K58
$$ -15 158 -160 191 562 -1155 294 905 399 -753 -377 -435 53 -264 -291 753 119 -337 340 -531 -273
6405b73R14n07kM29j315J545m3j793K060K9r44J9k86O3o23Q07j03k37N60l58N55
$$ -273 641 134 132 561 -754 791 748 -1045 1015 1044 100 119 -167 -104 -727 80 -23 -260 300 -58 497
6426D97m80J513j687J82k78Q98j003O50l04M76r81N96j68N85o96N27L68m98o58
$$ 497 17 1530 -157 25 -253 645 -358 292 -12 464 -517 79 -89 496 -200 327 695 197 -461
6445d61L40K52L34k03L14n74N65j8m93J71p22J462k011J786j049L00K42N7l61
$$ -461 -121 131 465 262 576 2 567 549 56 227 -495 967 -1044 742 -307 -7 235 292 -69
6464f9Q33q19n52J362j604J047k49J62m62P47j942K29K81Q14j39m76n16J398K41
$$ -69 764 -55 -607 755 -849 198 -51 111 -351 396 -1546 -1317 -1036 -222 -361 -837 -1353 45 286
6483B86j075P60j7j78O04k91q54R53n61J175M03r36J552k378M60M28p56j13J790
$$ 286 -789 -29 -46 -224 380 89 -765 188 -373 802 1205 269 1821 -557 -97 331 -425 -538 1252
6502A252q74j831K918j911P22n25M88L6j504Q66O15j19q99R12N49l70M22q88l14
$$ 1252 378 -1453 1465 -446 276 -249 239 275 -1229 -363 252 133 -766 146 695 325 747 -141 -455
6521d55j0J122l58L97n28l25M45n72j26O33o54l30Q38R07j645P54k3J123r21N10
$$ -455 -465 657 299 696 168 -157 288 -284 -410 223 -431 -761 77 984 -661 93 70 1193 272 782
6541G82j960M19j66K017j253q44N01j45M82M19q68M97J032n99n54O45m58m94j49
$$ 782 -1178 -759 -925 1092 -161 -1005 -504 -649 -167 252 -616 -119 913 314 -240 405 -53 -547 -696
6560f96J751q33M16j25O71n83r14J515j193J17k52M0L64n43N11J20q12J013l42
$$ -696 1055 222 638 513 1184 601 -313 1202 9 126 -126 -86 278 -265 246 366 -446 567 225
6579B25n17P28o49J326o82p08m56K412r29K36r68P66q40M8L35m35k97Q06j117
$$ 225 -292 436 -213 1113 431 -277 -733 1679 750 986 18 784 -56 -8 327 -108 -405 401 -716
6598g16J312n09R11n03r66J230m15L1o50m10K46P65j067L72Q48o65j86M61p90
$$ -716 596 87 998 495 -471 759 344 375 -275 -685 -439 326 -741 -369 479 -186 -372 89 -701
6617g01O77l62J80J96Q87j266P97p9k95N78j624R96Q99n16k43o95L15ON61l60
$$ -701 -24 -386 -206 -10 877 -389 408 329 34 612 -1012 -16 883 367 124 -571 -256 -250 311 -49
6637d9J152r27N15m44k63N96q66n26K82J066j153P92K65j13n30n16N15P25p6m24
$$ -49 1103 176 691 247 -16 580 -286 -812 -530 536 -617 175 440 327 -203 -719 -204 521 445 21
6657B1m58O25l39Q88j90J84m34l87n50J107r68N86j275J096J601j775l33l5J731
$$ 21 -437 188 -151 737 547 731 297 -90 -640 467 -501 85 -1190 -94 1507 -268 -601 -636 1095
6676A095q12q1Q8p55o25P85J57Q22m15L99K26j755Q95m28J35j28J085l04q1j567
$$ 1095 283 202 290 -465 -1090 -305 -148 674 259 658 884 -871 24 -404 -269 -397 688 384 303 -1264
6696a264J234o18J010k6p37J107p60q5r12J046K00P71j004M6k26P60j258N46j74
$$ -1264 -30 -648 362 336 -401 706 -54 -139 -1051 -5 195 966 -38 8 -218 542 -716 -170 -344
6715c44N57M1k45j93M17P93r07K25K36q14J010l56N37l29o25n66J11J513j461
$$ -344 213 254 9 -184 233 1026 119 344 580 -234 776 420 957 628 3 -563 -452 1061 -400
6734d00K94J45j13N68Q33j502R09j26j390K27J094m20K96j044J104p66P59k04
$$ -400 -106 39 -74 494 1327 -175 734 608 -782 -555 539 119 415 -629 475 -291 468 264
6752B64L12N29j601P79K09jj015M53J4r9M47o50K8K49j05l07J674j853J381j15
$$ 264 576 1105 -496 283 492 491 -524 -71 -57 -156 291 -359 -331 -82 -187 -494 1180 -673 708 593
6772E93r63O77n54J18N78Q7K07r61P85k14k067K382k33q23j11P88N72n36n45L15
$$ 593 -370 307 -247 -129 449 536 743 -218 567 353 -1714 668 435 -388 -499 289 861 325 -220 95
6792I5J47O64p92n82M39l57P15j01m69K50k11j176P92oJ947j685M76J90n80k83
$$ 95 242 906 114 -468 -29 -386 329 228 -241 9 -202 -1378 -586 -592 1355 -330 146 336 -244 -527
6812e27J95r9j50Q82L67m98k49R19p82k94p66J082M08m56k42N39N8o42Q51j555
$$ -527 -332 -431 -581 301 668 170 -79 840 58 -236 -1002 80 488 32 -210 329 387 -255 596 -959
6832i59M28Q90m73j20N93j76p45J210o65J37m53j210J628o69J476q51j009J171
$$ -959 -531 359 -114 -234 359 183 -562 648 -17 120 -333 -1543 85 -584 892 41 -968 203
6850B03j18M63n33q3l54O31r31J093n23R11p43j211J404o50N73p43o2O08N28p4
$$ 203 85 548 15 -68 -422 209 -722 371 -152 759 16 -1195 209 -441 132 -611 -673 -65 463 389
6870C89q02j163K733j127K46j074JN38r4J83m9p7n92O62l69K49j52P7M16k04J125
$$ 389 -413 -1576 1157 30 276 -798 -797 -259 -353 -170 -219 -296 -888 -226 -595 -346 -498 -421 -5 -209 916
6891I16p43n1p52L30j32L16m63O43o4K56o56J51j84O8o2K6j26L76Q24j48o80Q22
$$ 916 173 122 -630 -300 -432 -116 -579 64 0 256 -400 -249 -433 -365 -427 -401 -527 -151 673 525 -155 667
6913F67r49k76o5J177p85m83J110o93J83N22n77j6k36Q02j85L67j217J473j4p54
$$ 667 -282 -558 -623 554 -231 -714 396 -297 -114 408 -169 -185 -421 381 196 563 -654 819 805 51
6933E1k25K55o18O91m94O38r12M7J83O28J08m31Q13k63p37Q80l44p34K09N26p21
$$ 51 -174 81 -537 154 -340 298 -614 -567 -384 244 352 -79 734 471 -266 614 270 -464 -255 271 -450
6954d50r3R90m57M77m50k64n92J027P29r41k49O84Nm24k14K26L26K3k24j37K66
$$ -450 -543 447 -10 467 17 -247 -839 188 917 -24 -273 411 416 -8 -222 4 330 353 129 -8 258
6975B58k87J89J04M35Qr77J782k184K21J031L42j243O39n04R92n28M15o91r6j180
$$ 258 -29 160 264 699 707 -270 1512 -672 -451 580 922 -321 318 -186 806 278 693 2 -94 -1274
6995a274K289o87j970J412M06K52r13K98K59M01J2q51k78M39k8j48K68K76L7j238
$$ -1274 1015 328 -1642 -230 176 428 -485 -187 72 473 485 -366 -644 -205 -233 -381 -113 163 200 -1038
7015a038K130j397N42m52O15N7q84K90o31N35J158j480R32j82Q02j378M6P63j7
$$ -1038 1092 -305 237 -215 400 457 -427 -137 -768 -233 925 -555 377 195 997 -381 -335 428 411
7034D11o69q21J424o68M58n98L19Q48j084L96P15j62L26j306P04k82N53j75M49
$$ 411 -258 -1079 345 -323 135 -463 -144 704 -380 16 731 569 895 -411 293 11 564 389 838
7053H38k37p56o43K74N37l51K50Jr15J280k63Q5N98l96L12m41k50L53O00l96j039
$$ 838 601 -155 -798 -524 13 -338 -88 -87 -1002 278 15 100 698 302 614 173 -77 276 876 480 -559
7074e59J72O83K6l06R33j118j43R43j112Q01j73n39k48j1M57j21J100j054R0J535
$$ -559 -387 296 322 16 949 -169 -312 631 -481 320 147 -392 -640 -651 -194 -315 785 -269 -179 1356
7094A356j234K79q75o89O90K8M07N39m36N2M61n42J38N80r08K23L53j192R05l69
$$ 1356 122 401 -474 -1163 -473 -445 -38 501 65 117 578 36 174 754 -154 69 422 -770 135 -234
7114b34P45r99P56K3j113R77J08K13m46o61P60M77j101J35j77R23j250j30R40
$$ -234 511 -488 268 291 -822 155 263 476 30 -631 129 606 -495 -360 -537 386 -864 -994 -54
7133e4j797J845J44j79M84o34J55q99O97M66o4k38j16m7l59J366j149N0K38k58
$$ -54 -1851 -6 138 -41 443 -191 -36 -935 -238 228 164 -74 -190 -237 -596 770 -379 -329 -91 -349
7153c49Q75j71N69j271R20m45l20N3p34Q56n4M2m5o42j13J40N57J405k156P74
$$ -349 526 355 924 -347 573 128 -192 -139 -873 -17 -71 -29 -74 -716 -829 -689 -132 1273 -883 -109
7173a09J37Q7M74l74n65J74k9L58k13k28M82l51L66J43j17m92O47K9m7P87o78
$$ -109 28 115 589 215 -350 -176 -205 153 -60 -288 194 -157 209 352 235 -257 390 419 372 1159 481
7194D81N8l78k81j207J235L62L18r11K77J039q49P96j487Q08O91q26j58l88K58
$$ 481 539 161 -120 -1327 -92 270 588 -323 -46 993 144 940 -547 261 952 126 -32 -420 -162
7213a62m25O91p05K00N37r0o0k76K97l83P45p17o65J332n54m02Q38j01p92M76
$$ -162 -587 104 -601 -401 136 46 -14 -290 7 -376 369 -348 -1013 319 -235 -637 201 100 -692 -216
7233b16j16L4m46J674j474K26R5N5K09K46o07O33l28L68k67L05l96M68o67P91
$$ -216 -332 -298 -744 930 -544 -318 -223 -168 41 287 -320 313 -15 353 86 391 -5 463 -204 587
7253E87n0j113N66k40O67r93N52j60K98M06o55M04k82j49k84J713k435J004M18
$$ 587 537 -576 -10 -250 417 -576 -24 -184 114 520 -135 269 -13 -162 -446 1267 -1168 -164 254
7272B54k73m0L72p78L38R98j396N61L93J52m23m84Q80o26O93r3j52m38j202J054
$$ 254 -19 -59 313 -465 -127 871 -525 36 429 581 158 -326 554 -72 621 528 376 -62 -1264 -210
7292b10o74N77q15J029l4R8k26J67M89K03n66J05n65J56J041q92k03R00k56j618
$$ -210 -884 -307 -1122 -93 -127 -29 -255 -88 401 604 38 143 -422 -266 775 -117 -320 580 324 -1294
7312a294P99M51l6j043J296k79M85p55P03J97l36N4p05N64J48n28J0l4j362K260
$$ -1294 -495 -44 -80 -1123 173 -106 379 -376 327 524 188 242 -463 101 249 -279 -269 -303 -1665 595
7332E95p77Q9n3k25R17j082R07q02O43J39p53j68Q75l23Q42J36j448K50k88L63
$$ 595 -182 -93 -146 -371 546 -536 371 -431 212 351 -402 -570 305 -18 824 960 -488 -238 -526 -163
7352a63J27R46o73o47R79j20q81R01l12j38M05k47k12r4J86q6o8N82K09k27J40
$$ -163 -36 910 237 -410 569 449 -432 469 157 19 424 177 -35 -129 57 -29 -97 485 694 467 607
7373F07q77J79j63p40J418j201L44j43P70K98m35l94j209J829P29q4j632M74j81
$$ 607 -270 -91 -254 -994 424 -777 -433 -576 194 492 57 -337 -1546 283 1012 928 -704 -230 -411
7392d11R88P2N59p37q6O05k60j006P3L23J52K20m63K02k62R5P61q82N38j080R00
$$ -411 577 649 1208 471 385 990 730 -276 -203 120 272 492 29 231 -31 64 825 -57 481 -599 301
7413C01O77r55K54o05q20J270o22O52q63M44O11r71J299j004P81o51R38q45J082
$$ 301 978 23 277 -328 -1148 122 -500 152 -711 -267 344 -627 672 -332 449 -202 736 -109 973
7432I73j293O06j116J58J059P1j105p69J269r37J64J994j013L5O09l91R4J66k8
$$ 973 -320 286 -830 -672 387 458 -647 -1416 -147 -1084 -920 1074 61 96 705 314 408 574 546
7451E46j63q63P55j035Q77j91K41l61N87m89M80r42J316L3n78q0j67m13N95o7
$$ 546 383 -480 275 -760 117 -74 167 -194 393 -96 384 -558 758 791 213 133 -34 -447 148 81
7471H1L75l23K13J83p83R81m74K46l73L13q43J85o0k2J212j117j0J078j146Q42
$$ 81 456 133 346 529 -254 727 253 499 126 439 -404 -219 -279 -301 911 -206 -216 862 -284 558
7491E58L39j210O63l73J289j357l94q88J589k86M06j54M98p93j81j87O13m99L21
$$ 558 897 -313 350 -23 1266 -91 -485 -1373 216 -70 336 182 680 -113 -294 -481 132 -367 -46
7510d6n77L46K73Q4k44j15O31j01j11Q75p86N63m37o84k2J08O38o70L37l42l38
$$ -46 -623 -277 -4 80 -164 -279 352 251 140 1015 229 792 355 -329 -351 -243 395 -275 62 -280 -618
7531f18J36Q65k64O31p88k54k81l71J23J99N43R73j341P46J78p35P30p28O83m54
$$ -618 -482 383 119 750 -38 -292 -573 -944 -821 -622 -79 894 -447 299 477 -258 472 -256 427 -27
7551b7L38j161K31J363k67o30R30o22j18L09j469J288q21Q29n32N78j71M9q68
$$ -27 311 -850 -619 744 477 -153 777 155 37 346 -1123 165 -656 173 -359 219 48 97 -771
7570g71Q31l87j06l3K25J111j521L26j24M13O0q93Q15k99P70M8q58J55M49r6J5
$$ -771 60 -327 -433 -466 -241 870 -651 -325 -449 -36 24 -869 -54 -353 417 465 -393 -238 211 115 130
7591A30J90r03J53O35M3n57L67r06J305p02p07J485l40m47k23K40p0J076j441
$$ 130 320 -583 -430 205 248 -309 58 -848 457 -245 -952 533 193 -254 -477 -237 -307 769 -672
7610f72K67M00n27O37k61l51L03P79p42n0r43O17j56N94K49qn0q80O64P11n65
$$ -672 -405 -5 -532 105 -156 -507 -204 575 -167 -217 -1160 -543 -699 -105 144 136 86 -794 -130 581 16
7631A6m38k81O6m8l34L64Q27l36K04N55L34r40p15O42J80K98O28j255M75l01r79
$$ 16 -422 -703 -637 -685 -1019 -655 172 -164 40 595 929 -11 -726 -84 96 394 1022 -233 242 -59 -1038
7652a038K137p60J98L14j369R22n6k58L97j15j39o74l03L71j00R3J169n28j13
$$ -1038 1099 339 537 851 -518 404 348 90 487 372 233 -441 -744 -373 -473 -380 789 261 148
7671A48r27P23K88k8r55l63R32o44R99J15L25o69k89Q03n36M96N02k58r64k40
$$ 148 -779 -56 232 204 -751 -1114 -182 -826 173 288 613 -56 -345 458 -78 418 920 662 -302 -542
7691e42o17N48J27N54J0J33N76l76q56Q62m16j35J470j331M44n37P41o70R76K03
$$ -542 -1159 -611 -484 70 80 213 789 413 -443 419 3 -132 1338 7 451 -86 655 -15 961 1164
7711A164k55j124J07M42n93J178j547M77p16L54k98J42l97J404j74J87N6q32P52
$$ 1164 909 -215 -108 334 -259 919 -628 -151 -867 -513 -811 -669 -1066 338 164 351 407 -425 327
7730C27p21Q04n4k27O88n19l02K17N4p53J234M0j33m20K94o16l2n29R33P0r93
$$ 327 -394 410 356 129 817 298 -4 213 267 -486 748 788 655 235 529 -87 -119 -648 285 355 -638
7751f38R46J40j152R41j267J473Q07j443n65R90q91N25K24N92r50O12P2k63O36
$$ -638 308 448 -704 237 -1030 443 1250 -193 -758 232 -659 -134 90 682 -268 344 416 153 789
7770G89J7q02N31o07L59J62J41m08J16k84j139J770l88j132L04O53J47j40m05
$$ 789 806 4 535 -72 287 449 590 182 298 14 -1125 645 257 -875 -571 82 229 89 -316
7789c16Q25o09o00Q33k84k58O2M26r95K78N45K36K35j83N33l87j040O68L39o4
$$ -316 509 -100 -700 133 -151 -409 -347 79 -916 -638 -93 143 378 195 728 341 -699 -31 308 244
7809B44J96r20K43M26m3M00J82k44p76J135K43k003J388n89M6N02J67K07j533
$$ 244 440 -480 -237 189 146 546 728 484 -292 843 1086 -917 471 -118 -72 430 597 804 -729
7828g29J429p89J64M11K35k67n05k34R94j057o3K26J88R40j169Q17j137J294j080
$$ -729 700 -89 75 486 721 454 -51 -285 709 -348 -411 -185 3 943 -226 591 -546 748 -332
7847c32J12N91q77n28J043m45R32o75k8R30l20l80J81L18j037L1O83m19R10J25
$$ -332 -220 371 -506 -1034 9 -436 496 -179 -207 723 403 23 204 522 -515 -484 199 -220 690 815
7867H15o83K6L83m51L7J1r33L58J161j295L49O74J0Q37j058p71K60L57P74j05
$$ 815 132 158 541 90 127 138 -795 -437 724 -571 -222 452 462 1299 241 -530 -270 87 861 756
7887G56j114J23L3o21J34O26M73k54k13O20m63L05j8k30j17m6j83L00l35l8n42
$$ 756 -358 -235 -202 -823 -689 -63 410 156 -57 563 100 405 387 157 40 -6 -189 111 -224 -262 -804
7908h04O32m82J617r84O20k81J17m11o94J090j15m1q70L76J149j079n61J421j269
$$ -804 -172 -654 963 -21 599 318 435 24 -670 420 305 264 -606 -230 919 -160 -721 700 -569
7927e69Q6R27j64m64j51O10L82l81K44M93j328m71J492k24j225Q93L0K16q81K93
$$ -569 -483 444 280 -184 -335 275 657 276 520 1013 -315 -786 706 482 -743 150 180 396 -485 -192
7947a92m20L80Q83j509J674j144L56J41L22L2j420J239O49p83o09J78J173j258
$$ -192 -612 -232 651 -858 816 -328 28 169 491 523 -897 342 991 208 -401 -223 950 -308
7965c08J112r31ok04J339j662J285L2n79l20k77Q54K26m89j238J192l02N30k40
$$ -308 804 -127 -133 -337 1002 -660 625 657 78 -242 -519 335 561 72 -1166 26 -276 254 14
7984A4O33p85Q50p31q10J369j71o37n26M06R94M96j042K39M15p73q04R50j331
$$ 14 647 -138 712 -19 -829 540 369 -268 -794 -388 606 1102 60 299 714 -59 -863 87 -1244
8003a244J316l05M70k53O62k67j209Q50Q13j419N73K48p54M48m50J82p2J80J93
$$ -1244 72 -233 237 -16 646 379 -830 20 833 -586 -13 235 -519 -71 -521 -339 -411 -231 -38
8022c8L89m91j71O70Ok13L23p13k90J078m59O10n31L22n57M67p82j18J235j566
$$ -38 351 -140 -311 359 365 152 475 -238 -528 550 91 701 170 492 -65 402 -380 -498 737 -829
8042h29R55j9P39q49N6j43P05j454L40M52m65J682j181P83j110j9J74J89L51p93
$$ -829 126 107 846 -3 53 -90 615 -839 -499 -47 -512 1170 -11 772 -338 -357 -183 6 357 -436
8062d36Q96r82J78K31N4k65P28Rk33l80O56j967J267P55j307P93L26P1p24O84
$$ -436 460 -522 -344 -113 -59 -324 404 413 180 -200 456 -1511 -244 511 -796 -3 323 394 -330 354
8082C54jj091R45p19n53O36O56J98k11J89k53r57P37Pr79J296o6l05l04J202L33
$$ 354 353 -738 207 -512 -1065 -429 227 425 214 403 150 -807 -70 -63 -1042 254 188 -117 -421 781 1114
8103A114j191M16j31o80j93O67m04P71j508O31K20P86q38L2L92m43O67m36J85
$$ 1114 -77 339 208 -472 -665 2 -402 369 -1139 -508 -288 498 -340 -308 84 -359 308 -128 57
8122E7Q65o94m05R34O75j494J182j131j16K54P3K92q76M88o80k26J071Q92k57
$$ 57 922 228 -177 757 1432 -62 1120 -11 -127 127 200 492 -384 104 -576 -802 269 1161 904
8141I04o73n90kJ99J34p8O14j023l55R01J65L37p07j93O14j21n4R4j53J48j145
$$ 904 231 -359 -361 -162 -28 -106 508 -515 -870 31 196 533 -174 -367 247 126 72 166 13 161 -984
8162i84J343m43M21K5k32j386J447L92j429J023l4r72L65M14q1K82pn19R19n8
$$ -984 359 -84 337 362 130 -1256 191 583 -846 177 143 -829 -464 -50 -131 151 144 -375 544 486
8182D86j38j98p29J06K46N9l28L90N85
$$ 486 348 150 -579 -473 -227 -168 -496 -106 479
8191D79
$$ Imaginary data points
##PAGE= N=2
##DATA TABLE= (X++(I..I)), XYDATA
0@%%%%%%%%%%%%%%%%J02k10K16k16K16k16L20m28M32n01O09o61P69q99J008j186
$$ 0 0 0 0 0 0 0 0 0 0 0 0 0 0 0 0 0 102 -108 108 -108 108 -108 212 -216 216 -285 324 -337 432 -467 541 -645
32f45J366j519J696j919K171k439K720l035L385l758M168m620N117n658O244o886
$$ -645 721 -798 898 -1021 1150 -1289 1431 -1604 1781 -1977 2191 -2429 2688 -2970 3274 -3612
48c612P583q356R218j0146J1174j2329J3619j5072J6725j8615K0804k3377K6447
$$ -3612 3971 -4385 4833 -5313 5861 -6468 7151 -7921 8804 -9811 10993 -12384 14063
61A4063l0202L4912m1004M9221o0988P9393j12294J88712o86996k95135J212194
$$ 14063 -16139 18773 -22231 26990 -33998 45395 -66899 121813 -565183 -860318 351876
72C51876l60611k42342M41564k53283o13259P08397N05569n95616k76181L55985
$$ 351876 -8735 -251077 190487 -62796 -676055 32342 537911 -57705 -333886 22099
82B2099j36454K0943M62802j77850o48120K15005N47527r9386k83505O3881o7829
$$ 22099 -114355 -93412 369390 191540 -456580 -241575 305952 206566 -76939 -13058 -80887
93h0887j15973K99116K74994l72799l47853K63085K59278q6781J706p3965k79360
$$ -80887 -196860 102256 377250 4451 -343402 -80317 178961 92180 93886 19921 -259439
104b59439J20411M19139p8473l29440M774O5111l927K38498Q0655m10187j93046
$$ -259439 -139028 280111 201638 -127802 -123028 -57917 -61844 176654 257309 -152878 -345924
115c45924L74696K43806j85699j78137J238n028L9591K26568Q2220l90531k46541
$$ -345924 28772 272578 86879 -91258 -90020 -95048 -55457 171111 253331 -137200 -383741
126c83741M28192K95762l43345j43432K08936j69025j09822M97459P3100o86734
$$ -383741 44451 340213 -3132 -146564 62372 -106653 -216475 280984 354084 -332650
136c32650m9545O53165l1923m20956K11869J16532m43695J26637O35093k52691
$$ -332650 -382195 270970 239047 -181909 29960 146492 -297203 -170566 464527 211836
146B11836o73958K97086N09439l37225j80862M17036j91990n08509M68082N39513
$$ 211836 -462122 -165036 344403 7178 -173684 243352 51362 -457147 10935 550448
156E50448n74013m39764N28534J94815m20384J28772L39348m27060l09579O00006
$$ 550448 -23565 -463329 65205 260020 -160364 -31592 307756 -119304 -428883 171123
166A71123K85500o01367j98310M82890M017l40386K68941K45882n37949j94994
$$ 171123 456623 -144744 -343054 139836 143853 -196533 72408 318290 -219659 -414653
176d14653O86465J31643o57226M855M78724k25657k49183M84799N3836o81988
$$ -414653 271812 403455 -253771 -248916 229808 4151 -245032 239767 293603 -388385
186c88385P6184P21701j71646n74098K82915K89203m27524J7546N72587k49369
$$ -388385 -312201 409500 237854 -336244 -53329 235874 -191650 -174104 398483 149114
196A49114o37888L63855N56761l89837l17935L87825r827l90680L02920L95655
$$ 149114 -488774 -124919 431842 42005 -275930 111895 102068 -288612 14308 409963
206D09963m60823l67446M64718K61282l69805o7644K65055j73579k09986L78614
$$ 409963 -50860 -418306 46412 307694 -62111 -129755 135300 -38279 -248265 130349
216A30349K04178m73539j96453M41011J21554l23725L9859J99302k56114j11765
$$ 130349 334527 -139012 -335465 105546 227100 -96625 -56766 142536 -113578 -225343
226b25343M35935O7218m92951l0043M07267m1903k35154J69160N7635l18793N7253
$$ -225343 210592 277810 -215141 -245184 162083 120180 -114974 54186 111821 -206972 -149719
237a49719M23618j03054m11515J11920K73480j32979o7004J87180j13649k58509
$$ -149719 273899 170845 -240670 -128750 144730 11751 -55253 131927 18278 -240231
247b40231K10249K86478k05533k26527J40742Q1685p9743Q8732O4882k02928r7705
$$ -240231 -29982 256496 50963 -175564 -34822 46863 -32880 55852 120734 -82194 -179899
258a79899K18504J34970j47045j24912M6890M4052J8121P2743j4068j62569m3840
$$ -179899 38605 173575 26530 -98382 -51492 -7440 10681 83424 69356 -93213 -137053
269a37053J77248J04413j15860j10316K2547M0453M7210O9647n6559j49121O396
$$ -137053 40195 144608 28748 -81568 -59021 -18568 28642 98289 41730 -107391 -100995
280a00995J50367N9621p4558q5587l2922M9314J07321K4186j08886p8685M0283
$$ -100995 49372 108993 34435 -51152 -84074 -34760 72561 96747 -12139 -90824 -50541
291e0541P0796N2426K67j15448q5315J15794J26191o4156q8538O487j5277J4218
$$ -50541 20255 72681 72948 -42500 -127815 -12021 114170 50014 -38524 -32037 -47314 -33096
303c3096J32669P691k03438l6062J88513L2433j01334K0258j198j08428O6836
$$ -33096 99573 107264 -96174 -132236 56277 88710 -12624 7634 6436 -101992 -35156
314c5156J88146p7357k09556N3737J52335l9490m1463O4594p3795j18151J35422
$$ -35156 152990 75633 -133923 -80186 72149 32659 -8804 55790 -18005 -136156 -734
325g34J71755j35272j79938R9362J21265p4936p751Q3595j07072j24616J76478
$$ -734 171021 35749 -144189 -44827 76438 1502 -6249 77346 -29726 -154342 22136
336B2136J60728j78671j53499J42705P4663j05267N4864R3776j84363j02972K57375
$$ 22136 182864 4193 -149306 -6601 68062 -37205 17659 111435 -72928 -175900 81475
347H1475J04320k48914o3875J80557l0020r7068J52905L5037k56319M08K86315
$$ 81475 185795 -63119 -126994 53563 23543 -73525 79380 114417 -141902 -141494 144821
358A44821k1912k29116N6770J14401j15340J469J88658p9212k37396J04297K29619
$$ 144821 122909 -106207 -49437 64964 -50376 -48907 139751 60539 -176857 -72560 157059
369A57059j01061j52444R6055L9876j18469O7309J56864j28918j83966J38087
$$ 157059 55998 -96446 -391 39485 -78984 -11675 145189 16271 -167695 -29608
379b9608J68578j21717r2285J05779j9602j10565J23811J29126j79265j37486
$$ -29608 138970 17253 -75032 30747 11145 -99420 24391 153517 -25748 -163234
389a63234J80089J03712j46784j7782J05608r3311p7280J83386O4125k14297n0137
$$ -163234 16855 120567 -26217 -43999 61609 -31702 -108982 74404 138529 -75768 -125905
400a25905J82028R339j07902O0520L3566j41939J5187J93150l1159j85743K9950
$$ -125905 56123 65462 -42440 18080 51646 -90293 -75106 118044 86885 -98858 -68908
411f8908J22083l7884l2495P0054m4422j10613P6951J37890o9907j21774M2865
$$ -68908 53175 15291 -17204 52850 8428 -102185 -25234 112656 42749 -79025 -36160
422c6160O3135k6199J1468M0334o9524p5839R0757J02979p6737r3226M6746L9074
$$ -36160 26975 776 12244 52578 -16946 -92785 -2028 100951 24214 -69012 -22266 16808
434A6808k1491L1187K2087q6411m4321J06526N7505q3201m3501L8720l160J24
$$ 16808 -4683 26504 48591 -37820 -82141 24385 81890 -1311 -44812 -6092 -9252 -9128
446i128O1227j5031r9437N876R5253J1346n3578j0342m747j2477M8166M3935n9033
$$ -9128 52099 37068 -62369 -56493 38760 50106 -3472 -13814 -18561 -31038 17128 61063 2030
459B030n7644L4228M1918L749l063k5680m1600K0692O3046M493n0103k5150J1308
$$ 2030 -55614 -21386 20532 24281 21218 -4462 -46062 -25370 37676 42169 -7934 -33084 -21776
472b1776K2899L1746K748n5524k9609M2056M3722q392l0795k0401n235K4983M3757
$$ -21776 1123 32869 35617 -19907 -49516 -7460 36262 27870 -2925 -23326 -28561 -3578 40179
485D0179n268o1845k2920N0180L5453j6740k0514j5289j5572K4554N7330j3374
$$ 40179 34911 -26934 -49854 326 35779 19039 -1475 -16764 -32336 -7782 49548 36174
497C6174q0665k522O7996J0713l1574O220j3121l9191L9864P2484m3251q2952
$$ 36174 -44491 -47013 20983 31696 122 6342 -6779 -45970 -6106 66378 23127 -59825
509e9825L2751N7523k4891m278K6794m8690l8707P7949M9743p5179m4079N1663
$$ -59825 -27074 30449 5558 1280 28074 -20616 -59323 18626 68369 -6810 -50889 774
521G74J4984k5803K9836J1420o7594j3422Q1971J8864o9029j2855L7706r466r751
$$ 774 15758 -10045 19791 31211 -36383 -49805 32166 51030 -17999 -30854 6852 -2614 -12365
534a2365M7310n858p7137O363Q3621k140o3162P138K5203k4342P049N5449k5671
$$ -12365 34945 29087 -48050 -41687 41934 39794 -23368 -16230 8973 -15369 -8320 47129 21458
547B1458q0017K7572Q1543k3895n3761K5626O155l6414L5388N7221o0138o9007
$$ 21458 -58559 -30987 50556 26661 -27100 -1474 4681 -31733 3655 60876 738 -68269
559f8269O2489N5583m9314j8231L3307k9714k2299O5319K2961p7716k4201O2612
$$ -68269 -5780 49803 489 -17742 15565 -14149 -36448 28871 51832 -25884 -50085 12527
571A2527J7392l5784Q346Q326m0000N109O3018m883o6349j816N0248L18k0286
$$ 12527 29919 -5865 2481 10807 -29193 -24084 38934 34051 -32298 -34114 16134 16452 -3834
584c834J5285n950l9838K0235N5868k1182n1109J2423L0471r132l447K0185k0543
$$ -3834 11451 5501 -34337 -14102 41766 20584 -30525 -18102 12369 3237 -210 19975 -568
597e68l7409L2184M7844l2704l9573K4857J5129j8334J6928J8631m1837k3012
$$ -568 -37977 -5793 42051 9347 -30226 -5369 9760 -8574 8354 26985 -14852 -37864
609c7864M9472K2437l9332r253J7748j4477J398L8637j0351m7991N321M1537K027
$$ -37864 11608 34045 -5287 -14540 3208 -11269 -9871 28766 18415 -29576 -24255 17282 19309
622A9309k1791n43k489j0604K0420K4697k3088l1827J2176K6030L9q282m237j3777
$$ 19309 -2482 -3025 -5514 -16118 4302 28999 5911 -25916 -13740 12290 12329 4047 -190 -13967
636a3967j893K8493J3834k8678k1693J7290J7579j858l937n484j5770L866K9883
$$ -13967 -15860 12633 26467 -2211 -23904 -6614 10965 9107 5170 -314 -16084 -12218 17665
649A7665M541l2182q733J9074L483k097J1210j0058k6303J4064L2714j1358k5803
$$ 17665 22206 -9976 -18709 365 3848 1751 12961 2903 -23400 -9336 23378 12020 -13783
662a3783P990P045q130J4807J1809k8000j5215K7583J2042j6105m224O044j2807
$$ -13783 -5793 1252 -6878 7929 19738 -8262 -23477 4106 16148 43 -4181 1863 -10944
675a0944J825K5708j117l0099k893K3851K775p542Q61n586j2245J2561K3230j0429
$$ -10944 -9119 16589 15472 -14627 -17520 6331 9106 1564 2425 -3161 -15406 -2845 20385 9956
689I956k6972N772J7363n13l095M493j3155j0308J6945K1098j5116k3992J1081
$$ 9956 -17016 -11244 6119 5606 2511 7004 -6151 -16459 486 21584 6468 -17524 -6443
702f443J4354o564J238O198j8154j0268K8297J3760k6842j1888J9304N34q636
$$ -6443 7911 1347 2585 8783 -9371 -19639 8658 22418 -4424 -16312 2992 3526 -5110
715e110J5514j146k6596K808L0429l056k2054L629P976p723N138J5713j3605k1348
$$ -5110 10404 9258 -17338 -14530 15899 12843 -9211 -5582 2394 -5329 -191 15522 1917 -19431
729a9431J5824J8708j1281j0049O925j768p109J1530J0362j6723j0850J3129R911
$$ -19431 -3607 15101 3820 -6229 696 -1072 -8181 3349 13711 -3012 -13862 -733 9178
742I178o713l629L156p099k874J3953P910j7706j0284J6464O401j1022K279M911
$$ 9178 2465 -1164 1992 -5107 -7981 5972 13882 -3824 -14108 2356 8757 -2265 14 4925
756D925j4430q89K2906M4k2135QJ5334l776l196J0300p755j7701J4313J9424j2848
$$ 4925 -9505 -10394 12512 12556 -9579 -9571 5763 1987 -1209 9091 1336 -16365 -2052 17372 4524
771D524j6371R230N133n686P454O084j5682q317J8893N961j3014n128P313l507
$$ 4524 -11847 -2617 2516 -3170 4284 10368 -5314 -13631 5262 11223 -1791 -6919 394 -3113
785c113O44J1104l314j4604J056J4547J703j0981J16J888j395L212O444m926j0031
$$ -3113 -2469 8635 5321 -9283 -8227 6320 8023 -2958 -2842 -954 -2349 863 7307 2381 -7650
800g650K646J1387k040q321M947L82o958M540J1356r738j0881Q224Q615p959L09
$$ -7650 -5004 6383 4343 -3978 969 1351 -5607 -1067 10289 551 -10330 -2106 6509 -1450 -1141
815a141O341p426o686J3719N496j4709j676Q991l059k647Q339p47j3995J680J5351
$$ -1141 5200 -2226 -8912 4807 10303 -4406 -6082 2909 -150 -2797 5542 4795 -9200 -7520 7831
830G831j258j2222K806M256l992M147N363o878r559P419J1089o967o417L435L5
$$ 7831 6573 -5649 -2843 1413 -2579 1568 6931 53 -9506 -2087 9002 2035 -4382 -947 -912
845i12j388N895K338q286n483Q428P015n187o630M143M18l612O537K767j1858
$$ -912 -2300 3595 5933 -2353 -7836 592 7607 2420 -4210 -67 351 -3261 3276 6043 -5815
860e815j330J3003l28q988J716N372o463k153J2542k971j2415O120P392n409l293
$$ -5815 -7145 5858 5530 -3458 -1742 3630 -2833 -4986 7556 4585 -7830 -1710 5682 273 -3020
875c020N947j198p693O032P606q684n253P634P93n659M038M181o953k407P726
$$ -3020 2927 1729 -5964 68 7674 -1010 -6263 1371 2164 -3495 543 4724 -2229 -4636 3090
890C090J641n778j095L727l732O74M618M81p702L46N494J960m401q71K588j864
$$ 3090 4731 -1047 -2142 1585 -2147 -1473 3145 3626 -4076 -3730 1764 3724 -677 -1548 1040 -824
906h24j593O471j064q321J521Q714k050n468K095P01k053K703M374o856n744Q491
$$ -824 -2417 4054 2990 -5331 -3810 4904 2854 -2614 -519 182 -1871 832 5206 -1650 -7394 1097
922A097M638p045q3L743m025j404O444N64q170K054N163j479m369M189m10m883
$$ 1097 5735 -1310 -1393 2350 -1675 -3079 3365 3929 -4241 -2187 2976 1497 -2872 1317 907 -3976
938c976L751M540m006l789M351J981m072o23L093j601j751J733K435k348j791
$$ -3976 -225 4315 309 -3480 871 2852 -1220 -1843 1250 -351 -2102 -369 2066 -282 -2073
953b073K375q9r61L8K912k001l072K282M179l457j213K955j688k077L979K981
$$ -2073 302 213 -748 -710 2202 201 -2871 -589 3590 133 -1080 1875 187 -1890 2089 5070
969E070o701j397N661r24l573K414J854n093J378N934l889n367L043N111l791
$$ 5070 -1631 -3028 2633 1709 -1864 550 2404 -2689 -1311 4623 734 -4633 -1590 3521 -270
984b70j660L456j202l345N252J321n625j196M157K3j196J331O47m058J467M016
$$ -270 -1930 1526 324 -3021 2231 3552 -2073 -3269 888 911 -285 1046 1693 -2365 -898 3118
1000C118j539m342Q03L034L13k266k67R13q21q65L045l98l669L640J952k944j637
$$ 3118 1579 -2763 -1960 1074 1387 -879 -1146 -233 -1054 -1919 1126 728 -2941 699 2651 -293 -1930
1017a930M168q24l493J16M963l344k196M749o76l764J551L285l006k201L281N47
$$ -1930 2238 1414 -2079 -1963 3000 -344 -2540 2209 1533 -2231 -680 2605 -401 -2602 679 1226
1033A226l075J575L666m781j921N535K56m103lK457j723K39J577q42j220N35L430
$$ 1226 -1849 -274 3392 -1389 -3310 2225 2481 -1622 -1625 832 -891 -652 925 83 -1137 -602 2828
1050B828k109k580K457J49q24m02J050l93k041J286K860k587q01N76K261j920
$$ 2828 719 -1861 596 745 -79 -481 569 176 -1865 -579 2281 -306 -1107 -531 1730 -190
1066a90j25J303p64k147K664J393l009n98L660q04l460L062J336m092J193M542
$$ -190 -315 988 224 -1923 741 2134 -875 -1473 2187 1383 -2077 985 2321 -1771 -578 3964
1082C964l522l116L165J421m106P47L142k367j941M493r71l742J374M014j893
$$ 3964 442 -2674 491 1912 -2194 -1447 1695 -672 -2613 1880 909 -2833 -1459 2555 662
1097F62k133J993O80j795J182J97j269j396L321L1j722L7L76J236r11j693K047
$$ 662 -1471 522 1202 -593 589 786 -483 -1879 1442 1473 -249 -212 164 1400 489 -1204 843
1114H43n65n83J285l7k011r87K971J514k781q57J121M75j016K690j396k621K614
$$ 843 278 -305 980 943 -1068 -2055 916 2430 -351 -1208 -87 388 -628 2062 666 -1955 659
1131F59Q27j544j704J918J25q32M07J844k544p23L417j426j476J339J060j674
$$ 659 1486 -58 -1762 156 281 -551 -144 1700 -844 -1567 1850 424 -1052 287 1347 -327
1147c27l49J424j610o05J673N42j582j50J707l55K22p02j070N76J176n60P21j392
$$ -327 -676 748 -862 -1467 206 748 -834 -984 723 368 590 -112 -1182 -606 570 10 731 -661
1165f61J6J544o04j695O63J407l30j810J587l99k39l66J795p08j905J225J435
$$ -661 -645 899 295 -1400 -737 670 340 -1470 117 -282 -521 -887 908 200 -1705 -480 955
1182I55j630n97J551j699m31L131N76l319M34K829j704j717K720k59k093J888
$$ 955 -675 -1272 279 -1420 -1851 1280 1856 -1463 -1029 1800 96 -1621 1099 840 -1253 635
1198F35L16j475j020J718R79k175k3J274k53j77R81j215o35J430l3L78j622o90
$$ 635 951 -524 -1544 174 1153 -1022 -1045 229 -24 -201 780 -435 -1070 360 327 705 -917 -1607
1216a607J769l85k93L72K90n91R15L18p9j484K128L02k312n6R70q49m39J130N23
$$ -1607 162 -223 -516 -144 146 -445 470 788 709 -775 1353 1655 -657 -713 257 -592 -1031 99 622
1235F22j904k63K813J34k211Q26J035j340j3K124k105j121J747J053r00k343K410
$$ 622 -1282 -1545 1268 1402 -809 17 1052 -288 -301 1823 -282 -1403 344 1397 497 -1846 564
1252E64O98j364O57J50j811N79J398j132q0J00N1o7P48Pj095l9P28P27o2r54R0
$$ 564 1262 -102 555 705 -1106 -527 871 -261 -341 -241 -190 -257 491 498 -597 -636 92 819 757 -197 -107
1273a07J546j052p12r91J495j07N69j010p88K84J251M18j646O83J54K28k84L57
$$ -107 1439 387 -325 -1316 179 72 641 -369 -1157 -873 378 796 -850 -167 -13 215 -69 288
1291B88P55j960J811J35j266K35Q73p86J19M91n77o01K60J016n0j656K89J887
$$ 288 1043 -917 894 1029 -237 -2 871 85 204 695 118 -483 -223 793 743 -913 -624 1263
1309A263q37q11m20j163J649O42n92K74O46p66J018k00p01N70q57L98p13P87N05
$$ 1263 426 -385 -805 -1968 -319 323 -269 5 651 -115 903 703 2 572 -285 113 -600 187 692
1328F92j349J058J096j507j284J830j93j087P56j203O70l31K192j765q06J957
$$ 692 -657 401 1497 -10 -1294 536 343 -744 12 -1191 -521 -852 1340 -425 -1231 726
1344G26Q1j259r1N20K69m02R64P73k700K105l01j9k057J447j17j083J467O18j826
$$ 726 807 -452 -543 -23 246 -156 808 1581 -1119 986 685 666 -1391 56 -61 -1144 323 941 -885
1363h85k06M39J403o23l54L9N38o6l82M67k07o00Q83O8j556J83J306r66k87Q8
$$ -885 -1091 -652 751 128 -226 -187 351 285 -97 370 163 -437 446 514 -1042 -859 447 -519 -806 -718
1383g18K17Q18N2N97o81n99J77J397j016j90n17N11J24K30n60j105R18J861l62
$$ -718 -501 317 369 966 285 -314 -137 1260 244 54 -463 48 172 402 -158 -1263 -345 1516 1154
1402A154k305J396k61q4l44J73M6l86J116n0j492M1Q04P61K58J87j578p28J105
$$ 1154 -1151 245 -16 -100 -444 -271 -225 -611 505 455 -1037 -996 -192 569 827 1014 -564 -1292 -187
1421a87p3J452j658R02k09L81j034p57P57M97Q3J7l97j36N6J64o91K9K13J375
$$ -187 -260 1192 -466 436 227 608 -426 -1183 -426 71 154 171 -226 -362 -306 -142 -833 -804 -591 784
1441G84l54L19k62p90r42J162O21r37J21O77l55l39J066j658J02j8J876j051o89
$$ 784 430 749 487 -303 -1245 -83 538 -399 -278 399 44 -295 771 -887 -785 -803 1073 22 -667
1460f67J274J39l57P2l61m11J071M17m96o24m7J085j041k37R5L86j246O16%K80
$$ -667 607 746 389 461 100 -311 760 1177 681 57 10 1095 54 -183 -88 298 -948 -332 -332 -52
1480e2l8m36J387j062K8j95o9j173P53R30R2O36o42j98j32q39R39J457j694r76
$$ -52 -90 -526 861 -201 -173 -368 -437 -1610 -857 73 165 801 159 -39 -171 -1010 -71 1386 -308 -1284
1500a284J315l24q1L06J94n86L08M04J25J18n12J26m31J701n71j668J158j52L69
$$ -1284 31 -293 -374 -68 126 -460 -152 252 377 495 -17 109 -322 1379 808 -860 298 146 515
1519E15L49j960K061n46j51J62r05j39M23M82j322J287j004P29k7r7m77P60n0
$$ 515 864 -1096 965 419 268 430 -475 -614 -191 291 -1031 256 -748 -19 -46 -143 -620 140 90
1538I0j41J18m65K02J2J158j693N53J406k036N20N00p16j474J534K124j832q36
$$ 90 -51 67 -398 -196 -184 974 -719 -166 1240 -796 -276 224 -492 -1966 -432 1692 -140 -976
1556i76P94k04J538j434q3p3K38K11K9J76L73l44m95O48Q81j049o06Q58m69q49
$$ -976 -182 -386 1152 -282 -365 -438 -200 11 40 216 589 245 -250 398 1279 230 -376 482 13 -836
1576h36J150j345K110p39k6n26L58Q65q13K60m00k05J86M94n22L54M36q83M08
$$ -836 314 -1031 1079 340 314 -212 146 1011 198 458 58 -147 39 533 11 365 801 -82 326
1595C26j021O98l63K80Q31n33p01K34J00p18J191l08M7j26O40m17j382Q73M86
$$ 326 -695 3 -360 -80 751 218 -483 -249 -149 -867 324 16 63 -63 577 160 -1222 -349 137
1614A37j43J044p83m12P23n55O96j099L83m19M49j06M40n96M54M18l23Q85r02
$$ 137 -6 1038 255 -157 566 11 707 -392 -9 -428 21 -85 355 -241 213 631 308 1193 291
1633B91L71q05P26o69p35P86O03l67J005j236q2k38m96J257l57q19J039P39j306
$$ 291 662 -143 583 -86 -821 -35 568 201 1206 -30 -112 -350 -846 411 54 -765 274 1013 -293
1652b93l70M44o95J481k55l98j22k40N79Q26q81m71O74J67M31j99j292J510j823
$$ -293 -663 -219 -914 567 312 -86 -208 -448 131 957 76 -395 279 446 877 678 -614 896 -927
1671i27Q51nq89O45M50Q65j231R54j160J081q28m82J032o17Q57j166J769k433
$$ -927 -76 -81 -970 -325 125 990 -241 713 -447 634 -194 -676 356 -261 596 -570 1199 -1234
1689a234J367n67j32R84k8n90J478l10j040jK38j25m0q9o04O29O03l47q34R94
$$ -1234 133 -434 -566 418 390 -200 1278 968 -72 -73 165 40 0 -89 -693 -64 539 192 -642 352
1709C52K75j024K350j381r68L61m19P59M26j268P83r63N04Q43l46L74m14r07J558
$$ 352 627 -397 1953 572 -396 -35 -454 305 731 -537 246 -717 -213 630 284 658 244 -663 895
1728H95p78l84N62j67o8q45J367j495J489j702R94p6P46l11L62k52K7m71PR55
$$ 895 117 -267 295 128 60 -785 582 -913 576 -1126 -132 -208 538 227 589 337 364 -107 -100 855
1748H55m07p51p17J295k5k14j85L81q13K29N1K1N25l54L77J01j162Q17N4n09N19
$$ 855 448 -303 -1020 275 250 36 -149 232 -581 -352 -301 -280 245 -109 268 369 -793 24 78 -431 88
1769H8r6m37J659m41l51m18M45j81N12q17m14K11k28R93o00q97J002L94m30K29
$$ 88 -8 -445 1214 773 422 4 449 268 780 -37 -451 -240 -468 525 -75 -972 30 424 -6 223
1789B23K42n68O56M56j400K86r34J474n08Q47n61m44M22l62P29l03j77o17N38
$$ 223 465 -103 553 1009 -391 -105 -1039 435 -73 774 213 -231 191 -171 558 255 78 -539 -1
1808aJ00O44m58n6m77M75j4L35r46J624j659J118k60r71Q90r58q7L50l04K45M37
$$ -1 99 743 285 229 -248 227 213 548 -398 1226 -433 685 425 -546 344 -614 -701 -351 -655 -410 27
1829B7j73J80p20Q49L06l16m92L08j39J6j6J76n97L14K4R83m58o09R6J125q73
$$ 27 -146 34 -686 163 469 153 -339 -31 -170 -154 -170 6 -591 -277 -253 730 272 -337 -241 884 11
1850A1L98j153J485k49N70j134j125J486K27j08K11j052J99P26n2p50Q01p98L06
$$ 11 409 -744 741 492 1062 -72 -1197 289 516 408 619 -433 -234 492 440 -310 491 -307 -1
1869aL6L07p95m92J098p67M98n71N02k99R49k15p87L52p57R98j74N09m52L77m20
$$ -1 35 342 -453 -945 153 -614 -116 -687 -185 -484 465 250 -537 -185 -942 56 -118 391 -61 316 -104
1890a04m17P37n92M04k31J40m78M06k75p54J783q16n15O11L16m73J72L36j083
$$ -104 -521 216 -376 28 -203 -63 -541 -135 -410 -1164 619 -197 -712 -101 215 -258 -86 250 -833
1909h33M15j2o2K28P49K08l08p33K74R18p75O05j132R24n28J27K47n94J4R90m69
$$ -833 -418 -430 -492 -264 485 693 385 -348 -74 844 69 674 -458 466 -62 65 312 -282 -268 722 253
1930B53n04L59l18L72M5j041J705j186k27P18o3j31k77J07J91QK58j467Q94L19
$$ 253 -251 108 -210 162 207 -834 871 -315 -542 176 113 -18 -295 -188 3 11 269 -1198 -304 15
1950A5M01j019K78n76K88R86m82J85m8K75q78J037l53r74J60J069p61R03k58r2
$$ 15 416 -603 -325 -901 -613 373 -109 76 28 303 -575 462 109 -865 -705 364 -397 506 248 156
1970A56L42k35N07j709j09P07l3J2K62Q25l26K01m11k22p1Q95P6j400R37n58o84
$$ 156 498 263 770 -939 -1048 -341 -374 -362 -100 725 399 600 189 -33 -104 791 867 -533 404 -154 -838
1991h38M96l89K25R31j021L30L99q38J218r68L75N3k76K3M44j025J076R04k96
$$ -838 -342 -731 -506 425 -596 -266 133 -705 513 -455 -80 -27 -303 -280 164 -861 215 1119 823
$$ [...]
8191G16
##END NTUPLES=NMR FID
##END=
