##TITLE=1H_SAM_30.248.TFA
 CD3OD+CF3COOD,108 sc, 
 27.9.2021
##JCAMPDX= 6.0         $$ Bruker NMR JCAMP-DX V2.0
##DATA TYPE= NMR FID
##DATA CLASS= NTUPLES
##ORIGIN= UXNMR, Bruker Analytische Messtechnik GmbH
##OWNER= root
$$ XWIN-NMR		Version 3.5
$$ Mon Sep 27 11:29:48 2021 Russian Standard Time (UT+4h)  she@DPX200
##.OBSERVE FREQUENCY= 200.1314
##.OBSERVE NUCLEUS= ^1H
##.DELAY= (6, 6)
##.ACQUISITION MODE= SIMULTANEOUS
##.ACQUISITION SCHEME= undefined
##.AVERAGES= 108
##.DIGITISER RES= 18
##SPECTROMETER/DATA SYSTEM= spect
##.PULSE SEQUENCE= zg30
##.SOLVENT NAME= MeOD
##.SHIFT REFERENCE= (INTERNAL, MeOD, 0, 15.7039)
##AUDIT TRAIL= $$ (NUMBER, WHEN, WHO, WHERE, WHAT)
$$ ##TITLE= Audit trail, XWIN-NMR		Version 3.5
$$ ##JCAMPDX= 5.01
$$ ##ORIGIN= Bruker BioSpin GmbH
$$ ##OWNER= she
$$ F:/spectra/data/she/nmr/H-F/1/audita.txt
$$ ##AUDIT TRAIL=  $$ (NUMBER, WHEN, WHO, WHERE, WHAT)
(   1,<2021-09-27 11:28:28.23 +0400>,<she>,<DPX200>,
      <continue with go, POWCHK disabled, PULCHK disabled
       configuration hash MD5:
       00 E9 B6 7A A2 85 ED C7 34 08 36 98 17 FE 4E 26
       data hash MD5: 16K
       5C A3 04 4B 6C 07 E9 75 B9 68 97 1C AD 7C 4F 58>)
$$ ##END=
$$ 
$$ hash MD5
$$ 40 50 38 73 CF 54 9F 26 E8 BD 0A 36 DB 12 8C E3
##$RELAX= 
##$RELAX= 
##$RELAX= 
##$RELAX= 
##$RELAX= 
##$RELAX= 
$$ Bruker specific parameters
$$ --------------------------
##$DU= <F:/spectra>
##$EXPNO= 1
##$NAME= <H-F>
##$PROCNO= 1
##$TYPE= <nmr>
##$USER= <she>
##$AMP= (0..31)
100 100 100 100 100 100 100 100 100 100 100 100 100 100 100 100 100 100 
100 100 100 100 100 100 100 100 100 100 100 100 100 100 
##$AQSEQ= 0
##$AQ_mod= 1
##$AUNM= <au_zg>
##$AUTOPOS= <>
##$BF1= 200.13
##$BF2= 200.13
##$BF3= 200.13
##$BF4= 200.13
##$BF5= 200.13
##$BF6= 200.13
##$BF7= 200.13
##$BF8= 200.13
##$BYTORDA= 1
##$CFDGTYP= 0
##$CFRGTYP= 5
##$CHEMSTR= <none>
##$CNST= (0..31)
1 1 145 1 1 1 1 1 1 1 1 1 1 1 1 1 1 1 1 1 1 1 1 1 1 1 1 1 1 1 1 1 
##$CPDPRG= <>
##$CPDPRG1= <>
##$CPDPRG2= <>
##$CPDPRG3= <>
##$CPDPRG4= <mlev>
##$CPDPRG5= <mlev>
##$CPDPRG6= <mlev>
##$CPDPRG7= <mlev>
##$CPDPRG8= <mlev>
##$CPDPRGB= <>
##$CPDPRGT= <>
##$D= (0..31)
0 1.2 0 0 0 0 0 0 0 0.06 0 0.03 0 0 0 0 0.0002 0 0 0 0 0 0 0 0 0 0 0 0 
0 0 0 
##$DATE= 1632727188
##$DBL= (0..7)
120 120 120 120 120 120 120 120 
##$DBP= (0..7)
150 150 150 150 150 150 150 150 
##$DBP07= 0
##$DBPNAM0= <>
##$DBPNAM1= <>
##$DBPNAM2= <>
##$DBPNAM3= <>
##$DBPNAM4= <>
##$DBPNAM5= <>
##$DBPNAM6= <>
##$DBPNAM7= <>
##$DBPOAL= (0..7)
0.5 0.5 0.5 0.5 0.5 0.5 0.5 0.5 
##$DBPOFFS= (0..7)
0 0 0 0 0 0 0 0 
##$DE= 6
##$DECBNUC= <off>
##$DECIM= 32
##$DECNUC= <off>
##$DECSTAT= 4
##$DIGMOD= 1
##$DIGTYP= 9
##$DL= (0..7)
0 120 120 120 120 120 120 120 
##$DP= (0..7)
150 150 150 150 150 150 150 150 
##$DP07= 0
##$DPNAME0= <>
##$DPNAME1= <>
##$DPNAME2= <>
##$DPNAME3= <>
##$DPNAME4= <>
##$DPNAME5= <>
##$DPNAME6= <>
##$DPNAME7= <>
##$DPOAL= (0..7)
0.5 0.5 0.5 0.5 0.5 0.5 0.5 0.5 
##$DPOFFS= (0..7)
0 0 0 0 0 0 0 0 
##$DQDMODE= 0
##$DR= 18
##$DS= 0
$$ [...]
##$SUBNAM2= <"">
##$SUBNAM3= <"">
##$SUBNAM4= <"">
##$SUBNAM5= <"">
##$SUBNAM6= <"">
##$SUBNAM7= <"">
##$SUBNAM8= <"">
##$SUBNAM9= <"">
##$SW= 20.0188988654967
##$SWIBOX= (0..15)
0 0 2 0 0 0 0 0 0 0 0 0 0 0 0 0 
##$SW_h= 4006.41025641026
##$TD= 16384
##$TD0= 1
##$TE= 0
##$TE2= 300
##$TE3= 300
##$TEG= 300
##$TL= (0..7)
0 120 120 120 120 120 120 120 
##$TP= (0..7)
150 150 150 150 150 150 150 150 
##$TP07= 0
##$TPNAME0= <>
##$TPNAME1= <>
##$TPNAME2= <>
##$TPNAME3= <>
##$TPNAME4= <>
##$TPNAME5= <>
##$TPNAME6= <>
##$TPNAME7= <>
##$TPOAL= (0..7)
0.5 0.5 0.5 0.5 0.5 0.5 0.5 0.5 
##$TPOFFS= (0..7)
0 0 0 0 0 0 0 0 
##$TUNHIN= 0
##$TUNHOUT= 0
##$TUNXOUT= 0
##$USERA1= <user>
##$USERA2= <user>
##$USERA3= <user>
##$USERA4= <user>
##$USERA5= <user>
##$V9= 5
##$VALIST= <valist>
##$VCLIST= <CCCCCCCCCCCCCCC>
##$VD= 0
##$VDLIST= <DDDDDDDDDDDDDDD>
##$VPLIST= <PPPPPPPPPPPPPPP>
##$VTLIST= <TTTTTTTTTTTTTTT>
##$WBST= 1024
##$WBSW= 4
##$XGAIN= (0..3)
0 0 0 0 
##$XL= 0
##$YL= 0
##$YMAX_a= 1004487
##$YMIN_a= -1092924
##$ZGOPTNS= <>
##$ZL1= 120
##$ZL2= 120
##$ZL3= 120
##$ZL4= 120
##$ABSF1= 10
##$ABSF2= 0
##$ABSG= 5
##$ABSL= 3
##$ALPHA= 0
##$AQORDER= 0
##$ASSFAC= 0
##$ASSFACI= 0
##$ASSFACX= 0
##$ASSWID= 0
##$AUNMP= <proc_1d>
##$AZFE= 0.1
##$AZFW= 0.1
##$BCFW= 1
##$BC_mod= 2
##$BYTORDP= 1
##$COROFFS= 0
##$CY= 11.3945322036743
##$DATMOD= 1
##$DC= 2
##$DFILT= <>
##$DTYPP= 0
##$F1P= 2.36226072786647
##$F2P= -0.459571619588291
##$FCOR= 0.5
##$FTSIZE= 0
##$FT_mod= 4
##$GAMMA= 1
##$GB= 0.15
##$INTBC= 1
##$INTSCL= 1
##$ISEN= 128
##$LB= 0.24
##$LEV0= 0
##$LPBIN= 0
##$MAXI= 10000
##$MC2= 0
##$MEAN= 0
##$ME_mod= 0
##$MI= 1.114404
##$NCOEF= 0
##$NC_proc= 0
##$NLEV= 6
##$NOISF1= 3.799351
##$NOISF2= 2.8
##$NSP= 1
##$NTH_PI= 0
##$NZP= 0
##$OFFSET= 15.70392
##$PC= 1
##$PHC0= -14076.96
##$PHC1= 11.00089
##$PH_mod= 1
##$PKNL= yes
##$PPARMOD= 0
##$PSCAL= 0
##$PSIGN= 0
##$REVERSE= no
##$SF= 200.130013532006
##$SI= 16384
##$SIGF1= 3
##$SIGF2= 2
##$SINO= 400
##$SIOLD= 16384
##$SREGLST= <1H.CDCl3>
##$SSB= 0
##$STSI= 0
##$STSR= 0
##$SW_p= 3612.71676300578
##$SYMM= 0
##$S_DEV= 0
##$TDeff= 0
##$TDoff= 0
##$TI= <>
##$TILT= no
##$TM1= 0
##$TM2= 0
##$TOPLEV= 0
##$USERP1= <user>
##$USERP2= <user>
##$USERP3= <user>
##$USERP4= <user>
##$USERP5= <user>
##$WDW= 1
##$XDIM= 8192
##$YMAX_p= 0
##$YMIN_p= 0
$$ End of Bruker specific parameters
$$ ---------------------------------
##NTUPLES= NMR FID
##VAR_NAME=  TIME,          FID/REAL,        FID/IMAG
##SYMBOL=    X,             R,               I
##VAR_TYPE=  INDEPENDENT,   DEPENDENT,       DEPENDENT
##VAR_FORM=  AFFN,          ASDF,            ASDF
##VAR_DIM=   8192,          8192,            8192
##UNITS=     SECONDS,       ARBITRARY UNITS, ARBITRARY UNITS
##FACTOR=    0.0002496,     1,               1
##FIRST=     0,             0,               0
##LAST=      2.0444736,     0,               0
##MIN=       0,             -1092924,        0
##MAX=       2.0444736,     1004487,         0
$$ Real data points
##PAGE= N=1
##DATA TABLE= (X++(R..R)), XYDATA
$$ [...]
$$ plain form
2653 315 -119 -80 210 -140 -11 -226 -170 185 -148 -170 548 -229 -668 -219 214 47 -392 -55 -712 327 631
2674 631 -61 332 -956 581 155 -181 -727 -680 549 95 568 -247 -91 -639 -379 1011 -920 -674 -693
2693 -693 0 477 -63 646 -549 332 456 397 -39 57 660 286 -785 -386 485 279 -89 15 158 -91
2713 -91 -442 -263 516 -232 -226 285 -286 73 229 475 242 894 -173 313 84 -498 59 1138 328 -325
2733 -325 93 -283 536 -634 109 54 831 153 -12 110 303 -195 211 290 -50 569 -154 -785 -590 -245
2753 -245 966 405 504 -295 -818 -227 148 307 1038 647 -67 138 67 -260 228 -804 -58 576 1051 -289
2773 -289 428 558 882 -352 35 173 567 -173 -146 816 -47 820 81 -480 1505 -588 -350 1501 -17
2792 -17 386 230 -631 -645 388 -49 -465 -1252 480 -244 -182 663 -1011 -131 532 -536 91 171 175 230 278
$$ packed form
2653C15m34L9K90l50J29k15N6L55l33k2P18p77m39M49M33j67m39L37o57J039L04
2674F31o92L93j288J537m26l36n46M7J229m54M73q15J56n48K60J390j931K46j9
2693f93O93M77n40P09j195Q81J24n9m36R6O03l74j071L99Q71k06l68J04J43k49
2713i1l51J79P79p48ON11n71L59J56K46k33O52j067M86k29n82N57J079q10o53
2733c25M18l76Q19j170P43n5P77o78j65J22J93m98M06P9l40O19p23o31J95L45
2753b45J211n61R9p99n23N91L75J59P31l91p14K05p1l27M88j032P46O34M75j340
2773b89P17J30L24j234L87J38L94p40K7R62q63Q67p39n61J985k093K38J851j518
2792a7M03j56q61j4J033m37m16p87J732p24O2Q45j674Q80O63j068O27Q0MN5M8
$$ plain form
2813 278 879 -265 -979 603 931 476 293 1556 601 344 277 284 1018 122 550 -652 312 -73 2 59
2833 59 -989 -62 -274 -345 772 508 360 267 -25 -263 -511 -473 -426 411 308 -134 -1052 -312 357 591 -168
2854 -168 -355 892 21 215 103 -127 -129 375 -287 -568 -41 -518 -256 -257 159 161 188 -1190 -956 -1106 50
2875 50 -414 487 -349 619 269 68 -269 -255 110 -92 58 359 -68 627 459 -373 -192 860 32 -179
2895 -179 168 -356 562 618 551 431 31 -858 245 -489 -615 453 -554 252 -101 1589 -135 126 -429
2914 -429 -708 -151 523 1174 -307 -155 -88 708 96 -719 -1238 -437 -717 221 882 -180 416 -150 -60 35
2934 35 -231 -73 569 -496 -69 289 -935 -660 281 1245 665 -618 -67 -33 377 30 -629 -204 34 908
2954 908 24 -251 -265 545 31 -402 -209 104 -127 -32 546 541 1061 333 -666 428 47 -703 -280 -496 226
$$ packed form
2813B78O01j144p14J582L28m55j83J263r55k57o7PP34q96M28j202R64l85P5N7
2833E9j048R27k12p1J117k64j48r3k92k38k48L8M7Q37j03m42r18P40O69K34p59
2854a68j87J247q71J94j12k30kN04o62k81N27m77K62jM16KK7j378K34j50J156
2875E0m64R01q36R68l50k01l37J4L65k02J50L01m27O95j68q32J81J052q28k11
2895a79L47n24R18N6o7j20m00q89J103p34j26J068j007Q06l53J690j724K61n55
2914d29k79N57O74O51j481J52O7P96o12q15n19Q01k80R38O61j062N96n66R0R5
2934C5k66J58O42j065M27L58j224K75R41R64n80j283N51L4M10l47o59M25K38Q74
2954I08q84k75j4Q10n14m33J93L13k31R5N78nN20p28r99J094l81p50M23k16P22
$$ plain form
2975 226 659 -352 -752 -50 -200 426 -307 48 98 181 46 -586 -636 -140 144 400 -81 -113 -400 349 236
2996 236 405 -735 -615 26 -930 -918 -278 727 -388 390 527 134 -83 1 72 -55 1012 455 106 104
3016 104 316 -177 -426 553 -101 434 -698 -334 -769 288 359 -222 359 -181 -88 460 -85 427 1085 -10
3036 -10 132 -717 289 163 -449 657 119 816 -878 59 -1412 -285 -265 -12 -489 -1265 673 -261 -388
3055 -388 686 -1055 -359 432 675 10 -136 1304 -132 50 497 71 147 -651 -424 823 -1007 72
3073 72 26 141 212 102 -1038 -830 -1206 243 -223 -86 559 670 225 846 68 370 737 604 515 -335 -58
3094 -58 -388 504 -756 -733 1236 214 -314 -309 -441 218 470 -125 -238 -518 -124 -948 904 -17 -590 -292
3114 -292 510 30 75 557 397 285 215 -227 -806 -91 102 617 -271 543 881 693 26 -293 73 -710 -534
$$ packed form
2975B26M33j011m00P02j50O26p33L55N0Q3j35o32n0M96K84K56m81l2k87P49j13
2996B36J69j140J20O41r56J2O40J005j115P78J37l93k17Q4P1j27J067n57l49k
3016A04K12m93k49R79o54N35j132L64m35J057P1n81N81n40R3N48n45N12O58j095
3036a0J42q49J006j26o12J106n38O97j694R37j471J127K0K53m77p76J938r34j27
3055c88J074j741O96P91K43o65j46J440j436J82M47m26P6p98K27J247j830J079
3073G2m6J15P1j10j140K08l76J449m66J37O45J11m45O21p78L02L67j33q9q50K77
3094e8l30Q92j260K3J969j022n28Nj32O59K52n95j13k80L94q24J852r21n73K98
3114b92Q02m80M5M82j60j12p0m42n79P15J93N15q88Q14L38j88o67l19L66p83J76
$$ plain form
3135 -534 396 -154 -181 -633 387 -391 207 248 441 -184 103 594 -1469 1427 -52 -327 -761 141 -491
3154 -491 271 490 933 -465 -64 831 -343 646 650 473 -1272 150 676 403 -242 487 422 -157 -89 -404
3174 -404 36 -204 -323 25 -308 -392 954 -295 -242 77 547 -565 -409 -50 245 -715 100 173 -228 828
3194 828 -111 179 27 848 -256 -197 201 225 1111 671 119 -454 -208 -810 -438 887 139 755 439 420
3214 420 -1080 -20 -344 -234 -481 -716 209 -109 290 -740 63 457 -30 -43 -238 7 41 -136 -716 79
3234 79 -311 -572 220 912 402 -829 -166 -1026 -462 765 -562 314 250 524 -22 -141 690 76 701 104
3254 104 -769 -1164 717 -996 -368 954 426 236 -850 -348 202 641 526 406 -129 1019 303 176
3272 176 293 -21 -422 -764 -789 175 93 215 -10 327 93 -1104 75 -14 481 327 678 -75 -867 400
$$ packed form
3135e34R30n50k7m52J020p78N98M1J93o25K87M91k063K896j479k75m34R02o32
3154d91P62K19M43j398M01Q95j174R89Mj77j745J422N26k73o45P29o5n79O8l15
3174d04M40k40j19L48l33q4J346j249N3L19M70j112J56L59K95r60Q15P3m01J056
3194H28r39K90j52Q21j104N9L98K4Q86m40n52n73K46o02L72J325p48O16l16j9
3214D20j500J060l24J10k47k35R25l18L99j030Q03L94m87j3j95K45L4j77n80P95
3234G9l90k61P92O92n10j231O63q60N64J227j327Q76o4K74n46j19Q31o14O25n97
3254A04q73l95J881j713O28J322n28j90j086N02N50M39j15j20n35J148p16j27
3272A76J17l14m01l42k5R64q2J22k25L37k34j197J179q9M95j54L51p53p92J267
$$ plain form
3292 400 -1071 -842 222 730 486 91 731 -601 563 -618 -343 518 235 83 -190 328 146 -190
3310 -190 -244 743 130 -235 318 -27 -82 -216 126 -22 -484 -117 -508 649 -430 327 -6 -281 917 -723
3330 -723 -393 361 142 -926 404 -724 -1149 1121 422 120 533 -155 -229 -371 1129 232 219 54 654
3349 654 114 -165 -37 -796 -57 -298 911 221 41 -688 -16 -471 1083 -66 -110 -176 80 -24 -929 213
3369 213 -882 -1212 -477 -39 -801 254 -41 802 -320 114 -636 -107 -206 -779 1395 -33 1235 -420
3387 -420 232 -488 786 -390 281 -240 550 -780 -695 -255 318 596 744 210 -340 357 388 116 133 -719
3407 -719 -177 313 328 -473 -436 -558 -303 -695 70 -159 580 -239 -59 952 -613 -124 236 -237 -1071 -48
3427 -48 -666 -133 396 -249 579 333 112 428 360 -382 -669 1030 154 -710 -576 -206 -361 -140 -427 -565
$$ packed form
3292D00j471K29J064N08k44l95O40j332J164j181K75Q61k83j52k73N18j82l36
3310a90n4R87o13l65N53l45n5j34L42j48m62L67l91J157j079P57l33k75J198j640
3330g23L30P54k19j068J330j128m25K270o99l02M13o88p4j42J500q97j3j65O00
3349F54n40k79J28p59P39k41J209o90j80p29O72m55J554j149m4o6K56j04r05J142
3369B13j095l30P35M38p62J055k95Q43j122M34p50N29r9n73K174j428J268j655
3387d20O52p20J274j176O71n21P90j330Q5M40N73K78J48n34n50O97L1k72J7q52
3407g19N42M90J5q01L7j22K55l92P65k29P39q19J80J011j565M89L60m73q34J023
3427d8o18N33N29o45Q28k46k21L16o8p42k87J699q76q64J34L70j55K21k87j38
$$ plain form
3447 -565 -178 929 -715 -78 218 1006 411 -187 -944 -659 -584 -629 356 267 247 -422 -280 -484 -322 -557 1273
3468 1273 559 -176 658 301 -251 -249 263 -193 777 134 -584 -19 -224 1017 222 10 279 -1267 536
3487 536 445 -466 -103 -456 -335 304 -358 -965 182 424 116 -546 -283 -583 59 -49 -471 -649 -88 -291
3507 -291 -142 -845 158 -723 1656 -611 49 989 -396 -638 422 332 -925 300 494 -453 615 426
3525 426 374 833 363 648 1480 665 -477 756 -167 -678 551 468 40 -90 555 -45 137 -518 -500 -72
3545 -72 326 -413 165 -266 -570 -160 -90 -130 -47 190 -1327 1274 263 -398 -324 184 -109 32 406 -176 719
3566 719 2 172 -901 905 208 -622 407 154 644 679 -359 92 41 427 64 371 379 99 772 670
3586 670 -266 -115 926 219 -1260 -69 649 829 -344 -57 180 -922 -400 -798 -42 349 -48 -280
$$ packed form
3447e65L87J107j644O37K96P88n95n98p57K85P5m5R85q9k0o69J42k04J62k35J830
3468A273p14p35Q34l57n52KN12m56R70o43p18N65k05J241p95k12K69j546J803
3487E36r1r11L63l53J21O39o62o07J147K42l08o62K63l00O42j08m22j78N61k03
3507b91J49p03J003q81K379k267O60R40j385k42J060r0j257J225J94r47J068j89
3525D26n2M59m70K85Q32q15j142J233r23n11J229q3m28j30O45o00J82o55J8M28
3545g2L98p39N78m31l04M10P0m0Q3K37j517K601j011o61P4N08k93J41L74n82Q95
3566G19p17J70j073J806o97q30J029k53M90L5j038M51n1L86l63L07Qk80O73j02
3586F70r36J51J041p07j479J191P18J80j173K87K37j102N22l98P56L91l97k32
$$ plain form
3604 -280 616 447 -187 223 -80 -500 -143 -2 647 -1149 -393 -477 263 63 1068 364 -92 -356 -512 -1212
3624 -1212 -1044 983 -564 401 362 -228 491 -681 -7 410 -968 242 -94 887 -156 574 -85 905
3642 905 763 -246 -43 -64 -130 131 -53 -167 -279 394 117 1158 182 -588 38 1083 -518 269 462
3661 462 1212 404 -21 -95 -589 183 -65 221 -116 11 -128 -220 -728 -775 -694 -80 -352 -256 777 32 -166
3682 -166 1538 1395 -131 -219 -175 -187 334 -139 1097 24 250 758 -44 445 -693 721 218 28 288
3701 288 192 111 -39 -804 -494 791 19 128 -263 182 183 -732 -980 161 -102 -832 62 768 -414 892
3721 892 -32 1093 140 435 -3 575 -157 -93 715 487 1284 141 -132 398 298 746 -341 898 984
3740 984 -322 -370 136 -36 -247 216 -682 -98 1099 -141 -334 139 403 264 702 126 371 -213 -745
$$ packed form
3604b80Q96j69o34M10l03m20L57J41O49j796P56q4P40k00J005p04m56k64j56p00
3624a212J68K027j547R65l9n90P19j172O74M17j378J210l36R81j043P30o59R90
3642I05j42j009K03k1o6K61j84j14j12O73k77J041r76p70O26J045j601P87J93
3661D62P50q08m25p4m94P72k48K86l37J27j39r2n08m7Q1O14k72R6J033p45j98
3682a66J704j43j526q8M4j2N21m73J236j073K26N08q02M89j138J414n03j90K60
3701B88r6q1j50p65L10J285p72J09l91M45Jr15k48J141k63p30Q94P06j182J306
3721H92r24J125r53K95m38N78p32O4Q08k28P97j143k73N30j00M48j087J239Q6
3740I84j306m8N06j72k11M63q98N84J197j240j93M73K64j39M38n76K45n84n32
$$ plain form
3759 -745 -1111 -690 45 -922 454 225 180 -558 110 355 1123 371 -262 -483 -288 190 106 -429 80 -339
3779 -339 656 -598 -146 994 -146 -218 191 -604 530 -327 93 129 -283 -4 -66 -922 18 -208 -690 -155
3799 -155 173 -39 -250 -155 -308 -159 641 -664 -581 305 203 2452 779 730 -286 314 410 -148 69 1014
3819 1014 -238 -643 -1256 -1147 439 312 767 494 1092 994 -319 276 538 -658 328 360 733 -267 -89
3838 -89 221 127 80 -280 882 297 887 -536 340 -696 -528 -245 -563 179 139 -215 -21 139 90 -232 378
3859 378 675 -557 554 -359 123 -315 775 140 -94 91 -1581 -550 22 303 -335 -257 707 714 794 -26
3879 -26 -207 589 514 545 739 -218 810 -123 -518 118 -425 -40 225 193 386 -319 -74 -210 1251 748 680
3900 680 -447 607 1209 61 -135 -241 453 16 190 81 610 -1109 -114 -12 -163 -228 -862 666 573
$$ packed form
3759g45l66M21P35r67J376k29m5p38O68K45P68p52o33k21J95M78q4n35N09m19
3779c39R95j254M52J140j140p2M09p95J134q57M20L6m12K79o2q56R40k26m82N35
3799a55L28k12k11R5j53J49Q00j305Q3Q86j02K249j673m9j016O00R6n58K17R45
3819A014j252m05o13J09J586j27M55k73N98r8j313N95K62j196R86L2L73j000J78
3838h9L10r4m7l60J162n85N90j423Q76j036J68K83l18P42m0l54J94J60m9l22O10
3859C78K97j232J111r13M82m38J090o35k34J85j672J031N72K81o38P8R64PQ0q20
3879b6j81P96p5L1J94r57J028r33l95O36n43L85K65l2J93p05K45j36J461n03o8
3900F80j127J054O02j148j96j06O94m37J74j09N29j719R95J02j51o5o34J528r3
$$ plain form
3919 573 94 -651 -770 810 154 296 114 81 444 -1 189 -199 496 804 -382 -395 836 1151 188 -1352
3939 -1352 -344 -471 262 -560 508 197 -156 476 250 80 -478 -6 555 132 -1099 1027 -251 -151
3957 -151 13 -24 628 -688 -60 958 365 326 71 624 -1519 -567 -24 -354 -48 679 70 529 -195 -469
3977 -469 -303 -283 -102 287 78 26 367 883 -1350 523 -784 -286 -38 123 -686 -96 670 637 757 -132
3997 -132 -447 -107 -396 -327 297 223 406 -57 -395 -31 -871 -10 550 -385 -577 139 -663 -292 93 -320 1020
4018 1020 809 480 539 -276 -424 -717 -433 -107 571 -578 556 846 253 639 -96 641 588 235 -76 629
4038 629 1151 190 -382 103 -137 -580 -336 -704 398 303 31 131 -142 174 -158 -354 281 730 -584 446
4058 446 -119 -668 735 22 -568 429 519 -369 -110 390 868 515 -1174 79 519 -127 224 -1053 87
$$ packed form
3919E73m79p45j19J580o56J42j82l3L63m45J90l88O95L08j186j3J231L15r63j540
3939a352J008j27P33q22J068l11l53O32k26j70n58M72N61m23j231K126j278J00
3957a51J64l7O52j316O28J018n93l9k55N53k143R52N43l30L06P27o09M59p24k74
3977d69J66K0J81L89k09n2L41N16k233J873j307M98K48J61q09N90P66l3J20q89
3997a32l15L40k89O9O24p4J83m63l38L64q40Q61N60r35j92P16q02L71L85m13J340
4018A020k11l29N9q15j48k93K84L26O78j149J134K90n93L86p35P37n3l53l11P05
4038F29N22r61n72M85k40m43K44l68J102r5k72J00k73L16l32j96O35M49j314J030
4058D46n65n49J403p13n90R97R0q88K59N00M78l53j689J253M40o46L51j277J140
$$ plain form
4077 87 315 -396 -10 893 -731 26 -247 986 -284 -829 -672 39 15 -51 269 -336 -45 -166 543 673
4097 673 344 284 -179 316 68 -92 -348 468 89 92 831 290 629 -105 275 637 -54 -76 -488 -351 -189
4118 -189 517 1083 -308 -217 -468 70 75 -854 375 96 101 -473 -293 238 463 115 -108 -513 670 67 -606
4139 -606 -39 129 392 -299 -279 -957 1229 -10 -11 329 915 -674 -487 279 -86 -1303 -498 301 366 176
4159 176 -528 213 1097 -88 25 -1089 -939 -1012 459 -443 307 -420 -1201 -356 -689 -1016 -302 -799 -668
4178 -668 -298 434 -530 -122 -774 69 -133 -343 287 -57 -982 -384 211 -712 614 -849 -687 377 1816
4197 1816 98 -137 549 -441 -609 454 309 -905 218 319 178 -271 -819 702 77 -1206 115
4214 115 784 56 692 361 412 -319 827 -162 262 649 461 -405 -652 112 450 485 185 94 47 -411 -192
$$ packed form
4077H7K28p11L86R03j624P57k73J233j270n45J57P11k4o6L20o05K91j21P09J30
4097F73l29o0m63M95k48j60k56Q16l79LP39n41L39p34L80L62o91k2m12J37J62
4118a89P06N66j391R1k51N38Nr29J229k79Nn74J80N31K25l48k23m05J183o03o73
4139f06N67J68K63o91K0o78K186j239jL40N86j589J87P66l65j217Q05P99O5j90
4159A76p04P41Q84j185J13j114J50p3J471r02P50p27p81Q45l33l27P14m97J31
4178f68L70P32r64M08o52Q43k02k10O30l44r25N98N95r23J326j463J62J064J439
4197A816j718k35O86r90j68J063j45j214J123J01j41m49n48J521o25j283J321
4214A15O69p28O36l31N1p31J146r89M24L87j88q66k47P64L38L5l00r1m7m58K19
$$ plain form
4235 -192 966 104 37 349 -110 597 -626 -498 326 -160 26 737 -187 812 -330 -391 -368 278 -828 -614
4255 -614 260 -139 -58 347 645 -491 -13 -249 -130 489 269 433 -375 -144 952 366 591 650 -878 -338
4275 -338 -885 136 1118 -558 -88 -109 562 -233 -203 -441 -701 -815 -792 -26 -140 718 21 63 79 -219 89
4296 89 -657 392 -298 -86 60 -99 532 767 517 -69 308 -621 600 45 655 577 286 158 254 222 -419
4317 -419 666 1351 -372 67 -1080 345 -259 -88 487 608 516 -149 242 153 619 479 671 63 -868
4336 -868 -344 -798 491 78 -411 143 -424 25 48 -313 -584 186 127 179 -456 699 13 378 697 90
4356 90 97 415 -33 58 566 428 32 129 314 -506 121 312 308 -689 265 -544 890 9 -208 799 -240
4377 -240 304 -179 246 845 -94 1076 -240 -379 563 -72 157 -495 383 -1166 -321 -474 563 60 -459
$$ packed form
4235a92J158q62o7L12m59P07j223J28Q24m86J86P11r24R99j142o1K3O46j106K14
4255f14Q74l99Q1M05K98j136M78k36J19O19k20J64q08K31J096n86K25N9j528N40
4275c38n47J021R82j676M70k1O71p95L0k38k60j14K3P66j14Q58o97M2J6k98L08
4296H9p46J049o90K12J46j59O31K35k50n86L77r29J221n55O10p8k91j28R6l2o41
4317d19J085O85j723M39j147J425o04J71N75J21r2o65L91q9M66j40J92o08r31
4336h68N24m54J289m13m89N54n67M49K3l61k71P70n9N2o35J155o86L65L19o07
4356I0PL18m48R1N08j38l96R7J85q20O27J91mr97R54q09J434q81k17J007j039
4377b40N44m83M25N99r39J170j316j39R42o35K29o52Q78j549Q45j53J037n03n19
$$ plain form
4396 -459 -451 370 137 -381 -411 49 138 -298 171 -625 810 -183 780 -290 246 -22 -527 160 -905 -408
4416 -408 536 -313 205 -737 347 173 -648 537 -47 -91 874 886 -244 -142 56 666 149 560 -126 927
4436 927 309 48 627 -344 888 561 -248 244 -270 -421 301 -638 -813 -122 -220 -273 -51 -684 -216 1450
4456 1450 -194 58 -357 444 -312 -212 55 -160 67 -878 -717 649 297 14 -208 -1294 903 -273
4474 -273 -167 32 -234 -383 -253 -608 795 -85 -619 -286 -629 516 -207 338 299 -644 -147 -57 -32 -306
4494 -306 553 -54 -215 925 269 767 277 -32 -673 -192 569 509 815 -729 417 -262 1043 -106 -179
4513 -179 -776 299 540 -537 -1207 -739 -151 -59 835 -1068 -611 701 393 -309 -129 250 -142 376 -300
4532 -300 27 -477 -404 -402 295 635 182 -216 -721 809 335 166 237 -1326 -257 73 -306 472 -354 -901
$$ packed form
4396d59QQ21k33n18l0M60Q9m36M69p96J435r93R63j070N36k68n05O87j065M97
4416d08R44q49N18r42J084j74q21J185n84m4R65J2j130J02J98O10n17M11o86J053
4436I27o18k61N79r71J232l27q09M92n14j51P22r39j75O91r8n3K22o33M68J666
4456A450j644K52m15Q01p56J00K67k15K27r45J61J366l52k83k22j086K197j176
4474b73J06J99k66j49J30l55J403q80n34L33l43J145p23N45l9r43M97R0K5k74
4494c06Q59o07j61J140o56M98m90l09o41M81P61o0L06j544J146o79J305j149p3
4513a79n97J075K41j077o70M68N88R2Q94j903M57J312l08p02J80L79l92N18o76
4532c00L27n04P3KO97L40m53l98n05J530m74j69P1j563J069L30l79P78q26n47
$$ plain form
4552 -901 -251 -574 514 102 447 -828 -202 -286 299 58 -397 -1656 -541 792 1300 436 5 857 1075
4571 1075 -566 168 480 666 419 -342 -228 1340 436 159 814 -345 302 -681 -789 65 -231 -512 -39
4590 -39 369 708 -57 -354 707 202 70 -394 -124 9 53 -726 334 330 -386 334 -294 730 -235 290
4610 290 -32 808 654 -1320 343 -365 -541 162 -424 -93 486 633 -519 726 925 -153 782 -713
4628 -713 94 70 -51 -163 510 -573 -646 666 -90 -67 -96 281 566 -267 61 -224 285 699 -693 -380
4648 -380 138 71 246 91 724 -558 -882 -340 -820 366 -293 596 -363 -142 -820 161 -351 1414 285
4667 285 -1047 350 692 -296 105 953 26 -705 -762 596 281 57 296 -576 -259 456 -893 -275 -218
4686 -218 -1030 762 42 -219 -33 -56 -337 -112 -752 -454 274 -245 260 -1394 -1938 15 792 -819 -1266
$$ packed form
4552i01O50l23J088m12L45j275O26q4N85k41m55j259J115J333N08q64m31Q52K18
4571A075j641P34L12J86k47p61J14J568r04k77O55j159O47r83j08Q54k96k81M73
4590c9M08L39p65k97J061n05j32m64K70J33M4p79J060mp16P20o28J024r65N25
4610B90l22Q40j54j974J663p08j76P03n86L31N79J47j152J245J99j078R35j495
4628g13Q07k4j21j12O73j083p3J312p56K3k9L77K85q33L28k85N09M14j392L13
4648c80N18o7J75j55O33j282l24N42m80J186o59Q89r59K21o78R81n12J765j129
4667B85j332J397L42r88M01Q48r27p31n7J358l15k24K39q72L17P15j349O18N7
4686b18q12J792p20k61J86k3k81K25o40K98P28n19N05j654n44J953P77j611m47
$$ plain form
4705 -1266 407 298 -192 -768 279 -369 -137 -941 752 360 423 -82 -517 -291 136 727 219 -475 214
4724 214 713 325 43 -666 -291 -419 -404 -260 7 868 166 -88 -228 -208 -56 -698 305 95 -359 32
4744 32 131 -42 -357 161 351 380 -302 -228 1338 418 -449 437 278 -993 -49 744 -348 -634 -259 253
4764 253 -367 -900 -411 213 268 -409 229 -236 -942 -790 -111 -63 220 -501 370 -7 -426 486 1307 -453
4784 -453 253 917 265 870 -770 44 258 -146 -581 -476 -16 206 -447 731 1220 -320 91 1121 151
4803 151 176 660 171 -538 12 -613 -562 -1 -100 810 -754 -32 -456 283 376 979 -4 -596 65 674 222
4824 222 -116 407 -212 587 -432 -81 -94 265 -947 -893 18 -826 74 489 -172 581 64 48 5 -631 -715
4845 -715 282 -181 307 1020 -19 668 136 -156 -450 -312 478 -477 276 147 62 749 -79 -639 -346 -832
$$ packed form
4705a266J673j09m90n76J047o48K32q04J693l92O3n05m35K26M27N91n08o94O89
4724B14M99l88k82p09L75j28J5J44K67Q61p02k54j40K0J52o42J003k10m54L91
4744C2R9j73l15N18J90K9o82P4J566r20q67Q86j59j271R44P93j092k86L75N12
4764B53o20n33M89O24N5o77O38m65p06J52O79M8K83p21Q71l77m19R12Q21j760
4784d53P06O64o52O05j640Q14K14m04m35J05M60K22o53J178M89j540M11J030r70
4803A51K5M84m89p09N50o25N1N61r9R10j564P22m24P39R3O03r83n92O61O09m52
4824B22l38N23o19P99j019L51j3L59j212N4R11q44R00M15o61P53n17j6m3o36q4
4845g15R97m63M88P13j039O87n32k92k94J38P90r55P53j29q5O87q28n60K93m86
$$ plain form
4865 -832 -548 -258 -151 -394 543 -33 577 73 262 771 770 304 -533 -766 -756 17 -445 77 -106 242 -1167
4886 -1167 38 -56 -339 1036 224 -87 184 85 391 806 870 -1420 -240 56 -918 139 -389 1200 315
4905 315 273 328 -828 238 -277 546 -657 -98 588 323 -865 -1336 300 -346 -350 -81 -192 -412 -293 928
4925 928 20 -125 82 -205 -48 51 268 -178 -375 906 -630 123 -964 271 669 -93 -289 -266 -51
4944 -51 524 651 -329 -478 -832 -19 60 402 675 -1152 -219 85 -64 -326 -617 -255 330 367 138 983 235
4965 235 363 281 890 29 -963 -884 1096 -73 -472 -488 -368 -285 -311 -592 -501 -170 -711 502 -564 -1378 -152
4986 -152 382 665 -3 -45 -635 52 275 -90 -143 785 -83 -288 -1089 380 17 -451 -1165 -1555 252 -661
5006 -661 10 -88 -392 145 -1143 -660 -661 831 -132 -261 523 -256 -359 -431 -428 472 -171 -105 -294 -387 -197 -458
$$ packed form
4865h32K84K90J07k43R37n76O10n04J89N09jm66q37k33J0P73m62N22j83L48j409
4886a167J205r4k83J375q12l11K71r9L06M15O4k290J180K96r74J057n28J589q85
4905C15m2N5j156J066n15Q23j203N59O86k65j188m71J636o46mK69j11k20J19J221
4925I28r08j45K07k87J57R9K17m46j97J281j536P53j087J235L98p62j96K3K15
4944e1N75J27r80j49l54Q13P9L42K73j827R33L04j49k62k91L62N85L7k29Q45p48
4965B35J28q2O09q61r92P9J980j169l99j6J20Q3k6k81R1L31n41J213j066q14J226
4986a52N34K83o68m2n90O87K23l65n3R28q68k05q01J469l63m68p14l90J807r13
5006f61O71r8l04N37j288M83jJ492r63j29P84p79j03p2LR00o43O6j89r3J90k61
$$ plain form
5028 -458 234 -458 -178 370 -1078 257 142 323 -342 -590 36 295 270 427 -232 -1151 -1024 -390 -776 24
5048 24 -488 620 -169 -694 620 -418 423 -434 503 6 -321 -451 257 558 986 -234 550 -577 -1270
5067 -1270 752 574 537 -448 135 -539 -29 113 -1008 18 -627 -1229 -432 482 -185 -52 65 -605 -578
5086 -578 -619 874 -85 -811 569 -1044 500 -176 -400 -16 140 -42 -28 553 -92 -183 252 -982 -54
5105 -54 403 -211 -824 -327 -366 6 727 734 166 484 1152 -217 647 405 944 -169 210 -888 732 582
5125 582 -1030 629 1143 204 -220 560 185 -302 -95 789 817 128 -803 298 -104 337 -63 -550 -93
5144 -93 51 -701 -272 -625 -660 207 -327 181 438 214 -159 135 -698 -155 210 221 -109 -162 -5 -303 -106
5165 -106 836 188 -494 323 99 -785 671 341 -414 682 26 559 190 438 1351 -644 -838 -1007 412
$$ packed form
5028d58O92o92K80N48j448J335j15J81o65k48O26K59k5J57o59r19J27O34l86Q00
5048B4n12J108p89n25J314j038Q41q57R37m97l27j30P08L01M28j220P84j127o93
5067a270K022j78l7r85N83o74N10J42j121J026o45o02P97R14o67J33J17o70K7
5086e78m1J493r59p26J380j613J544o76k24L84J56j82J4N81o45r1M35j234R28
5105e4M57o14o13M97l9L72P21Pn68L18O68j369Q64k42N39j113L79j098J620j50
5125E82j612J659N14r39m24P80l75m87K07Q84K8o89r31J101m02M41m00m87M57
5144i3J44p52M29l53l5Q67n34N08K57k24l73K94q33N43L65J1l30n3J57k98J97
5165a06R42o48o82Q17k24q84J456l30p55J096o56N33l69K48R13j995j94j69J419
$$ plain form
5184 412 383 -952 -586 452 1100 521 -168 -81 433 -511 657 -346 952 339 -76 113 590 289 229
5203 229 -904 157 643 -575 729 -15 136 -321 -564 51 -1572 433 0 -620 852 -93 -483 -776
5221 -776 -784 411 287 529 784 756 -113 11 -429 -1083 718 442 -927 -486 -270 -506 -454 -525 279 -46 469
5242 469 -54 190 -85 76 447 53 -135 290 176 -559 -150 -112 -74 -352 306 -626 -579 1081 788 -442
5262 -442 -579 159 410 93 799 -304 -927 40 500 -128 141 122 463 -539 -871 -217 -148 -7 -146 -287
5282 -287 164 -304 296 -101 683 49 -534 -561 924 26 742 -753 10 215 248 409 504 -577 177 -1410
5302 -1410 -203 647 282 115 978 -58 -107 -493 -216 288 -322 309 -1242 -243 -87 -248 -104 72 284
5321 284 399 59 263 316 -230 332 69 134 -191 -973 133 616 -872 -39 -97 464 764 1042 192 -810
$$ packed form
5184D12k9j335L66J038O48n79o89Q7N14r44J168j003J298o13m15J89M77l01o0
5203B29j133J061M86j218J304p44J51m57k43O15j623K005m33o20J472r45l90k93
5221g76qJ195j24K42K55k8q69J24m40o54J801k76j369M41K16k36N2p1Q04l25N15
5242D69n23K44k75J61L71l94j88M25j14p35M09L8L8k78O58r32M7J660k93j230
5262d42j37P38K51l17P06j103o23R67M60o28K69j9L41j002l32O54O9J41j39j41
5282b87M51m68O00l97P84o34n83k7J485q98P16j495P63K05L3J61R5j081P54j587
5302a410J207Q50l65j67Q63j036m9l86K77N04o10O31j551R99J56j61J44J76K12
5321B84J15l40K04N3n46N62k63O5l25p82J106M83j488Q33n8N61L00K78q50j002
$$ plain form
5341 -810 921 1375 478 201 225 -240 561 -294 -669 493 -262 139 71 571 -271 -372 -1 -218 934 -176
5361 -176 22 474 539 -50 -228 701 -321 -176 -762 -81 175 -119 -269 -318 53 303 391 -681 104 -71
5381 -71 -12 -572 -161 -231 357 1135 -419 -69 216 310 -1166 1205 7 -230 464 -155 -59 20 500 -729
5401 -729 517 -358 -26 165 -1 729 176 -674 -564 -710 -60 -571 -451 460 247 -62 -98 -344 -305 37
5421 37 775 -263 102 -693 207 139 -316 -31 -648 229 337 808 835 -758 -70 -632 -176 405 236 151 477
5442 477 -902 69 -518 774 -312 -313 -454 539 -264 811 445 1181 458 -1141 1007 1110 -433 -36
5460 -36 -687 351 -437 -384 178 -193 158 85 732 670 -355 -382 -596 998 -23 217 -625 419 -307 75
5480 75 1 -846 -11 116 511 -27 538 35 -116 53 -249 4 178 -213 75 -682 -506 628 -234 163
$$ packed form
5341h10J731M54q97k77K4m65Q01q55l75J162p55M01o8N00q42j01L71k17J152j110
5361a76J98M52O5n89j78R29j022J45n86O81K56k94j50m9L71K50Q8j072P85j75
5381g1N9n60M11p0N88P78j554L50K85R4j476K371j198k37O94o19R6P9M80j229
5401g29J246q75L32J91j66P30n53q50J10j46O50n11J20R11k13l09l6k46L9L42
5421C7P38j038L65p95R00o8m55K85o17Q77J08M71K7j593O88n62M56N81j69q5L26
5442D77j379R71n87J292j086jj41R93q03J075l66P36p23j599K148J03j543L97
5460c6o51J038p88N3N62l71L51p3O47o2j025k7k14J594j021K40q42J044p26L82
5480G5p4q47Q35J27L95n38N65n03j51J69l02K53J74l91K88p57J76J134q62L97
$$ plain form
5500 163 -516 -558 149 288 -107 15 326 -325 140 -840 958 1786 576 -331 -45 -125 -909 -517 -799 628
5520 628 306 -480 550 528 -575 876 -39 -353 -1067 450 -810 248 346 119 -500 -929 252 679
5538 679 64 -442 435 -72 93 806 140 -1261 -95 -25 247 900 333 -64 202 -105 -302 -130 -481 -1654
5558 -1654 651 -81 -1278 -851 120 403 -465 -502 -153 -264 -837 791 -494 433 272 -256 -410 143 182
5577 182 252 -195 -523 -803 685 -609 -773 387 -419 798 201 -7 -40 -813 -77 -47 -1560 1259 -646
5596 -646 543 354 -771 -455 503 476 -315 -954 -730 -369 -220 -75 145 -308 -231 136 -338 -6 -82 62
5616 62 -339 630 -768 666 600 -32 477 746 566 -58 -219 -331 557 6 325 936 1205 380 -185 -769
5636 -769 -153 -705 -213 1105 36 866 466 -1163 -184 -425 -946 212 -616 -1097 -213 445 -704 799
$$ packed form
5500A63o79m2P07J39l95J22L11o51M65r80J798Q28j210r07K86q0p84L92k82J427
5520F28l22p86J030k2j103J451r15l14p14J517j260J058R8k27o19m29J181M27
5538F79o15n06Q77n07J65P13o66j401J166P0K72O53n67l97K66l07j97J72l51j173
5558a654K305p32j197M27R71K83q68l7L49j11n73J628j285R27j61n28j54N53L9
5577A82P0m47l28k80J488j294j64J160q06J217n97k08l3p73P36L0j513K819j905
5596f46J189j89j125L16R58k7p91o39K24L61J49J45K20m53P7L67m74L32p6J44
5616F2m01R69j398J434o6o32N09K69j80o24j61j12Q88n51L19O11K69q25n65n84
5636g69O16n52M92J318j069Q30m00j629R79k41n21J158q28m81Q84O58j149J503
$$ plain form
5654 799 1 273 163 870 48 -270 -745 -62 -47 -70 269 82 -62 -61 167 -799 123 543 -238 -340 -244 -179
5676 -179 217 342 -168 -1195 -973 75 37 -199 -574 120 107 -129 378 -116 -154 -450 -76 323 440 527 -102
5697 -102 -109 168 1259 -133 -274 573 -543 -294 -135 -872 -434 384 -210 -429 193 -835 352 150 567
5716 567 490 355 294 -332 216 -95 339 -937 488 -962 25 -322 -377 755 -235 -100 -1053 280 -260
5735 -260 -351 1112 -54 -176 57 -126 406 460 537 -692 -1258 954 -967 -882 -311 835 -1062 -866 -550
5754 -550 -579 431 -439 307 457 384 663 556 430 -642 -232 266 513 -955 41 128 901 1200 621 232
5774 232 -1136 -555 718 -755 287 20 155 -640 740 -434 -308 -745 162 312 -304 119 -44 353
5792 353 -17 547 271 -686 -339 233 -661 711 -389 392 -7 -440 -269 656 787 -773 -704 -274 -36
$$ packed form
5654G99p98K72j10P07q22l18m75O83J5k3L39j87j44JK28r66R22M20p81j02R6O5
5676a79L96J25n10j027K22J048l8k36l75O94j3k36N07m94l8k96L74L99J17Q7o29
5697a02pK77J091j392j41Q47j116K49J59p37M38Q18n94k19O22j028J187k02M17
5716E67p7j35o1o26N48l11M34j276J425j450R87l47n5J132r90J35r53J333n40
5735b60r1J463j166j22K33j83N32N4P7j229n66K212j921Q5N71J146j897J96L16
5754e50k9J010q70P46J50p3K79j07j26j072M10M98K47j468R96Q7P73K99n79l89
5774B32j368N81J273j473J042k67J35p95J380j174J26m37R07J50o16M23j63L97
5792C53l70N64k76r57L47N72q94J372j100P81l99m33J71R25J31j560O9M30K38
$$ plain form
5811 -36 -335 304 -10 9 -1391 418 -92 -8 63 -508 -254 208 -497 1178 -399 -79 -515 -404 -874 1341
5831 1341 -1059 -43 558 378 -238 117 -208 940 -89 -359 -15 -93 25 -221 518 57 -816 109 575
5850 575 342 -1420 -124 375 6 263 353 -19 -222 951 652 1064 -57 -844 938 958 409 -379 -60
5869 -60 200 271 -204 -243 -336 1044 509 -189 517 280 -30 913 332 -920 26 -38 -407 248 433 81 87 -653
5891 -653 92 -54 123 -126 105 29 -513 -185 999 -84 -380 620 169 -8 248 132 67 -1400 -724
5910 -724 220 597 -705 728 695 193 -435 420 392 279 -262 695 473 -238 -587 -341 598 504 -308 -491
5930 -491 17 -999 46 422 -228 213 -279 797 35 205 281 1598 286 -335 -435 -55 165 -19 -146
5949 -146 800 -56 388 -517 243 88 76 164 54 -844 -153 383 84 516 92 -319 -876 -595 -220 -51 86
$$ packed form
5811c6k99O39l14J9j400J809n10Q4P1n71K54M62p05J675j577L20m36J11m70K215
5831A341k400J016O01j80o16L55l25J148j029k70L44p8J18k46P39m61q73R25M66
5850E75k33j762J296M99l69K57R0l72k03J173k99M12j121p87J782K0n49p88L19
5869f0K60P1m75l9r3J380n35o98P06k37l10R43n81j252R46o4l69O55J85l52Op40
5891f53P45j46J77k49K31p6n42L28J184j083k96J000m51j77K56j16o5j467O76
5910g24R44L77j302J433l3n02o28Q55k8j13n41R57k22p11l49K46R39r4q12j83
5930d91N08j016J045L76o50M41m92J076p62J70P6J317j312o21j00L80K20j84j27
5949a46R46q56M44r05P60j55j2Q8j10q98O91N36k99M32m24m11n57K81L75J69J37
$$ plain form
5970 86 -316 -345 127 281 -419 -724 482 28 -97 66 433 -217 -326 420 -243 687 -196 -550 72 -189
5990 -189 286 -913 -725 -528 -194 513 0 -192 934 100 1118 -199 244 172 -579 -194 322 -346 -384
6009 -384 381 873 256 -79 -696 -334 -125 646 171 482 298 -639 -271 178 93 -233 -530 -646 -151 412
6029 412 -363 238 571 -79 544 -62 349 400 335 -257 611 -741 -350 741 -608 -808 1028 -298 257
6048 257 -259 224 -179 -210 339 736 298 18 240 -739 -314 -658 -256 -403 598 -276 -339 -149 226 288 491
6069 491 -329 -1283 -378 953 -1183 697 -674 -861 95 287 257 -320 801 -198 766 -110 364 756 702
6088 702 -7 -226 1336 1314 -474 108 408 -359 -129 189 -642 -298 -224 880 258 659 45 -46 99 32
6108 32 29 308 -454 762 -103 -778 -210 171 -511 -110 830 700 88 323 129 210 898 -21 172 -766 754
$$ packed form
5970H6m02k9M72J54p00l05J206m54j25J63L67o50j09P46o63R30q83l54O22k61
5990a89M75j199J88J97L34P07n13j92J126q34J018j317M43p2p51L85N16o68l8
6009c84P65M92o17l35o17L62K09P71m75L11j84r37L68M49q5l26k97j16M95N63
6029D12p75O01L33o50O23o06M11N1o5n92Q68j352L91J091j349k00J836j326N55
6048B57n16M83m03l1N49L97m38k80K22r79M25l44M02j47J001q74o3J90L75O2K03
6069D91q20r54R05J331k136J880j371j87R56J92l0n77J121r99R64q76M74L92n4
6088G02p09k19J562k2j788N82L00p67K30L18q31L44P4J104o22M01o14r1J45o7
6108C2lK79p62J216q65o75N68L81o82M01R40j30o12K35j94Q1O88r19J93r38J520
$$ plain form
6129 754 -83 259 499 322 -950 -240 87 -280 -650 423 -638 -407 -374 -920 -48 61 -253 -70 510
6148 510 164 -263 -1336 -789 -799 -536 363 -440 771 -241 59 36 -626 560 -1009 -825 -343 -95 -276
6167 -276 -517 74 -507 112 126 -942 -297 -220 498 260 49 -114 86 478 17 -10 541 547 217 -366 -615
6188 -615 600 881 -287 642 675 685 -213 1058 -601 -643 1082 -100 30 362 -358 -59 653 -92 24
6207 24 -188 217 536 331 74 183 -707 894 -974 295 -305 -912 857 435 -427 364 -455 111 -255
6226 -255 -417 47 -244 513 -891 136 77 -666 318 -223 -161 -265 228 498 814 486 -391 -46 -127 425
6246 425 371 141 753 -717 255 -335 -69 73 -239 -266 -818 -1050 -630 -461 -718 327 -603 -920 75 -1102
6266 -1102 311 507 289 113 773 852 276 -931 -330 280 -65 322 -11 544 306 586 206 329 -420
$$ packed form
6129G54q37L42K40j77j272P10L27l67l70J073j061K31L3n46Q72J09l14J83N80
6148E10l46m27j073N47j0K63Q99q03J211j012L00k3o62J186j569J84M82K48j81
6167b76k41N91n81O19J4j068O45P7P18k38k11j63K00L92m61k7N51Ol30n83k49
6188f15J215K81j168R29L3J0q98J271j659m2J725j182J30L32p20K99P12p45J16
6207B4k12M05L19k05k57J09q90J601j868J269o00o07J769m22q62P91q19N66l66
6226b55j62M64k91P57j404J027n9p43R84n41O2j04M93K70L16l28q77L45q1N52
6246D25n4k30O12j470R72n90K66J42l12k7n52k32M20J69k57J045r30l17R95j177
6266a102J413J96k18j76O60P9n76j207O01O10l45L87l33N55k38K80l80J23p49
$$ plain form
6285 -420 65 -431 -798 -758 -173 1062 -202 -446 -9 409 -448 -753 -479 111 -818 -458 -232 670 391 78
6305 78 805 557 311 -372 49 -75 179 -62 415 463 78 -84 -226 378 -132 247 -129 176 -28 238 221
6326 221 467 201 -78 707 -177 -56 -767 21 464 609 -263 59 516 23 -633 177 93 122 -1134 -21
6346 -21 -531 262 896 130 -1098 -6 326 381 -38 380 48 -83 1031 -939 511 -582 104 523 484
6365 484 -413 26 1193 -287 21 344 -315 447 -266 -25 -165 -144 504 75 -820 -456 -41 879 322 219
6385 219 183 -531 -552 146 -101 -396 218 -286 236 -1186 475 542 -406 658 313 -149 -376 187 -5 -326
6405 -326 1225 -294 -301 196 753 74 -592 -26 -402 247 -838 491 -160 -779 725 491 -205 1009 62
6424 62 290 -909 399 -208 1151 -75 -453 975 -99 929 269 -248 588 939 226 320 290 672 86
$$ packed form
6285d20M85m96l67M0N85J235j264k44M37M18q57l05K74N90r29L60K26R02k79l13
6305G8P27k48k46o83M21j24K54k41M77M8l85j62j42O04n10L79l76L05k04K66j7
6326B21K46k66k79P85q84J21p11P88M43J45q72L22M57m93o56Q10q4K9j256J113
6346b1n10P93O34p66j228J092L32N5m19M18l32j31J114j970J450j093O86M19l9
6365D84q97M39J167j480L08L23o59P62p13K41j40K1O48m29q95L64M15R20n57j03
6385B19l6p14k1O98k47k95O14n04N22j422J661O7r48J064l45m62k27N63j92l21
6405c26J551j519pM97N57o79o66N66l76O49j085J329o51o19J504k34o96J214r47
6424F2K28j199J308o07J359j226l78J428j074J028o60n17Q36L51p13R4l0L82n86
$$ plain form
6443 86 689 -214 -164 -388 -822 -495 -392 -331 -45 -462 -277 -354 -411 371 240 -815 -577 -355 33 -68 -671
6464 -671 -116 -1042 151 -391 -496 -197 -164 -182 -548 -107 170 -386 641 -787 580 -325 -829 671 -132
6483 -132 -100 222 463 485 -610 34 122 -579 -692 199 22 971 -350 -21 899 81 -829 -218 -268 19 368
6504 368 18 -17 -1335 595 22 -118 -103 431 -574 -748 230 -418 -529 25 -162 -47 -48 -370 -86 398
6524 398 508 -1 182 13 -266 -105 -191 -126 241 -352 657 -271 -138 484 -659 12 -19 622 616 -649 -704
6545 -704 133 157 -864 -91 777 116 -82 493 -990 93 -348 -530 -980 -402 645 -621 400 281
6563 281 72 35 -415 -27 -161 -911 234 -270 745 -178 -162 -812 40 505 339 105 -724 -374 -478 379
6583 379 -480 -383 -153 278 523 1483 -76 -417 -791 -798 -127 -11 -1016 -220 -168 -347 -987 126 130 546 -258
$$ packed form
6443H6O03r03N0k24m34L27J03O1K86m17J85p7n7P82j31j055K38K22L88j01o03
6464f71N55r26J193n42j05K99L3j8l66M41K77n56J027j428J367r05n04J500q03
6483a32L2L22K41K2j095O44Q8p01j13Q91j77R49j321L29R20q18r10O11n0K87L49
6504C68l50l5j318J930n73j40J5N34j005j74R78o48j11N54j87J15jl22K84M84
6524C98J10n09J83j69k79J61q6O5L67n93J009r28J33O22j143O71l1O41oj265n5
6545g04Q37K4j021P73Q68o61j98N75j483J083m41j82m50N78J047j266J021j19
6563B81k09l7m50L88j34p50J145n04J015r23J6o50Q52M65j66k34q29L50j04Q57
6583C79q59R7K30M31K45R60j559l41l74pO71J16j005P96N2j79o40J113MM16q04
$$ plain form
6604 -258 -613 376 438 456 -66 -776 -875 339 209 312 -6 618 288 119 -74 186 -202 -164 -22 -84 -83 6
6626 6 248 -321 592 82 24 -444 369 154 79 -192 -440 -350 114 -235 169 807 418 -1120 54 -136 316
6647 316 105 635 -160 -271 742 253 -321 -294 -656 86 360 -138 307 267 -300 -133 -192 -991 -397 281 -79
6668 -79 989 -654 -980 824 959 -180 -221 -1527 443 28 996 133 69 143 -117 12 432 133 317
6687 317 131 1047 -184 -903 681 -1 82 -185 406 -873 -508 252 -952 -164 -385 542 15 -254 -842
6706 -842 -661 343 -862 214 -269 362 -822 721 1191 708 395 -115 -475 -700 -848 1311 -174 477
6724 477 220 -252 697 702 -94 -1213 -37 -406 -584 -395 -597 581 -634 -35 -412 -536 -531 95 -92 -644
6744 -644 -149 1149 546 -192 355 -656 -320 352 -641 187 -39 141 -812 466 287 639 -160 38 -639
$$ packed form
6604b58l55R89O2J8n22p10r9J214j30J03l18O24l30j69j93K60l88L8J42o2JQ9
6626FK42n69R13n10n8m68Q13k15p5k71k48R0M64l49M04O38l89j538J174j90M52
6647C16k11N30p95j11J013m89n74K7l62P42K74m98M45m0n67J67n9p99N94O78l60
6668g9J068j643l26J804J35j139m1j306J970m15R68q63o4P4k60J29M20k99J84
6687C17j86R16j231p19J584o82Q3k67N91j279L65P60j204P88k21R27n27k69n88
6706h42J81J004j205J076m83O31j184J543M70m83l13n10l60k25j48K159j485O51
6724D77k57m72R49Np96j119J176l69j78J89k02J178j215N99l77j24NO26j87n52
6744f44M95J298o03p38N47j011L36O72r93Q28k26J80r53J278j79L52p99J98o77
$$ plain form
6763 -639 -431 399 -197 -719 622 389 137 -618 -533 -107 206 754 -477 539 -223 146 -428 556 323
6782 323 613 -961 157 -77 -127 215 -821 432 -1040 11 -946 338 153 152 -191 -405 -505 340 -522
6801 -522 -305 -371 -1217 -591 902 323 636 -279 142 164 1051 200 -60 -237 -514 414 137 -372 237 1011
6821 1011 16 -564 -1205 -562 15 525 -476 210 96 451 150 -27 -1310 158 -264 323 935 674 529
6840 529 -125 91 -376 1040 729 -226 713 692 -41 -10 181 -211 -117 -752 -40 -45 656 455 264 139 -6
6861 -6 827 -225 842 -334 -395 333 -292 -78 1055 42 439 217 31 -668 -110 -230 625 24 13 58
6881 58 1474 -422 -195 547 262 -474 -200 -20 -734 39 93 -274 -191 74 -809 -253 178 303 1026 288
6901 288 -832 762 -333 271 -553 -426 -483 156 491 277 -132 611 341 1180 -478 -198 797 608 486
$$ packed form
6763f39K08Q30n96n22J341k33k52p55Q5M26L13N48j231J016p62L69n74R84k33
6782C23K90j574J118k34n0L42j036J253j472J051r57J284j85jl43k14j00Q45q62
6801e22K17o6q46O26J493n79L13r15M21K2Q87q51k60j77k77R28k77n09O09P74
6821A011r95n80o41O43N77N10j001O86j14L55l01j77j283J468m22N87O12k61j45
6840E29o54K16m67J416l11r55R39k1p33L1J91l92R4o35P12nP01k01j91j25j45
6861fQ33j052J067j176o1P28o25K14J133j013L97k22j86o99N58j20Q55o01j1M5
6881E8J416j896K27P42k85p36K74J80p14P73N4l67Q3K65q83N56M31J25P23p38
6901B88j120J594j095O04q24J27n7O39L35k14m09P43k70Q39j658K80R95j89j22
$$ plain form
6920 486 -16 162 1176 696 302 -966 -114 -372 626 298 -645 -762 153 -386 -602 -293 -264 -70 616 -512
6940 -512 22 170 -332 -777 -600 -496 -269 -765 -698 -173 -287 -486 -658 -382 -69 -301 91 287 -93 -1293
6960 -1293 -572 361 617 459 78 515 -575 -196 6 495 -688 -975 604 -91 100 630 -261 177 734
6979 734 980 274 -925 407 1057 12 -616 -389 240 -281 -358 906 -216 584 506 -101 -639 472 -543
6998 -543 369 501 -102 -649 66 589 76 188 -1119 -189 -708 557 269 -560 530 548 298 720 713 -508
7018 -508 83 775 -338 125 -772 11 -213 -455 -173 475 -118 75 913 954 -425 -446 -389 455 -94 -624
7038 -624 232 -25 954 456 -351 -324 840 -114 117 -424 674 -813 568 -47 431 486 897 163 -637
7057 -637 476 -313 -521 589 1506 -14 -128 -851 561 -53 38 -1218 -799 46 474 -268 419 811 -85
$$ packed form
6920D86n02J78J014m80l94j268Q52k58R98l28r43j17R15n39k16L09K9J94O86j128
6940e12N34J48n02m45J77J04K27m96O7N25j14j99j72K76L13k32L92J96l80j200
6960a293P21R33K56j58l81M37j090L79K02M89j183k87J579o95J91N30q91M38N57
6979G34K46p06j199J332O50j045o28K27O29n21p7J264j122Q00p8o07n38J111j015
6998e43R12J32o03n47P15N23n13J12j307R30n19J265k88q29J090J8k50M22pj221
7018e08N91O92j113M63q97P83k24k42K82O48n93J93Q38M1j379k1N7Q44n49n30
7038f24Q56k57R79m98q07K7J164r54K31n41J098j487J381o15M78N5M11p34q00
7057f37J113p89k08J110R17j520j14p23J412o14R1j256M19Q45M28p42O87L92q96
$$ plain form
7076 -85 -72 915 11 859 -30 26 -335 -216 550 210 749 380 776 266 234 -499 175 -680 -153 -740 -315
7097 -315 428 -1100 306 -641 -329 401 -316 106 -1291 -82 672 -239 943 -352 184 698 16 -401
7115 -401 114 -29 317 -808 -260 -28 1421 120 -296 -281 261 255 -200 526 -229 -781 589 244 -157 443
7135 443 201 -415 293 653 -932 -301 256 -139 325 -557 85 -688 6 23 31 150 -171 74 33 444 127
7156 127 -128 212 332 116 -879 -56 -610 -320 448 -535 252 614 247 -279 -619 -653 887 551 459 473 239
7177 239 -432 -699 -418 364 -157 -7 771 1396 337 -631 414 -229 208 647 306 815 -519 87 -359
7196 -359 146 15 658 330 -743 -672 432 847 674 -1009 -415 -719 207 -585 312 -4 -334 -234 347
7215 347 -342 -215 1060 -852 64 409 68 168 333 -276 419 111 -667 262 -550 -1071 -724 -605 -49
$$ packed form
7076h5J3R87r04Q48q89N6l61J19P66l40N39l69L96n10l2p33O74q55N27n87M25
7097c15P43j528J406r47L12P30p17M22j397J209P54r11J182j295N36N14o82m17
7115d01N15j43L46j125N48K32J449j301m16J5N42om55P26p55n52J370l45m01O00
7135D43k42o16P08L60j585O31N57l95M64q82O42p73O94J7QJ19l21K45m1M11l17
7156A27k55L40J20k16r95Q23n54K90P68r83P87L62l67n26l40l4J540l36r2J4k34
7177B39o71k67K81P82n21J50P78O25j059r68J045o43M37M39l41N09j334O06m46
7196c59N05j31O43l28j073P1J104M15j73j683N94l04R26p92Q97l16l30J00N81
7215C47o89J27J275j912R16L45l41J00J65o09O95l08p78R29q12n21L47J19N56
$$ plain form
7234 -49 214 -1136 100 -306 132 176 206 15 420 733 94 -35 15 228 226 152 414 272 -125 583 259 391
7256 391 194 -316 -231 278 340 61 365 559 66 510 33 389 -438 -1289 77 345 -175 -115 -330 587 618
7277 618 -1256 450 -470 265 -146 200 -446 -74 367 -425 -639 115 -376 521 -943 -680 -209 386 301
7296 301 -158 852 -35 656 1280 16 -737 -19 -637 -671 -491 -216 964 -392 -192 -890 -6 -305 -366
7315 -366 634 605 281 -360 10 -155 84 -767 -694 221 -301 201 212 889 -1382 -515 376 451 -718 -560
7335 -560 560 518 92 565 -795 -205 92 57 -393 437 -10 -97 -120 -488 371 -417 -356 534 618 -87 593
7356 593 102 190 -386 19 63 353 196 418 -865 364 253 -388 -346 -598 -474 85 433 612 -133 98
7376 98 268 19 242 469 -371 496 -421 -250 306 -534 46 488 532 -103 -254 -261 627 478 -360 -213 -337
$$ packed form
7234d9K63j350J236m06M38M4L0j91M05L13o39j29N0K13kp4K62j42l97P08l24J32
7256C91j97n10Q5N09O2k79L04J94m93M44m77L56q27q51J366K68n20O0k15R17L1
7277F18j874J706r20P35m11L46o46L72M41p92k14P54m91Q97j464K63M71N95q5
7296C01m59J010q87O91O24j264p53P18o18l4J80K75J180j356K00o98Q84k99o1
7315c66J000k9l24o41L70j65K39q51P3R15n22N02J1O77k271Q67Q91P5j169J58
7335e60J120m2m26M73j360N90K97l5m50Q30m47q7k3l68Q59p88O1Q90Q4p05O80
7356E93m91Q8n76M05M4K90j57K22j283J229j11o41M2k52J24N59L48J79p45K31
7376I8J70k49K23K27q40Q67r17J71N56q40N80M42M4o35j51pQ88j49q38J47j24
$$ plain form
7397 -337 -280 657 -63 -75 383 386 162 104 105 -480 252 -1366 448 565 539 -188 411 -960 -958 369 184 559
7419 559 167 -374 360 -42 -52 579 -28 82 204 1306 -53 -137 47 -385 161 546 -126 -427 -180 -343
7439 -343 629 671 -28 559 311 -1088 322 538 -259 -113 379 78 994 101 155 412 -429 177 -337 366
7459 366 282 -98 -81 324 -1337 774 945 104 655 89 -884 388 -511 -202 519 165 381 -257 -1289
7478 -1289 -545 -833 -178 -713 384 -995 -324 379 -322 -343 -393 -499 461 634 765 62 648 -230 -401 713
7498 713 48 903 -135 313 570 728 34 1104 321 134 404 0 513 -277 226 1000 -618 556 -423
7517 -423 -898 -94 -229 -441 330 -596 626 -623 467 -572 -282 210 -344 426 467 1051 -255 713 -547
7536 -547 -672 -560 -72 -316 253 -171 426 771 49 618 -1139 814 -624 365 -150 297 -178 102 -144
$$ packed form
7397c37N7R37p20j2M58Lk24n8Jn85P32j618J814J17k6p27N99j371KJ327j85L75
7419E59l92n41P34m02j0O31o07J10J22J102j359q4J84m32N46L85o72l01K47j63
7439c43R72M2o99N87k48j399J410K16p97J46M92l01R16q93N4K57q41O06n14P03
7459C66q4l80J7M05j661K111J71q41N51n66r73J272q99L09P21l54K16o38j032
7478a289P44k88O55n35J097j379O71P03p01k1n0j06R60J73J31p03N86q78j71J114
7498G13o65Q55j038M48K57J58o94J070p83j87K70m04N13p90N03P74j618J174r79
7517d23m75Q04j35k12P71r26J222j249J090j039K90M92n54P70M1N84j306R68j260
7536e47j25J12M88k44N69m24N97L45p22N69j757J953j438R89n15M47m75K80k46
$$ plain form
7555 -144 47 -489 646 34 493 472 538 479 -219 488 -158 -201 -26 143 716 1047 -335 484 -148 -134 579
7576 579 -423 79 -560 271 -224 -385 564 -367 12 -262 446 819 -275 970 528 -203 -1061 159 294
7595 294 144 537 185 20 -430 663 -350 760 -283 288 654 468 695 450 -193 -274 -397 131 39
7614 39 -197 -257 253 267 395 202 -870 -98 -595 -333 -262 -914 7 -264 -237 45 -293 363 301 757 312 478
7636 478 168 355 -828 -114 -645 -84 -54 1029 -7 -559 292 -108 566 1236 315 -135 1322 378 310
7655 310 -12 -359 97 1035 692 -618 278 79 428 -276 231 445 -139 67 -711 392 425 213 -850
7674 -850 -743 -426 94 957 119 -397 -790 358 -633 -409 -148 274 338 -1130 495 23 143 1022 486
7693 486 -849 210 116 -395 29 476 788 -230 -39 338 87 323 -164 -464 480 618 -75 211 -215
$$ packed form
7555a44J91n36J135o12M59k1O6n9o98P07o46m3J75J69N73L31j382Q19o32J4P13
7576E79j002N02o39Q31m95j61R49r31L79k74P08L73j094J245m42p31q58J220J35
7595B94j50L93l52j65m50J093j013J110j043N71L66j86K27k45o43q1j23N28r2
7614C9k36o0N10J4J28j93j072P72m97K62P1o52R21k71K7K82l38O56o2M56m45J66
7636D78l10J87j183P14n31N61L0J083j036n52Q51m00O74O70r21m50J457r44o8
7655C10l22l47M56R38l43j310Q96j99L49p04N07K14n84K06p78J103L3k12j063
7674h50J07L17N20Q63q38n16l93J148r91K24K61M22O4j468J625m72J20Q79n36
7693D86j335J059r4n11M24M47L12j018J91L77k51K36m87l00R44J38o93K86m26
$$ plain form
7712 -215 693 660 119 836 -434 -449 420 326 -19 315 293 724 -825 -128 -426 -258 -859 -396 420 -752
7732 -752 194 -824 -46 420 472 -990 643 -1165 -1032 435 -724 -307 1272 339 118 711 -588 -201
7750 -201 99 31 585 916 100 -192 37 -223 198 -401 -642 768 -585 -1039 -468 267 -774 173 740
7769 740 -434 -246 565 -594 129 417 -77 494 2 198 -586 -721 439 -15 -1336 -391 504 -191 927
7788 927 553 427 448 295 -1033 -256 -322 -112 -546 306 242 1472 -138 99 -522 187 128 7 809 -726
7808 -726 -14 457 493 -421 151 -517 -1399 -198 -252 -148 -115 1048 -111 600 181 52 -699 506 -137 -417
7828 -417 849 -1372 515 -496 -148 140 -495 -222 267 -867 -558 34 -402 808 511 285 -923 -61
7846 -61 743 699 135 -165 372 610 -364 -582 -531 -408 -569 -220 1341 -433 -482 -358 -754 53 -47 -464 -392
$$ packed form
7712b15R08l3n41P17j270j5Q69r4l45L34k2M31j549O97k98J68o01M63Q16j172
7732g52R46j018P78M66N2j462J633j808J33J467j159M17J579r33k21N93j299L87
7750b01L00o8N54L31q16k92K29k60M21n99k41J410j353m54N71P35j041R47N67
7769G40j174J88Q11j159P23K88m94N71m92J96p84j35J160m54j321R45Q95o95J118
7788I27l74j26K1j53j328P77o6K10m34Q52o4J230j610K37o21P09n9j21Q02j535
7808g26P12M71L6r14N72o68q82J201n4J04L3J163j159P11m19j29p51J205o43k80
7828d17J266k221J887j011L48K88o35K73M89j134L09N92m36J210k97k26j208Q62
7846f1Q04m4n64l00N37K38r74k18N1J23j61L49J561j774m9J24l96Q07j00m17P2
$$ plain form
7867 -392 -462 -222 -177 24 261 -152 -944 -285 576 93 104 406 755 26 112 873 -1331 86 127 -480 -133
7888 -133 -865 504 -615 198 139 139 -294 427 407 -677 -750 73 360 438 -999 -820 602 20 -132 976
7908 976 367 -90 -543 4 1165 -469 309 -681 -930 476 729 -122 379 1022 134 -75 132 -128 -359
7927 -359 531 -200 103 822 353 241 -356 -68 -367 -41 -1067 -116 -312 -446 -84 1144 -619 500 -417
7946 -417 -299 -730 -73 -276 279 -117 181 45 -421 155 -358 920 914 -64 -1537 -494 481 596 -350 -619
7966 -619 -273 529 687 26 -260 128 117 -239 788 -381 552 -529 -1156 34 -213 250 -129 759 -385
7985 -385 -1117 -760 193 -572 390 205 -105 -168 188 -222 311 88 -616 -495 172 40 681 -420 606 627
8005 627 -791 -415 996 -508 -330 -341 162 438 128 -560 657 396 191 1 -105 155 367 -77 -594
$$ packed form
7867c92p0K40M5K01K37m13p92O59Q61m83J1L02L49p29Q6P61k204J417M1o07L47
7888a33p32J369j119Q13n9%m33P21k0j084p3Q23K87P8j437J79J422n82j52J108
7908I76o09m57m53N47J161j634P78r90k49J406K53q51N01O43q88k09K07k60k31
7927c59Q90p31L03P19m69j12n97K88k99L26j026R51j96j34L62J228j763J119r17
7946d17J18m31O57k03N55l96K98j36m66N76n13J278or78j473J043R75J15r46k69
7966f19L46Q02J58o61k86L88j1l56J027j169R33j081o27J190k47M63l79Q88j144
7985c85p32L57R53p65R62j85l10o3L56m10N33k23p04J21O67j32O41j101J026K1
8005F27j418L76J411j504J78j1N03K76l10o88J217k61k05j90j06K60K12m44n17
$$ plain form
8024 -594 -601 11 3 -1018 273 -238 -154 -667 -85 -217 -537 -59 -827 -363 1656 1081 611 -568 -282 -590
8044 -590 -459 -58 718 298 16 -46 -989 -457 -177 -164 -144 -1389 -733 147 259 -137 -534 909 -49 -123 126
8065 126 -365 -934 435 1080 -121 118 685 1183 175 -194 238 -1219 1100 -519 155 -30 -87 755
8083 755 287 154 711 645 -94 562 73 64 -59 -211 -819 296 71 -668 420 -126 -70 -345 -777 -1379 -611
8104 -611 575 -394 146 383 23 -557 -254 -105 -159 -185 190 -413 46 300 6 -255 -58 -157 -267 -362 -546
8125 -546 -222 30 214 -245 -454 245 -82 -302 -501 342 -345 -734 451 764 314 461 479 595 -516 875
8145 875 -629 -342 64 -14 -308 -699 466 -314 339 267 -625 -136 -540 -80 886 -76 980 420 -85 438
8165 438 1209 -88 -141 -282 449 518 -106 -668 -382 55 200 -1435 941 -117 -278 565 -268 -620 -154
$$ packed form
8024e94pO12qj021J291n11Q4n13N82j32l20M78p68M64K019n75m70j179K86l08
8044e90J31M01P76m20k82o2r43N32K80J3K0j245O56Q80J12l96l97J443r58p4K49
8065A26m91n69J369O45j201K39N67M98j008l69M32j457K319j619O74j85n7Q42
8083G55m68j33N57o6p39O56m89rj23j52o08J115k25p39J088n46N6k75m32o02P68
8104f11J186r69N40K37l60n80L03J49n4k6L75o03M59K54k94k61J97r9j10r5j84
8125e46L24K52J84m59k09O99l27k20j99Q43o87l89J185L13m50J47J8J16j111J391
8145H75j504K87M06p8k94l91J165p80O53p2q92M89m04M60R66r62J056n60n05N23
8165D38P71j297n3j41P31O9o24n62K86M37J45j635K376j058j61Q43q33l52M66
$$ plain form
8184 -154 -411 -569 -448 -408 138 -193 309
$$ packed form
8184a54k57j58J21M0N46l31N02
8191C09
$$ Imaginary data points
##PAGE= N=2
##DATA TABLE= (X++(I..I)), XYDATA
$$ plain form
0 0 0 0 0 0 0 0 0 0 0 0 0 0 0 0 0 0 108 -108 108 -108 108 -109 216 -216 216 -323 324 -403 432 -533 559 -651
32 -651 756 -857 964 -1078 1204 -1349 1507 -1681 1868 -2077 2302 -2547 2813 -3107 3432 -3781
48 -3781 4168 -4584 5054 -5569 6141 -6779 7495 -8301 9226 -10290 11533 -13010 14790
61 14790 -16979 19774 -23460 28570 -36117 48477 -72008 132876 -624758 -1051279 519599
72 519599 150525 -582998 129061 431154 -754824 -566146 797170 608858 -733923 -589861
82 -589861 430698 409660 -272794 -133313 257057 -100362 -431330 234543 629507 -178256
92 -178256 -694995 48672 549223 75074 -265868 -51829 4269 -81889 111776 253308
102 253308 -72153 -321752 -66530 196077 142372 59959 -124546 -351202 -14883 501974
$$ packed form
0@%%%%%%%%%%%%%%%%J08k16K16k16K16k17L25m32M32n39O47p27Q35r65J092j210
32f51J407j613J821k042K282k553K856l188L549l945M379m849N360n920O539p213
48c781P949q752R638j0623J1710j2920J4274j5796J7527j9516K1823k4543K7800
61A4790l1769L6753m3234N2030o4687Q4594j20485K04884p57634m26521J570878
72E19599l69074p33523P12059L02093j185978J88678J363316j88312j342781J44062
82e89861J020559k1038o82454J39481L90370l57419l30968O65873L94964q07763
92a78256n16739P43667N00551m74149l40942K14039N6098q6158J93665J41532
102B53308l25461k49599K55222K62607n3705q2413j84505k26656L36319N16857
$$ plain form
112 501974 128637 -479550 -123756 296534 -81003 -106783 377283 -1182 -624615 -23726
122 -23726 673895 102607 -523483 -130947 271162 33380 -76431 153756 22669 -344503
132 -344503 -116954 410725 242146 -337266 -289651 165455 179052 -14725 35909 -40250 -254328
143 -254328 -17734 345517 105694 -286960 -136669 124774 40013 30891 153185 -104196
153 -104196 -349609 81098 427977 -21145 -347045 5455 147357 -76269 61538 221217
163 221217 -174003 -345474 163949 363698 -75340 -245667 9253 54257 -23101 116125
173 116125 129329 -171899 -243335 128911 288992 -29397 -206108 -15450 50183 -23375 111699
184 111699 150235 -183046 -271819 162777 314614 -87122 -220963 50858 53255 -83657 121576
$$ packed form
112E01974l73337o08187L55794M20290l77537k5780M84066l78465o23433O00889
122b3726O97621n71288o26090L92536M02109k37782j09811K30187j31087l67172
132c44503K27549N27679j68579n79412M7615M55106J3597j93777N0634p6159k14078
143b54328K36594L63251k39823l92654J50291K61443q4761r122J22294k57381
153a04196k45413M30707L46879m49122l25900L52500J41902k23626J37807J59679
163B21217l95220j71471N09423J99749m39038j70327K54920M5004p7358J39226
173A16125J3204l01228p1436L72246J60081l18389j76711J90658O5633p3558J35074
184A11699L8536l33281q8773M34596J51837m01736j33841K71821K397j36912K05233
$$ plain form
195 121576 188356 -207691 -278361 197535 290676 -121987 -179352 61983 -7259 -56573 180652
206 180652 107606 -257502 -164770 212519 165151 -97624 -80099 -4028 -62795 27843 190319
217 190319 27365 -238912 -106599 190276 139446 -90554 -80132 11527 -52535 -1671 187893
228 187893 55345 -255959 -119615 226829 136457 -135529 -65799 51637 -67775 -23654
238 -23654 199469 55620 -259134 -97487 222744 96369 -117998 -23256 15471 -98514
248 -98514 33073 207281 -22116 -239899 -14814 178729 26972 -58637 14960 -46873 -98492
259 -98492 87387 180321 -52433 -205678 -10016 155098 38699 -55300 -3433 -33933 -86270
270 -86270 66578 181703 -40404 -218793 -9075 174010 28825 -69430 10089 -37683 -94820
$$ packed form
195A21576O6780l96047p0670M75896R3141m12663n7365K41335o9242m9314K37225
206A80652p3046l65108R2732L77289m7368k62775J7525P6071n8767R0638J62476
217A90319j62954k66277J32313K96875n0830k30000J0422R1659o4062N0864J89564
228A87893j32548l11304J36344L46444r0372k71986O9730J17436j19412M4121
238b3654K23123j43849l14754J61647L20231j26375k14367R4742L8727j13985
248i8514J31587J74208k29397k17783K25085J93543j51757q5609P3597o1833n1619
259i8492J85879R2934k32754j53245J95662J65114j16399r3999N1867l0500n2337
270h6270J52848J15125k22107j78389K09718J83085j45185r8255P9519m7772n7137
$$ plain form
281 -94820 91374 176822 -79624 -201649 32737 144579 -5770 -31611 25818 -84335 -87903
292 -87903 140992 147570 -125908 -159887 66900 101380 -20858 995 20598 -99040 -63090
303 -63090 141349 116068 -113215 -134875 48761 94185 -1126 -11684 5655 -75315 -54926
314 -54926 117703 113103 -101934 -131092 51219 86093 -11877 3284 12755 -96347 -50510 143484
326 143484 90261 -127125 -94423 68323 41188 -12084 48290 -4810 -131980 -17404 167427
337 167427 52127 -136115 -59868 64067 21575 3837 50020 -25011 -115820 314 141679
348 141679 43941 -110387 -65746 44415 38579 14768 26872 -30646 -96163 1673 129496
359 129496 39934 -111162 -56975 53018 27277 7561 39296 -34133 -106851 22452 136435
$$ packed form
281i4820J86194Q5448k56446j22025K34386J11842j50349k5841N7429j10153l568
292h7903K28895O578k73478l3979K26787L4480j22238K1853J9603j19638L5950
303f3090K04439k5281k29283k1660J83636M5424r5311j0558J7339q0970K0389
314e4926J72629m600k15037k9158J82311L4874r7970J5161R471j09102M5837J93994
326A43484n3223k17386L2702J62746k7135n3272O0374n3100j27170J14576J84831
337A67427j15300j88242P6247J23935m2492j7738M6183p5031r0809J16134J41365
348A41679r7738j54328M4641J10161n836k3811J2104n7518o5517R7836J27823
359A29496q9562j51096N4187J09993k5741j9716L1735p3429p2718J29303J13983
$$ plain form
370 136435 6265 -111928 -19474 44136 -5453 24971 57169 -64303 -107827 54073 123013
381 123013 -20320 -91415 -5396 24298 -1900 38580 40386 -66658 -80392 49416 96222
392 96222 -8917 -71427 -19484 16268 13314 36735 27740 -61260 -75374 48369 94930 -14212
404 -14212 -74746 -10848 21060 2300 37760 38449 -68164 -78573 61636 90005 -30180 -58574
416 -58574 2890 -783 -1387 61352 27465 -91364 -57785 77500 65862 -34645 -38122 -5746
428 -5746 -12366 17342 60142 2776 -80726 -35203 62847 52297 -23202 -37835 -14129 -5398 21259
441 21259 50770 1475 -75475 -37326 66854 54685 -33058 -40043 -11 -4683 12010 50862
453 50862 2555 -78591 -28204 71747 38801 -36440 -19866 -294 -19779 20650 60758 -13518
$$ packed form
370A36435j30170j18193R2454O3610m9589L0424L2198j21472m3524J61900O8940
381A23013j43333p1095Q6019K9694k6198M0480J806j07044j3734J29808M6806
392I6222j05139o2510N1943L5752k954K3421q995q9000j4114J23743M6561j09142
404a4212o0534O3898L1908j8760L5460O89j06613j0409J40209K8369j20185k8394
416e8574O1464l673o04O2739l3887j18829L3579J35285j1638j00507l477L2376
428e746o620K9708M2800n7366q3502M5523R8050j0550p5499j4633K3706Q731K6657
441B1259K9511m9295p6950L8149J04180j2169q7743o985M0032m672J6693L8852
453E0862m8307q1146N0387R9951l2946p5241J6574J9572j9485M0429M0108p4276
$$ plain form
465 -13518 -76455 -7509 60585 20364 -20736 -11146 -17844 -18176 36510 48664 -24729 -59354 -2682
478 -2682 42417 22787 -9201 -16378 -21886 -12326 33606 46421 -18097 -63122 -9061 50499 25441
491 25441 -19502 -17586 -14418 -14042 31031 48224 -26123 -64243 4414 50561 11780 -16359 -8495
504 -8495 -22506 -16243 44018 42280 -40257 -53604 15837 38242 8136 -4136 -15263 -29524 470
517 470 44601 22323 -36544 -36086 10633 28873 12296 -4306 -17173 -22462 -483 34687 24760
530 24760 -28649 -38398 9745 32237 8976 -7016 -12652 -21977 -2612 36890 24446 -32783 -34612
543 -34612 16204 22212 2522 3501 -7947 -32417 -2337 44474 17303 -36526 -25261 13152 15728
556 15728 10157 7267 -20829 -29355 12965 37466 6599 -26557 -22215 3304 20727 15923 -2283
$$ packed form
465a3518o2937O8946O8094m0221m1100R590o698l32N4686J2154p3393l4625N6672
478b682M5099j9630l1988p177n508R560M5932J2815o4518m5025N4061N9560k5058
491B5441m4943J916L168L76M5073J7193p4347l8120O8657M6147l8781k8139P864
504h495j4011O263O0261j738q2537j3347O9441K2405l0106j2272j1127j4261K9994
517D70M4131k2278n8867M58M6719J8240j6577j6602j2867n289K1979L5170r927
530B4760n3409r749M8143K2492k3261j5992n636r325J9365L9502j2444n7229j829
543c4612N0816O008j9690R79j1448k4470L0080M6811k7171n3829J1265L8413K576
556A5728n571k890k8096q526M2320K4501l0867l3156M342K5519J7423m804j8206
$$ plain form
569 -2283 -21283 -20952 10476 34384 12252 -28379 -26134 9328 23225 9947 -2196 -19470 -23286
582 -23286 12952 35562 2045 -31426 -14559 12751 13035 8774 3134 -18495 -23076 16785 34151
595 34151 -3659 -27126 -7608 8434 8418 12907 781 -22928 -15139 18051 21969 -3417 -16724
608 -16724 -10383 1890 14265 11701 -5508 -15455 -10864 7686 22597 5396 -19907 -13819 5334
621 5334 12759 10102 469 -19496 -17522 14648 23910 -3801 -19778 -6074 1530 8702 15552 322
635 322 -24210 -13671 18153 20981 -4746 -16704 -7908 1038 14204 16329 -7192 -22868 -4724
648 -4724 17673 14569 -2277 -12873 -10285 2896 14367 8097 -9293 -15321 -5306 10849 14573
661 14573 -87 -16738 -7330 8286 9807 7551 -4606 -16953 -5523 16297 11398 -7127 -10303
$$ packed form
569b283j9000L31L1428K3908k2132m0631K245L5462J3897j3278j2143j7274l816
582b3286L6238K2610l3517l3471J6867K7310K84m261n640k1629m581L9861J7366
595C4151l7810k3467J9518J6042j6M489j2126k3709P789L3190L918k5386j3307
608a6724O341J2273J2375k564j7209r947M591J8550J4911j7201k5303O088J9153
621E334P425k657r633j9965J974L2170R262k7711j5977J3704P604P172O850j5230
635C22k4532J0539L1824K828k5727j1958Q796Q946J3166K125k3521j5676J8144
648d724K2397l104j6846j0596K588J3181J1471o270j7390o028J0015J6155L724
661A4573j4660j6651R408J5616J521k256j2157j2347J1430K1820m899j8525l176
$$ plain form
674 -10303 -3485 120 7926 12153 -5370 -16862 -2191 12787 7541 -1963 -7462 -9225 290 12564
688 12564 8923 -7796 -13880 -23 10251 8789 513 -9754 -9682 2743 11796 6281 -5346 -11962
702 -11962 -5602 10330 13220 -1547 -11930 -6301 2980 9274 8017 -4467 -16001 -2314 14181
715 14181 7070 -5349 -7775 -6207 1909 12178 6116 -9666 -11696 621 9300 5598 -1713 -8984
729 -8984 -8092 6536 12702 962 -9634 -6369 2006 7589 6056 -3169 -8542 -3270 5969 6925 751
744 751 -3928 -6875 -2668 9100 6931 -4906 -6233 -955 967 6470 5388 -5132 -9437 1144
758 1144 7976 1892 -1481 -3288 -6042 231 8754 2755 -6030 -4861 -1127 4459 7525 298 -9365
773 -9365 -6067 5730 9000 112 -5731 -6348 -2285 6880 6882 -3588 -8435 -962 4372 4815 2726 -5081
$$ packed form
674a0303O818L605P806M227j7523j1492J4671J4978n246r504n499j763R515J2274
688A2564l641j6719o084J3857J0274j462q276j0267P2J2425R053n515j1627o616
702a1962O360J5932K890j4767j0383N629R281O294j257j2484j1534J3687J6495
715A4181p111j2419k426J568Q116J0269o062j5782k030J2317Q679l702p311p271
729h984Q92J4628O166j1740j0596L265Q375N583j533r225n373N272R239R56o174
744G51m679k947M207J1768k169j1837j327N278J922N503j082j0520m305J0581
758A144O832o084l373j807k754O273Q523n999q785J169L734N586L066p227r663
773i365L298J1797L270q888n843o17M063R165Kj0470m847P473N334M43k089p807
$$ plain form
789 -5081 -7844 1338 8355 4589 -5034 -5548 -2440 2063 7612 2310 -8443 -6307 6060 5171 1548
804 1548 -2361 -4501 -2782 3426 5851 -2041 -4779 -1066 877 1983 3741 -1906 -6801 -23 4453
819 4453 2520 -6 -1575 -3964 -282 4594 1858 -2743 -3294 -17 636 1151 2487 -2511 -5035 1020
835 1020 3968 1904 76 -2981 -3657 2784 5746 1701 -5024 -2791 1846 3727 3076 322 -5397 -3034
851 -3034 5249 3513 -1059 -2184 -2507 -1045 4492 4464 -2971 -5213 445 3537 2612 337 -3552 -4438
867 -4438 3021 6117 -861 -3887 -1957 -477 1237 1935 -429 -3197 -2441 3722 2858 -66 -1224 -2025
883 -2025 -1654 3574 2126 -2964 -3231 -14 1526 704 311 -403 -1550 92 2143 -38 -403 791 -1228
900 -1228 -1651 2254 1629 -1925 -794 -577 -67 3051 2274 -3026 -3142 2230 1895 141 -592 249 -2646
$$ packed form
789e081k763R182P017l766r623n14L108M503N549n302j0753K136J2367q89l623
804A548l909k140J719O208K425p892k738L713J943J106J758n647m895O778M476
819D453j933k526j569k389L682M876k736m601n51L277O53N15J336m998k524O055
835A020K948k064j828l057o76O441K962m045o725K233M637J881o51k754n719K363
851c034Q283j736m572j125l23J462N537k8p435k242N658L092r25k275l889q86
867d438P459L096o978l026J930J480J714O98k364k768P56O163q64k924j158q01
883b025L71N228j448n090k67L217J540q22l93p14j147J642K051k181l65J194k019
900a228m23L905o25l554J131K17N10L118p77n300j16N372l35j754p33Q41k895
$$ plain form
917 -2646 443 3110 -90 -2957 -996 76 1450 1929 -123 -2862 -1108 3672 2213 -1829 -2390 -540
933 -540 695 3003 387 -3501 -1808 1115 2901 -383 385 -842 -1261 1771 1882 -452 -2828 24
949 24 785 116 1972 128 -3020 -94 3228 105 -1140 -38 72 108 1877 1219 -1091 -422 1449
966 1449 -54 -414 2117 297 -1947 1045 1440 459 -268 -685 -1594 -305 1461 1174 -551 -508 -810 146
984 146 1154 1108 -2844 -2223 1035 709 287 577 -952 -1405 722 2777 318 -2211 168 2313 393
1001 393 621 229 -1132 752 1187 416 -1082 -1147 266 492 198 514 -1571 -144 1575 360 -1149
1018 -1149 -407 -975 -1409 1603 1148 -844 -543 1506 -167 -925 -326 468 -99 210 197 -1732 -503 958
1036 958 -319 -636 500 -522 -624 567 760 -1231 -540 302 526 -1081 126 424 -345 50 744 -827
$$ packed form
917b646L089K667l200k867J961J072J374M79k052k739J754M780j459m042n61J850
933e40J235K308k616l888J693K923J786l284P68j227m19L032J11k334k376K852
949B4P61o69J856j844l148K926L322l123j245J102J10L6J769o58k310O69J871
966A449j503l60K531j820k244K992L95r81p27m17r09J289J766k87j725M3l02R56
984A46J008m6l952O21L258l26m22K90j529m53K127K055k459k529K379K145j920
1001C93K28l92j361J884M35p71j498o5J413K26k94L16k085J427J719j215j509
1018a149P42n68m34L012m55j992L01K049j673p58N99P94n67L09j3j929J229J461
1036I58j277l17J136j022j02J191J93j991O91Q42K24j607J207K98p69L95O94j571
$$ plain form
1054 -827 -2079 1819 1580 -862 -763 1035 832 1267 335 -551 -923 868 1041 -1217 -657 -491 -537 71 316
1073 316 -491 -254 403 388 1014 690 -998 -389 594 955 397 -2092 533 830 187 685 -356 -947 12
1092 12 1525 -433 -504 1143 437 -421 -999 -186 -701 -634 1060 537 -1372 843 538 -983 602 568 -2074
1111 -2074 -869 -168 395 -903 -869 630 499 696 -23 -1018 -296 1740 -438 -595 484 94 -43 1154
1129 1154 -381 -640 418 1356 181 -1236 -657 58 -250 781 788 -572 -669 451 820 38 -1037 -607
1147 -607 0 372 583 -244 -1837 1045 1911 370 106 -462 -623 215 1259 -290 57 2029 485 5
1165 5 208 57 -430 735 411 -1237 -1494 -48 625 -799 333 -334 -190 176 730 -927 -1763 -969 1042
1184 1042 539 -521 -931 -345 1028 792 -252 -321 652 -44 482 794 232 -1256 6 309 391 -551 -269
$$ packed form
1054h27j252L898k39k442R9J798k03M35r32q86l72J791J73k258N60J66m6O08K45
1073C16q07K37O57j5O26l24j688O09R83L61n58k489K625K97o43M98j041n91R59
1092A2J513j958p1J647p06q58n78Q13n15O7J694n23j909K215l05j521J585l4k642
1111b074J205P01N63j298L4J499j31J97p19r95P22K036k178j57J079l90j37J197
1129A154j535k59J058R38j175j417N79P15l08J031Pj360r7J120L69p82j075M30
1147f07O07L72K11q27j593K882Q66j541k64n68j61Q38J044j549L47J972j544m80
1165EK03j51m87J165l24j648k57J446O73j424J132o67J44L66N54j657q36P94K011
1184A042n03j060m10N86J373k36j044o9R73o96N26L12n62j488J262L03Q2r42K82
$$ plain form
1203 -269 339 -380 -221 -360 -635 -302 546 -324 -752 -583 326 745 365 466 -739 1094 -621 941 -1758
1222 -1758 1393 76 305 1290 -639 -701 194 695 440 142 -886 -964 843 124 503 -15 -62 668 1082
1241 1082 -1106 257 -641 738 106 -74 438 -863 1254 987 -389 -642 267 332 -31 792 79 -480
1259 -480 1025 793 -1401 768 -250 790 560 967 -1053 -607 837 540 181 -445 106 -1074 375
1276 375 1574 -259 -40 519 908 -145 -277 61 429 736 19 -1602 -1082 1234 1528 -1056 -1029 -502
1294 -502 -191 1133 72 207 -360 392 754 966 -174 614 324 268 1679 -794 -636 -407 1177 -1362
1312 -1362 -1048 910 -1025 -912 777 464 -866 -337 -28 922 -968 -387 -1027 -189 882 1167 -346
1329 -346 -342 568 -412 1052 -622 -391 -528 851 786 -361 -446 156 -275 305 -448 -1015 -889 1151 419 403
$$ packed form
1203b69O08p19J59j39k75L33Q48q70m28J69R09M19l80J01j205J833j715J562k699
1222a758L151j317K29R85j929o2Q95N01k55k98j028p8J807p19L79n18m7P30M14
1241A082k188J363q98J379o32j80N12j301K117k67j376k53R09O5l63Q23p13n59
1259d80J505k32k194K169j018J040k30M07k020M46J444k97l59o26N51j180J449
1276C75J199j833K19N59L89j053j32L38L68L07p17j621N20K316K94k584K7N27
1294e02L11J324j061J35n67P52L62K12j140P88k90n6J411k473J58K29J584k539
1312a362L14J958j935J13J689l13j330N29L09R50j890N81o40Q38J071K85j513
1329c46MR10r80J464j674K31j37J379o5j147q5O02m31N80p53n67J26K040p32j6
$$ plain form
1349 403 -425 83 286 -769 1022 -1087 -1053 -102 557 -318 362 -209 -630 263 760 -428 -1657 353
1367 353 885 1254 -1030 -959 1060 -709 614 -1055 -242 157 410 69 -199 -172 673 558 182 -333 -22
1386 -22 -119 240 82 -1345 1445 -306 -710 1045 138 34 -281 322 -536 15 45 -201 954 815 475
1405 475 426 -76 865 -94 307 57 -622 50 158 -752 -1491 463 -246 -90 639 -232 332 -358 886 -200
1425 -200 -259 178 -1216 734 -347 -346 -559 -315 -520 352 -715 263 -305 551 191 738 -1180 78 498
1444 498 212 -720 -731 76 -547 187 294 915 -92 753 -38 60 -16 712 -420 -773 119 61 -1173 739
1464 739 -543 634 -386 70 44 102 -646 -986 -755 909 592 -317 446 184 1123 99 431 408 -356
1483 -356 521 1132 382 66 369 -97 -728 802 328 953 -762 995 -408 -320 398 57 -329 452 -192
$$ packed form
1349D03q28N08K03j055J791k109L4R51O59q75O80n71m21Q93M97j188j229K010
1367C53N32L69k284P1K019j769J323j669Q13L99K53l41k68K7Q45j15l76n15L11
1386b2r7L59j58j427K790j751m04J755r07j04l15O03q58N51L0k46J155j39l40
1405D75m9n02R41r59M01k50o79O72J08r10p39J954p09J56P29q71N64o90J244j086
1425b00n9M37j394J950j081Jk13K44k05Q72j067R78n68Q56l60N47j918J258M20
1444D98k86r32j1Q07o23P34J07O21j007Q45p91R8p6P28j132l53Q92n8j234J912
1464G39j282J177j020M56k6N8p48l40K31J664l17r09P63k62R39j024L32k3p64
1483c56Q77O11p50l16L03m66o31J530m74O25j715J757j403Q8P18l41l86P81o44
$$ plain form
1502 -192 2 14 1327 1255 -902 225 -122 804 148 611 -827 262 609 -245 191 -182 -477 615 -566
1521 -566 958 -12 565 -176 -602 64 52 -571 -954 67 654 -894 -447 572 326 -413 408 -1184 -48
1540 -48 471 -20 212 -253 -596 -401 -213 -45 244 457 127 438 -265 -14 -348 583 272 96 693 -592
1560 -592 -150 226 299 -1328 1030 617 198 854 -469 -554 -135 826 -234 -491 -39 433 175 -33 -150
1579 -150 659 484 -209 64 -274 -150 -201 60 -135 -945 -776 -33 1039 957 -527 -705 -95 400 -201 -456
1599 -456 -574 1021 211 407 438 134 -184 248 -78 89 -170 179 742 967 246 239 -93 -870 -805 -7 -185
1620 -185 396 203 335 246 145 -682 -649 573 -609 -537 -1277 877 446 -621 -105 845 -784 105 -314
1639 -314 109 683 -38 474 -62 -1157 -680 -1091 411 425 -756 -1326 -123 214 -319 -1066 -651 114 795
$$ packed form
1502a92J94J2J313p2k157J127l47R26o56M63j438J089L47q54M36l73k95J092j181
1521e66J524r70N77p41m26O66j2o23l83J021N87j548M47J019k46p39Q21j592J136
1540d8N19m91K32m65l43J95J88J68K89K13l30L11p03K51l34R31l11j76N97j285
1560e92M42L76P3j627K358m13m19O56j323q5M19R61j060k57M52M72k58k08j17
1579a50Q09j75o93K73l38J24n1K61j95q10J69P43J072q2j484j78O10M95o01k55
1599d56j18J595q10J96L1l04l18M32l26J67k59L49N63K25p21pl32p77O5P98j78
1620a85N81j93J32q9j01q27L3J222j182P2p40K154m31j067N16R50j629Q89m19
1639c14M23N74p21N12n36j095M77m11J502J4j181n70J203L37n33p47M15P65O81
$$ plain form
1658 795 371 -129 33 -61 236 2 -1208 -214 -116 483 -329 467 26 276 -368 853 -127 -147 336 136
1678 136 -93 -850 166 -757 155 406 470 -364 -423 -115 304 -771 -125 -554 -71 -530 752 -252 -149
1697 -149 125 -604 111 -589 464 -357 -381 870 305 -1514 335 332 149 164 -171 -121 445 308 -393 -297 763
1718 763 222 -11 318 287 621 1154 -689 -687 -398 -719 1056 -35 93 70 978 297 656 394 -637 -792
1738 -792 1074 309 -642 -667 718 -66 560 -153 692 253 -327 467 -15 563 -962 -284 923 -241 -971
1757 -971 272 -135 1146 177 125 162 960 512 113 -281 302 317 1470 939 50 -1303 549 -237 -137
1776 -137 21 -492 -537 -67 1106 -141 -192 347 -604 -277 -317 -338 -454 -42 91 22 215 353 480 1021 -313
1797 -313 357 -641 555 841 465 -163 335 -604 1061 -153 -430 60 382 284 375 16 -233 -390 -179 -1
$$ packed form
1658G95m24n00J62r4K97k34j210R94R8N99q12P96m41K50o44J221r80k0M83k00
1678A36k29p57J016r23R12K51O4q34n9L08M19j075O46m29M83m59J282j004J03
1697a49K74p29P15p00J053q21k4J251n65j819J849lj83J5l35N0N66j37p01R6J060
1718G63n41k33L29l1L34N33j843KK89l21J775j091J28k3R08o81L59k62j031j55
1738g92J866p65r51k5J385p84O26p13Q45m39n80P94m82N78j525O78J207j164p30
1757i71J243m07J281r69n2L7P98m48l99l94N83J5J153n31q89j353J852p86J00
1776a37J58n13m5M70J173j247n1N39r51L27m0k1j16M12J33o9J93J38J27N41j334
1797c13O70r98J196K86l76o28M98r39J665j214k77M90L22r8R1l59k49j57K11J78
$$ plain form
1817 -1 -399 168 -527 521 215 -238 -464 -96 396 186 374 -934 -1293 -1205 54 -318 -227 180 -2 1020
1837 1020 576 324 -829 -31 285 91 -6 -255 620 134 85 -362 159 -421 -152 345 -142 -1628 -130
1856 -130 -725 -791 -735 421 -97 -636 95 126 247 131 178 415 675 -282 233 142 458 -237 223 -441 -293
1877 -293 8 -89 605 -395 639 968 -243 -333 -146 368 494 -1189 -920 29 18 115 310 -1235 725
1896 725 637 -42 -714 106 -211 176 953 -157 -169 -247 -571 822 180 -417 -202 -832 -701 -1134 855 -796
1916 -796 -101 -964 522 -494 -631 -272 105 307 479 874 23 622 -220 -525 125 -498 -682 142 -127
1935 -127 246 34 -708 718 511 -333 529 -357 839 -976 -145 394 -1144 619 -868 -662 407 55
1953 55 -276 -837 782 -311 645 470 1236 -534 -1047 121 391 696 347 950 464 -75 -67 -399 -343 -371
$$ packed form
1817al98N67o95J048l06m53k26L68M92k10J88j308l59Q8J259l72R1M07j82J022
1837A020m44k52j153P98L16j94r7k49Q75m86m9m47N21n80K69M97m87j486J498
1856a30n95o6N6J156n18n39P31L1J21j16M7K37K60r57N15r1L16o95M60o64J48
1877b93L01r7O94j000J034L29j211r0J87N14J26j683K69R49j1R7J95j545J960
1896G25q8o79o72Q20l17L87P77j110j2p8l24J393o42n97K15o30J31m33J989j651
1916g96O95q63J486j016j37L59L77K02J72L95q51N99q42l05O50o23j84Q24k69
1935a27L73k12p42J426k07q44Q62q86J196j815Q31N39j538J763j487K06J069l52
1953E5l31n61J619j093R56j75P66j770n13J168K70L05l49O03m86n39Ql32N6k8
$$ plain form
1973 -371 295 585 -745 -172 610 553 -44 -129 -1282 -501 1028 278 675 -216 118 204 682 -234 -469 196
1993 196 327 31 -160 -405 -347 177 163 526 -199 -805 586 -267 -293 -101 -811 -290 258 465 318 -260 -87
2014 -87 895 -261 -250 193 88 -113 -267 -315 -719 -200 -92 335 1003 -441 -233 132 1602 494 189 -250
2034 -250 72 -174 -349 -671 -145 19 873 222 -86 -171 -820 -51 -469 -1183 -287 48 443 501 81 -48 344
2055 344 67 -314 706 -388 1209 154 632 381 166 -140 701 1194 -591 477 -509 227 8 296
2073 296 -927 -137 570 445 -513 -351 -553 1414 -149 -171 169 29 323 -441 -275 -524 217 525 -801
2092 -801 -586 -853 815 -191 -22 218 -544 -107 -441 322 -665 -358 223 -246 290 -242 -170 11 434 246
2112 246 -222 -219 612 -571 -45 -254 -1029 -670 -285 -683 -234 823 -435 -372 -733 1222 -207 -418 -1496
$$ packed form
1973c71O66K90j330N73P82n7n97q5j153P81J529p50L97q91L34Q6M78r16k35O65
1993A96J31k96j91k45N8N24j4L63p25o06J391q53k6J92p10N21N48K07j47n78J73
2014h7R82j156J1M43j05k01j54m8m04N19J08M27O68j444K08L65J470j108l05m39
2034b50L22k46j75l22N26J64Q54o51l08q5o49P69m18p14Q96L35L95N8m20j29L92
2055C44k77l81J020j094J597j055M78k51k15l06Q41M93j785J068r86P36k19K88
2073B96j223P90P07j25r58J62k02J967j563k2L40j40K94p64J66k49P41L08j326
2092h01K15k67J668j006J69K40p62M37l34P63r87L07N81m69N36n32P2J81M23j88
2112B46m68LQ31j183N26k09p75L59L85l98M49J057j258O3l61J955j429k11j078
$$ plain form
2131 -1496 129 364 401 203 720 852 425 -492 43 715 -598 132 -482 -364 -448 -172 -667 -603 359 -283
2151 -283 -804 236 -459 -327 -823 47 324 -346 -838 -97 -265 -193 206 521 -1709 -578 262 403 -21
2170 -21 539 314 56 -132 566 881 -276 -260 787 -100 922 166 1667 -310 815 -241 306 -226
2188 -226 -246 -101 -163 -190 266 1123 788 -69 598 -220 189 95 -76 682 -365 -899 -78 -193 152 -601 -155
2209 -155 -586 0 161 17 -40 16 111 -515 780 -316 -356 924 -354 523 124 -379 1080 -208 284
2228 284 729 -497 70 -275 -210 239 -741 0 -526 -2 -144 197 -708 371 -38 -428 298 -752 226
2247 226 -487 494 -211 227 859 26 -332 65 244 609 83 -1377 -263 -617 252 -974 1098 -41
2265 -41 -758 -534 -33 333 621 -440 -25 668 515 207 125 341 -143 -14 -1046 -157 -112 -267 -453 -339
$$ packed form
2131a496J625K35L7j98N17J32m27r17N35O72j313P30o14J18q4K76m95O4R62o42
2151b83n21J040o95J32m96Q70K77o70m92P41j68P2L99L15k230J131Q40J41m24
2170b1N60k25k58j88O98L15j157J6J047q87J022p56J501j977J125j056N47n32
2188b26k0J45o2k7M56Q57l35q57O67q18M09r4j71P58j047n34Q21j15L45p53M46
2209a55m31N86J61j44n7N6R5o26J295j096m0J280j278Q77l99n03J459j288M92
2228B84M45j226N67l45O5M49r80P41n26N24j42L41r05J079m09l90P26j050R78
2247B26p13R81p05M38O32q33l58L97J79L65n26j460J114l54Q69j226K072j139
2265d1p17K24N01L66K88j061M15O93j53l08q2K16m84J29j032Q89M5j55j86J14
$$ plain form
2285 -339 -595 -454 -112 -312 -371 -52 78 290 -264 194 121 -363 863 -128 1842 875 -353 -583 -468 -56
2305 -56 480 -554 -238 122 -286 624 1174 -132 198 847 -668 -737 138 -459 356 1422 -95 -1008 -285
2324 -285 366 301 451 -379 -250 102 444 -54 161 -559 854 434 -594 421 -17 28 155 -302 -209 -740
2344 -740 1 170 426 -484 114 -26 -3 543 136 -89 942 -208 -836 1003 -361 533 187 397 -750
2363 -750 539 328 1095 -13 436 -117 304 45 298 -653 217 881 -451 -18 588 98 -193 842 -777
2382 -777 978 -389 140 -1635 46 -486 529 327 -211 -276 -92 390 750 -213 -56 473 -553 -62
2400 -62 457 723 117 584 -233 -52 30 -255 -194 138 -744 -275 -546 84 -166 551 306 -126 -703 -157 653
2421 653 -98 -448 301 29 603 -273 -128 -827 -233 -347 -464 100 -578 -36 -569 358 -352 324 -995 679
$$ packed form
2285c39k56J41L42k00n9L19J30K12n54M58p3m84J226r91J970r67j228k30J15M12
2305e6N36j034L16L60m08R10N50j306L30O49j515o9Q75n97Q15J066j517r13P23
2324b85O51o5J50q30J29L52L42m98K15p20J413m20j028J015m38M5J27m57R3n31
2344g40P41J69K56r10N98j40K3N46m07k25J031j150o28J839j364Q94l46K10j147
2363g50J289k11P67j108M49n53M21k59K53r51Q70O64j332M33O06m90k91J035j619
2382g77J755j367N29j775J681n32J015k02n38o5J84M82L60r63J57N29j026M91
2400f2N19K66o06M67q17J81Q2k85O1L32q82M69k71O30k50P17k45m32n77N46Q10
2421F53p51l50P49k72N74q76J45o99N94j14j17N64o78N42n33R27p10O76j319J674
$$ plain form
2441 679 -806 -122 -19 182 -485 236 -107 -324 40 235 230 -364 -271 -379 517 -415 -23 1169 465 -159
2461 -159 662 133 454 -197 855 7 -327 663 -233 81 -691 110 -59 -138 305 -181 724 343 312 1251
2481 1251 -628 -261 683 -621 -597 251 311 -810 513 610 207 -347 -765 836 -724 -470 590 331
2499 331 -1109 -137 124 886 -461 -721 -121 223 415 -355 134 1671 -274 -724 1267 -185 -191 -185 -395
2518 -395 -393 313 570 425 70 -424 -384 182 -183 231 -461 -120 -182 396 -401 -871 -70 61 366 932 -454
2539 -454 -820 483 594 782 -533 991 -850 -90 848 -358 287 -520 252 669 -71 -164 324 -562 -118
2558 -118 -449 -668 716 914 5 -530 1 -255 113 -733 390 -16 586 296 480 -198 693 -1057 -477
2577 -477 -158 479 -916 -371 804 133 -93 -438 -55 -63 -1019 -747 1438 1299 44 215 301 582 754 551
$$ packed form
2441F79j485O84J03K01o67P21l43k17L64J95nn94R3j08Q96r32L92J192p04o24
2461a59Q21n29L21o51J052q48l34R90q96L14p72Q01j69p9M43m86R05l81l1R39
2481A251j879L67R44j304K4Q48O0j121J323R7m03n54m18J601j560K54J060k59
2499C31j440R72K61P62j347k60O00L44J92p70M89J537j945m50J991j452oOk10
2518c95KP06K57j45l55m94M0N66l65M14o92L41o2N78p97m70Q01J31L05N66j386
2539d54l66J303J11J88j315J524j841P60R38j206O45q07P72M17p40r3M88q86M44
2558a18l31k19J384J98r09n35N31k56L68q46J123m06O02k90J84o78Q91j750N80
2577d77L19O37j395N45J175o71k26l45L83qr56K72K185j39j255J71Q6K81J72k03
$$ plain form
2597 551 337 -625 233 12 -176 185 -92 -792 163 270 874 -642 -964 -49 -172 182 -658 541 -826
2616 -826 117 181 616 -199 -1122 994 -404 -726 -585 879 -211 -161 337 654 269 664 -523 -419 624
2635 624 441 146 333 1694 -1099 -145 -299 495 -572 373 247 1043 349 -16 -121 357 -458 842 -476
2654 -476 -152 700 -256 -1284 -239 -623 -1057 180 -152 309 -340 483 299 522 472 -853 403 1291 -297
2673 -297 -352 -423 843 -515 596 550 -532 495 -699 -58 -402 -411 -466 139 -410 9 -32 -158 -82 -433 -452
2694 -452 -100 11 90 -721 -189 795 196 178 34 560 -35 436 547 522 79 1056 618 876 505 -134 90
2715 90 -162 48 512 836 132 -342 -274 1217 -156 1031 448 -64 620 613 403 60 438 543 152 -507
2735 -507 59 -185 -33 -346 -715 -152 -106 294 -324 -69 -237 -472 -305 889 14 -358 -541 -564 -342 115
$$ packed form
2597E51k14r62Q58k21j88L61k77p00R55J07O04j516l22R15j23L54q40J199j367
2616h26R43O4M35q15r23K116j398l22J41J464j090N0M98L17l85L95j187J04J043
2635F24j83k95J87J361k793R54j54P94j067R45j26P96o94l65j05M78q15J300j318
2654d76L24Q52r56j028J045l84m34J237l32M61o49Q23j84K23n0j325J256Q88j588
2673b97n5p1J266j358J111m6j082J027j194O41l44rn5O05n49M19m1j26P6l51j9
2694d52L52J11P9q11N32R84n99j8j44N26n95M71J11k5m43R77m38K58l71o39K24
2715I0k52K10M64L24p04m74O8J491j373J187n83n12O84pk10l43L78J05l91o59
2735e07N66k44J52l13l69N63M6M00o18K55j68k35J67J194q75l72j83k3K22M57
$$ plain form
2755 115 -922 -251 289 90 447 -473 63 -1143 209 -200 215 376 -185 -221 -920 -136 -327 280 437
2774 437 -112 -308 149 32 591 693 -560 -322 719 -951 -447 -371 194 916 -568 -298 185 350 364
2793 364 -390 -283 602 -323 -463 51 -467 -361 -322 -597 -152 -14 -35 556 -560 -100 200 464 69 -362
2813 -362 -525 -436 -364 -701 606 38 1091 1156 -483 5 -687 728 6 -553 -259 609 -214 84 83 770
2833 770 41 947 203 257 -284 -126 -305 -95 -1059 -321 593 -458 -96 659 -791 920 367 555 1174
2852 1174 437 304 -69 -827 610 329 337 899 331 984 282 693 -139 318 -133 -224 -592 -108 -509 -85
2872 -85 245 -269 -204 1032 740 26 927 308 581 -102 -162 446 -549 -340 -231 429 -10 224 98 -297 -1006
2893 -1006 -117 -715 -248 -318 31 -387 -569 -532 -633 -786 274 -235 384 315 -374 -165 -93 -188 422 118 -78
$$ packed form
2755A15j037O71N40j99L57r20N36j206J352m09M15J61n61l6o99P84j91O07J57
2774D37n49j96M57j17N59J02j253K38J041j670N04P6N65P22j484K70M83J65J4
2793C64p54J07Q85r25j40N14n18J06L9k75M45J38k1N91j116M60L00K64l95m31
2813c62j63Q9P2l37J307n68J053O5j639M88o92J415p22n59K94Q68q23K98jO87
2833G70p29R06p44N4n41J58j79K10r64P38R14j051L62P55j450J711n53J88O19
2852A174p37j33l73p58J437k81QN62n68O53p02M11q32M57m51r1l68M84m01M24
2872h5L30n14O5J236k92p14R01o19K73o83o0O08r95K09J09O60m39K34j26l95p09
2893a006Q89n98M67p0L49m18j82L7j01j53J060n09O19o9o89K09P2r5O10l04j96
$$ plain form
2914 -78 -8 -244 -375 588 301 597 88 -52 89 139 824 -950 348 -169 40 -109 326 -535 838 801
2934 801 28 13 -832 16 -1389 -972 -766 -706 -372 21 -605 126 -64 -779 169 -108 -279 517 397 -869
2954 -869 -391 -157 -133 358 -7 -379 124 507 506 670 -37 685 968 -206 -541 -52 -266 266 486 128 -324
2975 -324 -131 -181 657 -207 -13 682 100 282 -330 -712 423 902 503 -166 262 207 -198 391 -94 33
2995 33 -758 -208 843 377 253 -135 677 237 910 907 44 206 562 -54 86 -794 1050 -107 -416 279
3015 279 837 718 326 742 -11 -257 379 -289 -339 -112 -221 -682 915 -232 -483 -132 -500 52 -774 36
3035 36 -295 13 -536 50 -121 174 85 -379 621 -131 -352 -146 -537 8 -9 -188 366 -238 -133 -315 1061
3056 1061 248 -563 628 -221 235 -495 652 292 78 681 -116 917 1358 -521 266 -863 -962 19
$$ packed form
2914g8P0k36j31R63k87K96n09j40J41N0O85j774J298n17K09j49M35q61J373l7
2934H01p73j5q45Q48j405M17K06O0L34L93o26P31j90p15R48k77j71P96j20j266
2954h69M78K34K4M91l65l72N03L83jJ64p07P22K83j174l35M89k14N32K20l58m52
2975c24J93n0Q38q64J94O95n82J82o12l82J135M79l99o69M28n5m05N89m85J27
2995C3p91N50J051m66j24l88Q12m40O73lq63J62L56o16J40q80J844j157l09O95
3015B79N58j19l92M16p53k46O36o68n0K27j09m61J597j147k51L51l68N52q26Q10
3035C6l31L08n49N86j71K95q9m64J000p52k21K06l91N45j7j79N54o04J05j82J376
3056A061q13q11J191q49M56p30J147l60k14O03p97J033M41j879P87j129r9R81
$$ plain form
3074 19 -431 501 -96 -95 21 -816 628 936 -122 -433 280 691 -463 708 -162 301 92 111 246 -488
3094 -488 686 -722 219 -96 15 843 -575 460 40 441 -395 1117 12 699 -284 0 242 -174
3112 -174 829 -40 213 146 900 185 -137 -62 -57 143 364 387 -644 -411 -1471 -482 -416 -351 -458 -966 -847
3133 -847 309 -263 221 -140 -84 -331 -482 -297 329 26 -1020 -565 553 -137 1038 917 140 -400 593
3152 593 -726 -485 -283 -178 567 -340 1244 -147 -870 81 533 396 144 -256 -321 -297 313 541 522 972
3172 972 394 -610 -326 -74 -968 -357 -1518 -409 723 220 88 -453 -355 1606 592 59 15 -311 477
3191 477 -211 361 -188 641 -74 706 285 682 -19 -371 53 -298 133 19 373 214 -48 466 501 -303
3211 -303 -956 -332 431 -33 -842 519 755 -591 -827 739 -1039 49 -733 -58 -265 156 -8 1188
$$ packed form
3074A9m50R32n97JJ16q37J444L08j058l11P13M11j154J171q70M63k09J9J35p34
3094d88J174j408R41l15J11Q28j418J035m20M01q36J512j105O87r83K84K42m16
3112a74J003q69K53o7P54p15l22P5NK00K21K3j031K33j060R89O6O5j07n08J19
3133h47J156n72M84l61N6k47j51J85O26l03j046M55J118o90J175j21p77n40R93
3152E93j319K41K02J05P45r07J584j391p23R51M52j37k52m00o5K4O10K28j9M50
3172I72n78j004K84K52q94O11j161J109J132n03j32n41R8J961j014n33m4l26P88
3191D77o88N72n49Q29p15P80m21L97p01l52M24l51M31j14L54j59k62N14L5q04
3211c03o53O24P63m64q09J361K36j346k36J566j778J088p82O75k07M21j64J196
$$ plain form
3229 1188 252 478 74 184 -118 -937 176 -227 -380 218 548 305 -477 746 -197 -407 303 -858 -189
3248 -189 55 505 -830 59 -648 -153 560 -341 596 -414 -99 460 -620 980 48 -495 -912 280
3266 280 33 -40 203 809 30 -469 132 -1044 -16 461 -1252 -972 1001 217 -722 -324 725 -209 816
3285 816 485 455 38 243 350 -74 -55 -1 -166 906 -519 -104 5 -542 -204 -740 -155 154 114 408 38
3306 38 25 -529 -835 -172 -4 380 -132 -1472 -58 498 22 69 -616 5 41 -690 -1336 -932 -499 114 292
3327 292 -67 -151 629 621 -673 -286 325 -457 402 -247 -475 -743 -346 662 -379 6 -607 372 361 -386
3347 -386 -317 -436 -523 -685 461 344 -480 600 1077 -162 -547 -241 315 81 -363 212 1090 1319 761 84
3367 84 -754 300 201 -1344 -360 -801 231 314 1242 9 -305 -467 506 -1 -393 -577 -254 -646 467
$$ packed form
3229A188r36K26m04J10l02q19J113m03j53N98L30k43p82J223r43k10P10j161O69
3248a89K44M50j335Q89p07M95P13r01R37j010L15N59j080J600r32n43m17J192
3266B80k47p3K43O06p79m99O01j176J028M77j713K80J973p84r39L98J049r34J025
3285H16l31l0m17K05J07m24J9N4j65J072j425M15J09n47L38n36N85L09m0K94l70
3306C8j3n54l06O63J68L84n12j340J414N56m76M7o85O21L6p31o46M04M33O13J78
3327B92l59q4P80qj294L87O11p82Q59o49k28k68L97J008j041L85o13R79j1p47
3347c86O9j19q7j62J146j17q24J080M77j239l85L06N56k34m44N75Q78K29n58o77
3367H4q38J054r9j545R84m41J032Q3R28j233l14j62R73n07l92j84L23l92J113
$$ plain form
3386 467 -536 -49 -467 304 -147 -25 -793 391 419 -586 -870 -15 781 -539 -115 89 -179 775 -496
3405 -496 -239 693 -442 535 187 570 261 282 -126 -42 -23 -465 -278 -249 -204 345 -274 -407 111 -670 145
3426 145 -331 -1441 147 221 297 -926 -980 873 -1163 333 -176 -496 1048 567 77 131 614 -189 22
3445 22 565 -641 -1129 -267 -347 20 -538 4 787 -1095 -287 113 -685 -291 -24 -366 -387 299 -229 -226 -235 -515
3467 -515 -550 -22 -281 -259 310 -358 -627 1062 230 500 232 66 -337 849 9 -549 -1066 -261 -109 0
3487 0 511 -58 -451 134 -78 -183 205 -195 -133 -627 -811 -304 821 847 523 344 -36 509 -175 795 -40
3508 -40 -1148 552 -505 -513 7 -412 -948 -61 125 1231 68 -442 -502 -917 -357 -291 150 -213 -542 -433
3528 -433 359 255 -796 811 590 691 132 -287 118 -508 -196 -345 379 -485 -373 -480 -393 -871 -640 -1271
$$ packed form
3386D67j003M87m18P71m51J22p68J184K8j005k84Q55P96j320M24K04k68R54j271
3405d96K57R32j135R77l48L83l09K1m08Q4J9m42J87K9M5N49o19j33N18p81Q15
3426A45m76j110J588P4P6j223n4J853k036J496n09l20J544m81m90N4M83q03K11
3445B2N43j206m88Q62q0L67n58N42P83j882Q08M00p98L94K67l42k1O86n28Lrk80
3467e15l5N28k59K2N69o68k69J689q32K70k68j66m03J186q40n58n17Q05J52J09
3487@N11n69l93N85k12j05L88m00O2m94j84N07J125K6l24j79l80N45o84R70q35
3508d0j108J700j057qN20m19n36Q87J86J106j163n10o0m15N60O6M41l63l29J09
3528d33P92j04j051J607k21J01n59m19M05o26L12j49P24q64J12j07Q7m78K31o31
$$ plain form
3548 -1271 521 -28 115 875 -828 408 -287 284 -829 464 -1089 3 353 -468 -116 -385 -14
3565 -14 199 1630 276 382 624 413 920 -46 1144 -689 78 374 -583 440 314 212 -290 136 -225
3584 -225 605 -365 1142 1066 186 863 379 -125 172 -231 -120 173 -780 -460 -87 536 -110 380 539 419
3604 419 182 546 128 -696 -1493 -38 894 47 -338 -656 -512 90 160 -88 -700 268 751 458 381 -481
3624 -481 394 -135 116 117 -846 -540 1146 -36 253 733 -741 763 -232 -1221 -53 49 -229 515 -63
3643 -63 757 642 144 99 208 237 -571 40 -468 -1141 -1124 1692 755 72 -1172 296 -14 585 832 -314
3663 -314 -253 133 -145 -172 -1111 -724 52 273 260 -759 -209 -614 -837 -315 -1024 649 -522 -308 109 93
3683 93 -996 405 -140 812 -732 -90 -432 1700 -9 -345 1438 -1154 -117 449 -674 -891 -28
$$ packed form
3548a271J792n49J43P60j703J236o95N71j113J293j553J092L50q21L52k69L71
3565a4K13J431j354J06K42k11N07r66J190j833P67K96r57J023j26j02n02M26l61
3584b25Q30r70J507p6q80O77m84n04K97m03J11K93r53L20L73O23o46M90J59j20
3604D19k37L64m18q24p97J455R32q47l85l18J44O02P0k48o12R68M83k93p7q62
3624d81Q75n29K51Jr63L06J686j182K89M80j474J504r95r89J168J02k78P44n78
3643f3Q20j15m98m5J09K9q08O11n08o73J7K816r37o83j244J468l10N99K47j146
3663c14O1L86k78k7r39L87P76K21j3j019N50m05k23N22p09J673j171K14M17j6
3683I3j089J401n45R52j544O42l42K132j709l36J783k592J037N66j123k17Q63
$$ plain form
3700 -28 -1289 229 -145 -296 -509 121 1517 418 688 -284 135 280 287 -493 111 -318 404 -129 284 43
3720 43 -344 -407 1283 -217 -15 -61 -21 254 -656 -124 -774 987 -127 611 1247 -217 34 -346 141 -683
3740 -683 -652 26 866 -424 -66 -356 179 -46 -297 -173 -166 825 -539 -226 -96 -644 -503 326 890 -276
3760 -276 -698 -432 555 -18 715 259 -100 -128 574 266 -132 46 -33 -1009 -439 405 234 738 -262 -142
3780 -142 -64 -399 842 -702 -601 -483 520 138 -683 19 -77 -417 1038 -934 -2 427 -955 814
3798 814 -249 801 366 128 1 -240 126 232 303 265 -102 -280 -626 -704 -661 -198 470 425 278 -124 504
3819 504 -531 -319 -220 141 -246 621 754 647 587 365 68 11 413 -358 89 -275 -1058 -708 903 -418
3839 -418 44 939 1084 -1029 38 538 111 373 -1103 26 985 -892 -234 338 159 -214 1158 619
$$ packed form
3700b8j261J518l74j51k13O30J396j099K70r72M19J45Pp80O04m29P22n33M13k41
3720D3l87o3J690j500K02m6M0K75r10N32o50J761j114P38O36j464K51l80M87q24
3740f83L1O78Q40j290L58k90N35k25k51J24PR91j364L13J30n48J41Q29N64j166
3760b76m22K66R87n73P33m56l59k8P02l08l98J78p9r76N70Q44j71N04j000J20
3780a42P8l35J241j544J01J18J003l82q21P02r6l40J455j972R32M29j382J769
3798H14j063J050m35k38j27k41L66J06P1l8l67j78l46p8M3M63O68m5j47m02O28
3819E04j035K12R9L61l87Q67J33j07o0k22k97n7M02p71M47l64p83L50J611j321
3839d18M62Q95J45k113J067N00m27K62j476J129R59j877O58N72j79l73J372n39
$$ plain form
3857 619 790 426 48 639 1015 -92 -379 -354 -113 -74 -340 904 429 -323 -124 883 28 323 -321 -828
3877 -828 6 -40 -501 -662 468 -557 -156 1048 369 -994 34 -15 111 -1 458 381 584 504 -562
3896 -562 98 -74 -926 -768 550 95 424 -91 840 -670 4 186 61 -46 248 514 -292 -898 -161
3915 -161 -926 379 -1001 425 -115 -258 -391 -388 193 -712 331 42 224 178 -951 356 399 217 87
3934 87 -410 -770 198 -427 -895 1013 -470 -158 -287 584 448 49 -241 101 27 1088 80 365 -584
3953 -584 -343 -188 339 -527 115 379 -372 123 -268 -151 135 941 79 -70 366 -397 15 -194 -382 -483
3973 -483 -153 -221 189 1003 -1019 -1 384 457 28 2 -760 105 172 33 -217 -638 -361 514 346 1238 -72
3994 -72 -435 434 -373 81 -602 -529 -743 283 -491 809 -593 10 -213 -1121 -228 219 159 463 -623 -172
$$ packed form
3857F19J71l64l78N91L76j107k87K5K41L9k66J244m75p52J99J007q55K95o44n07
3877h28Q34m6m61j61J130j025M01J204o79j363J028m9J26j12M59p7K03q0j066
3896e62O60j72q52J58J318m55L29n15R31j510O74J82j25j07K94K66q06o06P37
3915a61p65J305j380J426n40j43j33LN81r05J043k89J82m6j129J307M3j82j30
3934H7m97l60R68o25m68J908j483L12j29Q71j36l99k90L42p4J061j008K85r49
3953e84K41J55N27q66O42K64p51M95l91J17K86Q06q62j49M36p63M12k09j88j01
3973d83L30o8M10Q14k022J018L85P3m29k6p62Q65O7j39k50m21K77Q75j68Q92j310
3994g2l63Q69q07M54o83P3k14J026p74J300j402O03k23r08Q93M47o0L04j086M51
$$ plain form
4014 -172 -771 -408 452 133 -1098 571 -210 -219 745 -407 -640 -137 223 -192 -671 545 -314 536 305
4033 305 -24 -323 730 -158 303 -158 769 -547 -496 192 -854 -252 330 -550 679 -332 225 77 -904
4052 -904 -343 -452 8 535 -123 -319 157 -139 -962 -167 432 150 756 1243 95 106 -398 1064 538 -23
4072 -23 -214 -910 -99 362 -28 271 -1116 336 619 -415 -1415 375 585 616 69 -345 -740 435 620
4091 620 313 274 -192 295 357 -266 -400 -77 -80 420 218 280 139 -762 26 -702 -343 -339 622 396 35 -684
4113 -684 -156 -8 911 152 599 -192 459 179 71 -159 -1161 -860 352 904 43 475 -310 136 -181
4132 -181 -96 45 34 -274 -111 242 547 -166 18 -466 -462 255 219 -603 -693 -215 -377 -551 -144 -603 -120 -27
4154 -27 -147 -19 42 160 870 803 579 -74 51 -549 -52 -625 540 -676 -58 207 498 -55 487 -1326
$$ packed form
4014a72n99L63Q60l19j231J669p81rR64j152k33N03L60m15m79J216q59Q50k31
4033C05l29k99J053q88M61m61R27j316N1O88j046O02N82q80J229j011N57j48r81
4052i04N61j09M60N27o58j96M76k96q23P95N99k82O06M87j148J1n04J462n26n61
4072b3j91o96Q11M61l90K99j387J452K83j034j000J790K10L1n47m14l95J175J85
4091F20l07l9m66M87O2o23j34L23lN00k02O2j41r01P88p28L59MR61k26l61p19
4113f84N28J48R19p59M47p91O51k80j08k30j002L01J212N52q61M32p85M46l17
4132a81Q5J41j1l08J63L53L05p13J84m84MP17l6q22r0M78j62j74M07m59M83R3
4154b7j20J28O1J18P10o7k24o53J25o00M97n73J165j216O18K65K91n53N42j813
$$ plain form
4174 -1326 -200 -79 -1221 -1088 -161 -855 650 -1021 -236 528 498 1167 263 -785 740 -1043 42
4191 42 -829 1551 1365 -7 1376 537 1050 319 196 -45 -150 -17 32 -380 -320 -485 -26 583 -123 -464
4211 -464 -234 -1615 -879 -808 -75 932 -165 -383 -181 -175 -247 -45 -34 -37 132 -974 109 -106 247 -8 -133
4232 -133 147 -813 -257 -744 -388 -344 -471 -162 -236 17 355 199 -530 -297 180 50 -55 87 810 168 25
4253 25 440 372 409 -702 -86 36 -450 25 1367 642 35 414 -1025 71 282 -368 -506 831 -232
4272 -232 -568 208 -395 956 365 -714 1322 -857 143 -499 -1114 -477 19 551 130 234 -600 184
4290 184 254 -138 129 241 -335 8 373 -400 -342 309 -403 -71 -211 -691 -748 326 -607 671 50 1294
4310 1294 -349 -959 -557 -542 -260 1610 -407 -574 226 -620 -718 -838 -266 0 229 -699 -218 -970 351
$$ packed form
4174a326J126J21j142J33R27o94J505j671P85P64l0O69r04j048J525j783J085
4191D2q71K380j86j372J383q39N13p31j23k41j05J33M9m12O0j65M59O09p06l41
4211d64K30j381P36P1P33J007j097k18K02Op2K02J1lJ69j106J083k15L53k55j25
4232a33K80r60N56m87L56M4j27L09p4K53L38j56p29K33M77j30j05J42P23o42j43
4253B5M15o8L7j111O16J22m86M75J342p25o07L79j439J096K11o50j38J337j063
4272b32l36P76o03J351n91j079K036k179J000o42o15O37M96N32m21J04q34P84
4290A84P0l92K67J12n76L43L65p73N8O51p12L32j40m80n7J074r33J278o21J244
4310A294j643o10M02J5K82J870k017j67Q00q46r8j20N72K66K29r28M81p52J321
$$ plain form
4329 351 369 -349 20 -451 -490 -182 139 -145 -240 -64 13 -221 -223 36 -541 -591 -439 -593 43 985 402 179
4351 179 103 267 31 -234 -403 -393 -458 -366 -233 -255 -21 70 -247 -692 628 154 -867 -518 275 233 -112 32
4373 32 -891 969 -146 442 692 269 -565 -133 -593 1263 -646 313 -466 -421 416 501 950 -298 170
4392 170 18 -771 908 -296 688 806 -433 245 176 93 -319 -61 -303 -498 -364 150 113 -518 746 317
4412 317 -244 484 -212 -347 -174 494 1475 337 -778 132 529 -179 422 57 -739 961 754 459 -31
4431 -31 -337 113 180 67 -67 595 802 -261 -566 729 602 -148 -1233 -955 351 90 -496 -268 -243 21
4451 21 -283 846 -239 -976 313 -231 364 -278 -728 -170 43 543 650 58 -68 738 388 -106 -81 21
4471 21 298 88 -19 -1136 -249 373 -33 82 -150 427 -513 -252 208 170 291 -427 82 3 -672 178 1118
$$ packed form
4329C51J8p18L69m71l9L08L21k84r5J76P7k34kK59n77n0J52j54O36R42n83k23
4351A79p6J64k36k65j69J0o5R2J33k2K34R1l17m45J320m74j021L49P93m2l45J44
4373C2r23J860j115N88K50m23q34M32m60J856j909R59p79M5Q37Q5M49j248M68
4392A70j52p89J679j204R84J18j239O78o9q3m12K58k42j95J34N14l7o31J264m29
4412C17n61P28o96j35J73O68R81j138j115R10L97p08O01l65p96J700k07k95m90
4431c1l06M50O7j13j34O62K07j063l05J295j27p50j085K78J306k61n86K28K5K64
4451B1l04J129j085p37J289n44N95o42m50N58K13N00J07n92j26Q06l50m94K5J02
4471B1K77k10j07j117Q87O22m06J15k32N77r40K61M60l8J21p18N09p9o75Q50R40
$$ plain form
4492 1118 569 -255 -647 962 -91 50 -1216 345 474 1503 43 -400 851 350 253 289 669 -347
4510 -347 -247 -48 -654 260 -365 20 -522 -160 -664 -121 -170 -100 195 380 -7 350 90 -8 213 -795 314
4531 314 -39 297 -648 290 663 -522 -377 -94 9 907 526 -191 -888 -185 -107 815 -1218 458 -51
4550 -51 -6 -322 -70 -327 -628 849 814 -569 -327 -685 240 -493 332 223 -623 -995 -275 129 -483 -431 429
4571 429 46 213 -697 -354 -302 -534 321 13 -3 -89 403 -318 -556 887 604 -311 -277 -424 -88 677 622
4592 622 672 49 -981 -234 -438 -94 555 444 -314 -268 64 -198 36 -276 27 266 -413 -72 -251 661
4612 661 -197 1386 365 563 387 -969 237 365 -762 -210 -264 210 254 1020 -316 336 -687 226
4630 226 -174 -179 750 852 -471 -261 413 -65 223 843 -2 489 1348 186 590 150 -1000 1095 -909
$$ packed form
4492A118n49q24l92J609j053J41j266J561J29J029j460m43J251n01r7L6L80j016
4510c47J00J99o06R14o25L85n42L62n04N43m9P0K95J85l87L57k60r8K21j008J109
4531C14l53L36r45R38L73j185J45K83J03Q98l81p17o97P03P8R22k033J676n09
4550e1M5l16K52k57l01J477l5j383K42l58R25p33Q25j09q46l72P20M04o12N2Q60
4571D29l83J67r10L43N2k32Q55l08j6q6M92p21k38J443k83r15L4j47L36P65n5
4592F22N0o23j030P47k04L44O49j11p58M6L32k62K34l12L03K39o79L41j79R12
4612F61q58J583j021J98j76j356J206J28j127N52n4M74M4P66j336O52j023R13
4630B26m00nR29J02j323K10O74m78K88O20q45M91Q59j162M04m40j150K095k004
$$ plain form
4649 -909 -565 289 409 87 -626 30 285 931 428 -239 -404 559 -176 1254 -1073 -131 -72 -449 -240 -330
4669 -330 -118 1054 113 146 -1281 -602 -32 -114 468 455 -519 -144 -130 868 405 231 408 78 -275 393 81
4690 81 702 -288 -339 2 -4 780 -482 432 208 59 266 682 476 232 545 -1026 232 104 -144 194
4710 194 517 382 547 378 -1083 -1645 13 606 569 54 -759 -215 -388 54 49 -18 21 46 -102 -135 -189 821
4732 821 931 382 -411 7 1327 -257 469 -982 -148 -750 40 62 1101 749 -298 445 -329 -83 553
4751 553 -317 131 -402 -547 -287 109 -32 -458 349 52 174 586 885 180 16 -178 809 -303 1024
4770 1024 -458 436 -421 465 -730 41 170 -544 1071 600 169 240 294 200 154 788 -69 -324 58 -596
4790 -596 -232 -446 115 -156 -177 -700 -1532 -1097 138 83 -1093 -390 628 129 958 23 969 362 -144 328
$$ packed form
4649i09L44Q54J20l22p13O56K55O46n03o67j65R63p35J430k327R42N9l77K09r0
4669c30K12J172r41L3j427O79N70q2N82j3r74L75J4R98m63j74J77l30l53O68l12
4690H1O21r90n1L41oP84j262R14k24j49K07M16k06k44L13j571J258j28k48L38
4710A94L23j35J65j69j461n62J658N93l7n15q13N44j73M42no7L9K5j48l3n4J010
4732H21J10n49p93M18J320j584P26j451Q34o02P90K2J039l52j047P43p74K46O36
4751E53q70M48n33j45K60L96j41m26Q07k97J22M12K99p05j64j94R87j112J327
4770A024j482Q94q57Q86j195P71J29p14J615m71m31P1N4r4m6O34q57k55L82o54
4790e96L64k14N61k71k1n23q32M35J235n5j176P03J018m99Q29r35R46o07n06M72
$$ plain form
4810 328 234 -1407 -316 -996 -420 -108 -1205 -137 -288 -484 -605 -1103 685 126 749 793 421 453 198
4829 198 -52 -182 723 -368 167 -284 199 -417 160 -358 -199 102 39 327 -148 93 -1 -534 505 -277
4849 -277 258 670 -722 458 64 693 -11 -1169 -371 166 -107 106 298 -487 -44 -676 -1099 480 901
4868 901 -464 -222 121 999 404 261 945 -803 -412 -64 651 738 -9 -450 -575 -1279 -687 47 -269 -155
4888 -155 -557 -360 -1005 -235 -317 -227 765 -588 -864 -299 187 -204 135 -112 89 313 -243 8 516 351
4908 351 -820 622 57 -398 -570 -173 -803 -396 155 -133 413 132 -351 -1146 39 492 -65 386 68
4927 68 -731 49 -843 186 -1293 -24 374 -650 -604 1303 1000 128 472 529 330 62 659 19 -222
4946 -222 -106 -103 -27 -115 403 179 874 411 274 -185 -609 -224 265 -9 -275 -46 708 107 390 -662 73
$$ packed form
4810C28r4j641J091o80N76L12j097J068j51j96j21m98J788n59O23M4l72L2k55
4829A98k50j30R05j091N35m51M83o16N77n18J59L01o3K88m75K41r4n33J039p82
4849b77N35M12j392J180l94O29p04j158P98N37k73K13J92p85M43o32m23J579M21
4868I01j365K42L43Q78n95j43O84j748L91L48P15Q7p47m41j25p04N92P34l16J14
4888a55m02J97o45P70q2R0R92j353k76N65M86l91L39k47K01K24n56K51N08j65
4908C51j171J442n65m55j72L97o30M07N51k88N46k81m83p95J185M53n57M51l18
4927F8p99P80q92J029j479J269L98j024M6J907l03q72L44N7j99k68N97o40k41
4946b22J16LP6q8N18k24O95m63j37m59m24L85M89k74k66K29P54o01K83j052P35
$$ plain form
4967 73 -7 -107 -335 513 -777 394 -315 105 819 729 -172 341 130 -767 -135 -259 -421 192 -648 38
4987 38 -731 -108 162 802 340 355 97 -101 316 -948 -611 22 719 132 -137 819 -1626 -271 901
5006 901 -693 33 -300 219 318 -195 88 -61 -209 403 -467 282 231 471 63 591 -467 -427 100 -241
5026 -241 274 -25 -369 333 -815 -993 -123 5 275 929 -302 -620 517 -396 -358 291 1102 -661 451
5045 451 93 198 386 -188 -427 304 822 -831 -209 -544 195 198 10 -286 147 502 -430 -792 1018 711
5065 711 -254 -870 465 257 -442 599 112 -610 -630 349 853 304 839 828 -35 -1152 -804 -643 207 132
5085 132 -811 -691 -728 351 100 -265 99 227 1010 -367 -156 -450 -17 42 48 -428 -1184 1270 -574 -76
5105 -76 273 -307 645 102 1106 -279 -394 -1472 -214 363 266 -740 255 1210 -77 65 1160 -375
$$ packed form
4967G3q0j00k28Q48j290J171p09M20P14r0r01N13k11q97O32j24j62O13q40O86
4987C8p69O23K70O40m62J5k58j98M17j264L37O33O97n87k69R56k445J355J172
5006I01j594P26l33N19R9n13K83j49j48O12q70P49n1K40m08N28j058M0N27l41
5026b41N15k99l44P02j148j78Q70J28K70O54j231l18J137r13L8O49Q11j763J112
5045D51l58J05J88n74k39P31N18j653O22l35P39Lj88k96M33L55r32l62J810l07
5065G11r65o16J335k08o99J041m87p22k0R79N04n49N35j1q63j117L48J61Q50p5
5085A32r43J20l7J079k51l65L64J28P83j377K11k94M33N9Om76p56K454j844M98
5105g6L49n80R52n43J004j385j15j078J258N77r7j006R95R55j287J42J095j535
$$ plain form
5123 -375 -268 -82 -70 459 -35 -71 419 1214 93 577 8 107 710 -245 -578 -363 394 -907 -710 508
5143 508 873 -281 71 -16 -37 211 -615 -1331 69 792 74 -252 709 -988 129 782 -202 -431 59
5162 59 144 -99 406 -142 -638 -392 -289 -342 -284 330 867 518 -805 986 -780 258 -45 100 282 251
5182 251 176 250 -109 -199 -1014 -1024 -103 -31 588 507 -403 -180 -307 -493 -405 -835 632 251 -419 70 248 -141
5204 -141 -852 -127 43 -201 -530 120 -508 -266 14 -223 455 -1102 -455 -15 308 181 -190 -106 -255 -389
5224 -389 568 614 -18 35 196 855 -192 -796 -309 -674 569 -938 -266 26 514 -304 -879 82 353 152
5244 152 -100 -468 555 -686 79 89 -182 -750 -460 85 66 -408 535 -647 -246 115 -315 299 -617 -571
5264 -571 468 543 136 376 -185 -274 -931 513 -828 185 -530 397 183 64 -312 -260 510 -507 -287
$$ packed form
5123c75J07J86J2N29m94l6M90P95j121M84n69R9O03r55l33K15P57j301J97J218
5143E08L65j154L52q7k1K48q26p16J400P23p18l26R61j697J117O53r84k29M90
5162E9Q5k43N05n48m96K46J03n3N8O14N37l49j323J791j766J038l03J45J82l1
5182B51p5P4l59r0q15j0R21P2O19q1r10K23j27j86Q8m30J467l81o70M89J78l89
5204a41p11P25J70k44l29O50o28K42K80k37O78j557O47M40L23j27l71Q4j49j34
5224c89R57M6o32N3J61O59j047o04M87l65J243j507O72K92M88q18n75R61K71k01
5244A52k52l68J023j241P65J0k71n68K90N45j9m74R43j182M01L61m30O14r16M6
5264e71J039P5m07K40n61q9o57J444j341J013p15R27k14j19l76N2P70j017K20
$$ [...]
8191f77
##END NTUPLES=NMR FID
##END=
