##TITLE=1H_SAM_30.248
 THF,108 sc, 
 24.9.2021
##JCAMPDX= 6.0         $$ Bruker NMR JCAMP-DX V2.0
##DATA TYPE= NMR FID
##DATA CLASS= NTUPLES
##ORIGIN= UXNMR, Bruker Analytische Messtechnik GmbH
##OWNER= root
$$ XWIN-NMR		Version 3.5
$$ Fri Sep 24 12:55:27 2021 Russian Standard Time (UT+4h)  she@DPX200
##.OBSERVE FREQUENCY= 200.1314
##.OBSERVE NUCLEUS= ^1H
##.DELAY= (6, 6)
##.ACQUISITION MODE= SIMULTANEOUS
##.ACQUISITION SCHEME= undefined
##.AVERAGES= 108
##.DIGITISER RES= 18
##SPECTROMETER/DATA SYSTEM= spect
##.PULSE SEQUENCE= zg30
##.SOLVENT NAME= THF
##.SHIFT REFERENCE= (INTERNAL, THF, 0, 15.7039)
##AUDIT TRAIL= $$ (NUMBER, WHEN, WHO, WHERE, WHAT)
$$ ##TITLE= Audit trail, XWIN-NMR		Version 3.5
$$ ##JCAMPDX= 5.01
$$ ##ORIGIN= Bruker BioSpin GmbH
$$ ##OWNER= she
$$ F:/spectra/data/she/nmr/H-F/1/audita.txt
$$ ##AUDIT TRAIL=  $$ (NUMBER, WHEN, WHO, WHERE, WHAT)
(   1,<2021-09-24 12:54:19.62 +0400>,<she>,<DPX200>,
      <continue with go, POWCHK disabled, PULCHK disabled
       configuration hash MD5:
       00 E9 B6 7A A2 85 ED C7 34 08 36 98 17 FE 4E 26
       data hash MD5: 16K
       E2 CF 04 DA 6B 81 2F 80 6F 3F B8 27 7D C7 4F F6>)
$$ ##END=
$$ 
$$ hash MD5
$$ 35 63 48 43 DB FF D3 D0 B5 95 C3 18 F7 2F 95 BC
##$RELAX= 
##$RELAX= 
##$RELAX= 
##$RELAX= 
##$RELAX= 
##$RELAX= 
$$ Bruker specific parameters
$$ --------------------------
##$DU= <F:/spectra>
##$EXPNO= 1
##$NAME= <H-F>
##$PROCNO= 1
##$TYPE= <nmr>
##$USER= <she>
##$AMP= (0..31)
100 100 100 100 100 100 100 100 100 100 100 100 100 100 100 100 100 100 
100 100 100 100 100 100 100 100 100 100 100 100 100 100 
##$AQSEQ= 0
##$AQ_mod= 1
##$AUNM= <au_zg>
##$AUTOPOS= <>
##$BF1= 200.13
##$BF2= 200.13
##$BF3= 200.13
##$BF4= 200.13
##$BF5= 200.13
##$BF6= 200.13
##$BF7= 200.13
##$BF8= 200.13
##$BYTORDA= 1
##$CFDGTYP= 0
##$CFRGTYP= 5
##$CHEMSTR= <none>
##$CNST= (0..31)
1 1 145 1 1 1 1 1 1 1 1 1 1 1 1 1 1 1 1 1 1 1 1 1 1 1 1 1 1 1 1 1 
##$CPDPRG= <>
##$CPDPRG1= <>
##$CPDPRG2= <>
##$CPDPRG3= <>
##$CPDPRG4= <mlev>
##$CPDPRG5= <mlev>
##$CPDPRG6= <mlev>
##$CPDPRG7= <mlev>
##$CPDPRG8= <mlev>
##$CPDPRGB= <>
##$CPDPRGT= <>
##$D= (0..31)
0 1.2 0 0 0 0 0 0 0 0.06 0 0.03 0 0 0 0 0.0002 0 0 0 0 0 0 0 0 0 0 0 0 
0 0 0 
##$DATE= 1632473280
##$DBL= (0..7)
120 120 120 120 120 120 120 120 
##$DBP= (0..7)
150 150 150 150 150 150 150 150 
##$DBP07= 0
##$DBPNAM0= <>
##$DBPNAM1= <>
##$DBPNAM2= <>
##$DBPNAM3= <>
##$DBPNAM4= <>
##$DBPNAM5= <>
##$DBPNAM6= <>
##$DBPNAM7= <>
##$DBPOAL= (0..7)
0.5 0.5 0.5 0.5 0.5 0.5 0.5 0.5 
##$DBPOFFS= (0..7)
0 0 0 0 0 0 0 0 
##$DE= 6
##$DECBNUC= <off>
##$DECIM= 32
##$DECNUC= <off>
##$DECSTAT= 4
##$DIGMOD= 1
##$DIGTYP= 9
##$DL= (0..7)
0 120 120 120 120 120 120 120 
##$DP= (0..7)
150 150 150 150 150 150 150 150 
##$DP07= 0
##$DPNAME0= <>
##$DPNAME1= <>
##$DPNAME2= <>
##$DPNAME3= <>
##$DPNAME4= <>
##$DPNAME5= <>
##$DPNAME6= <>
##$DPNAME7= <>
##$DPOAL= (0..7)
0.5 0.5 0.5 0.5 0.5 0.5 0.5 0.5 
##$DPOFFS= (0..7)
0 0 0 0 0 0 0 0 
##$DQDMODE= 0
##$DR= 18
##$DS= 0
##$DSLIST= <SSSSSSSSSSSSSSS>
$$ [...]
##$SUBNAM2= <"">
##$SUBNAM3= <"">
##$SUBNAM4= <"">
##$SUBNAM5= <"">
##$SUBNAM6= <"">
##$SUBNAM7= <"">
##$SUBNAM8= <"">
##$SUBNAM9= <"">
##$SW= 20.0188988654967
##$SWIBOX= (0..15)
0 0 2 0 0 0 0 0 0 0 0 0 0 0 0 0 
##$SW_h= 4006.41025641026
##$TD= 16384
##$TD0= 1
##$TE= 0
##$TE2= 300
##$TE3= 300
##$TEG= 300
##$TL= (0..7)
0 120 120 120 120 120 120 120 
##$TP= (0..7)
150 150 150 150 150 150 150 150 
##$TP07= 0
##$TPNAME0= <>
##$TPNAME1= <>
##$TPNAME2= <>
##$TPNAME3= <>
##$TPNAME4= <>
##$TPNAME5= <>
##$TPNAME6= <>
##$TPNAME7= <>
##$TPOAL= (0..7)
0.5 0.5 0.5 0.5 0.5 0.5 0.5 0.5 
##$TPOFFS= (0..7)
0 0 0 0 0 0 0 0 
##$TUNHIN= 0
##$TUNHOUT= 0
##$TUNXOUT= 0
##$USERA1= <user>
##$USERA2= <user>
##$USERA3= <user>
##$USERA4= <user>
##$USERA5= <user>
##$V9= 5
##$VALIST= <valist>
##$VCLIST= <CCCCCCCCCCCCCCC>
##$VD= 0
##$VDLIST= <DDDDDDDDDDDDDDD>
##$VPLIST= <PPPPPPPPPPPPPPP>
##$VTLIST= <TTTTTTTTTTTTTTT>
##$WBST= 1024
##$WBSW= 4
##$XGAIN= (0..3)
0 0 0 0 
##$XL= 0
##$YL= 0
##$YMAX_a= 1189662
##$YMIN_a= -1566438
##$ZGOPTNS= <>
##$ZL1= 120
##$ZL2= 120
##$ZL3= 120
##$ZL4= 120
##$ABSF1= 10
##$ABSF2= 0
##$ABSG= 5
##$ABSL= 3
##$ALPHA= 0
##$AQORDER= 0
##$ASSFAC= 0
##$ASSFACI= 0
##$ASSFACX= 0
##$ASSWID= 0
##$AUNMP= <proc_1d>
##$AZFE= 0.1
##$AZFW= 0.1
##$BCFW= 1
##$BC_mod= 2
##$BYTORDP= 1
##$COROFFS= 0
##$CY= 11.3945322036743
##$DATMOD= 1
##$DC= 2
##$DFILT= <>
##$DTYPP= 0
##$F1P= 2.36226072786647
##$F2P= -0.459571619588291
##$FCOR= 0.5
##$FTSIZE= 0
##$FT_mod= 4
##$GAMMA= 1
##$GB= 0.15
##$INTBC= 1
##$INTSCL= 1
##$ISEN= 128
##$LB= 0.24
##$LEV0= 0
##$LPBIN= 0
##$MAXI= 10000
##$MC2= 0
##$MEAN= 0
##$ME_mod= 0
##$MI= 1.114404
##$NCOEF= 0
##$NC_proc= 0
##$NLEV= 6
##$NOISF1= 3.799351
##$NOISF2= 2.8
##$NSP= 1
##$NTH_PI= 0
##$NZP= 0
##$OFFSET= 15.70392
##$PC= 1
##$PHC0= -14061.61
##$PHC1= -5.599119
##$PH_mod= 1
##$PKNL= yes
##$PPARMOD= 0
##$PSCAL= 0
##$PSIGN= 0
##$REVERSE= no
##$SF= 200.130013532006
##$SI= 16384
##$SIGF1= 3
##$SIGF2= 2
##$SINO= 400
##$SIOLD= 16384
##$SREGLST= <1H.CDCl3>
##$SSB= 0
##$STSI= 0
##$STSR= 0
##$SW_p= 3612.71676300578
##$SYMM= 0
##$S_DEV= 0
##$TDeff= 0
##$TDoff= 0
##$TI= <>
##$TILT= no
##$TM1= 0
##$TM2= 0
##$TOPLEV= 0
##$USERP1= <user>
##$USERP2= <user>
##$USERP3= <user>
##$USERP4= <user>
##$USERP5= <user>
##$WDW= 1
##$XDIM= 8192
##$YMAX_p= 0
##$YMIN_p= 0
$$ End of Bruker specific parameters
$$ ---------------------------------
##NTUPLES= NMR FID
##VAR_NAME=  TIME,          FID/REAL,        FID/IMAG
##SYMBOL=    X,             R,               I
##VAR_TYPE=  INDEPENDENT,   DEPENDENT,       DEPENDENT
##VAR_FORM=  AFFN,          ASDF,            ASDF
##VAR_DIM=   8192,          8192,            8192
##UNITS=     SECONDS,       ARBITRARY UNITS, ARBITRARY UNITS
##FACTOR=    0.0002496,     1,               1
##FIRST=     0,             0,               0
##LAST=      2.0444736,     0,               0
##MIN=       0,             -1566438,        0
##MAX=       2.0444736,     1189662,         0
$$ Real data points
##PAGE= N=1
##DATA TABLE= (X++(R..R)), XYDATA
$$ [...]
2646c17N54o7n49J028k67L96k00j147M59m46Q78n56l48R05k73K01m35L73K60j49
2666C00L70p07k2J190m04j138P6R59r91O5K85n25J111l30J41m4j77r9J51n15J464
2687A160j706k70J147J041k439J453m98m34P96j918Q54M47j85M67r12N27k8RJ396
2706I07l61K55p55N22O46j432N42k84N44j090L5O31J53k08k89k77J16J242n68
2725C29l19r31J607n97QM1p43l16Q14O30K15j01j045N73m17O68q37l65J567j184
2745d03L83K02j77n76j99Q34M48N7k03j36j225J568n13n99K39o47J476o2K52o94
2765B5R73j682J048k60K9J0M62k95o98M01J178m16l83k44j03m12m02K66Q53M58
2785H08k09o76o41O57q48J594j098J187k96n6n44P54k22j188J442r04L72p81Q52
$$ y = [-317, 237, 170, -379, 649, 382, 778, 578, -569, -110, -556, 322, -234, -582, 323, 50, 251, -184, 189, 449, 300, 670, -37, -59, 1131, 727, -411, -335, 624, -367, -302, -17, -542, 569, 239, 380, 336, 159, 60, 211, -304, 1160, -546, -816, 331, 1372, -1067, 386, -112, -546, 250, -1668, -814, -367, -552, -85, -997, -470, -498, -489, 907, 546, 801, 46, 568, 1214, -218, 324, 40, 584, -506, -471, 160, 313, 105, -184, -461, -345, 897, 329, 10, -921, 686, 89, 97, 138, -605, -921, -107, 523, 738, 637, -408, 165, -252, 416, -421, -786, 781, -403, -20, 182, 5, -571, -770, 64, 512, 569, 366, 230, -995, 573, 60, -539, -300, -947, 529, 467, 719, 25, 998, -684, 364, 104, 133, 143, 605, 310, -388, 13, 1191, 775, 392, 148, 45, -367, -769, -503, 350, 808, 599, -77, -718, -61, -909, 685, -413, 774, 478, 422, -122, 632, 410, -778, 664, -240, 132, -649, 203]
2804B03l35n6L97L80p61J102r45J48K86J17K60l4j074j54J002p17K42l90N55p43
2824e17M07J54pK03K72o29J0J118m19j062K18M46m3q72P10k24j18L42k09M8r6
2845b68m96J282j588J858j465L38j90M33Q4K62l0k70j87L62n23r78J686l77j97
2864b64k17M30m59M23Q14p06J69J86j653K244j074O50m22M97l07j411R35N35L14
2883F84q73K80k89p5K78j15n46N81l19o05K037j58p05O46k328J561P5k14j06N68
2903C77q96R40l91m18J628j557J462j308N61j83M76p95lM29M6N11m10o91O09j41
2923B46J2J12K38m0L55r84l32Q97j443P64N39N98j151O06l26q1n2O64j48k92N18
2944G00o59j53J114r76M47O3n26l56J007j123p63O96J210l28j94n11O8p53L97
$$ y = [203, -132, -188, 209, 589, -172, 930, -15, 133, 419, 536, 796, 762, -312, -466, 536, -181, 61, -329, 226, -517, -110, 44, 37, 240, 512, -117, -107, 1011, 592, -470, -252, 194, 151, -721, -11, -235, -353, -11, -220, -172, -268, -764, 518, -1070, 788, -677, -339, -529, -96, -12, 250, 220, -50, -237, 125, -398, -1376, 310, -67, -264, -481, -51, -510, -87, 727, 21, 190, 376, -1277, 967, -107, 543, 121, 618, 311, -1100, -165, 370, 684, -189, 91, -198, -273, 5, -110, -656, -75, -394, -999, 1038, 880, 175, 821, -1507, 54, 129, -85, -191, 377, -519, 421, 30, -388, 1240, -317, 1145, -163, 398, 215, 691, -104, -107, 322, 368, 879, 469, -222, 387, 246, 258, 370, 608, 568, 923, -61, -393, 504, -939, -175, 364, 962, -189, 417, 91, 10, -42, 622, 474, 182, 700, 41, -112, 1002, 26, 473, 536, 10, -346, 661, -462, -1225, -529, 681, 353, 159, -352, -284, -1037, -640]
2963f40J71n05J123M7p63J173j05N94j026n77o04M71J287J92r35L8n6J3o24P65
2983C9O16j888J575j140J527j114J7K30Q51j287L64J11o46Q54k22M38J05J73J97
3002H00m02j036J296o54K97J3k34L84n26P9J54n79n19J98J274n21O4p96j27O06
3022b29Q96n50r48J055l78O36k43n5L60j52P57j646j97K3Q89j15N83l94o4m54
3042b26J266j031k78j19Q9M93o47Q75j204J38K43N86p03Q74M50r91J25N26j107
3061f41K97j65p0Q50l10l3k9j128J336J40K4l56M9o09Q40K41k47Q00j328J289
3081I50j423R73j045j41J78K75r7K73j26l72P04Q94r65J48M85q11j04o18J759
3100I37p46m64Q17j332Q68N58l08q34P92q63L37P7N19R2j70o95J0m0J74O59j94
$$ y = [-640, -469, -974, 149, 196, -567, 606, 501, 1095, 69, -508, -1112, -641, 646, 838, -97, -59, -115, -102, -726, 39, 655, -1233, 342, -798, 729, -385, -368, -138, 713, -574, -210, -99, -745, 109, -113, 325, 430, 603, 800, 398, -638, 658, 4, 301, 314, 80, 464, -62, 17, 171, -408, -927, -729, 545, 24, 88, -708, -835, -229, 667, 117, -831, 224, -154, 482, 239, 184, 544, 392, 1149, -497, -694, -671, 218, 103, 686, 292, 228, -226, 1040, 9, -269, -388, -299, 194, -453, 422, -782, -644, -401, 185, -518, 356, 806, -185, -60, 466, -641, -344, -509, -579, 271, -39, -72, -101, -1229, 107, 247, 271, -85, -36, -645, 195, 436, 189, 989, -339, 950, -473, 500, -545, -686, -508, -233, -330, -57, -183, -555, 149, 1043, 78, 226, 711, -100, -204, -822, 937, 191, -273, 544, -788, 80, 638, 330, -504, 288, -575, -238, -161, 358, 450, 280, -415, -405, -445, -271, 388, 194]
3121A94j79o40M55j25R93p58l04J033m29o42J084j38o31O85j241J350m83m5J95
3140C74l01L44k26M42q31J078j412k26O12O08q90j1P19J19j827K846k076J215
3158E57l01J14j2k15K89m38l06n03J173J65p50M79j71o45r2N43P0l7O55j221J324
3179F78q49P65q5n61j403P96J122n06q4r24M54L20K76L1L27o00J07J127j037Q14
3199G68R8q07M55n59Q18j035K23p1l44O49k32p08J69Q11l28k79J96l67Q69o45
3219c19J192r97K46p06Q34j26j47M89Mm71J46M4j70k17k39k24M05j17n44Q06j87
3240b98O65l27R74m03p07L94J91n45N08j393J191J72m53j1j063J479m89J410j630
3259c35Q99r61J89O7N7L03q31N84o58p93J781j23n89n8J370q56j81K13K59o31
$$ y = [194, 15, -625, -170, -295, 698, -60, -364, 669, 240, -402, 682, 544, -87, 598, -643, 707, 224, 179, 374, 73, 417, 191, 633, -198, 880, -532, -758, -146, 462, -428, -439, 280, 399, -1428, 1418, -658, 557, 256, 370, 358, 143, 432, -6, -312, -815, 358, 523, -227, 252, 81, -564, -656, -113, -43, -80, 575, -646, 678, -171, 594, 509, -52, -1455, -659, 463, -43, -127, -1051, -597, -277, -1, 30, 357, -243, -136, 991, -46, 768, 866, 59, 514, -45, 773, -262, -39, -110, -454, 195, -37, -745, -576, 235, -93, -372, -176, -543, 326, -319, 873, -124, 122, -584, 250, 124, -23, 466, 470, -1, 145, 189, 19, -198, -437, -661, -256, -373, -917, -111, -298, 367, 40, 1014, 611, -96, 298, 489, -56, 452, -941, 250, 422, -31, -42, -1105, 374, -115, 1295, -335, 564, -397, -208, -141, -84, 219, -612, -28, -686, -1479, 302, 179, -410, -468, 902, 46, -135, 78, 337, -294]
3279b94J138K37j092l44O11p05M62l43J42j64O85J08P72j269J6o0n03J581q87
3298I1n88N75m80k80R19l62P33n39m49o78J762L46n49n44o42L02J039k3Q08m51
3318I90q72p28O06l3p57O66j00k75O50O74j605R14J49k92q2m39J199j10K29r08
3338a24o0L19jR39n86q04M38M30j162nQ21l48J090k16j75j64q70Q5R87p31L11
3359A74m39R11j327J90N69K18q95J540j628N98J285l53n58J69p89N65L6O64j829
3378h99J50M31J125k198P43K00Q60q63k8J201o60J41J43j01Q3K62l53j67L31o89
3398b88K52k75M5L18l3J09q10J324j208L36O59p47n46J245n26P96j230R18O53
3417I92m08o55J45n14P08J077j001k87L44j019L20m08P69O6n00j46K69ln11J243
$$ y = [-294, 844, 1081, -11, -355, 256, -449, 13, -330, -188, -352, 333, 441, 1213, -56, -40, -100, -603, 978, 91, -497, 78, -402, -682, 237, -125, 608, 69, -380, -1058, 704, 1050, 501, -43, -685, -383, 656, 633, 1441, 990, 118, -610, -4, -37, -794, -128, -228, -503, 147, 821, -784, 130, 279, -13, -95, -534, 665, 555, 784, -124, -184, 135, 134, 1073, 487, -317, 121, 551, -611, -616, 205, -143, 947, 731, 556, 392, -478, -393, 594, -137, 174, -265, 646, -681, -491, 78, 296, -599, 941, -687, -89, 1196, 843, 285, 454, -335, 230, 266, 930, -899, -749, -318, 807, -1391, -648, -448, 412, -451, -479, 722, 62, 203, 346, 245, 328, 590, 237, 70, 401, -288, -36, -311, -266, 52, 19, 128, -682, 642, -566, -230, 429, -318, -864, 381, -145, 651, -579, 339, 992, 584, -71, 74, -440, 268, 1345, 344, 57, 401, -618, -298, -706, 63, 129, -371, -517, -248, -251, -762, 481]
3437D81j63m53k73P25j48J24j3J49p60J947j915J4n94P60j00N16M39l27q65P39
3457B83M63r70M87K0j014R38J50k46r86R07M40k19j29J0q5P27K06j124M29J99
3477D86r23K26K87n14K65J044j508L98N27j083L68N69M99j402P51N46r70M25l66
3496c75J059p53N15o11m4M24m91N21K20p91j88Q61p0q36j75L72Q04m13l57J52
3516a76N18j033J323q84O77r79R13M6Jq6k63n0L6K25l95J29J139j993J023p69
3536e98k21Q73m7n35j35N50j118L67P52J082n87j96m56j05Q3J594j189j169J269
3555B14m08q44O07P51J45k80m39K65P57k54O19n76n47K22k14L12J7l95K71N01
3575G24p76M41Q4j36o78p8j08K75J00P27p87o0o45R35P09l86k44q16J163L4o73
$$ y = [481, 318, -135, -408, 317, 169, 293, 280, 429, -331, 1616, -299, -285, -879, -119, -219, 297, 736, 409, -456, 283, 746, -224, 263, 283, -731, 207, 357, 111, -875, 32, 472, 253, 124, 134, 49, 776, 982, -142, 287, 486, -437, -211, 76, -438, -173, 871, -637, -239, 288, -795, -427, 142, 641, -761, -10, 536, -434, -9, -375, 684, -69, 446, -165, -209, 215, -276, 245, 465, -326, -514, 347, 277, -559, -734, -362, 442, 29, -328, -176, 342, -691, 632, -252, 425, -554, 359, 405, 406, 320, 57, 7, 43, 268, -127, 2, 1141, -852, 171, -598, -819, 54, 7, -528, -663, -113, -1231, -864, -112, 970, 383, 187, -269, -374, -291, 1303, 114, -1055, 214, -194, -1038, -431, 320, 465, 185, -254, 11, 768, 514, 1133, 557, 10, 232, 18, 330, 347, -48, 223, 724, -52, 389, 473, 337, -341, -419, -527, -252, -152, 575, -212, -272, -917, 18, 727, 341, 97, -719, 444, 478, -195]
3596a95J6K7pM26j254Q90L52r0j98L91l91J12l3K7l07J103j905R36N52j92Q95
3617A155j275k89N61L67n10O70j400l21J616j000j38J284r87Q99m07j412K465
3634A278r97p13M73j26J72n26J90l6J340j266P34m16m60R33l84J28j192N93K47
3653b8k46O47l50l57K68R30q99p51J05N95k41j63N60M35j6p10k24R3Q86j179m3
3674f88J94J142N90j294P63n57l56L79n74J81k1k23J929k656P42K31M6M43q55
3693e84k31N59K07J02q4j281N30O16L74J47k62L78o80j52O91l6N65q49J088q78
3713B20n86R32Q0k30m5l52r41K079k120O93r0N82j077Q33j35k18L13q40M55n84
3733a031J317M10l89m83o49J397m96m21M36j62j59nk64N58J5J43M79l65k75p42
$$ y = [-195, -179, -152, -159, 267, -987, -97, 255, 165, -33, 358, -33, 79, 46, 73, -234, 869, -1036, -100, 452, 260, 1155, -120, -409, 152, 519, 9, 679, -721, -1042, 574, -426, -564, 720, -267, 632, 225, -1187, 1278, 281, -432, 41, -85, 87, -439, -249, -285, 1055, -211, 523, 107, -353, 580, 196, 324, -868, -275, -28, -274, 373, 23, -334, -66, 864, -35, -786, -681, -86, -327, -490, 70, 505, 489, -221, -445, -352, 534, -645, -688, -494, 648, 1238, -56, 707, 150, -206, 173, -401, -220, -241, -464, 1465, -1191, -449, -218, -172, 271, -584, -815, -256, -49, 53, -31, -1312, -782, -166, 208, 355, 93, 471, -209, -361, 330, 294, 859, 10, 1098, 220, -366, 566, 646, 416, 371, 19, -922, 1157, -963, -270, -360, 222, -855, -22, -157, -375, -62, -902, -447, -1031, 286, 696, 307, -176, -825, 572, 76, -345, 91, -71, -230, -235, -499, 59, 74, 217, 696, 331, 56, -686]
3753f86L65R59j028J44Q08Q0j463M24N85q44M77j26J013n20M59n01J84M62r52
3772a60r9j85O42m34J46j098K58J258j029L1J494r52J83M96m39M39j299N01M02
3791A55k15k98N43J61p71M28O5k82Q22j565L90M20P77o57k00P37m25R3q21J155
3811E12n90N98j014R18M02n04J37l04M00l68n28n94J336Nk61m15M00l51Q26O32
3831A237j712P27j663K198q42p17O15K89k98m58L68K81j8l1J188n60j386J491
3849G09m13p06J62K54k75j17L64p98J031J78m23k1M6j065J180K92o57O74o95o63
3869i43O86R36j168J65R56q48n94O01m66M31P80j231J429j506Q76N05j267j59
3887h17R51j04k99R15N21j169pj68N59m01m22N42l94R23j416N22L6J221j909J234
$$ y = [-686, -321, 638, -390, -246, 562, 642, -821, -397, 188, -656, -179, -305, 708, 188, 647, 146, 330, 792, -160, -259, -444, 198, -236, -90, -1188, -930, 328, -701, -670, 824, -128, 55, 551, 112, 551, -748, -247, 155, -60, -358, 185, 346, -425, 3, 68, -214, 608, -957, -567, -147, 630, -27, -227, 510, 85, 178, -643, 512, -78, 520, -494, 424, 826, 322, 459, 155, 555, 187, -341, -935, 401, 406, 145, -270, 130, -221, 605, 1237, -475, 252, -1411, 787, -55, -772, -157, 132, -166, -624, -256, 25, 7, -24, 1164, 604, -782, 709, 296, -410, -248, 6, -269, -386, -22, -820, 211, 389, -34, -55, -9, -1074, 106, 398, -259, 415, -280, -943, -257, 679, -489, -324, 632, -216, -810, -209, -675, -244, 536, -695, 734, -772, 104, 609, -658, -817, 134, 30, -269, 646, 1167, -2, -9, -177, 382, -19, -441, 101, -293, 630, -786, -264, -228, 993, -916, 318]
3907C18K98M6M30o03o5l46p63J408q55k7L87o04Q6J25J95O20o36J60P1m48M5m9
3929b07Q23m93n89Q61k69m36K08K88o58M60l17Q5J38L36N21r64N77o42p18J184
3949A88q34J151J06q38j72M19k73m76O26N73l81m42k49k93O94J501j049p91Q79
3968C39q02j40m56J309n08J297j619P47R3q45l7J141n68K24j151J575r32k23J395
3987H39N00m49j607J075q45L44k39n30J516N29j411J53n58P26l12k26Q46n2O36
4006I35l38n51K49m83R07j255J277j059Q08l67j00K84N14j59o70K48l40j8k23
4025c41L65K44k10N45l15L03N16j044P76j143P9M58n85K37p3K77K76j98J198j111
4045B54l71m04N08o6J51n88M95N58j91q14Q4L09J12l26J55J200j359R29o53L29
$$ y = [318, 616, 662, 1092, 489, 424, 78, -685, 723, -132, -159, 228, -376, -290, -165, 30, 650, 14, 174, 245, -203, -158, -207, 616, 123, -466, 395, 126, -310, -102, 186, -472, -12, -329, -244, -106, 230, 751, -213, 364, -278, -996, 188, -646, 505, 611, -227, -399, 20, -253, -729, -103, 470, 89, -353, -602, -895, -201, 1300, 251, -540, 339, -463, -603, -1059, 250, -258, 1039, -580, 167, 260, -585, -622, 519, -49, 175, -976, 599, -333, -556, 839, 1339, 890, -717, 358, -487, -143, -382, -912, 604, 1133, -278, -125, -683, 43, -269, -495, 351, 299, 935, 597, 46, 295, -188, 719, -536, 741, -318, 490, 123, 23, 307, 821, 662, -8, 240, -100, -118, -341, 24, 268, 58, 603, 288, 591, 1107, 63, 839, -304, -225, 233, -352, -115, -188, 89, 365, 167, 1365, 254, -117, -521, -13, -79, 72, -516, -21, 537, 346, -468, -384, -75, 37, -289, -134, 1066, -293, 636, -17, 312]
4065C12p50K96M22J72m10l22O22j62k19N08l08J73J19o1l25P40r90P03l56pJ74
4086C31K29j292J190m11M29n69O03o35o17J681j085m05J282j383Q55K51j033J873
4104A294k305K218j120j812J484P73q99N50p21J375j177M25l2P30o44N00r13Q15
4122E41m09j030J956j033K2r3O63j014L87J17J80m32Q67m89j08J200j335l52j18
4141d80J172p29N77o28L89K90k13k25m07N32R1k35P5l40mm96O11l50L69j71K38
4162F6n94Q70m95O56j12L00n37P97j422J82J0j44n6M67N8k98Q34m58j132J369
4182C61j42n72l75N21P63p84o85p09K097q95J17n99Q21%k2R22L93j336L22o14
4202d16J072r21J035o35n26O51l0p70n2J637j424O39r47L44N39n6N3N15j60l08
$$ y = [312, -438, -142, 280, 452, 42, -280, 342, 180, -39, 469, 161, 334, 453, 392, 67, 807, -183, 520, 164, 157, 331, 560, -732, 458, 47, 476, -93, 510, -125, -742, 939, -146, -551, 731, -652, 203, 454, -579, 1294, -1011, 1207, 87, -1725, -241, 532, -367, 183, -538, 837, -340, 85, 53, 783, 139, 639, -274, 541, 132, -898, 1058, 25, 47, -46, 617, -397, -10, 107, 287, -145, 722, 233, 125, 1325, -10, -362, -480, 692, -37, 540, -88, 301, 591, 378, 153, -254, 278, 369, 134, 209, -131, -135, -631, -20, -370, -1, -172, 66, -528, 342, -153, 503, 391, 691, 154, 951, -471, -289, -279, -423, -479, -12, 46, -252, 582, 124, -1008, 361, 219, -353, -728, -207, 556, -228, -913, -1622, 475, -420, -303, -902, -81, -81, -103, 819, 1212, -124, 198, -416, 656, -265, 770, 135, -391, 260, 230, -540, -592, 1045, -379, 260, -687, -343, 196, 140, 193, 708, 548, 240]
4222B40k16J029l21r20R88r46n54K02O22k61n31J252m58k93n1N77j118k0M56n79
4242i02M23O54j09m82JN10O5m00P86r68l91J10N88L89q00J260q11l84Q89n03j34
4263b09q3N74J25K00k10L63j144l62R8J30Q96l69J60L37m41J30k24k16K04K88
4283B47P86j09j394K94j027J279M36j495R33k64M33J45k45P36j004J46j91J098
4301H04j420J099r86q67J862m25K86m72M67o6j74l41R8O70on24J412j137k81m3
4321d4n91J272r60k03O92M75r92N36n39N45j88O21r15J00L5p23m6P82O66N19j603
4342e61J173q58M35M46q62o5m21Q79k62J06M17n43j2l77O72M93j17j218M93Q66
4362F84m13j30P9O74j636Q00M8p73J000O64o07r6J24Rq06P81M1j50q8p92R51m83
$$ y = [240, 24, 1053, 732, -188, 800, -146, -700, -498, 124, -137, -668, 584, 126, -167, -218, 359, -759, -779, -323, -902, -479, 175, 66, -416, -415, 95, 160, -240, 546, -422, -813, -703, -115, 274, -526, 734, -77, -461, 428, -75, -209, -292, 282, 407, 607, 397, 760, -384, -746, -648, -518, 378, 9, 169, 506, 65, 195, -29, -245, -41, 247, 1033, 924, -470, -176, -1203, 76, 512, -983, -50, -314, 119, 264, 19, 755, -249, -103, -294, 804, -616, 483, -503, -1370, 492, 67, 353, -119, 348, 282, 108, -233, -135, 535, 529, 5, 1417, 280, -1, -44, -635, 637, -323, -526, 166, 641, -351, 185, -354, 191, 3, 624, -291, -191, -156, -879, -925, -143, 523, 1042, -561, 612, -246, 189, 635, -227, -292, -713, 166, -96, 10, 427, -116, -128, -505, 167, 660, 543, -675, -182, 684, 271, 141, 220, 894, -742, 58, 106, -667, 333, 997, 390, 294, 418, 427, -379, 402, 443, 293, 205, -587, 364, -119]
4384a19L69K90p74l07l0N92k65r18L89J437j46o44K34q99k10J136N35o32O2j178
4404a078J320j329J378j22n73L65L06k23p50M18n9N51J08j90M09p75O76r06n7
4423e31K46M45K05o21l80R68q20N78j66L61k91J34L43q47N62j82j18m45n57J054
4443f2j3M6O8l4q0r52P90N90k95k60N65n83L24L07j659L69J388J56L15n26q55
4464d01M08N22p61o57p9Q43R22p23L05k96q7K77l14m23m94O69L26L99p79k90m37
4485a070J255L2n68P12r06P14p11Q01l80Q08j284J0J217l01o04Lq36J039L48l57
4505g8N57l24K27p02J79n85J849o55j76n72M12J84j77j66M61K70j21P91j792k90
4525g08M1N49q4N74j245P36M09q14M71j30k82Q0J053j628Q74Q49j049l57O18N5
$$ y = [-119, 250, 540, -234, -541, -571, 21, -244, -1162, -773, 664, 518, -126, 108, -791, -1001, 135, 670, 38, 100, -1078, 242, -1087, 291, 169, -404, -39, 267, 44, -706, -288, -347, 204, 312, 122, 531, -244, 432, -474, -531, -285, 160, 365, -256, -636, 332, -488, 90, -76, 285, -6, 128, 471, -376, 186, 4, -114, -559, -1116, -62, -75, -29, 39, 5, -75, -1027, -237, 353, 58, -202, 363, -220, 104, 411, -1248, -879, 509, 665, 980, 454, -401, 7, 529, -232, -889, -968, -125, 797, 74, 379, 83, -4, 273, -41, -464, -958, -289, 37, 436, -343, -633, -1070, 185, 217, -351, 361, -545, 169, -542, 259, -121, 687, -597, -587, 630, 329, -275, -272, -1108, -69, 279, -78, 479, 155, 382, -320, -141, -726, 1123, 468, 292, -280, 132, 316, 139, -27, 434, 704, 583, 1374, -418, -708, -667, -118, -202, 372, -873, -137, 272, -542, -71, -201, -483, -403, 650, -978, -104, 745, -304, -661, -43, 12]
4545A2m10l33J53Q02ok49k70J9O69m80m56O97k37k15M48j7L14o1o86R84p91n42
4567f55K93L12O38j16p4p22r6Q7K69o72R74J88N5k88K89l56j82Q31j590J536m78
4588B43L99l21l77J70q41J260n30m12J381j028R53k29q30p46J314n40L5L32k10
4607B3K25o03r2L07n26O43K60M90j794J458l83R4P5j406J116O05j96m31p21J158
4627C02j36j07n84R70j43K81J53j113J48J113r30j4o15N98O24n68k3L29q0o60
4647d55l8j14q9K05R05j047J015m66j31K31P43J01j480L50J58O67j200M73J84
4666A2lK51o83N61n27K35R68j135k36l44J557r63Q26K52k52n12n02N17O29l63
4686B88m93n48L05L16m24KO33J24j068J857m5j169J040o31k94Q00n63N2j103J784
$$ y = [12, -398, -731, -578, 224, 218, -31, -301, -282, 387, -93, -549, 148, -89, -304, 144, 127, 441, 380, -306, 678, -113, -655, -362, -50, 588, 472, 398, -324, -420, -333, -64, -736, 238, 426, 481, 193, 482, 126, -56, 775, -815, 721, 243, 642, 321, -56, 114, -727, 533, 3, -409, 972, -56, 897, 668, -162, -908, 406, -134, -99, 233, 23, 248, -355, -447, -140, -666, -23, 237, 727, -1067, 391, 8, 102, 177, -1229, -113, 492, 296, -135, -856, 302, 166, 59, -525, 445, 302, 583, 736, -377, -229, 884, -46, -60, -675, -77, 547, -21, -44, 285, 205, -455, -493, -607, -696, -491, 414, -633, 382, -84, -215, 16, 759, 860, -620, -270, -112, 555, -645, -172, 12, 9, 260, -423, 138, -389, -154, 814, -321, -557, -901, 656, -307, 519, 771, 519, 7, -495, 22, 651, 288, -205, -753, -448, -132, -556, -554, 79, 203, -865, 992, 947, -222, 818, 187, -107, 693, 130, 182, -921, 863]
4706H63o41k32K32J98K12o16K70l24l67K94j701J647j90R7p43J363o6M19o61l41
4726b87J134j65k65q26p48J126K31n65J89O20r42M04J75O57r06R8K06J8M95j079
4746d30PO61k2L3M41m78q99R92j317J065j10J609j590M4R4n07J16L76j86M94m92
4767i9l53J254p39O09M11j706J65N06M80r08Q81n63J30n55K61M23Q99M0j210q87
4787i61J048N55p61L76P54Q0j331P52l08j304J593m2l24m71L89o52pO89j185L55
4807g55m00Q29J076j817J304M32k84L0j140Q68M92n79J8p49P06k71N33R32j325
4826a00L3n05O08J13K04j72O50n77J07m05J07m60P19O92j28p62N17k70j75J71
4846C67r47R11o07j147J749l02J38o4N69j005n7J460j952R89n07j38L65Q55k54
$$ y = [863, 222, -10, 222, 420, 632, 16, 286, -38, -405, -111, -1812, -165, -355, -258, -1001, 362, 296, 715, 54, -287, 847, 682, 417, -409, -1157, -31, 200, -365, -176, 444, -498, -94, 81, 738, -168, -70, 136, 154, 649, -430, -423, 238, 216, 249, 690, 212, -687, 305, -1012, 53, -57, 1552, -38, 6, 100, -407, -291, 85, -101, 393, -99, -452, 802, 63, 672, 1083, -623, -458, 48, 528, -380, 501, -62, 68, -487, -226, 197, 1096, 1136, -74, -961, 87, 642, -119, 257, 1011, 1091, -240, 512, 204, -1100, 493, 451, 127, -344, 45, -607, -614, 75, -1110, -755, -1155, -326, 750, -1067, 237, 669, 385, 415, -725, 143, 635, 56, 74, -675, 31, -240, 293, 1225, -100, -67, -572, 36, 149, 353, 181, 831, 254, 361, -44, 63, -397, 322, 1014, 886, 124, 641, 371, 196, 367, -580, 331, -276, -1423, 326, 24, 162, 98, 667, -338, -395, 1065, -887, 102, -405, -543, -178, 677, 423]
4865D23j054j08K15j053J176Q72l45m41J130r73l43N21M82m29m72k13O33J57J065
4884A243j628J578n56k46m90P88o00j64L0j125K053j180OM31l26R5n10L4p54J57
4904a164J156L09r01L52k9N92k00m25P55OJ04o82J68J41p60N61k36l07R21O90
4924A051k10p32j01O35n25O21K8r37K11L86q31Q2Q40m33KL31j475J487j066M59
4944a77J423n31j315J041m06j368J483p69M36j292J913l35o23j72R44p6o76J003
4962E03m52R8J79m65M24m93k26O41j046J309j094R68q6j59N21p55P66q56j447
4981a670J205O33n73O48k00n14o7J349j184O32m26j32j05R35r75R41mp14l01P21
5001A99r9J69n37p88N84R41k83J027j160N75m59r6m95O6k83J281k99k95K32L17
$$ y = [423, -631, -739, -524, -1577, -401, 471, 126, -315, 815, -158, -501, 20, 502, 73, -399, -612, 21, 178, 1243, -385, 1193, 637, 391, -99, 689, 89, -75, -45, -1170, 883, -297, -291, 140, -186, -91, -601, -567, -1321, -1164, -8, 301, -600, -248, -277, 315, 115, -310, 445, 451, 555, -127, 41, 182, -578, -17, -253, -560, 361, 1051, 841, 109, 8, 643, 118, 739, 767, -170, 41, 427, -404, -322, 518, 85, 87, 418, -1057, 430, -636, -177, 1246, 715, -600, 441, 35, -1333, 150, -619, -183, -1475, 438, 103, -520, -692, 252, 176, -500, 503, 51, 149, 328, -137, 287, -206, -432, 209, -837, 472, -622, 346, 260, 101, 622, -133, 633, -223, -1670, -465, 168, -405, 243, 43, -471, -538, 811, -373, 259, -167, -299, -404, 531, -444, 497, 493, -221, -522, 199, 100, 269, -268, -1056, -472, 469, 186, 1213, 53, 628, 169, 73, -422, -356, -639, 642, 343, 48, 280, 597]
5021E97l60l77P51R1m85k42p2p84J762p85o22R32j52k70K95J33l36L98J34p31
5041a23J27M33k64P19j13j380P42L21p45K02l00L49j94j99J6N52m35R62M76m49
5061F97l66j122K248p06r59K75j059J048O32l74m97k0l65k29O61O0j96N29o91
5080d34P36L2p9l13j0L0L62j113J139l06o5m8L50m75K15L80j038q1N88M02R93
5101A265j515J37k07K17K0N53k06m30Q65n59q33J027o32J057r86L09N23n60j210
5120a165J118M07m32K24r45P34j76N61L90j483P91K98l72K56o6R16p76j54K09
5139C35n00R22j08p11p27M00J064j403K43N74J00j40J46j144J042j46M43P26r19
5158A97L2p13L07J41K73j43K99k52K97j22r6j658O80J372j048K20O82o92O56k42
$$ y = [597, 237, -140, 611, 702, 217, -25, -97, -881, 881, 96, -526, 406, 254, -16, 279, 412, 76, 474, 608, -123, 4, 437, 173, 892, 779, -601, 141, 462, -283, -81, -381, -32, -226, -425, -409, 143, -292, 670, 1146, 697, 331, -791, 1457, 751, -208, 67, -992, 56, 688, 314, -183, -203, -568, -797, -136, -76, -272, 257, -434, 302, 334, 255, -58, -68, -38, 324, -789, 350, 44, -21, -69, 281, -194, 21, 401, -637, -718, -130, 272, 1265, -250, -113, -320, -103, -83, 470, 264, -166, 699, 140, -693, 334, -298, 759, -227, 82, 605, 45, -1165, -47, 360, -72, 152, -793, -59, -235, 326, 716, -767, 24, 322, -50, 206, 140, 1056, 280, 126, 335, -165, 757, 649, -62, -789, -389, 675, -728, -485, 89, 189, 49, 195, -949, 93, -53, 390, 1116, 197, 229, -484, -177, -36, 237, 94, 393, 141, 438, 316, 220, -1438, -758, 614, -434, -214, 468, -224, 432, 190]
5178A90J86j487K323m77o52q4K62j23m83J157j322R05m16L17L41j010J688o28
5196F87p16P43j430J211k3P7j38k95J81o44p4M24N14j758K310m72p34oR29n35
5216B51K83J6q21J099p02n28M09K74R71j425j19N11L65q09R59n53r44P31m09M35
5236fk15K20m75P91l69J42P66j175J590q32m06pl12L07q93J095j146L99K75K90
5256C9L34Q5p63j79R22l62K42p61J173j750J295l74k83O09m43J239j045j158J108
5275g2j83l28R69L06m12o6k84N68j055J235k10r67M74o2K1J059j079j56K06O3
5295B7N77j115j81O99m50j40j18J098qn19j182J725O4J52j38n83k87M08m65P15
5315B79j15l85k96J085p38l82J185q87k53n82J445q15P99n37L77N2r56P26q33
$$ y = [190, 376, -1111, 1212, 735, 83, -1, 261, 138, -345, 812, -510, 395, -21, 296, 637, -373, 1315, 687, -29, 714, -716, 495, 472, 549, 411, 116, 297, -347, -421, 3, 517, -1241, 1069, 597, -137, -143, 786, 251, 534, 550, -271, 828, 126, -402, 7, 281, 1252, -173, -292, 219, 584, -225, 734, 181, -763, -32, -441, -6, -221, -1, -476, 315, -54, 88, 854, -321, 1269, 437, 31, 24, -288, 19, -874, 221, -925, -526, -251, 39, 373, 458, -305, -484, 438, 76, 318, -443, 730, -1020, 275, -99, -382, 227, -216, 1023, -22, -1180, -72, -255, -583, 386, 692, 280, 214, -70, 498, -557, 678, 468, -499, -25, -87, -66, 993, -86, -242, -36, 27, 604, -511, -692, 7, -443, -583, -701, 397, 389, -130, -1312, 413, 477, 629, 491, -92, -379, 29, -436, 279, 164, -221, -517, 568, -170, -552, 633, -254, -507, -1089, 356, -459, 340, -197, 180, 232, -724, 2, -831]
5334h31P00M5L73l81j17M16N08l04k90l70n0J764j315j30P57j041m14J274l58
5353B36Q39j367M27j95m05J364p32l08l55O04n11Q79K24m50k86R85r11J54j163
5372i71J99Q43K0O0J274j056q47L1L13n22L70M18o49K44Q61j86l40n16K6J140
5392G12M42j040P95j223m71J005Q1p19J507j042N70j095J127J32q88m3p1j81N05
5411A03J74L44l0p74k36k88Q16j30M03J05p45M74o90L21p6M66O9N23l86m51m76
5432d84J023q87J318o13J49j66j438R57j064J710p60j79R46O9m57p8P32m92j89
5451I7J31r31R59J37n79P23j413P76O90j34j104Q72k88l89P54m70o16Q22l84n54
5471i01LP22j21r27Q16J128o63o02J135k80Q72j251J42j297J566J216k560R17
$$ y = [-831, -131, -86, 287, -94, -211, 205, 713, 409, 119, -251, -301, 1463, 148, 18, 775, -266, -680, 594, 236, 1075, -292, 135, -60, -465, 899, 167, -141, -496, 108, -403, 476, 700, 250, -36, 949, 38, 192, -971, -772, 71, 91, 151, 1425, 369, -478, -447, -134, -656, -286, 132, -517, -273, 588, 402, 62, -454, -428, 712, 1154, 114, 909, -314, -785, 220, 301, -418, 1089, 47, 617, -478, 649, 781, -107, -150, -221, -402, 103, 277, 621, 591, -183, -419, -707, 109, -21, 382, 487, -258, 216, -474, -153, -229, 237, 306, 829, 443, -8, -484, 539, -348, 970, 357, 506, 340, -1098, -141, -1205, 505, -255, -434, 512, 581, 124, 46, 778, 286, 97, 228, -703, 256, 393, -186, 537, -876, -100, 590, 456, -648, 224, -64, -453, 301, -169, -785, 37, -347, -901, -898, -176, -297, -1224, -408, 720, 57, -545, 590, 310, 1182, -69, 73, -1224, 342, 1558, -1002, -85]
5489h5P27j309M45q65P38R45m25J37l17J76l63l20J027j57k3j63j260J339k55
5508hk28P60p42L07n76J70Q50p5N68j518J028j019K17R9N96m45K8j33o40K00P74
5529B13m75J474Lj461J006j135k20L51L66J91p51n87J748l66o2n67J02J578j754
5548c46n57Q42L83L20j82j16r86N16P49m80J22k50L08m77R41k27q93O94J95q53
5568b97j32q7P93n46R11r21k16R17j126J262J37m63k68L07l77l79J173n51j58
5587b1L33l34k44P60N60j572R65l25p28O54O5L01pn41K05n53L21r36L38r58J135
5608e82M62M17q27K33Mp6K63P49M4l57p32R71J06n05j89L32j134R39j30n93R70
5629C65o30J121q92j2k57M35j84q89J114M24r15j0p3k25M31o69N52l54Q51p51
$$ y = [-85, 642, -667, -222, -1087, -349, 596, 171, 308, -9, 167, -196, -516, 511, 354, 331, 168, -1092, 247, -8, -236, 524, -218, 89, -487, -317, 533, 458, 1026, -492, 536, -483, -266, -167, 429, -16, 12, -121, -761, -561, 213, -262, 1212, 1215, -246, 760, -375, -595, -244, 122, 313, -438, -1025, 723, 357, 295, -272, -170, 1408, -346, -903, -61, 322, 642, 460, 344, -642, -126, 623, 143, 265, 15, 323, -154, 787, 560, -333, 361, 556, -297, -429, -516, 277, -269, 642, -279, -495, 422, -704, 558, 695, 232, -36, 271, -106, -485, 688, 137, -21, 312, -22, -266, 494, 1054, -518, 447, 122, -606, 48, 113, 414, 407, -134, 71, -482, -161, -1097, -759, -1717, -582, -120, 297, -530, -297, -293, -369, -106, 643, 687, 330, -402, 569, 675, 170, -19, 313, -821, 118, -12, -605, 365, -265, 856, -36, -48, -305, 130, -54, -943, 171, 595, -320, -330, -403, -628, -197, -866, -314, -668, 183, -568]
5649e68J76N37j29n00J196o79l32Q87r50j58N35n41J173o45J35K13m20p54J356
5668E32p65r19O90l09M72L71K09j27Q24j473K30m63Q60j335J105l35L93j09J19
5687c0N3K61p51P6j19L00J138m40o54j221O61m62Q07J97P24LJ12r48N0L39l40
5708b44K84j0M46k79P75l14o49k45L33j001O31j16n35N59J62L56m74N38q32m1
5728f56J363n61m09M82o93M30M58p72p07R49M32J11k50K45k51q20O80K62n28k08
5748d43O86p8j121O01Q73o45K73n00O27J87o43M2n25O76o97N08j68P60J58p81
5768b10O02n08K79p9j058P32M5k90J858p13k41m52l98O37q61J089k51o10M13m81
5788d97J282j809L96O94M83j064N36n08L7m54Q33k71N80n24o5K49m85O94N91o91
$$ y = [-568, -392, 145, 16, -484, 712, 33, -299, 588, -362, -520, 15, -526, 647, 2, 137, 350, -70, -824, 532, -233, -1152, -462, -771, -299, 72, 281, 154, 978, -495, -265, -728, 132, -1203, -98, -433, -40, -149, -30, 23, 284, -467, -391, -510, -210, 928, 488, -166, -1387, -726, -1188, -381, -184, 540, 543, 655, -293, -243, 96, -244, 40, 30, 476, 197, 972, 658, 9, -236, 97, -904, -273, -389, -924, -365, -203, 153, -321, 217, -615, -656, 707, 146, -263, 219, -474, -44, 414, -358, -1065, -116, 316, 427, 177, 422, 171, -649, 31, 293, -235, -443, 243, 165, -956, -355, 518, -127, 146, -354, 273, 460, -183, -141, -666, 10, -687, -179, -347, 413, 571, -210, 392, -116, 163, 84, -974, -242, -197, -487, 1371, 658, 417, -35, -433, 204, -657, 432, 181, -429, -16, -497, 785, -1024, -628, 66, 549, -515, 21, -487, -450, -904, -71, -342, 238, -286, -351, -102, -587, 107, 698, 7]
5808Gn90J620j899K82O10K52k53j61O53j353J293n58K04j30j09K51J55J57m35
5827dn8m00M11J32n29k61O70L66J46m28o21J362j298R8N18J34p17%L41Q6m47K59
5849b40o73K81J527m55q03J047n70l73J490j382J521j516M17O1l02N73j69j587
5867a153R47r28J265P8r85J586J59j163Q70k85K02q06r69J161j68Q39j039o61
5885a050Q26M61Q3n69K30o49J059j76L99q53N02j05M36J69m01q00K64q42N97O6
5905c53J189m52J26j202J296n90K59p86J95L96k07n98K60N56p24J478j121K68
5923a0m68L62p61J160n06M21m35m06J229j02N7k89n07j83O41pk04K79k32j091
5943a052J235N90j471J001lk55L73l93Q07j616R79r2n54O32n73L34k90P81r38
$$ y = [7, -583, 1037, -862, -580, 30, 282, 29, -132, 521, -832, 461, -97, 107, -23, -132, 119, 274, 431, -4, -62, -462, -51, 81, -448, -709, -39, 327, 473, 45, -576, 786, -512, -414, 104, 238, -479, -479, -138, -52, -499, -240, -913, -632, 895, 440, -363, 684, 114, -259, 1231, -151, 1370, -146, 271, 332, 30, 603, 434, -1153, -206, -1134, 131, 209, -776, 810, 969, -194, 676, 391, 593, -213, -1182, -21, -189, 650, -389, -1050, -224, 237, 320, -249, -19, -668, 391, 215, 614, -239, 263, 158, 594, 763, 362, -438, -174, -1016, -419, -353, 836, 384, 510, -692, 604, 14, 273, -513, -318, 78, -129, -727, -467, 89, -635, 843, -278, -10, -478, -116, -877, 283, -223, 198, -237, -643, 586, 484, 541, 252, -255, -438, 203, 196, -8, 271, 39, -1052, 183, 773, -698, 303, 300, 45, 418, 25, 832, -784, 195, 103, -451, 181, -392, -58, -348, 433, -505]
5962e05Q85n41J330p64j95o58L74J39R3j32j65j94L40n30J306q73L28K43m88k67
5982b74J097j043J54K77l52L18l98o43J271l34K99K46L36j138N08m55n00Q41J56
6001C66o15N45L5p95J870j859J029K41j153m44R85r94Q1Q49o76J297j153J039
6019F48j32o05m08P64P60j598M99l04P4R77p45L15J77n03j091J263j47K07M84
6038F35q63L53J7O04n06j056R69k09K7k46Q85n17n23J40M17p91K36R63P44o57
6058F22l12K52q98N76J60N4q61j73J005j579J814n63n88M9O93p73M78l43P57l92
6078b2M50r52J25J431j368L13K44k09k1m01J292m36K16m57M56p69J73J24J16j44
6098A61m57j13O26j87L35j060pQ81j007J30j60Q27L6l36J019j333J005k21j95
$$ y = [-505, 380, -161, 1169, 405, 210, -448, -74, 65, 158, 26, -139, -333, 7, -523, 783, -90, 238, 481, -7, -274, 823, -220, -66, 211, -141, 177, -221, -864, 407, 73, 372, 618, 954, -184, 324, -131, -631, 210, 366, -249, 296, 331, -464, 1406, -453, 576, 817, -336, -780, 205, -789, -708, 141, -535, 762, -391, 648, 516, -89, -497, 267, 1027, -571, -72, -376, -302, 675, -70, 245, 422, -81, -1172, 91, -56, 151, 635, -228, 125, 142, 746, 240, -816, 153, -56, -29, -275, 610, 93, -430, -290, 127, -664, -428, 535, 1279, 622, 310, 562, -336, 240, 400, 454, -407, -580, 425, -1154, 660, 97, -491, -442, 251, -522, -44, -387, 370, -22, 428, -524, -399, 1032, -336, -23, 221, 12, -9, -410, 882, 446, 662, 205, 661, -108, 65, 189, 305, 161, -296, -409, 217, 30, 365, -695, -702, 179, -828, -698, -858, -31, 5, -331, 688, -645, 360, 139, -56]
6117e6N30k023J512j338J666j6l60r2N62j109J229j26j262O45N47J218j965R6
6135c42O48j11L8N49j001J23j16O68m40M01p10L96L63j69J86r22N60l76O91m89
6155e3r62J721q09k49q0J388j406l59R96R16n46m54o8J327j593O25j355R73k41
6174b29J26R7R3k60k53Q99j02M51m43L1J07p87N4l45J7J372j543J020K46l11j299
6195a059J603j290N86M20k67k71p32J420k23N02n9n11K35j779J108k33R82o14
6213a82O25r09Q51J97l79J13L76j402J242m42L62K61j337J003n99R4R37j330O1
6232d58L58q3n24J087j065M31j89p72Q62j7P02j296R30P87j228L89J49M4N2Q81
6252A040j487M49m77K54N94l73m18j84J650j091N11k21p03K20PN01j285Q06J519
$$ y = [-56, 474, -1549, -37, -1375, 291, 275, -85, -177, 385, -724, 505, 379, -883, -238, 309, 1527, -438, -342, 306, 195, 233, 782, -219, -96, -212, 456, 16, 417, -293, 103, 466, 297, 483, -439, 121, -255, 436, -53, -1015, 706, -103, -352, -432, 956, -450, -809, 187, 1103, 557, 103, 35, 1362, -231, 394, -961, 12, -229, -103, -6, 87, -173, -426, 473, 371, 822, 379, 410, 517, -270, -216, -561, -544, 828, -715, 305, 551, 240, -1059, 544, -746, -160, 260, -7, -278, -1010, 410, 187, 689, 630, 119, 354, -1425, -317, -550, 432, -182, 443, -466, 385, 582, 203, 316, 692, -710, 532, 90, 452, 713, -624, 379, -220, -126, 811, -519, -458, -100, -183, -707, 380, -685, -254, -443, -1215, -353, -370, 332, -964, -34, 753, -475, -86, 63, 107, 159, 1040, -447, 2, -475, -221, 373, 0, -418, -602, 1048, -43, 468, 247, -456, -236, -229, 272, -1013, -207, 1312]
6271A312j041k72p44J233K63j730J858O9K55l11p18k16L3P95L00j502J028j368
6289g56J110j59q72MO13j11l41Q42r9m4j77o07N0N77mk06k77J710j38j560k62
6310g07R87l37M46o21N26n46O66q60Q72m89l17J99Q98j17j129J253p02M60j047
6329e65K33Q68o90l48j75J492m93m03Q31m85O47o11P24j758L61k87Q49J13j362
6348a059J789J063k165J197n0p81j26J12N48j080L98oN51n46J274o69l66J5M85
6367E84o60q04P64j30R98q2n79P5O32j118j01L81n5J45j70m87P9Q52J96j059L40
6388a99r1N18m19K60M61o81J47n98P94k58k74j048J022k49L91M29K64j36p91O76
6408B18o35Q96q11k32r6M39M92O8m16O28q70O41m12o26N34j94Q74m62o32m41J479
$$ y = [1312, 271, -1, -745, 488, 751, -979, 879, 948, 1203, 892, 174, -42, -9, 786, 1086, -416, 612, -756, 354, 195, -677, -673, -60, -171, -512, 330, 231, 187, 10, -597, -547, 30, 26, -180, -457, 1253, 1115, -445, -707, 280, -57, 389, -232, 294, -252, 414, -446, 426, -63, -380, -181, 717, 600, -529, 724, 22, 482, -565, -332, 536, -154, -502, -677, 815, 322, -81, 750, 265, 912, 301, 1025, -733, -372, -659, 190, 303, -1059, 730, 1793, -372, 825, 775, -6, -132, -20, 528, -552, -154, -160, 391, -155, 1119, 450, 84, 99, 584, -76, -880, -116, -246, 752, 670, 91, 166, 798, -320, -421, -40, -95, 50, -120, -607, -528, 324, 520, -539, -199, -290, 228, -191, 69, 530, -151, -4, -602, 192, -66, -340, -1388, -366, -615, -224, 205, 469, 333, -458, 218, -417, 479, -332, -564, -660, -221, 271, 339, -77, 551, -319, 322, -90, -716, -182, -376, 498, 36, -596, -1037, 442]
6429D42j107J444n37M50l04o5o96l24N83o35J480o50p06J200j520P10k23M15L95
6448C52q18Q93j307N50L21J25o85l62J626L43r33K64q88P11L79p40J82J81O27
6467H21n30P92p07j652J664m97J075j690N30N8L03J423k547J521l67j13k17J6
6485a17j33R27j428j17N94o15P72P48K35j927J307o53N27o41J101p78J15q13o45
6504a541J06J488J075j994J246j062l03J614r30R9l8J134j133K85j48K93l81l2
6522b22M02N35l16m53k28J40l49M11j02j63N84M03n93N47L69p72j34j03p43R33
6542A46o31R46j480J88J115q26M41r33J717n78j45J14L57N32j459N72O6N60j223
6561e21J043q05n40R94l34O77k58K85o42J01j35n94R99m42j95M36J327j406K61
$$ y = [442, -665, 779, 242, 692, 388, 323, -373, -697, -114, -749, 731, 81, -625, 575, -945, -235, -458, -43, 352, -466, 427, -880, -330, -9, 116, -569, -931, 695, 1038, 105, 369, -519, 192, 571, -169, 13, 194, 821, 291, 1083, 376, -1276, 388, -109, 966, -724, -194, -136, 167, 1590, -957, 564, 197, 84, -133, -117, -250, 677, -751, -868, -274, -889, -117, 631, 866, -1061, 246, -407, 120, -521, 580, -198, -83, -896, -1541, -1435, 53, 1128, -866, 380, -682, -985, 629, -301, -202, -240, 894, -239, 46, -102, 191, -190, -222, 180, 715, 399, -54, -282, -142, -491, -80, -182, -345, 239, 642, 49, 596, 965, 193, 59, -44, -787, 146, -485, 461, -1019, -831, 284, -542, -101, -1034, 683, 105, -40, 74, 431, 963, -496, 76, 142, 702, -521, 522, -283, -823, 171, -163, 514, 256, 541, -101, 0, -135, -729, 270, -172, -367, 69, 1396, -10, 251]
6580B51n09K38q04L71L14J70M22o35O23q45R43o05j306Q16R52n70l2m2n22P59
6600a1j079J580j097J289p97K61p95K20K18n11N89n05J65Q70l71m91j65J650q26
6619A94J49l67m68O67p06N50j208K307j228m91R47M93L77j559j7L13M78P5m67
6638C9J26l77r9Q85p19m17R03m23K55N69k105J848k00n69M17p9O73q11L28J91
6658D35p32M15j029J512j162m95J041P74m47k18n92J103Q07k321J609l86j339
6675a025J098L35j255R20L30j6J0o60J93L11o52K49J69m93J58M28P2J662j599
6694B35j257P26Q20p89K27J31r41J255k38p56L32k58L93k2p4K09q00P45Q5L67
6714C90k6L69q44Q19j148Q10m24J37M06n1P7P36j376k72P3P69n41J19p12J180
$$ y = [251, -258, -20, -824, -453, -139, 31, 453, -182, 441, -404, 539, -66, -1372, -556, 396, -174, -206, -248, -770, -11, -1090, 490, -607, 682, -115, 146, -649, -429, -211, -722, -133, -638, -473, 397, 26, -465, -630, 1020, 194, 343, -24, -492, 175, -531, 19, -1189, 1118, -110, -601, 346, 839, 1216, -343, -360, -47, 431, 506, 39, 165, -212, -311, 574, -145, -562, 341, -82, 173, 742, -1363, 485, 285, -284, 133, 54, 727, -84, 244, 435, -297, 118, -911, 601, -561, -1056, -15, 759, 312, 94, -498, 605, 1412, -909, 700, 314, -1025, 73, 408, -847, 73, 403, 387, 397, -263, -70, 241, -411, -162, 7, -486, -328, 100, 172, 1834, 235, -1022, -296, 524, -265, -38, 93, -848, 407, 169, -587, -255, -513, -120, -142, -216, -7, -807, -62, 23, 390, 364, 733, -111, 708, -440, 370, -54, 83, 489, 438, 515, 1251, -125, -397, -324, 445, -96, 23, -689, 491]
6734D91k47l50l04J036j369l3J07J195J83L11k256P71Q29j430O82K10L86o53Q
6753d33l81l54K032j792J029L38j313J244l10J084j102J08k81P34n15J302j825
6770d35L17l14O97k18M22J77K72r89P01q13k83J30J239m29o85O07K86q16p33N60
6790c07L02lJ1o7j86J04M51n39K69j025P17N06j045J022q03J326j156L50K90P76
6810I93j076N55k50j75P52p03q60Q53l84n52Q53m68K18N36L58j099K57J18J002
6829I28j324M96o44N96q13R15l11n95M50r0K51K08L24l81rk31p09J250o00J55
6849a34o7L82l69O75P3j567J229l80o25N09M88o75Q28k60k83O92m58L15m03K6
6869do15Q61J95n0p02K30R03j074J14n85L89L56N59J13q73O56l60L15n12l97N37
$$ y = [491, 244, -106, -410, 626, -743, -776, -669, 526, 709, 1020, -1236, -465, 364, -1066, -384, -174, 212, -441, -433, -814, -1168, 864, -928, 101, 439, -874, 370, 60, 1144, 42, 150, -131, 603, 88, 1390, -435, -118, -432, 265, 47, 469, 646, 918, -71, 630, -183, -466, -336, 903, 474, -211, 396, 682, -134, -867, -307, -5, -8, 3, -64, -250, -146, 305, -234, 35, -990, -273, 233, -812, 210, -593, 733, -423, -73, 217, 993, -83, 472, 222, 47, 799, 96, -764, 89, -295, -847, 6, -462, -244, 292, 650, -449, -192, -74, 928, -396, 100, -544, 52, -761, 154, -157, -752, -302, -392, -141, 67, 391, 10, 1, -230, -939, 311, -289, -134, -201, 181, -188, 487, 560, -1007, 222, -158, -783, -274, 214, -461, 367, 107, -176, 516, 58, 373, -30, -4, -619, 242, 437, 387, -315, -85, 818, -256, -142, -727, -338, 18, 577, 690, -183, 473, 113, 428, -84, -481, 56]
6890E6L09L60q91M47j280J123M6lp42L53M63J024r59p28J784j765Q45o69N14K52
6910E39q43L65n95l54K090p63n7k9j312J087O32q04J522j946K40O19j529R78k98
6929d58n3N1L70N8l9l41J483p22p65J012k73o70J71Q35L8l72o83Q04m54qn98L33
6951b81Q99l87o57P73j036J186j81m33J97k34Q48K55j20j267m71K48J79N92N20
6970F30k68L0n06L79L76m22K58j194O92M31n55p41P28pk40M79l63K8J97K88Q7
6991C07L89l93n74j46L74M54j130o2O61k67k82R59n77j97K54l92N89J452j502
7010h3M71j50m98l5O88o31R82j087P60j169N48L47N51r02k02J395j436K78O96
7029E23q64n1N57q66m7L20R64j249K68N73l04m42J245r84k4N18m18J12L27q12
$$ y = [56, 365, 725, -166, 281, -999, 124, 170, 167, -575, -222, 241, 1265, 306, -422, 1362, -403, 442, -227, 287, 539, -304, 61, -534, -888, 1202, 439, 382, 353, -959, 128, 760, -44, 1478, -468, -228, 391, -1138, -160, -458, -511, -460, -90, -32, -71, -412, 1071, 349, -416, 596, 323, -347, -176, 659, 697, 325, -358, 446, -8, -16, -614, -281, 618, 231, -426, 347, -689, 497, 316, -117, 80, -154, 694, 949, 829, -438, -909, -661, -482, 110, 630, 362, 392, -114, 265, 641, 219, 477, -717, -25, 406, -149, -890, -162, -169, -409, 70, -293, -265, -68, 220, 307, 696, 303, -271, -417, -43, 411, -719, -781, -120, -387, -669, 290, -287, -484, -230, -622, -33, 1419, -83, 388, 238, -260, -295, 393, -238, 744, -343, 417, -752, -204, 143, 694, -208, -410, 985, -451, -173, 523, -341, -392, 165, -701, -748, -428, 536, -713, -445, 128, -176, -618, 627, -357, -381, 137, -281, -169, 158, -654]
7049f54N28O6P03j343O46l66o72J053O98m49M57j359K65R03p20R07m16K43L2p47
7069b25K1O12l92O45j424J178k71k28m75P46J92k80j18k60L28K50j035Q85M10
7088E59p87p88Q79l92M08j86N61K8K15k94J85j28o69k56P44L02p70N95j69L40
7108C77l28J22j00l6j62j35J211j150J09N30j01J37j215J386r68J49J19J430j168
7127B07l53o46O16j32O82m43J14P19q12j92k93n02M89R33N5J92K15q45m48k43
7147f87Q64J86o56P02j159M52M39K99k266K062p66J759k099J54R78L20r76J078
7165F84j73p65P25j09M8j153Q73l24l55J913k100P63L11L39K48j185N5lM69p5
7185A86N48n51L12O19j230O41NK67r90J37O71m89L3l31j26R66r59L70k30Q70K64
$$ y = [-654, -126, -60, 643, -700, -54, -420, -1092, -39, 659, 210, 667, -692, -427, 476, -244, 663, 247, 490, 522, -225, -204, 408, 16, 661, -763, 415, 144, -84, -559, 187, 379, 99, -19, -279, 49, 299, -736, 149, 559, -228, -1016, -137, -529, -121, -307, 254, 282, 497, 203, 388, 260, -409, -665, 79, 381, -389, 206, 37, 377, 49, 171, 71, 35, -127, -262, 949, -201, -92, 438, 337, 474, -741, 645, -323, -174, -55, 1375, 207, -146, -792, -176, -308, 374, -69, 45, 764, -48, -240, -533, -1035, -546, 387, 442, 634, 849, 4, -444, -687, 177, 363, -293, 409, -750, -298, 141, 440, -1826, 236, -530, 1229, -870, -716, 262, 582, -394, 684, 511, -254, 471, 362, 410, -743, 130, -194, -549, 1364, -736, 27, 338, 677, 925, -260, -205, -208, 261, 186, 734, 183, 495, 1114, -116, 525, 530, 797, -193, -56, 615, 126, 159, -172, -298, 668, -291, 79, -151, 719, 983]
7206I83j201K53q80J163j5N51j245O97J33l74j410N64J452r11N03M89j059Q39
7224E32j112J03Q28q94O00l10J019q31M98k92l20O03o64k02K3Q04j240K88n09
7243a076J332j99j65O58J49j36l91On62M33J23p44K5Q50l72M0j59k54R79q39N01
7264A99P69k48Rp0r22L65k38o73N05L50k43k16J145m34j145J274n46j40k46Q27
7284C22j82J39J46q5p50P60m50J111o56j298N83K12O96m47m36R38j049O49j17
7303H6p54R13N93K4j731O26J240j387R8rQ37n82j91r5M08L39m76J134n36l1n00
7324Fj30n17j0K22k56j35Q04j63M21m97P13P08j149p58j23j21j42J519j71Q8n81
7345b72Q28j0Lj121R36J72l68J02K49l39n07K94j39k96J60J96P2j18k01J64J23
$$ y = [983, -218, 35, -845, 318, 303, 854, -391, 306, 439, 65, -1345, -781, 671, -240, 263, 752, -307, 532, -580, -477, 351, -543, 57, -253, 766, -65, 433, 141, -179, 424, -240, -442, -419, 385, -855, -567, -1076, 256, 57, -108, 550, 699, 563, 172, 178, -384, 49, 172, -572, -547, 303, -69, -29, -188, -442, 537, -302, 199, 968, 720, 729, 659, -263, 102, -136, -809, -304, 46, -197, -413, 732, 298, -847, 427, -119, -259, -505, 322, 140, 279, 425, 340, -410, 350, -100, 1011, 355, -943, -360, -148, 548, 101, -335, 603, -446, 203, 86, -668, 245, 838, 862, -869, -243, 997, -390, -292, -301, 536, -46, -237, -332, 76, 415, -61, 1073, 537, 506, 6, -124, -641, -651, -429, -685, -820, -16, -179, 242, -255, 458, 1166, 17, -741, -864, -985, -1127, 392, 221, 309, -272, 556, 546, 549, -572, 364, 536, 168, 270, 519, 180, -327, -33, -172, -468, -308, -112, -40, -158, -359, -195, -72]
7366g2K17m86R48q02L30L45J58j123PL14k38R63m35J23p81N65p22j054R67O59
7386a17O72m51K64O25j191k62M94J48p46J624j286K16J112m27j04j035n3p42J438
7405A79k99K04m82O0J26M09n12J69n8l29J696n94j486O43l2N39pj33p79O12J13
7426C9O30j796J271j15L79K5l65n15O14%p43R02M2q23P57j049J00P81J90R90k023
7447g09J210n50J72l02M14q82J119k77o6k14p54J137K33l46N77N1k41J18q69M16
7467B37l8p68N81L10L66K99j017K19m00K26J031j226J409j237M38k03M20j236
7485e89P02J84m72j114J422J36R56j472L70l80K80L21l8M17J6p27L28p69p67J133
7505f3K20M24j790K005j337R12M4K27K20j477O40Q54n40m44P42j457k70J859r65
$$ y = [-72, 145, -341, 607, -195, 135, 480, 638, -485, -478, -164, -402, 561, 126, 249, -532, 33, -689, -1743, -776, -117, 555, 104, 368, 993, -198, -460, 34, 182, -564, 1060, -226, -10, 1102, 675, 571, -464, -517, -1259, 179, -120, 84, -398, -338, -212, 197, -315, -146, -204, -533, 1163, 569, -917, -274, -306, 233, 226, 93, -686, -74, 39, 669, -1127, 144, 29, 408, 433, 68, -447, 167, 167, -576, 326, 368, -455, 302, -747, -647, 134, 324, 1314, -709, 501, -49, 123, -179, 235, -647, 472, 195, 129, -85, -839, 298, 531, 185, 762, 813, 572, 690, -179, 237, 199, -569, 12, 322, 688, 987, -30, 189, -211, 15, 1046, -180, 1229, -8, 430, 227, 647, -589, 113, 297, -175, -1289, 133, 269, 1225, -247, 123, -257, 23, 344, 306, 723, 739, 12, 340, -429, -1196, -63, 157, 581, -1209, 796, -541, 371, 415, 642, 862, -615, 25, 879, 339, -105, 637, -820, -1090, 769, -196]
7524a96n09M13M39k35N38n94P8j84N92K19J02n85N71r06l37J167n38j27R39r46
7544i9O81n58k53M38p00Q13k97J6K72j640J153K14O72p5r79R44j086p97J477O8
7564B64PN94m77J19k11q63M55K84K19K96j020P11j4J27j298P39r2K96j033J93
7584g04M63k02M74q64J244k33Q2k9q84J269j263J15P9J1P26j651R99Q07o62j59
7604c82J054j377J326j339j5J400j032O79r36J49R56j130M90J79J66k11k95J189
7622H71j749J454j072M79m6J01M43q98j47J648j559K5J499k204J434N3j05r74
7640g47J110M45j319m9k99Q64L0p99L34J728j588n88J953j604J655k104N34N6
7658c88o2Q07o55O9N39m28L59p39O12K52j299J324m08l61K17M71j31J73MK66o6
$$ y = [-196, -705, -292, 147, -88, 450, -144, -66, -250, 342, 561, 663, 78, 649, -257, -594, 573, 35, -92, 847, -99, 582, 24, -229, 209, -491, 322, 25, 41, 313, -1327, -174, 40, 712, 637, -342, 602, -484, -1281, 196, 264, 271, 865, 388, 507, 296, -567, -112, 172, 391, 687, -333, 378, 364, 491, -807, -68, -160, 136, -897, -704, -241, -443, 31, -833, 411, 178, 260, 231, -653, 616, -647, -532, -453, -442, 284, -1367, -368, 439, -223, -382, 672, -705, 621, -718, -733, 667, -365, 314, -622, -473, 483, -647, -157, 22, 188, -23, -318, 871, -878, 576, -496, -17, -63, 38, 481, -417, -564, 1084, -475, -450, 1049, -1155, 279, 332, 227, -747, 363, 808, -511, -560, -859, 5, 35, -764, -430, 1298, -290, -878, 1075, -529, 1126, -978, -444, -388, -450, 357, -298, -229, 310, -118, 241, -498, 114, 366, -933, 391, -17, -378, -161, 310, 179, 352, 356, 622, 556]
7679E56L05o61j26O70r71R75k50l00k51j01N06K1n46M85L30j252J549j173N51
7698C17o01k00J017l91j93N26o76O28j52n57j15M35J44j392J462O9M01q18J68
7717G2o18k83Q14P47j204n0O87Q79m75j058P27q78K13L15Q32j239K49k10O40q7
7737G3n7l52m6M62mn71N86l16l68R34R0K7j819J014K30p7j93K21n12R06o44J565
7759A149q11j764M64J778q09O82r2p63L5J175j289J98K46l90j14LR6J079m74K04
7779F03O20j478M31k73K71n03J655r11o52Q7n61R01j32P80j238P55q29N39j50
7798h5m91L87K51L55R8r24O03M88r12L73O25l55m28k07j3J232k395J167k81O22
7818A10o54N21Q13j278M79N01p87M91k29l41Q15M5l51L78k23l71K75m93m6J15
$$ y = [556, 861, 200, 74, 744, -227, 748, 498, 198, -53, -154, 352, 373, -173, 312, 642, -610, 939, -234, 317, -284, -484, 533, 142, -51, 475, -201, 427, 275, -282, -397, 38, 182, -1210, 252, 321, 722, -96, 72, -546, -829, -15, 732, -472, -522, 165, 1044, 569, -489, 238, -640, -427, -112, 720, -519, -270, -480, 160, 73, 16, -336, -382, 80, 76, -495, 91, -225, -593, 341, 431, 458, -1361, -347, -117, -194, -387, -166, -678, 228, -416, 1149, 338, -1426, -962, 816, 7, 689, 597, -166, -131, 1044, -245, -47, 199, -191, -305, -302, -206, 873, 399, 603, 1223, -255, 176, -97, 174, -329, 1326, 415, -237, -150, -711, 190, 58, 838, -400, 355, -474, 65, -85, -576, -189, 62, 417, 515, -409, 194, 682, -230, 143, 768, 413, -15, -222, -235, 997, -1398, -231, -512, 110, -544, -23, 790, -488, -9, 492, -295, 196, -33, -374, 441, 486, 135, 513, 290, -81, 194, -299, -345, -230]
7838b30M88M15O84r03K90p06o45N16J70j36M67J97q25K30K13o35k66J725j595
7857e46O85N82K32n35k68l64j00J093k77r54M61L52J59m43Q18K85r71o23R98L74
7877I58r07o48J034m48K47j0O25j301P64p73l49N83l79Q48J57o71j132J091O7
7896b44L60p99J296q2l04q32R83r88J020N10k85K40j308L72k65J53q4O63o52J21
7916a25n05q1Q19Q18j224O13J91n29K25q76J50L24J29M27m39o37J35j3L12J000
7936G14j05p32m79O80j43J352l40p26m27J60r2l27J04L79n8N52j255O01m9o02
7956g93P18l79J96k20n20P14k28M68Q02k85J57p98N28j397J255k56r9n90K54J841
7976A368j552m10R51n62m20M9p95J532L76j02k39N96j624J155j82q68L72J49k00
$$ y = [-230, 258, 673, 1357, 454, 744, 38, -607, -91, 79, -57, 410, 607, -218, 12, 225, -410, -676, 1049, -546, 139, 721, 953, 418, 150, -214, -314, 779, 502, -452, 9, 361, 520, 77, 895, 1180, 209, -414, 584, 958, 51, -597, 437, -11, 236, 226, 851, -450, 314, -459, -808, -225, -604, 244, 401, -270, -1402, -311, -244, 116, -683, 613, 531, 227, -605, 378, -610, 410, 920, 635, 875, -433, -61, -326, -173, -257, 406, -246, -125, -630, -711, 108, 926, -298, 315, 506, -23, 202, -674, -524, -200, -71, 356, -83, -720, -585, -598, -286, 714, 609, -123, -602, 78, -65, 1287, 947, 221, -206, -46, -138, -465, -361, 18, -40, 512, -743, -142, -191, -793, -75, -454, -258, -478, -998, -284, -512, -44, 758, 473, 630, -168, 360, -1037, 218, -38, -137, -727, -473, 1368, -184, -594, 357, -205, -625, -576, -1371, 161, 537, 435, 196, 792, -832, 323, 141, -727, -355, -206, -406]
7995d06R04l52M95N09j332m89m49J396k36O94j034K55P19j572R84J3l50k72k74
8014g97J87K67K23R58j644J630j006M99%j151R15n61R44o47n2m70M58J224j244
8033b67l64Q41l89L72o80K62J41r14R90o91O05N49j02r07J79M54j108J612p90
8052b07L06L15j80L9N32o77k1j92N50j463N64Q53r79J435o63M29j795J308o11
8071d57l68R12O75j828J756p55L43m5k69O74j054O68P59j243O32j093N21K43k37
8090a66k93J504q77M25r10k02R92q48L66j38J12q85Q81R31k96j352J150R5j053
8109e64Q76r67J232k90p34J03O72n24j29N04j411M53M59j63N00J118q10m52R10
8128G83l50K4p3O38p15L07j131N58k11L45j48Q41p78L87N91j147k25Q69l5o55
$$ y = [-406, 498, 146, 641, 1150, -182, -671, -1120, 276, 40, 734, -300, -45, 674, -898, 86, 99, -251, -523, -797, -610, -343, -120, 838, -806, 824, -182, 317, 317, -834, 81, -480, 464, -183, -235, -705, -247, 977, -267, -631, 210, -179, 193, -487, -225, -84, -998, -8, -699, -94, 455, 353, -554, -375, 79, -1029, 583, -207, 99, 414, 234, 273, 805, 128, 107, -85, 465, -998, -434, 419, -560, 875, 212, 641, -1154, 154, -457, -825, 87, 762, -1066, 690, -65, 278, 233, -36, 638, -416, 252, 1011, -232, 400, -693, -172, 71, -166, -459, 1045, 168, 593, -317, -519, 473, -375, -9, -147, -35, -920, -39, 892, 596, -756, 394, 489, -564, 312, -655, 577, 287, -447, -344, 328, -196, -325, 179, -1232, -779, -320, -483, 17, 1135, 325, -127, 783, 433, 457, 384, 1022, 307, 614, -517, 41, -170, 175, 27, 868, 90, 477, 1068, -79, -304, 565, 530, -125]
8148a25N52O92m08N3j29j204J17Q37m10L82o94N86M95N64j358l82Q18p1l79P75
8168G11p27j1j51r0J000q80Q0j6M45o04j61O03n46J80l17M50N31m71J110j301
8188a65P62j198K14
$$ y = [-125, 427, 1119, 711, 764, 635, -569, -452, 385, -25, 357, -337, 249, 744, 1308, -50, -432, 386, 315, -64, 711, -16, -27, -178, -268, 732, -148, -68, -84, 361, -243, -404, 199, -347, -167, -484, -34, 497, 26, 1136, -165, 597, -601, -387]
8191c87
$$ Imaginary data points
##PAGE= N=2
##DATA TABLE= (X++(I..I)), XYDATA
0@%%%%%%%%%%%%%%Mj12K16k16K16k16K69l77M32m54N62o53P61q93J003j190J381
31G33j547J730j960K223k488K785l113L464l864M300m767N282n842O445p113P849
47D117q651R531j0500J1558j2738J4048j5496J7127j8983K1113k3560K6415k9808
60a5827L3908l8984M5432n3909O5601q2718J10130j60424K79955j020309p29293
71a566438K596389j437435n05381J183716k06600J23930k16415j50295P78173
80E99644o39529l32735O68145k74710j87264L00931l21990K32393K70751p03656
90c88020K64652O15773p23070k2810M49071j27415m591l31464K42211O01318r07719
101c32064j03787J094065o61210n59796Q56541j57452k97432J79689k02998M55888
$$ y = [0, 0, 0, 0, 0, 0, 0, 0, 0, 0, 0, 0, 0, 0, 0, 4, -108, 108, -108, 108, -108, 161, -216, 216, -238, 324, -329, 432, -461, 542, -648, 733, -814, 916, -1044, 1179, -1309, 1476, -1637, 1827, -2037, 2263, -2504, 2778, -3064, 3381, -3732, 4117, -4534, 4997, -5503, 6055, -6683, 7365, -8131, 8996, -9987, 11126, -12434, 13981, -15827, 18081, -20903, 24529, -29380, 36221, -46497, 63633, -96791, 183164, -837145, -1566438, 1029951, -407484, -912865, 270851, 64251, 188181, -28234, -178529, 599644, -39885, -372620, 295525, 20815, -166449, 134482, -187508, 44885, 315636, -388020, -123368, 492405, -230665, -253475, 195596, 68181, 63590, -267874, -25663, 575655, -332064, -435851, 658214, -2996, -562792, 293749, 136297, -161135, 18554, -184444, 271444]
111B71444j26585o78130Q34065j3186p16905N89170j54240o5114L45885p30847
121d44443M87797M82728j014950L58910N63412n75567L0126J25858J7201J90849
131B21921m60803N4241O27881n23859k98835O51794j51782l02077J88381m4903
141c8041K13606j41629m09324O23292n796o59763M87554J52455l73687K08262
151E6929j51687P8522L43420o41109J44949O61138o97005n5513N32690l04448
161c2114L0322n7396p2127M78956m62619k20155P05692l50974k74366L71809j31785
172a4757R1098o7447k72772N06636p0058n63334M85322J73793m83087J75064J10157
183G0615p2379J10338k91498J28050L85631n02353m7400N05975k95913j32825
$$ y = [271444, 144859, -533271, 300794, 287608, -429297, 159873, 5633, -59481, 286404, -444443, 43354, 526082, -488868, -129958, 433454, -142113, -111987, 13871, 31072, 221921, -238882, -184641, 443240, -80619, -379454, 272340, 120558, -181519, 6862, -38041, 175565, 33936, -375388, 247904, 242108, -417655, 69899, 222354, -151333, 56929, -94758, -16236, 327184, -313925, -168976, 492162, -204843, -260356, 272334, -32114, -1792, -59188, -131315, 347641, -114978, -335133, 370559, 19585, -254781, 117028, -14757, 76341, 8894, -263878, 242758, 172700, -390634, 94688, 268481, -214606, -39542, 70615, -1764, 108574, -182924, -54874, 330757, -171596, -218996, 286979, -8934, -141759]
193a41759J77355n9984J78895k26904j70352N54649k63018l89467N35423r7993
203I6845k44585K22247j86446K02821P0279m99298M33146J86264n67096K62292
213b3531J92320k32449R0297j29083J13884K10737m32044J04908L79631l53461
223g8791o2965K37438q5666L1698r9907o7724L56268k21117k95059M72316n4423
234A32068l45260K47233K5058o6213N3936k02803K13639J46909m39077J89502
244d5008K73123l30141M1612R3907l6122J23464k64991N3687L76923m09531n8957
255a82034M01254k50088l5594J04299j19906K23956j43051k22993M13143q9757
265I9229l27634K86528M4804j55868L7910m3140J33862J0459k68004J96864J68821
$$ y = [-141759, 35596, -24388, 154507, -72397, -242749, 311900, 48882, -340585, 194838, 96845, -147740, 74507, -111939, 90882, 161161, -338137, 95009, 281273, -285823, -23531, 168789, -63660, 26637, -102446, 11438, 222175, -209869, -104961, 274670, -78791, -141756, 95682, 10016, 41714, -58193, -125917, 230351, 9234, -285825, 186491, 132068, -213192, 34041, 59099, -7114, 46822, -155981, 57658, 204567, -234510, -45008, 228115, -102026, -60414, 33493, -2629, 120835, -144156, -90469, 286454, -123077, -182034, 219220, -30868, -66462, 37837, -82069, 141887, -1164, -224157, 188986, 99229, -228405, 58123, 102927, -52941, -15031, -58171, 75691, 86150, -181854, 15010, 183831]
276A83831l05045N1786J66083j01808K1413q8147L7832K21210k83626o6183L78065
287B15411k07632j72682K51848o8459j9729R874j29022K44892m4825k95934K91913
298G5655N8005k56590J17833K3769P822K6709k07422J97599J28546l47153J37779
309c7448J89146k12037L2160K9416j5909J18567j83563k0261K78514j91882j41274
320a54571K47073l5856j16356M5337p30Q7474n9127j52574K17501K5761k41312
331a37380J34023Q1993j01507K6499o5127Q5407R9508k64192R3494K31670k65575
342h1187m098J76895j03342K3744l9461k9752J86644j54654j10121K49902p2668
353D1902j33849J02534N565K7538o4992p3792J95194m7154j94355J75096N4481
$$ y = [183831, -121214, -69428, 96655, -5153, 16260, -71887, -34055, 187155, -96471, -162654, 215411, 7779, -164903, 86945, 18486, -1243, 8631, -120391, 124501, 79676, -216258, 75655, 133660, -122930, -5097, 18672, 26494, 53203, -154219, 43380, 171926, -175227, -37448, 151698, -60339, -28179, 1237, -14672, 103895, -79668, -99929, 178585, -13297, -154571, 92502, 56646, -59710, -14373, -15103, 72371, 13244, -139330, 78171, 103932, -137380, -3357, 78636, -22871, 3628, -61499, 23908, 123416, -140776, -47282, 184388, -81187, -85285, 91610, -11732, 12012, -27449, -57201, 129443, -25211, -135332, 114570, 41902, -91947, 10587, 16152, 43690, -21302, -95094, 100100, 52946, -141409, 33687, 88168]
364H8168j48822M6855J6061J4913L5835j42912O9964J54535k00927k6155J99629
375A07144r5459p2124O6363m823N3179q0565n9164J86351p3527j40437J55382
386D2320M02o7022K1480m4127J09281j5166j81023J77323O0881k06758Q6176P7402
398F1169p2787J5804m6637M6125Q2841j56959J8297J50209j03645n5405P4825
409A3837J5195r006o6139J3648J18316r3467q5365J50549j2553j02542N3940J6839
421A3252M764l220q4997R4570O1398j74154N8394J22105j18685r747M7989j521
433A0148K4449q5172K1582J17795j16731l4605J13997m0425k3477n765J336Q4057
445F7189q5463o2234J53105l7918j15086R4120K4615m7878K94j7434N7473N363
$$ y = [88168, -60654, -13799, 2262, 17175, 53010, -89902, -19938, 134597, -66330, -92485, 107144, 11685, -60439, 5924, 1101, 54280, -26285, -85449, 100902, 27375, -113062, 42320, 42722, -24300, -2820, -46947, 62334, 47168, -133855, 43468, 104349, -102409, -16233, 61169, -11618, 4186, -42451, 3674, 86515, -70444, -52147, 98062, -5583, -60988, 13837, 29032, 20026, -46113, -32465, 85851, -7616, -92981, 57568, 45015, -57527, -3587, 13252, 18016, 14796, -70201, 24369, 85767, -88387, -29993, 92112, -26573, -36320, 11669, 10148, 34597, -50575, -28993, 88802, -27929, -62534, 51463, 11038, -12439, -18204, -16868, 67189, -18274, -80508, 72597, 34679, -80407, 13713, 38328, -9550, -9256, -26690, 30783, 36146]
457C6146j00154N8077P4309r2371k0173O9382L77l2136k9794M2514N1915r4744
469c6652j1683J09545n1030n7931N8699q92M010j8611m4594R9117j7758j13664
481h1444J00347L6379r4562K4012K5950N683o471n8098O2550L7605r6271K3673
493b0647N7656l4053j6415p843L5267K4820q0995J3758R0920o7898m5127P4963
505B4406l13l7945LR235L2255k1476n3104O2470K8792q1215J4525N4233k1733
518A0133k6987l557M1832Q592p4148L1277O3451o6519j0282M1239j0447P686l2932
531b0662J178O9389n7777m1940Q5752j2821n6437K6659K0810Q20k8244j1421N2915
544B8221j3232m7671L0790K7123k4112k0151R968L4422j4017m9264M0880L7749
$$ y = [36146, -64008, -5931, 68378, -23993, -44166, 25216, 25593, -6543, -36337, 6177, 58092, -36652, -48335, 61210, 10180, -47751, 10948, 10056, 14066, -4545, -49139, 49978, 32220, -81444, 18903, 55282, -39280, -15268, 10682, 16365, 9894, -48204, 14346, 51951, -44320, -20647, 37009, 2956, -13459, -21302, 13965, 38785, -42210, -28452, 62468, -5430, -50557, 24406, 24093, -13852, -13849, -4614, 27641, 6165, -46939, 15531, 44323, -36892, -22367, 31866, 10133, -16854, -20411, 21421, 30013, -44135, -12858, 50593, -15926, -26208, 15031, 4584, 12270, -20662, -19484, 49905, -7872, -49812, 35940, 23119, -33318, -6659, 14151, 14971, -13273, -24694, 28221, 14989, -32682, -1892, 25231, 1119, -19032, -9064, 25358, 11341, -37923, 2957, 40706]
556D0706o1167q701N8567j8518l0871J6990O984J3224k3294k4994N7733o032n6477
569c5850L5486K5992k8390j4180Q774L4091k0592m2057N0245J2363m8295J4949
581g464J5694o51n262k4754K7228K5996n4288K876N1530k6824k8270K3594J8311
594A7716j4115k2619J7303K1353k0367k0780K5349J4890k3721j1706K1458J3802
606A8563k4688j5049L4500J0199m8338J4023L8257l2674p571J5157J050R316k5123
619a2378j286L9479k5303k5594L2805P189j8878j1235J8571J7954l4670l162L4586
632A8078j2367j8844R231J0768J724j5408p467K8842l164l2651J7740K5581k5572
645c509j5895K7795M691k2364J723J3345L385j2499q818J8767O087k2461J752
$$ y = [40706, -20461, -29162, 29405, 10887, -19984, -2994, 3990, 17214, -6080, -31074, 26659, 20627, -35850, -364, 25628, -2762, -16942, -8168, 25923, 5331, -36726, 13519, 25882, -22413, -7464, 8230, 7579, 2317, -22437, 4791, 30787, -23501, -20625, 30905, 4081, -24189, -595, 17716, 3601, -19018, -1715, 19638, -729, -21509, 3840, 18730, -4991, -16697, 4761, 18563, -6125, -21174, 13326, 23525, -24813, -10790, 27467, -5207, -12778, 2379, 3429, 12745, -12378, -13664, 25815, 512, -25082, 7723, 14912, -3966, -15201, 3370, 21324, -13346, -16508, 18078, 5711, -13133, -3902, 6866, 8590, -6818, -14285, 14557, 11393, -21258, -3518, 22063, -3509, -19404, 8391, 13082, -9282, -7559, 5786, 9171, -3328, -12146, 6621, 12708, -9753, -8001]
658h001J7818j882j6861l570L0012j0432l0787L0256P029k2582N329M184N109
671E622m81j9096J5379J5431k4650l097J9072K143j9227k507K5410p938k0773
684a4712J3586J2199j2043o412N531R407m799j3221P890J3324r218j5488J6630
697B674J2469k4949j53K2747r340j2301P095O175j4q650j869J5611n206j2312
711h023O193Q163j047j6622Q807J9223k4280m258K2210o166q225J798L576M489
725E838r845k005J0733M27j0451j858J5607j948j8889J2038J1396j4194l728J0699
739C820K225q143m124P992L570q212m26M123N195o864r064J7447J7j8965J0491
754i18R946j0625k807M883L682j902p204N108N548n396n215K553J0722r083j0156
$$ y = [-8001, 9817, 7935, -8926, -12496, 17516, 7084, -23703, 6553, 13582, -9000, -3671, 513, 5622, 5141, -13955, 1424, 16855, -7795, -10892, 8180, 10323, -8904, -11411, 13999, 6061, -14712, -1126, 11073, -970, -7382, -1851, 7556, 2757, -10464, -2574, 10750, 1532, -13956, 2674, 15143, -9806, -9959, 12788, 3448, -8853, -1758, 4417, 4403, -4247, -6116, 9495, 4289, -8023, -1830, 6333, 5286, -11336, -2529, 16694, -7586, -11844, 10366, 4200, -4025, -2227, 1349, 5838, -4007, -6012, 4721, 5148, -5303, -7161, 8446, 6498, -12391, -353, 11043, -3151, -6879, 3820, 6045, -2098, -6222, 1770, 5340, -2872, -3298, 825, 6020, -844, -9908, 7539, 7556, -11409, -918, 9028, -1597, -4404, 479, 4161, 2259, -4945, 163, 5711, 315, -4900, -2347, 8375, -708, -10864]
769a0864J6974k54j4359O853O692m384m416K036O664l586n110L023M469j90q713
784e165J291J4251j0593p632J3320n93r346K978M042j914k958q09N920j099j889
799a96k588L752N040j1125O39J2769q492p699J0866J061o284Q8M097R11n123R67
815a317J993J230j008n906O326N603j2023Q69J1409p525m950O455J810k854l014
830b902M522M04l439J760k070M747n7q711O346N411j0733J901P325l122n245L213
846f50L353l228j770L446p15N44n22k711N541l18r657P317M414p944l1O268j787
863A550l977J372M518l650j313K232j412L811k986l395P502k939o419O182K959
878D035n907l57L298J619m789J797L296m481M048l674o42M504l022l438O550P58
$$ y = [-10864, 6110, 5856, -8503, -1650, 5042, 658, -3758, -1722, 4942, 1356, -3754, -731, 3738, 3548, -5165, -3874, 10377, -216, -7848, 5472, 4879, -4467, -1489, 2553, 639, -2319, -3128, 2792, 1693, -196, -2784, 968, 6008, -5117, -4478, 8291, -201, -7900, 2966, 4027, -2257, -2169, 1928, 2839, -2284, -1317, 676, 1906, 898, -5008, 1318, 6921, -5102, -4233, 7176, -349, -5299, 1156, 2966, 112, -2902, 1620, 2024, -1415, 345, -1725, 3022, 2965, -5746, 600, 6011, -4722, -2821, 4504, 1382, -3863, -650, 2703, -525, -2295, 1151, 436, 980, 458, -2253, 3288, 2970, -6687, 630, 5044, -2900, -2931, 3337, 1550, -2427, -1055, 3463, -187, -1500, 732, -680, 3131, 145, -3250, 4252, 1313, -5106, 1076, 4035, -1872, -2229, 1069, 2688, -2101, -304, 2992, -1489, 2559, -1115, -1757, 2747, -275, -3713, 2837, 3595]
894C595p128L607K774l122k953M211M52l559K535L38r05K752m447j163O457l423
910B1l641O515j556k716l12M628j845l691M753j340l459L836l120J728K298m978
926b879J422N414l837l025M278J09l228n4M308l133j408L550k569N08J910l163
942a797K333J523l870q24M566k652j372J616K416l799q64N085k348k98J939l358
958a704J219J079k658K285K049m134N09L719k126j703J498L045m963Q13L022m063
974b113K254J383l847L340M97l407L422P34l005j656L444J51l785K769J185l713
990b347K413J421l169K639n12j716K104O76k485k40K804j428k231L601o87m033
1006c190L802m4k058K036m93j841K724m71k153K475m41l92j166K896p48k622L532
$$ y = [3595, -3533, 74, 2848, -274, -3227, 984, 1436, -2123, 412, 750, -155, 2597, -1850, -3013, 3444, 21, -3620, 2895, 1339, -1377, -1689, 2939, 1094, -2597, 2156, 816, -2643, 1193, -1927, -199, 2099, -2879, -1457, 3957, 120, -2905, 1373, 1482, -1746, -1800, 2508, -625, -2033, 1517, -1052, -544, 1366, -1797, 536, 2059, -1811, -2635, 1931, -721, -2093, -477, 1939, -1860, -2724, 2361, 13, -285, 1654, -1704, -485, 594, -2064, 221, 2270, -1864, -1355, 2364, 238, -1465, 33, 3078, -1885, -1072, 1950, -2113, 141, 1524, -2323, 1017, 1514, -1893, 1529, 2263, -742, -2398, 1046, 1197, -2588, 181, 1366, -2347, 66, 1487, -1682, 957, 445, -1271, 833, 1509, -976, -1216, 1588, 160, -2071, 1530, 843, -3190, 612, 568, -1490, 546, 53, -1788, 936, 465, -1688, 787, 346, -46, -1212, 1684, 936, -1686, 1846]
1023A846j243k511K412N87j338J586j257k066L345m0k028K17K407l106%M232k791
1040B52j213L504j788k301L080j350j803L058k299L07J95J541j647k28L289m233
1056a636J465J926k716P56J904k162n04K616k371R1J681j165l88n96L346l994
1072a747J762J276l624K064K281k252l86J988k678J054J896k243O25M66k1j724
1088a263J482J234l406K788O11l785K440O61j613L31K119k274q43K434L60k508
1104a232J950L48l527K478R49j800J005R96l607K196J190k704K601k83o85N41
1120D16o00K62j743K464o94j467J639k21n62Q78M81j960K029l89p94N36J09k56
1138A28l96Q97j135l09J275o58j174L063k076p11J885q43n95o1J484r76j048K670
$$ y = [1846, 603, -1908, 504, 1091, -247, 1339, 82, -1984, 1361, 1321, -707, -490, 1917, -1189, -1189, 3043, 252, -961, 2543, 755, -1546, 1534, 184, -1619, 1439, -860, -553, -358, 1183, -464, -692, 2597, -1636, -171, 1755, -961, -205, 1699, -463, -967, 1649, -722, -631, 1050, -115, -503, -1099, 2247, -1747, 15, 1291, -2333, -269, 2012, -240, -626, 1362, -1316, -262, 1634, -609, 16, 482, 461, -1263, 219, 1453, -1953, 835, 1446, -2339, 101, 762, -851, -520, 1599, -675, -1518, 916, 1276, -1232, 718, 1066, -2461, 17, 966, -834, 171, 1167, -2440, -244, 946, -1758, 843, 560, -125, 416, -184, 78, -1665, 799, 105, -1362, 277, 56, -506, 372, 853, -1107, 922, 533, -261, 275, 384, 128, -268, 629, -506, -815, 460, -198, -1372, 1691, -385, -1096, 789, -54, -649, -710, 774, -202, -1250, 1420]
1156A420n33j190O95j118p60J492j01r98K422j396k60N28Q99j335M9J656k180
1173g10N4K054k747O13K522k263l92K407j871l73K272j693o91K091j478n04Q24
1190A15O78j703J627j94j510P43R00r19L88J167j831L66M48J24j392J801l79j768
1208a339J001M5o90P37J380k637J906Q84k440J917Q74k694J207N34l2k636K072
1225H9Q28k198K803j544k117K177M98j476J216N69j383P63k83r7p4l9n0l64K416
1244A734j708k35J309j552p16J957J19k302J346L75r73P90M70j669P10L98j58
1261a05O2J594j269j773K543k43q44R73l08j277N66K38J70m49J526j647M7O85
1279D89mk340L514j421j696K245j693R90J83Q23k406J230J297j861m9J364l8p86
$$ y = [1420, 887, -303, 392, -726, -1486, 6, -95, -1093, 1329, -67, -327, 201, 1100, -235, -186, 1470, -710, -656, 1398, -1349, -736, 1786, -477, -869, 1538, -333, -706, 1566, -127, -818, 1273, -205, -709, 115, 793, -910, 717, 523, -987, -244, 656, -263, 125, 1292, -539, -173, 275, 399, -993, 808, 429, -1339, -338, -293, -983, -246, 1134, -1503, 403, 1287, -1153, 764, 1638, -1056, 151, 685, 653, -1983, 89, 917, -1281, 1522, -22, -2139, 38, 536, -940, 276, 845, -538, 225, -58, -155, -229, -268, -318, -682, 1734, 26, -209, 1100, -452, -1168, 789, 908, -1394, -48, 327, -646, 144, 614, -1055, -345, 53, -105, -43, 1551, 282, -1491, 1052, 809, -35, 938, 630, -647, -81, 157, 327, -122, 1404, -243, -196, 489, 485, -1855, 1659, 238, -1458, 787, -906, 84, 267, 1090, -1316, -86, 1211, -650, -699, 665, 627, -159]
1297a59J223j376o53J519j433K37J764j300l1M57m97m97J863N06j499qR70j258
1315a72j65R51j057L73K89r36N35K89k28n76Q03J329k681J717N39k256J334P94
1333H82q21q81K42l60J041N28j65n34J027p38j216N51J215j367L78J605k019O01
1351c1K1j307J355l29oP28q72J62l59J428m10m30M02j268J09J734k24k022J108
1370b11J076j675J248l5o47O59q65M87j255J657l70j152J469p9p84J065m17j245
1388a074J143N90j239L66L74r08J552J290l113J513M43r16q87J437o68j55L28
1405G6k71k29l17L34l93J596J310j978l98R29j065j50j37Q86m97n6O48m87L96
1424A97l32q33J713j107j193J426J251m55p45M85k221J205J308j494K24O89k47
$$ y = [-159, 1064, -312, -965, 554, -879, -642, 1122, -178, -209, 248, -249, -746, 1117, 1623, 124, 116, 1086, -172, -337, 614, -443, -70, 219, -717, -182, 107, -121, -697, 106, 1435, -1246, 471, 1010, -1246, 88, 882, 61, -820, -578, -938, 103, 631, 466, -68, 959, 221, -995, -444, 771, -596, -218, 1387, -632, -31, -10, -1317, 38, -291, -297, 431, -441, -279, -638, 790, 380, -50, 352, -916, -807, 927, 703, -1319, -211, 865, -810, 438, 403, -244, 415, -450, 37, -1218, 439, 69, -1083, 386, 307, -477, 588, 171, -1074, 69, 659, -580, -214, 160, -748, 804, 2094, -1019, 494, 937, 21, -866, 571, -97, -252, 76, -195, -424, -741, -407, -800, 796, 2106, 128, -270, 659, -406, -556, -693, 193, -304, -360, 288, -199, 197, -135, -968, 745, -362, -1555, -129, 1122, 667, -78, 407, -1814, -609, 699, -795, -571, 118, -129]
1441a29k41k54Q26n97K41J384j542l1J316j374J160L04j073L45j61k39Q13m80
1459B68j037K40J206m81l66M99M9p00N51o72O15M19m91p37J099k16n37K08r3J406
1479A230j823J138j087j21J097J31r18N52p0o43R12lj98j080J080m18n03K83R87
1498E46k20O70j055R80M8j836Q43N54o47J39P17j355r4j13J552q47l90O74j324
1517a158L1J271k35r47J953p12m24P58j71p14O41o36O09q4Q40j283j99J243j271
1536d88L35Q3k46j528K809j951J283L68r69L43P4K86j432J316O40j038N80M63
1554I28r31l83R2R56p69N41l91J84P92j870k38J127N68q8n08o9o45L74L26p19
1574g23J060o33J78J50M77m61l24m24L05j32K48P32r52q49J309o41J315l05j056
$$ y = [-129, -370, -624, 202, -395, -154, 1230, -312, -343, 973, -401, 759, 1063, -10, 335, 174, -65, 748, 268, -769, -529, 677, 196, -170, 329, 378, -322, 229, -443, 172, 591, 100, -637, 462, 246, -291, -83, -176, 1230, -593, 545, -542, -663, 434, 565, -353, 199, 129, -514, 398, 395, 197, -883, 197, -221, -724, -441, 546, 326, 996, -59, 921, 969, -867, -24, 530, -117, 22, 739, -616, -710, -823, 729, -118, -508, 166, -1158, -1127, 144, -91, -1038, 915, 203, -221, 537, 366, -348, 293, -343, 266, 182, 1022, -261, -460, 783, -488, -153, -70, -316, -1844, 965, -986, 297, 665, -304, 39, 113, 399, -1033, 283, 923, -115, 465, 928, -3, -386, -294, 662, -107, 434, 43, 227, 1019, -851, -1089, 38, 606, 518, 10, -59, -704, -330, -4, -723, 337, -296, -118, 32, 509, 48, -276, -700, -395, -527, -279, 453, -499, -1348, -39, -680, 635, 330, -726]
1593g26J122J05j784J196mk15J62P63o04K74o21P35j154J213R9j804J361L92j190
1612f80J154O1p06J77k64O20r82J599j072O78r12N42L6j279J069j293J545j36
1630A57J24J94j247J532p30K29l22Q17K8J39p01K74J99q12O24j73O82n06k87q29
1650f08Q35M53j023J92m35L52K03N7m32j82J031J24q07k5J34J46m56M60K26n25
1670b80R99ko49J090j344L02K43o07J00N99j151N73K24K77j551J847r67J441j016
1689A28o95j00J199k39J34J077p22j411p04Q07M09j346J999j225J524m72r0n20
1707b47J89M43p47Jk04J094q69K20L33j712J498j84Q66j37l93m18Q32r26m31L56
1727d36j18k13Q57n03l6k07J196q98j05J514o94r77J688r91n31J623p94q2K40
$$ y = [-726, 396, 501, -1283, -87, -91, -306, -144, 619, 15, 289, -332, 403, -751, 462, 561, -1243, 118, 510, -680, 474, 535, -171, 6, -258, 362, -620, 979, -93, 585, -327, 215, 251, -1028, 41, -1252, 293, 157, 281, 475, -772, 760, 30, 259, -63, 754, 782, 921, 220, 494, 693, -119, 505, 332, 1014, 508, 221, -608, 227, 680, -343, -151, -586, -234, -31, 26, -406, -588, 443, 567, -240, -265, -131, 15, -441, 19, 245, -280, 719, 717, 68, 1158, -186, 116, 359, -248, -148, 451, -700, -127, 97, 374, -1177, 670, -297, 1144, 128, -567, -667, 532, 293, 427, 1504, 782, -629, -1333, -526, -117, -1463, 536, -689, 835, 363, 273, -247, -58, 385, -362, -361, -565, 529, -340, -120, 213, -1499, -1, -185, 681, 544, 151, -267, 565, -361, -792, -436, -554, -767, 90, -413, -449, -656, 540, -358, -463, 1051, 357, -620, 1068, 77, -454, 1169, 375, 293, 533]
1746E33J86j636L29P63l31M41j43o39P11L9j016J214j547R41j059J405o5k17L76
1765B85q85p47J538P5n37J5J152j220l65J137n15m4P89q97N17k26j11q32J295
1784D24r60L31J290p56P1l14m11o6J237n01m57o25J368r42J28N37j92k81N66M01
1804H48r55J9P2q75O71P62o14L70j12q03M38P47j327J698r60J74l18K74J72L29
1824F10J13r01k66p7O66j785J263Q13k88j48L60j084P95L6K86N4o95N14K30r55
1844d59R59Ml93P4j280J143rl27N16N81P6m69n78J01M4O99p50O58o08O15o39R68
1866I26M08j958O44l53J029p51k66J856j166K23n67j256J521p99P3Q00o38J66
1884a08k14M29k41P23m93m53j19M96j17k9P52K84j334N93j175R62J99q06O03m51
$$ y = [533, 719, -917, -588, 175, -156, 285, 142, -497, 214, 253, -763, 451, -1096, -155, -1214, 191, 126, -91, 285, -600, -1347, 191, 266, -271, -256, 896, -324, -689, 448, -67, -111, 678, -219, 298, 72, -39, -871, 424, -536, -205, 1085, 329, 400, 86, -325, -391, 846, 345, -112, -737, 631, -311, -183, 354, 162, -119, 447, 848, -107, -88, -16, -891, -220, 542, -72, 298, 186, -617, -179, 568, -759, 939, -21, 153, -165, 109, 281, 610, 723, -178, -444, -521, 145, -1640, -377, 436, 148, 0, 360, -724, 71, 107, 393, 447, -248, 266, 496, -459, 500, 504, 111, 185, -1095, 48, 39, -288, 228, 809, 885, 416, -162, -61, -17, 682, -68, 590, -18, 597, -42, 926, 1334, -624, 20, -333, 696, -55, -321, 1535, 369, 592, 25, -1231, 290, -509, -436, 364, -274, -108, -322, 107, -134, 589, 96, -357, -476, 20, -97, -126, 626, 910, -424, 169, -1006, -44, 155, -651, -48, -499]
1904d99J026o48O3j98P46n28K39l32l96P09J19k85l30K69l71Q2l29J193Q00j506
1924a76j31Q9J029j674O13K26j68L24Q21j073K9j16n92J804j129L69m55L93R1
1943B74o92O95K45p53p77J873j507M85O09j467R84r48N02N24q11J405o11O0N42
1962F32K39l02J51j313J38N69l02%N63k47J46m79P15o33O06r38P70p12O65p50
1982d82R37j69j22j410J334j86J22N45n72M8j47j15J55M8J33q18N45r32qJ562
2002D68k66L77l63n78L61j03L68N49p27L64n94k47M23J22q66J334l83m00O33m53
2022A9K09j015Q87j032J280J28L50l71L98m67N8k14m18l07M62N66j139K96J114
2041H04j597J346K15j73j19r85N12L0O03j428P11n30l31J049m24J47p40Q82J32
$$ y = [-499, 527, -121, -58, -256, 490, -38, 201, -131, -527, 182, 301, 16, -314, -45, -416, -334, -663, 530, 1330, -176, -307, -218, 811, -863, -250, -24, -192, 132, 953, -120, -91, -207, -799, 1005, -124, 245, -210, 183, 274, -418, 277, 522, -231, -1008, 865, -642, -157, 452, -1015, -31, -979, -477, 47, -764, 641, 30, 90, 632, 871, 569, 720, -593, -455, 114, -188, -188, 375, 128, 274, -205, 510, -123, 483, -455, 315, -397, 268, -482, 455, 286, 164, -1246, 88, -98, 24, 569, -3, 45, -102, -217, -62, -14, 119, -699, -154, -1086, -1094, 468, 202, 579, 216, -362, -1, -104, 264, 813, 86, 450, -144, -391, 32, 154, -712, 622, 239, -161, 472, 19, 228, -787, 100, -932, 348, 476, 826, 455, 853, 386, 444, 230, -188, -495, -33, 533, -606, -310, 804, -793, 553, 768, 595, 476, -509, 3, 33, 636, -792, -81, -611, -942, 107, -317, -170, -910, -28, 104]
2060A04l44L34j66l1J58l56o99M18J380j899J490m78O81j57j954K083n47P44m85
2079B76K1j45n67m1P64N2p43P13k74q8r8j91n66R19O81l38k87K97O27o36l75n85
2101e84N32j52J75J107j404l11J402p35r87l5J076J50j579Q19L97J72k45J88O24
2120F10j089n88K62M37r4Q75j58l32j06O90k78o01J137l11l25M97m23M11j394
2139g80Q95o81jk64R06j79j01O90j067k46Q25j26M85M02p72O63p01M72o70M85
2159B35j84r0M55l86n59K21J44j85L65j70K66j538J386l91Q08l46j80l23k74Q04
2179E8K17k13r19R32k86j347O89N80J359j05l36l80j85l67m04K137j905K4R55
2198E04l61p25K44L90P0l01J009k44r64M02p90r5K22P44o21O93k72O2N12L1p10
$$ y = [104, -240, 94, -72, -103, 55, -301, -1000, -582, 798, -1101, 389, -89, 592, 435, -1519, 564, 17, 761, 276, 297, 152, -415, -456, 308, 360, -383, 330, 56, -32, -130, -321, -887, 32, 713, 375, 88, 385, 1012, 376, 1, -584, -52, -204, -29, 1078, -326, -637, 765, 30, -957, -992, 84, 234, -1345, -526, -129, 43, -202, -14, 610, -479, -1067, -805, -368, -462, 413, 255, -77, -183, 507, 229, -372, 765, 454, 129, 626, 203, 614, -780, 115, -566, -567, -831, 75, -104, -205, 485, -582, -828, -3, -129, 356, 758, -14, 649, -52, 420, -250, 235, 51, -39, 416, 30, -529, -308, -164, -349, 16, -154, 112, -1426, -40, -431, 377, 31, -149, -472, -746, 58, 275, 62, -857, 75, -211, -1558, -869, -289, 1070, 965, 629, 249, 64, -303, -707, 1430, -475, -451, 504, 143, -582, -338, 52, 122, -179, 830, 586, -378, 24, -766, -861, -639, 105, -516, 177, -95, -33, 479, 510, -200]
2219b00j31N38Q65j178o70N34L12j34L05j428J504j272K39O76m34M78q58Q09K92
2238B47k52K17M55m22m27j7O13k14p7o57Q93l51M1n6J12k21K10K55o78k04M98
2259c5n72N07p73L00l58Q28M53j96o73o4k63J563l42r61L51J23L92L74n41L89
2279E02m28p6Q4j1R9j49O18p26n45K19R68J90k51p11M17o50J141j642M17J78Q86
2300E30j436J435o87%K59q1j157J225J291O5j657P03j68k10L50m03o4p10J168
2319D53m70K24K55o29N22P66q48K00Lq5P2l66l82P74Q4j137N06k91N32o00K94
2340a23k22R83m65M57r50Q1M92n64J30l81O65p31N03j22Q26m8r47L18n52O15L5
2361@M02o82Q07j341N28M06l58J101r33J370j878Q01K15j312O12L51l16K61M0
$$ y = [-200, -331, 207, 1072, -106, -776, -242, 70, -64, 241, -1187, 317, -955, -716, -40, -474, 4, -854, -45, 247, -5, 212, 667, 245, -182, -199, 414, 200, 123, -534, 359, 8, 49, -7, 105, -116, 94, 349, -329, -533, -35, -607, -100, -873, -573, -931, -103, 350, 154, -519, -583, -846, 717, 375, -586, -235, -112, 280, 654, 113, 502, 74, -2, 82, 71, 170, 21, 639, -87, -632, -413, 555, 745, 494, -217, 200, -450, 691, -951, -534, -356, 530, -906, 529, -158, -158, 101, 20, -1137, 88, 1379, 1444, -213, 490, 322, 112, 462, 59, -5, -715, 453, -17, 207, 462, -167, 355, 1121, 273, 473, 476, 391, 463, 97, -285, 489, 573, -564, -58, -349, 183, -417, -123, -345, 638, 173, 630, -320, -239, 253, -311, -181, -562, 103, -628, -125, -247, 579, 531, -416, -98, -650, -35, 0, 402, -280, 527, -814, -286, 120, -238, 863, -70, 1300, -578, 223, 438, -874, -262, 89, -227, 34, 74]
2380G4q11P72N84j454J132o98Q3N67q02M22J44m63N06m42J10L80J78K46j2n12
2400Dj43K0k10m91J347j165R82r30K15L96n1j27j046O59J194j427P67l71O40l03
2420d0K60n2M18p13j06J92k01N93M98j041m5j1M20n13K21O29l80l3r32J044m21
2441b13R02j195M0Q06j31k17J01j69j71Q20p01N38l70K87o90M35r7J97M06q64
2461b86J98J10l82J323j009R3L00n45o11J775j451M31M05j00n79J014q41N70n21
2480a06m84J68p35M73Q21N63n13K86o02R3K47j019j74J132L94r8m28L46M88j220
2500c68k66p6M72O68K22m37m59q70K23N20M51O21k04j39M40J21j594J055L8j354
2520i36J043J321r99L00j605P58l00k07N32M01j292O78K59j77m6j24O08J38M17
$$ y = [74, -737, 35, 619, -835, 297, -401, -318, 249, -553, -131, 13, -450, 56, -386, -276, 104, 282, 528, 516, 4, -139, -119, -329, -820, 527, -638, 344, -586, -371, 25, -26, -153, -1199, -540, 654, -773, -6, -377, 263, -40, 220, 168, 586, -127, -233, -41, -242, 351, 849, -192, -237, -248, 172, -341, -120, 509, 129, 96, -836, 208, -213, 689, -506, -466, 340, 209, -8, 93, -76, -247, 573, -128, 410, 40, 327, -363, 72, -25, 172, 578, -286, -88, 22, -360, 963, -46, 47, 347, -198, -809, 966, -485, -54, 351, 251, -328, 686, -155, 415, -106, -590, -422, -1157, -684, 137, 700, 187, 473, -129, -36, 211, -808, -982, 150, 544, 446, 18, 364, 852, -368, -634, -710, -238, 430, 652, 215, -244, -1114, -891, -371, 80, 701, 497, 358, 798, 919, -675, 380, 418, -936, 107, 1428, 429, 729, -876, -118, -418, -625, -93, 308, -984, -306, -47, -224, -270, -394, 214, 352, 769]
2539G69j019k87k27N79q00R46J099j209k82J169j130n56M21L16k40P06j359J068
2557c6J8J072n96m27j91N4M65J54l19m62N73n64k0N07R1m49M89q67O81l37Q78
2578G14j018l8J635j344p39J92j76J240o57K46m42j81k12J632o74n27K63m42R57
2597D29l01o38O68N27j287L09J09r19K49K89M71P2p28J541j228P23n4j417J407
2616B22J29j317J246o27o05N56J080l57l78j14r98J294m14j10N63P53j301K40
2634a38N59O36m96p48k6j29K40P56p99J36J07n42K33M3j96J20Q65j619J268M85
2654G55j337M36k09O26m18K75K22j12P67q08N36n75l09N57l8P33k07j425O17p22
2674f36L50L57L93p82K55q5k83N89m93R52l88m01o05Q83K59k53K26m39p42R24
$$ y = [769, -250, -537, -764, -185, -985, -39, 1060, -149, -431, 738, -392, -948, -527, -211, -451, 255, -1104, -36, -18, 1054, 458, 31, -160, -106, 359, 513, 194, -268, 305, -259, -279, 228, 319, -130, 359, -508, 173, -164, 714, -304, -342, 1293, -51, -790, -598, -774, 466, -191, 55, -387, -568, -780, 852, 178, -349, -86, -528, 429, 128, -510, 158, 685, -602, -293, -184, -1103, -854, -565, -94, -22, -750, 791, -437, 286, 232, -1185, 222, 351, -966, 280, -347, -952, -396, 684, 327, -51, -165, -1163, 131, -283, -393, 170, 923, -378, -138, 421, 1057, 561, -187, -213, -342, -102, 654, -145, -9, 98, -444, -211, -168, -364, -244, 621, -998, 270, 755, -582, -146, -355, 271, -147, 128, 350, 238, 1005, 197, 733, 158, -151, 406, 368, 1101, 894, -531, 86, -636, -286, 71, 464, -318, -63, -148, -431, 158, -335, 617, 229, -172, -777, 106, 365, 112, 338, -101, -843, 81]
2694H1q3r72L67P55J2j52Q79k58m15m27R46o75K98K50j380J30N60n29R59J06o79
2715b27j61o01Q08Q81p11n67j05J251j241M5q9K65J30J18J48j53P49l21q57N45
2735i3O6K90J34J53K57j038r6J494j84j128N43p01Q31m21L57p2m44O58O4n88q4
2756bO5M74N82j421J57l62M88n34L68J277o88k38n94Q60k21N05l6n82j29j43K71
2777I7l62m13J359m46j00k11l35J147j605N40k50Q27P3o32J78o50N47Q24j678
2796a090J012Q18k38l1m43m85L94m23P6j58N50q08Q95J18q11J107n33m93J18L32
2816i3K65M99j099l64J31k93J672k27q82k17P26p93n35j0J750r48O04k53L9K52
2836B24p79J407j326P13M55k45j437J299m76p65M47J439p26n37K11M44o84J141
$$ y = [81, -2, -974, -607, 148, 160, 8, 887, 629, 214, -213, 733, 58, 356, 606, -774, -644, -84, -613, 346, 452, -227, -388, -989, -181, 700, -11, -578, -683, 568, -673, -628, -717, -452, -322, -204, -56, -209, 540, 219, -638, -93, -27, 263, 397, 550, 807, -231, -327, 1167, 983, -145, 398, -303, 528, 107, 464, 392, -52, 606, 670, 82, -2, 63, 537, 1119, -302, -145, -507, -19, -553, -185, 1092, 404, 166, -428, 432, 211, 716, 680, 98, -31, -174, 97, -265, -678, 681, 235, 135, -76, -411, 736, -869, -329, -579, 248, 321, -311, -133, -783, -236, 588, -1090, -78, 740, 502, 471, 28, -457, -63, -486, -410, -568, -18, -826, 69, 187, -624, 483, -50, -543, -425, -93, 172, 671, -428, -792, -661, -954, 718, 491, -391, -608, 118, -675, -1210, -1220, 530, -418, 186, -67, -28, 224, -555, 852, -474, 239, 694, 449, -988, 311, -165, -930, -483, 956, 230, -307, -96, 348, -336, 805]
2854H05o62P86j402K9l44J86L63r64J511k04m89M58l29M00o10L45k88j11J007
2873D87j18p40l05K29P58J95j598J062k64k39J52J09J80l48m84O67P32r6n10J41
2893A0J28l87p50J371m74m11J162o79o06J044k74k10j83k12L10K8O69j660R88
2912a36J249q10p17J98N49j64m87l40N04o48Q29O73n51M61p91K3M13k50Kl69P26
2933C64J39j233R92k64m13J24N88j002P59q24R59q19J062m23J61p08P14m85M73
2952A64n02M27N85K14p57J75j9j69n74JM16K98r29P37N47L78j167m61P48l8m39
2973c65J21k03K82J144j710P38P78j273O15M46p72J94q77N32k8J085j31j103L70
2992a57Q32k53m10r10N46R0j7N76m11N44k52K62q67P36Q8j021O54K07O39j873
$$ y = [805, 143, 929, -473, -444, -788, -602, -239, -1203, 308, 104, -385, 73, -256, 144, -466, -121, -409, -520, 487, 369, -371, -676, -447, 311, 506, -1092, -30, -294, -533, -381, -272, -92, -440, -924, -257, 475, 379, -131, 10, 138, -249, -999, 372, -102, -513, 649, -30, -636, 408, 134, -76, -259, -471, -161, -133, 536, -1124, -136, 1113, 303, -414, -216, 333, 169, -318, -658, -154, -802, 27, 700, 149, 610, -181, -158, 255, 5, 7, -362, 364, 503, -730, 262, -2, -415, -291, 297, -705, 54, -770, 189, -630, 432, 9, 170, -538, 176, -309, 164, -338, 89, 674, 888, 131, 306, 287, 118, -456, -455, -39, 259, -670, 67, 614, 992, -175, -636, 112, 74, -365, -244, -447, -165, 979, -731, 7, 785, -488, 127, 573, -199, -5, -882, -350, -378, 707, 576, -527, -157, 675, 422, 12, -898, -352, -262, -279, 297, -114, 430, 178, 440, -427, 309, 397, -624, 30, 237, 876, -997]
3012i97p7J658m21P79j714Q0K95R28p98l40P70p1j79N44K89m93K08l95j47O79
3032E98M42k098O69M86L63q21L26L88L9j98k18K18M45M7k29n63P44p08L12J39
3052C81o13n9m41P19J48O69j059M38m50R03r57J035o35K79o38m34p41R43j4K14
3072c12P58J1K63p52l55J130q90O09j39o07J053k81l60L68j02p85m3M10K70lq13
3093e70N59M12n40k45Q16j468R43Q52p32J79J047j999K53O50K34j26n89L48p56
3112g32P45M15j384O62L45N6n03O69k52n17P03L9m64N99k07K41L51l88m00N09
3132D87q33L99q98N15Q26q28L90P43j792O26R34m12P33j414R7J57N53o20K5O33
3152C21j53l62L40P3q25N5J191j428L32M27n29J019o32M79m16J69k43N59j47l58
$$ y = [-997, -1074, 584, 163, 942, -772, -692, -397, 531, -267, -607, 163, 92, -87, 457, 746, 253, 461, 66, -81, 598, 1040, -1058, -389, 97, 460, -361, -35, 353, 392, 194, -24, 194, 639, 686, 457, -106, 638, -70, 242, 381, -232, -291, -732, -13, 135, 804, -255, 183, -267, 636, -321, 714, 79, 358, -280, -714, -1455, -512, -526, -312, 446, 457, 720, -32, -387, 743, -147, 462, 323, -284, 769, 488, 128, 496, 394, -391, -434, -24, 246, 243, -570, -11, 401, -139, -384, 432, -1036, -93, 759, 27, 206, 1253, -746, -493, 157, 391, 265, -324, 24, -732, 13, 428, -956, -294, 51, 107, -396, 273, 21, -496, 207, 246, -218, 381, 174, 415, 766, 378, -22, 487, -346, 53, -845, -330, 496, -332, 58, 801, -991, -365, 569, 157, 890, -524, -427, -270, 283, -337, -312, 321, 168, -194, 146, 219, -606, -551, 640, -788, -456, -29, -558, 461, -171, 308, -108, 61, -182, 377, 230, -128]
3172a28R28j123N69m0j43J37m14p17M66N79m70J371j368N02K99J27m78R7j018
3191h24J2k36J215K22j539J271O88m88p01l87J019m78o24L37P90k39J67n81K33
3210a43k41L18n0R68j822P23J011j477j134K068j057R0P71m24J246n64r15N79
3228e3m56J050j116K13N27l88o61O52K91l27P6q15J232l80m6M84m50J90j055J954
3248I22j790K10N83q98J123J2K05r68m15P96m62R48N50j263O99m24N62m91k76
3267c77P14l66j092J557l99K23j554J491m26J45o30J636p82M03j377k78J337M39
3285F64r65N21P82j00j32j083R1j170J192J73P11j94k38J18p55L4K0J47j1j816
3305b011K057L94N7l34K82Ol31P81j131O78j61o61J006j348R79J97k64K16p49
$$ y = [-128, 800, -323, 246, 206, 63, 200, -214, -931, -465, 114, -356, 1015, -353, 149, 448, 575, 97, 194, -824, -812, -1048, 167, 389, -1150, 121, 809, 321, -380, -767, 252, -226, -850, -513, 277, 38, 205, -376, -143, -384, -66, -116, 852, -970, -247, 764, -713, -1847, 221, -836, -746, 25, -399, 847, 283, -632, -53, -509, 541, -575, -362, 165, -223, -884, -232, 59, -268, -192, -1007, 225, -155, -201, 283, -167, 23, -1032, 922, -868, -658, -75, -973, 150, 162, 367, -601, -1016, -220, -682, 266, 816, -447, 252, -172, 390, -101, -377, 337, -29, -1121, 436, 37, 260, -1294, 197, -229, -84, -714, 922, 140, 543, -834, -1112, 225, 664, -301, 220, 1002, 902, 770, -313, -222, -1392, -200, -27, 684, 490, 252, 370, -385, -351, -331, -184, -195, -2011, 46, 440, 497, 163, 445, 451, 120, 901, -230, 448, 287, -374, 632, -716, 263, 460, 196, 412, -337]
3324c37J5K25m97M15M51n59n3K24K45j92Q08q69J089j867J032k55Q1k57J61L54
3344B14R0k70k86R28j70J07M21p63m19j46k7K1J619j290k59l84P58o18O42N40
3364G08n33l09j8M62m97L19m41l22O80l99N73oN65j499K72O34l03O18j217P41
3384B8R0J080r26m3q7L99r42O58k60o3j27n4j89L26R73j469Q99J9q87N21j11l32
3406d97K62j26K90m32Q10N5n59O41M04j703J452j130J047K7p7q97J165o73N25
3425E84k18n30M27q8j48Q09j616P30p69J001j315J117L79j097Q13O01N2q17j51
3444b36J398q71j024K67m94R79JKL2j397J959j425J159Kk02r79O48l65O94L34
3464D82L50r74j78K19o30Q41n08Q05L25o31j94L17p2n46K28p61Q61J48j88Q54
$$ y = [-337, -322, -97, -594, -179, 272, -287, -340, -116, 129, -63, 745, -124, 965, -902, 130, -125, -44, -301, -140, 214, 304, 34, -252, 676, 506, 613, 1034, 271, -148, -294, -321, -300, 1319, 29, -230, -614, 144, -474, 168, 708, 175, -134, -152, 310, -187, 132, -309, -631, 49, -350, 223, 217, 782, -717, -445, 189, -114, 504, -713, 28, 118, 1198, 272, 229, 142, 541, -401, 257, -3, -66, -193, -247, -436, -110, 863, -606, 293, 312, -575, -54, -165, -497, -235, -361, -71, -503, 307, 362, -197, 444, 848, -855, 597, -533, 514, 541, 464, -433, 732, 59, 584, 366, -164, 263, 175, 27, 836, -780, -50, -819, 182, -1133, -16, 363, -734, 79, 680, 732, -85, -236, 1162, 291, -733, -466, -960, 19, 20, 22, 54, -1343, 616, -809, 350, 352, 150, -829, -181, -546, 148, 482, 832, -142, -320, -101, -731, 110, -398, 407, 732, 101, -93, 224, 152, -394, -166, -927, -66, 82, -106, 748]
3484G48j286l91L13P99q18m1N38J11J51j091J274r15K70L94q13N7J1J269j76l44
3504F0l51N31n1l62P43j438L71P45j47j49J23K24j259J554M11j184J60M92P78
3523A251l75j830J216j393K4J477m82k56n27P49m01J367o33J81j467J519q34l87
3541h01M09O44l8m33O81J15r02M5O20n62j64l67K089j698j92R58L73q90m7K98
3561A38j432L96R92j30r6K10Q34m43m23M65l84K09j77J42k20l26L01J72p03l32
3581h07M51J183o17n87Q01L89j214R14L5m03n3k87l64J236n51j51k79j03J59P94
3601E46j166P48J14J08L57j229n62J349k42j31k12N03j09L25l68K7j141J638N08
3620A063j492O64kk3k80l00J044n88j017P98j6O61p99L20K75L94l20n54M56N71
$$ y = [748, -538, -929, -616, 183, -635, -676, -138, -27, 124, -967, 307, -608, -338, 56, -757, -700, -689, 580, 404, 60, -291, 240, 189, -173, 570, -868, -497, 248, 101, -48, 75, 299, -960, 594, 1005, -179, -19, 473, 1251, 876, -954, 262, -1131, -1107, 370, -112, -368, -895, -146, -547, 820, 187, 368, -1099, 420, -414, -801, -392, 252, 214, -219, 462, 577, -325, -280, 340, -222, -386, -753, 1336, -362, -554, 404, 777, -113, -160, 138, -1294, -898, 94, -36, -132, 78, 912, 469, 46, 511, 127, 336, 159, 301, 81, -245, 56, 228, -475, -807, -356, 827, 210, -377, 424, 813, -401, 513, 548, 145, 92, -195, -559, 677, 126, -25, -304, -407, -248, 546, -620, 128, 242, 350, 707, -522, -1084, 265, 23, -108, -320, 183, 74, 399, 31, 58, -1083, 555, 1063, -429, 235, 233, 210, -70, -370, 674, 86, -931, -133, -149, 512, -287, 33, 308, 702, 382, -172, 284, 855]
3640H55j171R63l87j61J025j184m35R43n18O52o90l21J216o19j134J297m38J082
3658I75j130r33J506q47R74p97O56j67l29M43n05r63J740o49J075p19j13n97j07
3677d87P1P02L51K11p20N37K26n58k4r95N40L85K73L85n50l17K69K0l39O64o34
3698A0O69k25j645J841p19J53l12M79l83r34J78J465l94R00p01n56L63j61K10
3717B38M6L9l37M77m84n18n89P78K06M79M62J78m77O01n91k050J869p53R17j039
3737e48J052r50M50N44o17o01M42p62M94J865j280Q90r33J028k058J167m81M79
3755A81q31J380n39M97p44r71P02J09P58p72j06J059q10P70j620N83j66k19R92
3774B53o7m28N23n28P72l81p58L84P32j046J413n29o20J246o89j27J32l44R80
$$ y = [855, -316, 647, 260, 99, 1124, -60, -495, 448, -70, 582, -108, -429, 787, 168, -966, 331, -107, 975, -155, -1088, 418, -429, 545, -252, 404, 237, -92, 351, -154, -1117, 623, -26, 1049, 330, 217, -380, -487, -416, 286, 637, 848, 128, 665, 891, 333, 309, -686, -146, 239, 512, 897, 347, 30, 299, 319, -20, 644, 10, 679, 454, -1191, 650, -69, 84, -228, 251, -132, -1066, -888, 577, 183, 1083, 382, -174, 189, 28, 238, 284, 323, -14, 463, -21, -539, -1128, -350, -144, 335, 797, 975, 498, 1099, 508, -1542, 327, -426, 491, -548, 504, -446, 4, 548, -69, -670, -228, -990, -496, 1369, 89, 979, 46, 1074, -984, 183, -298, 181, -650, 730, 191, 688, -56, -1027, -325, -216, 542, -230, -336, 723, -87, 683, -937, -354, -520, -739, 253, 186, -242, 281, -247, 525, 144, -614, -230, 502, -544, 869, 340, -280, 966, 277, 150, 282, -62, 918]
3793I18q97k0o1Q4J69j192J644j94J24L08k01j058J224p06J68j101J170q27J391
3812I43p89o89k37J276j081J077l94k62L31m42J249j277Q32p85l08kN01M36j081
3831g02O85p1j44n20O21R5N81p61R69q08j075J693K3o02P77l87j082O13L95j16
3851A84M56R5q92m06K58p6k9M87P2P70j613K92rK64M77j264J489j380r1O2J190
3872C36L93m38k23o95N85k98P22n44M25j02n09j42J58K84P16j133K30j21P79n50
3892a27J058n30K62k73L31r21p3n60J126O39j503P96K90j36l31j216K832j413
3910B51n92K10q5J48l27l81l25N59N98j42J49J14k04L16n11L99P1p7l43N6k98
3931d14J138j54J33o04k5L51O9m70J68m79J072n88O8R6j483O66J208k7J77j265
$$ y = [918, 21, 1, -60, 24, 193, -999, 645, 451, 575, 883, 682, -376, 848, 142, 310, -791, 379, -448, 943, 154, -535, -772, 504, -577, 500, 106, -156, 175, -267, 982, -295, 537, -248, -556, -558, -57, 379, -702, -17, -88, -232, -752, -131, -36, 545, -216, 753, -55, -1130, 563, 586, -16, 761, 374, -708, -95, 300, 184, 640, 735, -157, -563, -305, -381, -410, 77, 149, 919, -694, -402, -411, -147, 330, -934, 555, -825, -916, -854, 336, 729, 291, 68, -627, -42, -340, 382, -162, 263, 161, -348, -490, -332, -48, 668, -465, -235, -356, 423, -127, 931, 401, 663, 390, 721, -200, -273, -833, 293, 932, -571, 225, 515, 379, 48, -1168, 1664, 251, -341, -131, -216, -68, -395, -776, -1101, -542, 56, -86, 63, 177, -27, 289, -222, 177, 248, 171, -172, -116, -414, 724, 570, 703, 99, 74, 425, 494, 24, 192, -287, 785, 197, 265, 361, -1122, -456, 752, 725, 902, -363]
3951c63k90J225j252k79J770r48j49R16j96K35k9N62k465J920p12l18N23j27l74
3970c51O43k44q68M03J207j420m56J793j394R37j631J652q98L38k68J188p36J16
3988A1r18N45m01R40J06o65Q71m28n8l33O03J45l59j341J673j990K514r84j54
4007b23Q04n09p36J011p15J278q61M3m06L09K47o00Q44p77JJ67N25j68J6J0r28
4028f68J154k16k79J201p26M19j117J57j339J682m11r6L74q02n4R63m39P40p86
4047b43l17O07O03l41m57RL36l29K99j92L21q69K78M22o24L03N95Ql5j215J536
4068F95q91k06R90r47J601j029j34j046J549j131R02o25R0M86m39m83K78J424
4086A084j241M15O99o48j52n03k7K88O60k50k33m95M46l04O89k60j23o19J023
$$ y = [-363, -653, 572, -680, -959, 811, -137, -286, 630, 434, 669, 640, 1202, -1263, 657, -55, -373, 150, 23, -351, 292, 48, -820, -417, 790, -630, -1086, 707, -687, 250, -1381, 271, -627, -289, -557, 631, -105, 11, -907, -362, -763, 177, 283, -382, 489, 61, 3, -330, 273, 418, 59, -1282, 391, -1599, 915, -69, -223, 581, 72, -664, 347, -368, 910, 49, 92, -314, -5, 242, -358, 486, -291, -290, -123, 402, 234, 250, 260, -668, 486, 270, -9, 1192, 466, 885, -232, -75, -1414, 268, -143, -239, 135, -667, -721, 242, -197, 543, -243, -560, 47, 650, 309, -148, -139, 197, -132, 167, -25, 296, -573, -295, 127, -497, -194, 401, 409, 374, -841, 695, -196, -402, 588, -359, 1242, 213, 79, -967, 582, -549, 353, -272, -182, 304, -135, -618, -340, 1084, -157, 258, 957, 309, 157, -346, -373, -85, 575, 325, 92, -403, 43, -261, 428, 168, 45, -574, 449]
4105D49J68j37M2j002P76r23J092r97Q30J02j375J128m18p70O83k67J384j443
4123f78J114N83j723O05j06J37K13j52Qq06P32L66J2m48q7N06K20p93O04j02r90
4144g85J678j034O25J32p38M52j34l57Nj016J454K59o78J086r62q32P86m17P68
4163B92p19K66Qo1J12J6o37J854j150J18n66J116n94m29Q2J127j416J71M89o90
4183f11J8L93J451j395K58j173N02k44P72K11Om96j4j8Q2M1M1R97j446N69M00
4204C44m4J51l94l06P75m49m88O95n02N84o1k94p6R58q32l86J100p12R53j066
4224e0N96J0k73J31j92r29J036j028N52m56j51Q2k43O87L71o83K09L19m55K43
4244b24J79M40m0j101P81n28Q0l05J029m59M10l74Q33o44j149J065n47j11J740
$$ y = [449, 617, 480, 522, -480, 296, -627, 465, -532, 298, 400, -975, 153, -265, -1035, -352, -619, 765, -678, 436, 1019, -704, -99, -205, -68, 145, -7, 1, -805, -73, 293, 305, -143, -230, 276, 496, -297, 307, 205, -785, 893, -141, 484, 616, -122, 330, 196, -161, -156, -1172, 282, 541, -137, 949, -13, -845, -59, -476, 292, -427, -161, -153, -214, -102, -86, -723, 1131, -19, 99, -467, 649, 55, -374, -292, 835, -581, -410, 79, -611, -593, -200, 1251, -144, 114, -1059, -557, -801, -29, 182, 188, -308, -322, -340, -258, -217, -176, 821, -625, -56, 344, 300, 451, 57, -249, 526, 77, -411, 284, -218, 366, 305, 11, -65, 893, 61, -325, 775, 63, 1016, -50, 546, 556, 283, 414, 222, -707, 329, -699, -147, -603, -754, -672, -915, -228, 143, -540, -331, -12, -467, -224, -45, 395, 355, -746, 35, -493, -413, -718, 311, -148, 262, -112, 721, 77, -1072, -7, -554, -665, 1075]
4263A075q51m83L50O93k16q59R05j333K157j693o89J126M98k24o89R0J213q02
4281B68l02J47q4N96o15L85k63J363k220Q80k10K08j79n11P84j97K20k28O65q93
4301a86j86m56J317q21J30n76J97N59j194J555j143J50O52q92M35n3O72j227J067
4320@J34q81N06K86k70N18q81k96L93n55J107m97K00p6L04O25p14Q57j065K99
4340fl46M02L97n22O36K28p01Q92j508R87l17K30j1J033j793L06O09o40L6N81
4360D93j007J072m68j171R60K02j96P51r59m48Q04kj081J684j039n02J237p91
4378d61M2P13n95K78q11L20R85j37L22k16o14P49n64J30K73l94L09j646K039p26
4398dK59J38m73L30M41l48m23j39J96k26J04o2j276J490j25j60L91M48n12J59
$$ y = [1075, 224, -259, 91, 784, 568, -291, 614, -719, 1438, -255, -944, 182, 680, 456, -233, -143, 1070, 268, -34, 113, 29, 625, 10, 395, 132, 1495, -725, 155, -55, 153, -26, -537, 247, 50, 270, 42, 707, -186, -372, -828, 489, -332, -202, -778, -581, -22, -1216, 339, -804, -654, -2, -894, -459, -512, 160, -1067, 0, 134, -747, -241, 45, -225, 293, -588, -884, -491, -1046, 61, -436, -236, -312, -8, 617, -97, 760, -305, -6, -352, 50, 447, -75, 561, 789, 88, 980, -528, 459, 142, 372, 361, 1394, -399, -93, 516, -124, -88, 493, -514, 558, 90, -1081, -121, 81, -115, 636, -323, -771, 33, 31, -1050, 634, -405, -907, 330, -461, -419, 294, -301, -23, -834, -514, 471, 334, 656, 440, -174, 575, 11, 141, 414, 20, 329, -1317, 722, -4, 255, 393, -80, 250, 691, 343, -80, -219, -23, -249, -145, -207, -1483, 7, -118, -278, 113, 561, 49, 208]
4418B08J73K7j32M28K98j326P27J82q28r76Q49N77m36K37L20P27j348j85P82r90
4438f86J21P01M55j214L24n12M58J328j014k79J279j110n51rK65P2O93q80R18
4457C59o95L09N45o39l73l42J108l73M40j16m95n8J44K25K78r14J414k64K4r83
4477d06K73J088n38m80J227j528P5N07M1j366O38Q53l05M95p41J60kk91J172j192
4497c20j92Q39J39r06O01k51l82N30p44R94m03L2n45Q12m06M99q01N51p9l21M01
4518D8K42n34n25P56l1M8N00o53L93K73m12P43m88n92k09M70j80oP14p83J67M10
4540C51J180k188L91L51l67j148J161p54J058l5J68Q28j160Q16m98K5Q7N72j038
4559b00j085L76M56j75K89l84J091K03J8p32R3j44M89j192J459K80p71N80r90
$$ y = [208, 381, 408, 276, 704, 1002, -324, 403, 585, -243, -1219, -370, 207, -229, 8, 328, 1055, -293, -478, 304, -686, -565, 136, 591, -623, -299, -811, -353, 975, -39, -318, 961, -149, -700, -709, -444, -372, 321, -559, 359, -336, -27, 518, -121, -494, -836, 272, -101, 339, 223, -272, -330, -186, 39, 317, -597, 817, 553, 577, -406, -133, 955, 417, -63, 1164, -364, -289, 218, 259, -1107, -469, 384, 79, 574, -167, -7, -9, -300, 872, -320, -512, 327, 466, -440, 161, -90, -472, 58, -686, 308, -95, -63, -608, 204, -202, 297, -504, 47, -32, -353, 48, 290, -244, -769, -13, -44, 4, 504, -149, 244, 517, 105, 848, 360, -232, -441, 29, -151, -157, 557, -226, -59, 351, 1531, -657, -266, 85, -282, -1430, -269, -1023, 35, 0, 168, 996, -164, 652, 154, 179, 266, 838, -200, -1285, -909, -453, -628, -339, -723, 368, 571, 589, -143, -50, -194, 295, -897, 562, 842, 71, 651, -339]
4578c39M24k76M69j68m1N86j315K51J096j091M93O83j194j85k4o3M79M96n77M16
4598A20J3N34j252R96j234J380j50l16j68L50mJ18J88m58M14j039R14n39J61K35
4618B63k23j331j82J255j48J57R53m45kJ91l5k53j32q01N12L6K90m5Q77j416J615
4639A136j94j238R12j724J78M34O95L43m03j68p69R47k64J56j0L75n75k04O79
4658C06o8K99r40K83K14L87j67p30Q18j085P86K27n13J183k120J489q2k77k51
4677b41k56K62J387l85j847N62J351j004qp61J298K06k19q5O0n66j09J40m2O29
4697C72m31R46j159L57k06L6nO39j542p4J517n97J057m48p98O52m78K25m77j04
4717e18K95P77K8l47m77R35q17l02L93j61j28l9N55m23n72J107n72l88N63m40
$$ y = [-339, 85, -191, 278, 110, 69, 655, -660, -409, 687, -404, 89, 772, -422, -607, -631, -694, -215, 281, -296, 120, 133, 667, -585, 411, -823, 557, 407, 91, -77, 273, 269, 387, 575, 117, 531, -508, 406, -133, 28, 263, 40, -1291, -1473, -218, -366, -209, 744, 299, 297, 488, 453, 200, 68, -733, -221, -185, 105, 60, 937, -479, 1136, 942, -296, 616, -1108, -930, -496, 199, 542, 139, -29, -798, 149, -115, 41, 31, 406, -169, -373, 306, 238, 537, -403, -120, 94, 481, 314, -416, 402, -683, 103, 330, -183, 1000, -1120, 369, 287, 10, -241, -497, -235, 1152, 767, -1080, -518, 833, -171, -179, -940, 358, 564, 345, 260, 320, -246, -355, -215, -257, 372, -59, 887, -272, 85, -121, -85, -90, 549, -993, -1067, 450, -147, 910, 462, -336, 316, -162, 63, -414, -518, -223, 554, 582, 235, -242, 693, -124, -426, -33, -194, -322, -361, 194, -229, -801, 306, -266, -654, -91, -531]
4737e31j55O35L57l28k77M59n29N92j62K26n78r4o81N26P02j08j210k15K004q7
4757E46j166J80Q03m94K13P91p25j278J356q48K22J573r94n76Q6R0P35r22J812
4776A404j183r5m21n24P25J31j48N68j55p14k21J82O56Q4m13N7l84K17P6j54M63
4797A51j74j81n8l37r9M76M61N14q12J24j68L38K76n36j50p13J432n87o15N00
4817a58k36M43n23J046j197J623n43P10k607O99K13n76Q22J94O52m9p90M06K8
4836A57l81l07j76R94J3K56r9p19O43k83p46K2O36J83l26P7n48o8N55K66m87M9
4858b89l7P03o51m99J510l63j20N14m76L43K71n10r35k9Q08J23n35K14j30l19
4878d07J578r67R61j819Q66q12M67L91q67Q43n89l23L01K57l38K24Pl72J061l28
$$ y = [-531, -686, -51, 306, -22, -299, 160, -369, 223, 61, 287, -291, -385, -1066, -540, 162, 54, -1156, -1371, 633, 546, -620, -440, 363, -131, 82, 873, 148, -1130, 226, -622, -400, 1173, 179, -397, -311, -221, 514, -408, 1404, 221, 126, -295, -819, -94, 37, -111, 457, 302, -412, -633, -451, 205, 289, -124, -67, -451, -234, -158, -312, 151, -23, -204, -262, -599, -698, -222, 239, 753, -59, 65, -103, 235, 511, -25, -175, -888, 544, -43, -658, -158, -394, 49, -474, 572, -625, 998, 455, 1165, -1442, -743, -530, -1106, -284, -90, 562, 513, -277, 129, 157, -224, -531, -707, 287, 300, 556, 457, -262, 381, 98, -648, -626, 10, 193, -133, -56, -604, -672, -117, 149, -338, -289, -326, 377, -274, -773, 737, 374, 254, 768, 292, 635, 906, 396, -539, -568, 240, 363, -172, 42, -88, -407, 1171, 204, 1165, -654, 212, -600, -133, 258, -609, 234, -355, -678, -377, -120, -458, -234, -227, -599, 462, 134]
4898A34p73M05N58K46n79j11m9K45n69J068m00l00K06j28L27L60n01o07N73l60
4918b55O20K13j162j97Q94j358K94J133j700K044p05j49K69p3oJ25K0l21O58n14
4938a70q38R7J845r20k83N63q0M05K2q61m23R15q33P8N00j64J06m71J056j17j033
4959f06J86L67M69j00K76j069J292j585K24J746j778O44J89j40j396M75J028l32
4977a10K32M69q85R6K44N73l94L28r95N00M7N8k67L64l21n06J14J063r71m2P55
4998C52p43O8O61o56N60j93j54m81Q49K1k37o16J139K9r50K9k60M03M86j56k7
5019A24j43m39N71n53P81l68L11m48M14l98L90l47Q57j479O24R0K31j16o77Q22
5039B47j90K72j69M3J16j8k16j76P39m16N25j657J274m46M44l87k77M73M76j42
$$ y = [134, -639, -234, 324, 570, -9, -120, -169, 76, -493, 575, 175, -125, 81, -47, 280, 640, 139, -468, 105, -255, 365, 578, -584, -781, 113, -1245, -951, 182, -1518, 526, -179, -328, -59, -132, -138, -13, 7, -314, 344, -170, -1008, -911, 934, 14, -269, 294, 214, 619, 641, -220, -643, 272, -561, -483, 17, -147, -41, -512, 544, 427, -606, -420, -53, 416, 316, 592, -477, 815, -770, -546, 1200, -578, 66, 255, 115, -1281, -806, 222, -110, 122, 591, -294, -198, 46, 619, 225, 553, -442, 58, 105, 163, -104, 260, -61, -567, -453, 610, -361, -403, 352, -391, -323, 338, -318, 242, 49, -105, -586, 263, 284, 47, -569, 570, 599, -351, -322, -582, -179, 307, 151, 124, -19, -458, 113, -440, 341, -27, 284, -164, 250, -148, 242, -105, 752, -727, -103, -13, 218, 102, -575, 247, 57, 329, 160, 203, 319, 301, 85, -91, 648, 232, 757, -900, 374, -72, 372, -15, -292, 181, 657, 515]
5059E15r32O68J99q01R42n24k73N62O23j114P21j854P34L08k22L84J11r9K70l1
5079A87j164P91K8J22L0m9M16m85j09m96P78M87j564Q55K87p07J039q7p95O98
5099B62n07K75L24p95Q37j11r41O75K98n3n84J194o67O51j484J131n57Q99k08
5118F39j848J801j032J189j741J099o74M90l44Q1J326o20j224O91n14P07K00M61
5136F87j000M64j87N22M41k15m54j185L55N08J17q35Q04P9J19m30n90J293j399
5155i06P02K11q53J134p06K36J47L53l10k61j60J166q10Q08q79O00m40m25P81
5174C88j164j36j50J901n66r57N30J113k021J554N6P51j182k28k43K62J07P45
5192G60o32j098R29O0k63J89J451j935L63O17r12J019k81P29j903j0J569q62k30
$$ y = [515, -417, 251, 450, -351, 591, 67, -206, 356, 979, -135, 586, -1268, -534, -226, -448, -64, 47, -52, 218, 187, -977, -186, -158, -36, -6, -55, 361, -124, -233, -729, 49, 536, -1028, -173, 114, -593, 446, 359, -436, 262, -245, 30, 354, -441, 396, 285, -656, 19, 317, 264, -320, 874, 207, 858, -626, 505, -52, 847, 639, -1209, 592, -440, 749, -992, 107, -567, -77, -421, -340, 986, 366, -858, -167, -681, 26, 226, 687, -313, 151, -36, 486, 927, 712, 258, -927, -572, -64, 53, -782, 22, 101, 220, -210, -800, 493, -906, -204, 7, -846, 288, -418, -182, -35, 318, 8, -253, -413, 753, -57, 751, -128, 472, 32, -393, 388, -776, -912, -1062, 839, 273, -684, -154, 959, -1062, 492, 548, 1299, 117, -111, -354, -92, 15, 760, 128, -970, -41, 19, -244, -55, 1396, -539, -176, 441, -471, 548, 267, 996, -907, -917, 652, -210, -440]
$$ [...]
8191b74
##END NTUPLES=NMR FID
##END=
