##TITLE=1H_SAM_30.236.1.Py
 CDCl3, 108 sc, 
 18.12.2020
##JCAMPDX= 6.0         $$ Bruker NMR JCAMP-DX V2.0
##DATA TYPE= NMR FID
##DATA CLASS= NTUPLES
##ORIGIN= UXNMR, Bruker Analytische Messtechnik GmbH
##OWNER= root
$$ XWIN-NMR		Version 3.5
$$ Fri Dec 18 11:40:45 2020 Russian Standard Time (UT+4h)  she@DPX200
##.OBSERVE FREQUENCY= 200.1315066352
##.OBSERVE NUCLEUS= ^1H
##.DELAY= (6, 6)
##.ACQUISITION MODE= SIMULTANEOUS
##.ACQUISITION SCHEME= undefined
##.AVERAGES= 108
##.DIGITISER RES= 18
##SPECTROMETER/DATA SYSTEM= spect
##.PULSE SEQUENCE= zg30
##.SOLVENT NAME= CDCl3
##.SHIFT REFERENCE= (INTERNAL, CDCl3, 0, 15.7039)
##AUDIT TRAIL= $$ (NUMBER, WHEN, WHO, WHERE, WHAT)
$$ ##TITLE= Audit trail, XWIN-NMR		Version 3.5
$$ ##JCAMPDX= 5.01
$$ ##ORIGIN= Bruker BioSpin GmbH
$$ ##OWNER= she
$$ F:/spectra/data/she/nmr/H-F/1/audita.txt
$$ ##AUDIT TRAIL=  $$ (NUMBER, WHEN, WHO, WHERE, WHAT)
(   1,<2020-12-18 11:38:23.62 +0400>,<she>,<DPX200>,
      <continue with go, POWCHK disabled, PULCHK disabled
       configuration hash MD5:
       00 E9 B6 7A A2 85 ED C7 34 08 36 98 17 FE 4E 26
       data hash MD5: 16K
       85 89 03 F7 77 3D 50 C8 97 74 35 54 22 A5 E3 AD>)
$$ ##END=
$$ 
$$ hash MD5
$$ B3 A1 06 25 DF 38 E9 83 57 30 11 62 25 7B ED 59
##$RELAX= 
##$RELAX= 
##$RELAX= 
##$RELAX= 
##$RELAX= 
##$RELAX= 
$$ Bruker specific parameters
$$ --------------------------
##$DU= <F:/spectra>
##$EXPNO= 1
##$NAME= <H-F>
##$PROCNO= 1
##$TYPE= <nmr>
##$USER= <she>
##$AMP= (0..31)
100 100 100 100 100 100 100 100 100 100 100 100 100 100 100 100 100 100 
100 100 100 100 100 100 100 100 100 100 100 100 100 100 
##$AQSEQ= 0
##$AQ_mod= 1
##$AUNM= <au_zg>
##$AUTOPOS= <>
##$BF1= 200.13
##$BF2= 200.13
##$BF3= 200.13
##$BF4= 200.13
##$BF5= 200.13
##$BF6= 200.13
##$BF7= 200.13
##$BF8= 200.13
##$BYTORDA= 1
##$CFDGTYP= 0
##$CFRGTYP= 5
##$CHEMSTR= <none>
##$CNST= (0..31)
1 1 145 1 1 1 1 1 1 1 1 1 1 1 1 1 1 1 1 1 1 1 1 1 1 1 1 1 1 1 1 1 
##$CPDPRG= <>
##$CPDPRG1= <>
##$CPDPRG2= <>
##$CPDPRG3= <>
##$CPDPRG4= <mlev>
##$CPDPRG5= <mlev>
##$CPDPRG6= <mlev>
##$CPDPRG7= <mlev>
##$CPDPRG8= <mlev>
##$CPDPRGB= <>
##$CPDPRGT= <>
##$D= (0..31)
0 1.2 0 0 0 0 0 0 0 0.06 0 0.03 0 0 0 0 0.0002 0 0 0 0 0 0 0 0 0 0 0 0 
0 0 0 
##$DATE= 1608276675
##$DBL= (0..7)
120 120 120 120 120 120 120 120 
##$DBP= (0..7)
150 150 150 150 150 150 150 150 
##$DBP07= 0
##$DBPNAM0= <>
##$DBPNAM1= <>
##$DBPNAM2= <>
##$DBPNAM3= <>
##$DBPNAM4= <>
##$DBPNAM5= <>
##$DBPNAM6= <>
##$DBPNAM7= <>
##$DBPOAL= (0..7)
0.5 0.5 0.5 0.5 0.5 0.5 0.5 0.5 
##$DBPOFFS= (0..7)
0 0 0 0 0 0 0 0 
##$DE= 6
##$DECBNUC= <off>
##$DECIM= 32
##$DECNUC= <off>
##$DECSTAT= 4
##$DIGMOD= 1
##$DIGTYP= 9
##$DL= (0..7)
0 120 120 120 120 120 120 120 
##$DP= (0..7)
150 150 150 150 150 150 150 150 
##$DP07= 0
##$DPNAME0= <>
##$DPNAME1= <>
##$DPNAME2= <>
##$DPNAME3= <>
##$DPNAME4= <>
##$DPNAME5= <>
##$DPNAME6= <>
##$DPNAME7= <>
##$DPOAL= (0..7)
0.5 0.5 0.5 0.5 0.5 0.5 0.5 0.5 
##$DPOFFS= (0..7)
0 0 0 0 0 0 0 0 
##$DQDMODE= 0
##$DR= 18
##$DS= 0
$$ [...]
##$SUBNAM2= <"">
##$SUBNAM3= <"">
##$SUBNAM4= <"">
##$SUBNAM5= <"">
##$SUBNAM6= <"">
##$SUBNAM7= <"">
##$SUBNAM8= <"">
##$SUBNAM9= <"">
##$SW= 16.9725356469052
##$SWIBOX= (0..15)
0 0 2 0 0 0 0 0 0 0 0 0 0 0 0 0 
##$SW_h= 3396.73913043478
##$TD= 16384
##$TD0= 1
##$TE= 0
##$TE2= 300
##$TE3= 300
##$TEG= 300
##$TL= (0..7)
0 120 120 120 120 120 120 120 
##$TP= (0..7)
150 150 150 150 150 150 150 150 
##$TP07= 0
##$TPNAME0= <>
##$TPNAME1= <>
##$TPNAME2= <>
##$TPNAME3= <>
##$TPNAME4= <>
##$TPNAME5= <>
##$TPNAME6= <>
##$TPNAME7= <>
##$TPOAL= (0..7)
0.5 0.5 0.5 0.5 0.5 0.5 0.5 0.5 
##$TPOFFS= (0..7)
0 0 0 0 0 0 0 0 
##$TUNHIN= 0
##$TUNHOUT= 0
##$TUNXOUT= 0
##$USERA1= <user>
##$USERA2= <user>
##$USERA3= <user>
##$USERA4= <user>
##$USERA5= <user>
##$V9= 5
##$VALIST= <valist>
##$VCLIST= <CCCCCCCCCCCCCCC>
##$VD= 0
##$VDLIST= <DDDDDDDDDDDDDDD>
##$VPLIST= <PPPPPPPPPPPPPPP>
##$VTLIST= <TTTTTTTTTTTTTTT>
##$WBST= 1024
##$WBSW= 4
##$XGAIN= (0..3)
0 0 0 0 
##$XL= 0
##$YL= 0
##$YMAX_a= 1304804
##$YMIN_a= -769834
##$ZGOPTNS= <>
##$ZL1= 120
##$ZL2= 120
##$ZL3= 120
##$ZL4= 120
##$ABSF1= 10
##$ABSF2= 0
##$ABSG= 5
##$ABSL= 3
##$ALPHA= 0
##$AQORDER= 0
##$ASSFAC= 0
##$ASSFACI= 0
##$ASSFACX= 0
##$ASSWID= 0
##$AUNMP= <proc_1d>
##$AZFE= 0.1
##$AZFW= 0.1
##$BCFW= 1
##$BC_mod= 2
##$BYTORDP= 1
##$COROFFS= 0
##$CY= 11.3945322036743
##$DATMOD= 1
##$DC= 2
##$DFILT= <>
##$DTYPP= 0
##$F1P= 15.9154993809931
##$F2P= -4.1035820241983
##$FCOR= 0.5
##$FTSIZE= 0
##$FT_mod= 4
##$GAMMA= 1
##$GB= 0.15
##$INTBC= 1
##$INTSCL= 1
##$ISEN= 128
##$LB= 0.24
##$LEV0= 0
##$LPBIN= 0
##$MAXI= 10000
##$MC2= 0
##$MEAN= 0
##$ME_mod= 0
##$MI= 1.114404
##$NCOEF= 0
##$NC_proc= 0
##$NLEV= 6
##$NOISF1= 3.799351
##$NOISF2= 2.8
##$NSP= 1
##$NTH_PI= 0
##$NZP= 0
##$OFFSET= 15.70392
##$PC= 1
##$PHC0= -10755.12
##$PHC1= 1.400948
##$PH_mod= 1
##$PKNL= yes
##$PPARMOD= 0
##$PSCAL= 0
##$PSIGN= 0
##$REVERSE= no
##$SF= 200.130013532006
##$SI= 16384
##$SIGF1= 3
##$SIGF2= 2
##$SINO= 400
##$SIOLD= 16384
##$SREGLST= <1H.CDCl3>
##$SSB= 0
##$STSI= 0
##$STSR= 0
##$SW_p= 3612.71676300578
##$SYMM= 0
##$S_DEV= 0
##$TDeff= 0
##$TDoff= 0
##$TI= <>
##$TILT= no
##$TM1= 0
##$TM2= 0
##$TOPLEV= 0
##$USERP1= <user>
##$USERP2= <user>
##$USERP3= <user>
##$USERP4= <user>
##$USERP5= <user>
##$WDW= 1
##$XDIM= 8192
##$YMAX_p= 0
##$YMIN_p= 0
$$ End of Bruker specific parameters
$$ ---------------------------------
##NTUPLES= NMR FID
##VAR_NAME=  TIME,          FID/REAL,        FID/IMAG
##SYMBOL=    X,             R,               I
##VAR_TYPE=  INDEPENDENT,   DEPENDENT,       DEPENDENT
##VAR_FORM=  AFFN,          ASDF,            ASDF
##VAR_DIM=   8192,          8192,            8192
##UNITS=     SECONDS,       ARBITRARY UNITS, ARBITRARY UNITS
##FACTOR=    0.0002944,     1,               1
##FIRST=     0,             0,               0
##LAST=      2.4114304,     0,               0
##MIN=       0,             -769834,         0
##MAX=       2.4114304,     1304804,         0
$$ Real data points
##PAGE= N=1
##DATA TABLE= (X++(R..R)), XYDATA
$$ [...]
$$ plain form
3277 -6541 6003 -6263 4244 -3531 490 1097 -2220 5169 -6980 6181 -6470 4695 -3150
3290 -3150 396 729 -4090 3916 -5156 6070 -6676 5771 -4306 1845 1676 -3362 4711 -6404
3304 -6404 5753 -5915 4989 -2709 1251 204 -2631 4815 -5676 6662 -6247 4205 -3731
3317 -3731 1243 1281 -3054 4311 -4425 6635 -5935 5131 -5004 1718 1356 -3300 5059 -6132
3331 -6132 6393 -5920 3629 -3451 1462 615 -3181 3751 -5848 6488 -5789 4763 -3811 1805
3345 1805 1339 -2753 4948 -4622 6815 -6504 4920 -3127 1685 1204 -3463 4248 -5193 6248
3359 6248 -5401 4675 -3346 535 241 -3291 4035 -6045 5412 -5171 5498 -3564 2320 518
3373 518 -2780 4818 -5161 6322 -5439 4565 -2710 1857 304 -1781 5066 -5525 5856 -6043
$$ packed form
3277f541J2544j2266J0507p775M021O07l317P389j2149J3161j2651J1165p845
3290c150L546L33m819Q006r072J1226j2746J2447j0077O151j69n038Q073j1115
3304f404J2157j1668J0904p698L960j047k835P446j0491J2338j2909J0452p936
3317c731M974L8m335P365q736J1060j2570J1066j0135O722l62m656Q359j1191
3331f132J2525j2313R549p080M913q47l796O932r599J2336j2277J0552q574N616
3345A805m66m092P701r570J1437j3319J1424q047M812m81m667P711r441J1441
3359F248j1649J0076q021L881k94l532P326j0080J1457j0583J0669r062N884j802
3373E18l298P598r979J1483j1761J0004p275M567j553k085O847j0591J1381j1899
$$ plain form
3387 -6043 5211 -3806 1515 1283 -1977 3759 -5701 5468 -5516 4831 -2549 2049 881 -2280
3401 -2280 3541 -4911 4880 -5170 4817 -2227 2003 462 -1807 3573 -5325 7282 -5507 4423
3415 4423 -3857 746 -895 -2809 4315 -5204 5425 -5455 3817 -3404 1112 874 -2505 3270 -5140
3430 -5140 5664 -6260 4252 -3452 1741 344 -2670 4048 -5114 6108 -6281 5352 -3825
3443 -3825 1617 1294 -2420 4055 -4643 4882 -4803 4473 -3357 2078 336 -2223 3753 -4559 5812
3458 5812 -4474 4709 -2629 1320 -305 -2509 4143 -4485 5156 -4941 5025 -3435 1532 268
3472 268 -2631 3837 -4997 5694 -5267 4222 -3276 514 513 -2161 3160 -4955 5073 -6558 3986
3487 3986 -3426 1485 1078 -1213 3628 -4257 5530 -4494 4943 -3277 1651 353 -1348 3196 -4147
$$ packed form
3387f043J1254r017N321k32l260N736r460J1169j0984J0347p380M598j168l161
3401b280N821q452R791j0050R987p044M230j541k269N380q898J2607j2789R930
3415D423q280M603j641j914P124r519J0629j0880R272p221M516k38l379N775q410
3430e140J0804j1924J0512p704N193j397l014O718r162J1222j2389J1633r177
3443c825N442l23l714O475q698R525r685R276p830N435j742k559N976q312J0371
3458E812j0286R183p338L949j625k204O652q628R641j0097R966q460M967j264
3472B68k899O468q834J0691j0961R489p498L790jk674N321q115J0028j1631J0544
3487C986p412M911m07k291M841p885R787j0024R437q220M928j298j701M544p343
$$ plain form
3502 -4147 5878 -4760 4566 -3088 1542 -29 -1959 2676 -4149 5209 -5612 4781 -2142 1141
3516 1141 428 -2234 3847 -4405 4427 -4502 3550 -3029 353 -449 -1854 3742 -5217 5113 -4716
3531 -4716 5155 -2803 1955 -413 -1638 2608 -4103 5006 -4049 3889 -4221 1566 -304 -1933 3712
3546 3712 -4085 3881 -5538 4867 -3144 2297 -870 -585 3326 -4378 5162 -4539 5144 -4627 1570
3561 1570 -877 -2269 2715 -3965 4714 -3895 4140 -4451 2689 736 -1284 3296 -4403 4825 -4421
3576 -4421 5200 -3605 1230 -219 -1851 2021 -3586 4809 -4410 3829 -3384 2157 228 -1594 3157
3591 3157 -3716 5010 -4918 5081 -2981 1620 1141 -753 3411 -3593 4143 -4416 3936 -3550 1784
3606 1784 -483 -1571 2439 -3771 4538 -3579 4333 -2357 1711 -381 -1157 2382 -4190 3983 -4836
$$ packed form
3502d147J0025j0638R326p654M630j571j930M635o825R358j0821J0393o923L283
3516A141p13k662O081q252Q832q929Q052o579L382q02j405N596q959J0330r829
3531d716R871p958M758k368j225M246o711R109r055P938q110N787j870j629N645
3546C712p797P966r419J0405q011N441l167K85L911p704R540r701R683r771O197
3561A570k447j392M984o680Q679q609Q035q591P140j953k020M580p699R228r246
3576d421R621q805M835j449j632L872n607Q395r219Q239p213N541j929j822M751
3591C157o873Q726r928R999q062M601m79j894M164p004P736q559Q352p486N334
3606A784k267j088M010o210Q309q117P912o690M068k092p76L539o572Q173q819
$$ plain form
3621 -4836 3025 -3014 2475 -1535 -1211 3753 -4198 5307 -4759 4222 -2868 2468 -853 -592 2096
3636 2096 -2732 5343 -4267 3686 -3062 1880 -590 -1221 2315 -4260 4050 -4137 5420 -2696 1515
3651 1515 -557 -1415 3252 -3750 4910 -3788 3503 -3172 2621 -182 -1143 2519 -3127 4928 -4270
3666 -4270 3426 -2994 2396 -830 -1520 2839 -4515 3750 -4112 3825 -3981 1409 -402 -978 3030
3681 3030 -3718 3208 -4103 4354 -3303 3289 -454 -287 1498 -3156 3850 -4540 4183 -2644 2131
3696 2131 -771 -561 1701 -2320 4663 -4789 3714 -3406 2196 -1052 -53 2813 -3289 3791 -4706
3711 -4706 3915 -2947 2447 -1501 -362 2315 -3395 3658 -5986 5394 -3643 1864 -900 -999 1120
3726 1120 -3413 3940 -4051 3044 -4163 1807 -310 -603 1595 -4053 3627 -4548 3618 -2132 1289
$$ packed form
3621d836P861o039N489m010L24M964p951R505j0066Q981p090N336l321K61K688
3636B096m828Q075r610P953o748M942k470o31L536o575Q310q187R557q116M211
3651A515k072q58M667p002Q660q698P291o675N793k803r61L662n646Q055r198
3666d270P696o420N390l226o90M359p354Q265p862P937p806N390j811n76M008
3681C030o748O926p311Q457p657O592l743J67J785m654P006q390Q723o827M775
3696B131k902K10K262m021O983r452Q503p120N602l248R99K866o102P080q497
3711d706Q621o862N394l948J139K677n710P053r644J1380r037N507k764r9K119
3726A120m533P353p991P095p207N970k117k93K198n648P680q175Q166n750L421
$$ plain form
3741 1289 -550 -427 2234 -2956 4350 -3809 4596 -2803 2074 -1455 378 2314 -3299 3453 -3162
3756 -3162 4185 -2925 1164 -1077 -1150 1327 -2932 4366 -4693 4225 -3877 2333 -483 -1542 1999
3771 1999 -3154 3708 -3584 3100 -3186 3135 -1606 -612 2187 -3133 3766 -4339 4229 -2984 1748
3786 1748 -1128 -1032 1388 -3167 2962 -3338 4715 -2996 3112 -537 -1357 1984 -2970 3171 -4105 4843
3802 4843 -4061 2275 -1210 -927 2305 -3746 4033 -4964 4447 -3113 1951 -1244 -522 1427 -1505
3817 -1505 1862 -4548 4181 -2706 3417 -560 -224 1293 -2727 3458 -3847 2827 -2780 3652 -680
3832 -680 -1119 2244 -2932 4187 -4576 3146 -4694 2599 -517 -224 1834 -3196 3744 -4474 2591 -2153
3848 -2153 2658 -1147 -159 188 -3443 4926 -3849 3545 -3457 2838 -1417 -56 1752 -2652 3446
$$ packed form
3741A289j839J23K661n190P306q159Q405p399M877l529J833J936n613O752o615
3756c162P347p110M089k241p3K477m259P298r059Q918q102O210k816j059L541
3771A999n153O862p292O684o286O321m741R94K799n320O899q105Q568p213M732
3786A748k876R6K420m555O129o300Q053p711O108l649q20L341m954O141p276Q948
3802D843q904O336l485K83L232o051P779q997R411p560N064l195P22J949k932
3817a505L367o410Q729o887O123l977L36J517m020O185p305O674n607O432m332
3832f80m39L363n176P119q763P722p840P293l116K93K058n030O940q218P065m744
3848b153M811l805R88L47l631Q369q775P394p002O295m255J361J808m404O098
$$ plain form
3863 3446 -3568 4660 -3081 2738 -1655 -519 2076 -3275 3831 -4262 3462 -3756 1988 -513 -896
3878 -896 1148 -3648 4115 -3476 4405 -3555 2273 -1138 -131 2426 -2911 3281 -4333 3613 -3454
3893 -3454 1900 -1588 -970 2567 -2993 4543 -4587 4553 -3947 1594 -1271 249 2008 -3346 3637
3908 3637 -3771 4061 -3535 2107 -682 137 2157 -2702 3268 -3759 3766 -3466 2400 -1095 23
3923 23 685 -2814 4139 -4396 2241 -2731 1942 -1066 207 999 -2283 3306 -3353 3642 -3378 3211
3939 3211 -362 -124 3199 -2536 4497 -4555 5736 -2426 2998 -2543 -14 1005 -945 3769 -4954
3954 -4954 3049 -1768 1594 -1502 664 1644 -2488 3684 -4202 3923 -2605 2466 -701 512 2499
3969 2499 -2908 3375 -3626 4251 -3562 2863 -1130 566 404 -3144 2500 -3802 2883 -3643 2460
$$ packed form
3863C446p014Q228p741N819m393J136K595n351P106q093P724p218N744k501l83
3878h96K044m796P763p591P881p960N828l411J007K557n337O192p614P946p067
3893c454N354l488O18L537n560P536r130R140q500N541k865J520J759n354O983
3908C637p408P832p596N642k789Q19K020m859N970p027P525p232N866l495J118
3923B3O62l499O953q535O637m972M673l008J273P92l282N589o659O995p020O589
3939C211l573K38L323n735P033r052J0291q162N424n541K529J019j950M714q723
3954d954Q003m817L362l096K166R80m132O172p886Q125o528N071l167J213J987
3969B499n407O283p001P877p813O425l993J696j62l548N644o302O685o526O103
$$ plain form
3984 2460 -930 -709 2048 -2428 2424 -3860 4048 -3620 2128 -1417 283 1299 -2702 3129 -3130
3999 -3130 3590 -3694 2688 -1387 52 755 -2653 2807 -3649 3289 -3199 2404 -1721 317 639
4014 639 -1828 2380 -3594 3935 -3287 2734 -1786 1033 200 -3094 3294 -4052 3574 -3667 2690
4029 2690 -1087 -627 856 -3167 3816 -2938 3822 -3927 1083 -1545 -210 1237 -1623 2950 -3323
4044 -3323 3873 -2531 2508 -822 -198 347 -3194 2075 -3614 3424 -3586 2651 -205 362 520 -2838
4060 -2838 2810 -3225 2580 -2412 1673 -958 1447 -357 -2281 2635 -3057 2947 -3356 2091 -3289
4075 -3289 -547 1986 -1775 3480 -2807 3877 -2487 1802 -1626 624 733 -3382 3599 -3438 2525
4090 2525 -3329 2794 -749 -464 1784 -3540 2945 -4286 4845 -3022 2577 -945 -110 979 -2991
$$ packed form
3984B460l390K21K757m476M852o284P908p668N748l545J700J016m001N831o259
3999c130O720p284O382m075J439P03l408N460o456O938o488N603m125K038L22
4014F39k467M208n974P529p222O021m520K819q33l294O388p346P626p241O357
4029B690l777M60J483m023O983o754O760p749N010k628J335J447k860M573o273
4044c323P196o404N039l330O24N45l541N269n689P038p010O237k856N67J58l358
4060b838N648o035N805m992M085k631K405j804j924M916n692O004o303N447n380
4075c289K742K533l761N255o287O684o364M289l428K250J09m115O981p037N963
4090B525n854O123l543K85K248n324O485p231R131p867N599l522Q35J089l970
$$ plain form
4105 -2991 2623 -3731 4543 -2878 2480 -1694 -1485 1291 -1683 1679 -3068 2825 -3577 2492 -1461
4120 -1461 -140 870 -2121 2754 -2717 4245 -4248 1852 -2044 506 1050 -1466 2871 -3081 4154
4135 4154 -2866 2855 -1803 790 -202 -2002 2636 -2507 3472 -2975 1787 -1604 182 571 -1709
4150 -1709 3284 -2811 2906 -3041 2424 -1532 446 1028 -1833 3009 -3567 3831 -2597 2269 -1671
4165 -1671 937 445 -2446 2197 -2392 2940 -3728 2761 -1732 259 622 -1409 2927 -2579 3277
4180 3277 -3975 1916 -1959 628 681 -1760 3536 -3363 3423 -4054 1062 -1596 801 330 -1558 767
4196 767 -3559 4165 -2238 2222 -1668 193 743 -2051 2629 -3243 2915 -2689 2830 -1816 155
4211 155 871 -789 2598 -3324 2321 -3947 3412 266 1480 652 -3191 3127 -3580 3111 -2745 1303
$$ packed form
4105b991N614o354Q274p421N358m174K09K776k974L362m747N893o402O069l953
4120a461J321J010k991M875n471O962q493O100l896K550N44k516M337n952P235
4135D154p020N721m658K593r92j800M638n143N979o447M762l391J786L89k280
4150a709M993o095N717n947N465l956J978N82k861M842o576P398o428M866l940
4165a671K608m92k891M643m589N332o668O489m493J991L63k031M336n506N856
4180C277p252N891l875K587N3k441N296o899O786p477N116k658K397m71j888K325
4196G67m326P724o403M460l890J861N50k794M680n872O158n604N519m646J971
4211A55P16j660L387n922N645o268P359l146J214q28l843O318o707O691n856M048
$$ plain form
4227 1303 -2525 654 219 -1092 2582 -2729 2640 -3156 3329 -1863 1893 82 -1587 2675 -3055
4242 -3055 3170 -1347 2343 -857 441 -1020 -1172 2001 -3289 3337 -2706 2836 -1212 1163 -399
4257 -399 -830 1373 -2945 4346 -3191 2442 -1288 1576 868 -1958 1626 -3746 3576 -2808 1566 -544
4273 -544 1316 698 -1414 2459 -3085 2593 -2299 2901 -1671 732 420 -1725 1564 -3322 3383 -1932
4289 -1932 2093 -1188 1098 535 -871 2603 -2988 3249 -2122 2761 -1850 674 -665 -1021 1501
4304 1501 -2052 4429 -2894 2056 -1761 832 973 -2607 2800 -1480 2877 -3619 2166 -1981 992
4319 992 1000 -846 2581 -2718 2091 -3712 2254 -576 1180 -527 -1947 1448 -3451 3126 -4149 1563
4335 1563 -1317 300 -303 -532 2525 -2707 2546 -2355 1882 -909 227 -130 -1065 2475 -2005 2670
$$ packed form
4227A303l828L179m35j311L674n311N369n796O485n192L756j811j669M262n730
4242c055O225m517L690l200J298j461j52L173n290O626o043N542m048K375j562
4257c99m31K203m318P291p537N633l730K864p08k826L584n372P322o384M374k110
4273e44J860o18k112L873n544N678m892N200m572K403l12k145L289m886O705n315
4289a932M025l281K286n63j406L474n591O237n371M883m611K524j339l56K522
4304A501l553O481p323M950l817K593J41l580N407m280M357o496N785m147K973
4319I92Qj846L427n299M809n803N966k830J756j707j420L395m899O577p275N712
4335A563k880J617o03k29L057n232N253m901M237k791J136l57r35L540m480M675
$$ plain form
4351 2670 -2697 2793 -810 -547 -60 -1690 3436 -1815 2863 -2596 2630 -1119 730 -849 -1493 1986
4367 1986 -3915 2494 -2843 2203 -2098 648 -362 -2332 1727 -2840 2949 -3204 2401 -1158 131
4382 131 -806 -1302 1379 -3931 2826 -2234 1915 -1817 1670 501 -1405 2000 -1730 1566 -2096 3570
4398 3570 -1906 247 -781 -502 2074 -2478 3203 -1507 2576 -2018 -179 -723 -544 1003 -2436 3194
4414 3194 -2333 2822 -1756 748 -738 -2806 1243 -2081 3617 -2182 2328 -2057 -622 794 -627
4429 -627 1907 -2340 1887 -2852 1738 -2298 775 -525 -643 1426 -1904 2550 -2400 1680 -1313
4444 -1313 1040 -624 -664 577 -2078 2056 -2436 1674 -1973 221 528 678 1359 -1995 1845 -1610
4460 -1610 2012 -1677 944 -37 170 1288 -1921 2498 -1148 1955 -2152 1047 1125 -2616 888 -1267
$$ packed form
4351B670n367N490l603K63M87j630N126n251M678n459N226l749J849j579o44L479
4367A986n901O409n337N046m301K746j010j970M059m567N789o153N605l559J289
4382A31r37m96K681n310O757n060M149l732L487j169j906L405l730L296l662N666
4398C570n476K153j028K79K576m552N681m710M083m594J839n44J79J547l439N630
4414C194n527N155m578K504j486k068M049l324N698n799M510m385J435J416j421
4429f27K534m247M227m739M590m036L073j300j18K069l330M454m950M080k993
4444a313K353j664m0J241k655M134m492M110l647K194L07J50O81l354L840l455
4460a610L622l689K621r81K07J118l209M419l646L103m107L199P8l741L504k155
$$ plain form
4476 -1267 3389 -2753 1519 -2007 133 996 -348 2097 -2743 3505 -1508 1455 -801 1505 -774
4491 -774 -392 2835 -3505 1539 -3030 1979 -867 1015 -1110 -1116 1599 -1399 1779 -2140 2691 -1618
4507 -1618 893 381 496 1642 -2545 1726 -3072 2723 -743 409 49 -642 980 -3331 1946 -2671
4523 -2671 1578 -1261 -510 -712 -269 1302 -3066 2340 -1639 2471 -2318 150 -134 -1395 1721 -1198
4539 -1198 1227 -2428 1071 -820 611 -692 -892 1085 -1924 2591 -2649 1988 -1441 910 575
4554 575 -1429 534 -2394 2841 -2803 3064 -1696 1479 261 -953 1626 -2249 3372 -2488 2109
4569 2109 -1338 299 331 -394 1023 -2187 2686 -3272 2172 -2156 755 -98 -536 2054 -1467 1267
4585 1267 -1447 1900 -1660 1301 -321 168 1277 -1853 2269 -1581 1554 -1930 582 -4 -278 730
$$ packed form
4476a267M656o142M272l526K140Q63j344K445m840O248n013K963k256K306k279
4491g74L82L227o340N044m569N009k846J882k125oK715k998L178l919M831m309
4507a618K511n12J15J146m187M271m798N795l466J152l60o91J622m311N277m617
4523b671M249k839P51k02M43J571m368N406l979M110m789K468k84j261L116k919
4539a198K425l655L499j891J431j303k00J977l009M515n240M637l429K351l35
4554E75k004J963k928N235n644N867m760L175j218j214K579l875N621n860M597
4569B109l447J637L2p25J417l210M873n958N444m328K911q53m38K590l521K734
4585A267k714L347l560K961j622M89J109l130M122l850L135l484K512n86k74J008
$$ plain form
4601 730 -1463 2813 -1436 2461 -561 241 -346 -642 1719 -1027 1643 -2281 1553 -2595 1300 -631
4617 -631 88 1924 -2087 1567 -1927 1483 -1363 1049 292 -546 649 -1368 829 -1317 2209 -1322
4633 -1322 764 -550 -492 1416 -1496 3037 -1909 2106 -1932 1115 908 -1519 1038 -1926 1598 -2076
4649 -2076 2109 -773 675 -1173 27 1931 -1646 1354 -1275 1495 -1156 1257 -454 -908 600
4664 600 -2300 545 -1610 1545 -1304 311 -417 -875 871 -1266 1825 -1471 1775 -1544 567 -561
4680 -561 -304 660 -1079 1265 -1365 1183 -1619 767 -195 -222 646 -1226 2024 -1784 2498 -463 899
4697 899 251 -880 39 -1680 537 -1194 2142 -1331 510 -145 -228 1467 -3095 1542 -1529 1964
4713 1964 -1598 -39 -343 69 260 -2348 1998 -2345 1536 -653 1639 -165 -1356 956 -995 1114
$$ packed form
4601G30k193M276m249L897l022Q02n87k96K361k746K670l924L834m148L895j931
4617f31P19J836m011L654l494L410k846K412p57q38J195k017K197k146L526l531
4633a322K086j314N8J908k912M533m946M015m038L047k07k427K557k964L524l674
4649b076M185k882J448j848J200J904l577L000k629K770k651K413j711m54J508
4664F00k900K845k155L155k849J615p28m58J746k137L091l296L246l319K111j128
4680e61K57R64j739K344k630K548k802K386r62k7Q68j872L250l808M282k961J362
4697H99o48j131R19j719K217j731L336l473J841o55q3J695m562M637l071L493
4713A964l562J559l04M12J91k608M346m343L881k189K292j804j191K312j951K109
$$ plain form
4729 1114 -3000 1020 -578 -15 -1192 -580 886 -1862 1788 -1926 1764 -1893 1362 -451 -995 1157
4745 1157 -1585 1038 -1759 1423 -1142 1473 -143 507 795 -992 1867 -2377 1054 -483 630
4760 630 -1345 -687 1308 -1385 1056 -2215 1315 -1507 849 33 -412 992 -1327 2216 -1258 2113
4776 2113 -710 2033 51 -260 2297 -112 1743 -2639 2327 -482 533 -261 -410 1663 -1467 1908
4792 1908 -1602 2172 -2036 842 -393 -730 975 -1766 1907 -2464 1254 -2012 1878 -379 -590
4807 -590 587 -1443 1897 -1876 1773 -1221 -93 -324 53 1693 -708 1056 -2052 648 -1958 1521
4823 1521 -215 -447 698 -1704 1177 -1086 1491 -1147 81 -458 1118 812 -1156 1278 -1575 1610
4839 1610 -452 1373 -1290 467 901 -2091 859 -1813 2060 -1825 898 -378 506 194 -1345 963
$$ packed form
4729A114m114M020j598N63j177O12J466k748L650l714L690l657L255j813n44K152
4745A157k742K623k797L182k565K615j616O50K88j787K859m244L431j537J113
4760F30j975O58J995k693K441l271L530k822K356q16m45J404k319L543l474L371
4776B113k823K743j982l11K557k409J855m382M966k809J015p94j49K073l130L375
4792A908l510L774m208K878j235l37J705k741L673m371L718l266L890k257k11
4807e90J177k030L340l773L649k994J128k31L77J640k401J764l108K700k606L479
4823A521j736k32J145k402K881k263K577k638J228n39J576l06j968K434k853L185
4839A610k062J825k663J757M34k992K950k672L873l885K723j276Q84l12j539K308
$$ plain form
4855 963 -1660 1318 -1573 1718 -176 385 697 -1059 2203 -1565 2232 -1302 1056 24 -468 1112
4871 1112 -930 2544 -1578 1968 -1359 496 -724 -559 597 -1167 801 -1515 1549 -1999 870
4886 870 -117 -1003 631 -2165 987 -1446 1594 -1866 638 -1300 22 540 -1278 1303 -2046 1000
4902 1000 -1635 892 264 -674 496 -1351 1099 -1536 1602 -1691 157 -326 412 592 -938 1999
4918 1999 -1392 1461 -1630 749 -1401 208 1593 -347 1267 -2545 1536 -1630 1184 130 397
4933 397 1405 -804 1459 -1779 1629 -2106 908 -572 304 52 -1985 1997 -1695 1690 -2172 2089
4949 2089 -430 -186 -81 -897 1548 -1561 1455 -979 2675 -542 916 108 -132 1569 -970 1452
4965 1452 -1369 1146 -312 -71 394 -904 1289 -1448 1599 -2184 1391 -692 -135 99 -1583 832
$$ packed form
4855I63k623K978k891L291j894N61L12j756L262l768L797l534K358j032m92J580
4871A112k042L474m122L546l327J855j220J65J156j764J968k316L064l548K869
4886H70r87q86J634k796L152k433L040l460K504j938J322N18j818K581l349L046
4902A000k635K527o28r38J170j847K450k635L138l293J848m83P38J80j530K937
4918A999l391K853l091K379k150J609J385j940J614l812M081l166K814j054K67
4933C97J008k209K263l238L408l735L014j480Q76k52k037L982l692L385l862M261
4949B089k519K44J05q16K445l109L016k434L654l217J458q08k40J701k539K422
4965A452k821K515j458K41M65j298K193k737L047l783L575k083N57K34j682K415
$$ plain form
4981 832 -1308 2678 -1287 1284 -1385 -61 1166 129 1512 -1574 1092 -1764 800 46 101 675
4997 675 -1255 1369 -1428 2286 -2820 646 -1217 -1175 38 -2354 1948 -1603 1751 -1633 684 -316
5013 -316 -811 993 -551 1781 -1368 2465 -853 651 213 117 56 -1575 1405 -1825 1777 -1774 77
5030 77 -1339 -738 690 -946 1538 -1798 781 -1699 843 -1393 576 517 218 387 -2301 896 -1677
5047 -1677 713 -1097 504 251 -1999 208 -1865 1598 -817 55 -788 -423 151 -860 1970 -1635
5063 -1635 1098 -789 1185 -535 -178 944 -1757 1428 -918 1298 -827 916 -532 378 438 -938
5079 -938 1329 -2103 2794 -1085 1093 -925 -842 352 -1636 1660 -898 2081 -1272 502 332 -27
5095 -27 474 -1362 1701 -1879 1713 -2314 1641 -1944 -495 321 -261 1475 -2044 1132 -902 1518
$$ packed form
4981H32k140L986l965K571k669J324J227j037J383l086K666k856K564p54N5N74
4997F75j930K624k797L714n106L466j863M2J213k392M302l551L354l384K317j000
5013c16m95J804j544K332l149L833l318J504m38r6o1j631K980l230L602l551J851
5030G7j416O01J428j636K484l336K579k480K542k236J969n9k99J69k688L197k573
5047a677K390j810J601k53k250K207k073L463k415Q72q43L65N74j011K830l605
5063a635K733j887J974j720L57J122k701L185k346K216k125J743j448R10O0j376
5079i38K267l432M897l879K178k018Q3J194j988L296k558K979l353J774j70l59
5095b7N01j836L063l580L592m027L955l585J449Q16n82J736l519L176k034K420
$$ plain form
5111 1518 -1317 186 681 -105 1202 -764 1452 -2341 1591 1059 -297 -120 -316 755 -1118 753
5127 753 -917 1993 -1175 -60 1058 -954 2267 -1006 1242 -144 1382 -183 768 253 29 1731
5143 1731 -760 2416 -1376 1566 -625 1129 820 -1299 341 -202 1550 -967 939 -1437 417
5158 417 -109 -1337 253 -603 274 -1183 1847 -570 -367 730 -816 842 -1027 1609 -971 785
5174 785 279 837 569 -1173 984 -1574 1819 -1165 285 -141 598 133 -730 2447 -1245 1490 -626
5191 -626 991 -1710 491 551 -1275 1067 -1902 1472 -916 1131 -1620 -500 1211 -553 218 -556
5207 -556 1946 -1891 1214 -1475 -668 -985 -804 2368 -1659 1951 -1068 1938 -1206 1947 113 -123
5223 -123 184 -1087 1725 -1779 1277 -1053 334 496 -1133 1521 -1886 3432 -2048 -674 -52 1311
$$ packed form
5111A518k835J503M95p86J307j966K216l793L932n32j356J77j96J071j873J871
5127G53j670K910l168J115J118k012L221l273K248j386J526j565R51n15k24J702
5143A731k491L176l792K942k191J754l09k119J640n43J752k517J906k376J854
5158D17n26j228J590q56Q77j457L030k417K03J097j546J658j869K636k580J756
5174G85n06N58k68j742K157k558L393k984J450m26P39m65q63L177l692K735k116
5191f26J617k701K201O0j826K342k969L374k388K047k751J120J711j764P71p74
5207e56K502l837L105k689Q07l17J81L172m027L610l019L006l144L153j834k36
5223a23L07j271K812l504L056k330J387J62j629K654l407N318n480J374O22J363
$$ plain form
5239 1311 1554 -470 608 -1071 993 -550 1950 -2074 78 -1445 -775 1158 -828 1395 -1392
5254 -1392 1006 -441 -528 890 -349 69 -965 2761 -1681 1690 -1207 1041 801 -588 865 -1708
5270 -1708 1002 -1016 1946 -421 -481 1150 -616 740 -1626 1241 -1123 2033 -1578 571 -783
5285 -783 -380 1733 -1400 1563 -1341 339 -617 901 349 -421 1346 -1278 1734 -1616 275 -468
5301 -468 296 -931 -760 1614 -1320 812 -1432 1296 -303 986 761 -770 2033 -506 719 -2480
5317 -2480 1505 -467 787 -117 -304 1414 -775 1303 -658 1452 -841 399 1112 -967 555 -1153
5333 -1153 796 -2481 857 -257 87 730 -386 1020 -813 1699 -1547 1143 -724 574 234 48
5349 48 688 -1158 1548 -1279 1290 -889 -238 -113 -109 1294 -1128 949 -1118 1505 -409 -576 106
$$ packed form
5239A311K43k024J078j679K064j543K500m024K152j523O70J933j986K223k787
5254a392K398j447q7J418j239M18j034L726m442L371k897K248k40j389J453k573
5270a708K710k018K962k367o0J631j766J356k366K867k364L156l611K149j354
5285g83M03K113l133K963k904J680r56J518n52p70J767k624L012l350J891p43
5301d68P64j227J71K374k934K132k244K728j599J289k25j531K803k539J225l199
5317b480L985j972J254r04j87J718k189K078j961K110k293J240P13k079J522j708
5333a153J949l277L338j114L44O43j116J406j833K512l246K690j867J298l40j86
5349D8O40j846K706k827K569k179O51J25MJ403k422K077k067K623j914j67O82
$$ plain form
5366 106 -186 608 -444 756 -389 836 239 726 2009 -351 202 -1341 1929 -1672 442 25 242
5383 242 665 780 2579 -1252 1073 -1838 1569 -1146 333 87 -732 394 -2171 1629 -2103 495
5399 495 -978 -12 -632 -1114 1020 -865 1749 -1586 232 -369 625 549 -1205 93 -1035 1428 -631
5416 -631 1455 -899 330 271 -1031 -247 -706 1328 -792 611 -56 190 113 -454 -493 -1410 730 -930
5434 -930 1478 -556 383 -129 -577 871 -354 1418 -65 1105 -820 -239 331 -660 692 -422 999
5451 999 -975 810 -530 775 431 -219 1337 -1677 1869 -1258 1227 -584 658 -150 -216 871
5467 871 -1779 1440 -1822 849 -1050 886 -105 -123 1517 -1677 648 -1959 699 -636 392 915
5483 915 -525 739 -178 1592 -739 1012 -1100 1024 836 -737 -31 -658 1095 -1262 1632 -391
$$ packed form
5366A06k92P94j052J200j145J225n97M87J283k360N53j543L270l601K114m17K17
5383B42M23J15J799l831K325k911L407k715J479k46q19J126k565L800l732K598
5399D95j473R66o20m82K134j885K614l335J818o01R94p6j754J298j128K463k059
5416f31K086k354J229n9j302P84m59K034k120J403o67K46p7n67l9r17K140j660
5434i30K408k034R39n12m48J448j225J772j483J170j925N81N70r91J352j114J421
5451I99j974J785j340J305l44o50J556l014L546l127K485j811J242q08o6J087
5467H71k650L219l262K671j899J936r91j8J640l194K325k607K658j335J028N23
5483I15j440J264r17J770k331J751k112K124j88j573P06o27J753k357K894k023
$$ plain form
5499 -391 244 195 -251 296 -177 1806 -750 1694 -1098 1520 556 605 576 -437 401 -1995 1249 -354
5517 -354 1778 -656 -659 1166 -1584 780 -671 1558 -1797 1096 253 -236 1251 102 195 -1442 206
5534 206 -236 1252 -1217 212 309 -958 579 -83 229 -2021 444 292 -53 761 130 131 -1528 1417
5552 1417 -850 744 119 301 1492 -1311 1420 -1908 2197 -778 308 1164 -739 851 -1861 1360
5568 1360 -869 873 -447 795 -1070 275 878 -1343 984 -613 611 -681 303 -64 -665 -82
5584 -82 -380 1379 -1348 1038 -1077 295 -249 -999 2064 -836 598 -1369 1782 -505 222 188 -176
5601 -176 282 -1491 536 -872 417 -1156 1111 -528 139 824 -687 930 -936 1377 -968 610
5617 610 718 1067 1657 -238 -119 -906 1415 -748 305 -311 -492 684 -631 -342 -1578 -235 156
$$ packed form
5499c91O35m9m46N47m73J983k556K444k792K618r64M9k9j013Q38k396L244j603
5517c54K132k434lJ825k750K364j451K229l355K893q43m89J487j149R3j637J648
5534B06m42J488k469J429R7j267J537o62L12k250K465j52l45Q14o31Jj659K945
5552A417k267J594o25J82J191k803K731l328M105k975J086Q56j903J590k712L221
5568A360k229J742j320J242j865J345O03k221K327j597J224j292R84l67o01N83
5584h2k98J759k727K386k115J372n44p50L063k900J434j967L151k287P27l4l64
5601a76M58j773K027j408J289j573K267j639O67O85j511J617j866K313k345J578
5617F10J08L49N90j895J19p87K321k163J053o16j81J176j315K89j236J343L91
$$ plain form
5634 156 131 -438 -1132 -168 -339 1497 -122 70 -403 592 266 417 1040 -1290 798 -1649 998 538
5652 538 228 18 488 1445 -685 1446 -1166 701 -840 1033 154 -222 158 -667 934 -900 597
5669 597 -1523 835 492 -376 89 -431 1145 -1801 1365 -149 -175 -205 -64 1285 -808 1222 -720
5686 -720 734 -1119 60 -396 4 239 -98 1482 -1204 279 -222 1045 262 -464 509 252 -308 -966
5704 -966 871 -1049 601 -486 1002 537 -550 223 -1298 952 -404 1192 -1 -52 209 -1668
5720 -1668 801 -510 1075 -1116 471 832 187 -445 -1229 1722 -1391 1093 -364 -208 -215 532 189
5737 189 -307 758 -218 727 629 -537 -106 -642 -453 -893 770 -509 346 -731 -219 111 21 11 23 1767
5757 1767 -444 528 -1374 352 -330 476 605 -1614 -78 -618 1493 -529 902 -322 -554 248 -725
$$ packed form
5634A56k5n69o94R64j71J836j619J92m73R95l26J51O23k330K088k447K647m60
5652E38l10k10M70R57k130K131k612J867j541J873q79l76L80q25J601j834J497
5669E97k120K358l43q68M65n20J576k946L166j514k6l0J41J349k093K030j942
5686g20J454j853J179m56M00K35l37J580k686J483n01J267p83p26R73k57n60o58
5704i66J837j920J650j087J488m65j087P73j521K250j356J596j193n1K61j877
5720a668K469j311J585k191J587L61o45o32p84K951l113K484j457J56pP47l43
5737A89m96J065r76R45r8j166M31n36J89m40J663j279Q55j077N12L30r0j0J2J744
5757A767k211R72j902J726o82Q06J29k219J536n40K111k022J431j224k32Q02r73
$$ plain form
5774 -725 1713 126 72 -1329 743 -492 570 -125 -459 1511 -1260 1404 -613 703 714 757 968
5791 968 -1692 233 -417 922 -1048 662 461 245 67 -994 748 -1125 1206 -1190 1037 -453
5807 -453 746 1117 -392 -24 149 948 -1628 953 58 541 415 204 748 -224 1583 -58 622 -165
5825 -165 501 -868 -561 -560 -1008 408 -857 259 -91 -862 -98 -221 1168 -294 493 -579 510 -453
5843 -453 814 1427 -1008 397 -963 536 -781 -24 -403 -17 132 -75 814 -1093 740 -671 336
5860 336 286 -58 196 -618 -510 -1436 437 -345 125 150 -115 863 486 595 -498 735 -419 548 -181
5879 -181 211 484 -1262 711 -685 1310 -26 -57 -28 -314 434 -532 -86 -319 -58 -1237 200 -301
5897 -301 1010 -307 -151 -114 -277 726 -1160 1376 1028 -597 151 -596 565 -1195 -687 212 -39 709
$$ packed form
5774g25K438j587n4j401K072j235J062o95l34J970k771K664k017J316J1M3K11
5791I68k660J925o50J339j970J710k01k16j78j061J742j873K331k396K227j490
5807d53J199L71j509L68J73P99k576K581q95M83j26k11N44r72J807j641O80p87
5825a65O66j369L07Jm48J416j265J116l50p71P64j23J389j462P87j072J089r63
5843d53J267O13k435J405j360J499j317P57l79L86J49k07Q89j907J833j411J007
5860C36n0l44K54q14J08r26J873p82M70K5k65R78l77J09j093J233j154R67p29
5879a81L92K73j746J973j396J995j336l1K9k86P48r66M46k33K61j179J437n01
5897c01J311j317J56L7j63J003j886K536l48j625P48p47J161j760N08Q99k51P48
$$ plain form
5915 709 -493 -184 -556 852 -1835 964 -786 442 238 538 500 -247 314 -1252 1260 -743 537
5932 537 -154 -331 -229 -791 317 -526 1701 -365 -59 14 -328 -407 -887 792 384 643 -938 -119 -560
5951 -560 -254 930 -1774 927 -113 1112 -1636 860 -359 -1120 206 -401 944 -697 1103 -337
5967 -337 730 -385 -756 393 -358 370 -1520 661 71 734 -996 146 -47 -1057 1026 -1403 1229
5984 1229 -1015 1119 -923 12 1300 -559 538 -739 1935 -990 -75 349 335 609 -1381 254
6000 254 -750 438 -407 422 -297 -209 427 -696 785 -405 1475 -156 926 -246 409 764 -140
6017 -140 1295 -1158 1156 -389 733 -376 667 -510 -258 291 98 88 -1332 75 187 -40 827
6034 827 -364 178 -946 477 505 704 -36 -857 44 -498 541 469 181 -691 -513 219 -32 624 658 333
$$ packed form
5915G09j202L09l72J408k687K799j750J228k04L00l8p47N61j566K512k003J280
5932E37o91j77J02n62J108q43K227k066L06P3l42p9m80J679m08K59j581Q19m41
5951e60L06J184k704K701j040J225k748K496j219p61J326o07J345j641J800j440
5967c37J067j115l71J149p51P28j890K181n90O63j730J142j93j010K083k429K632
5984A229k244K134k042R35J288j859J097j277K674k925R15M24j4K74j990J635
6000B54j004J188q45Q29p19Q8O36j123J481j190J880j631J082j172O55L55r04
6017a40J435k453K314j545J122j109J043j177K52N49j93j0j420J407J12k27Q67
6034H27j191N42j124J423K8J99p40q21R01n42J039p2k88q72J78P32k51O56L4l25
$$ plain form
6054 333 -1165 117 -1404 477 -308 -929 474 -718 476 -884 616 -1196 1024 277 -126 138
6070 138 -992 328 -185 323 -969 -20 820 -58 914 -323 1017 -619 109 -266 -510 -1188 85 1830
6088 1830 -10 652 -1489 429 -1720 516 -375 201 542 -308 636 -1416 867 -258 414 -1093 -253
6105 -253 892 -865 330 -385 1011 -217 -390 434 -540 148 -335 594 -819 274 -228 1033 -431
6122 -431 -564 -1111 -885 409 -1502 1436 -1743 278 -657 -166 859 -223 639 -330 63 -354 306 -257
6140 -257 55 70 -402 1031 -309 1510 -647 679 176 268 857 -603 1139 -658 415 59 639 -979
6158 -979 695 1153 -576 237 81 714 -396 334 -271 818 -153 -642 1762 -1420 1319 -899 1047
6175 1047 -64 351 191 -1011 853 -958 392 -484 348 326 -418 614 -690 731 -731 -208 -911
$$ packed form
6054C33j498J282j521J881p85o21J403j192J194j360J500j812K220p47m03K64
6070A38j130J320n13N08j292R49Q40q78R72j237J340j636P28l75k44o78J273J745
6088A830j840O62k141J918k149K236q91N76L41q50R44k052K283j125O72j507Q40
6105b53J145j757J195p15J396j228j73Q24r74O88m83R29j413J093n02J261j464
6122d31j33n47K26J294j911K938l179K021r35M91J025j082Q62r69L93m17O60n63
6140b57L12J5m72J433j340J819k157J326n03R2N89j460J742j797J073l56N80j618
6158i79J674M58j729Q13j56O33j110P30o05J089r71m89K404l182K739k218J946
6175A047j111M15j60j202J864j811J350q76Q32k2p44J032j304J421j462N23p03
$$ plain form
6192 -911 751 429 132 539 -397 1078 133 1263 -1370 244 -509 -764 265 1102 133 228 887 -842
6210 -842 170 218 -101 917 -629 661 -886 632 -519 315 -1181 -69 1261 -730 632 -444
6226 -444 1257 -796 404 524 399 770 -175 84 -1477 505 -818 378 808 -243 15 -373 1002
6243 1002 -844 1284 -215 -696 -706 551 282 -99 1113 -374 214 -1699 210 663 98 101 -914 -370
6261 -370 -680 1689 -858 546 -891 525 310 -112 519 -1092 1088 -721 798 428 1365 206 -449
6278 -449 1101 -497 800 2 641 97 -784 1057 -534 -149 -551 972 -774 1301 427 546 -327
6295 -327 -1165 61 -564 1022 -930 1097 751 -446 -175 -26 547 -650 905 -436 576 -702 688
6312 688 692 -709 888 -471 700 -630 108 42 -445 54 -787 58 785 1272 -62 882 -296 660 62
$$ packed form
6192i11J662l22k97M07r36J475r45J130k633J614p53k55J029Q37r69R5O59j729
6210h42J012M8l19J018j546J290j547J518j151Q34j496J112J330j991J362j076
6226d44J701k053J200J20j25L71r45K59j561J982j323J196M30j051K58l88J375
6243A002j846K128j499m81j0J257k69l81J212j487N88j913J909M53n65Lj015N44
6261c70l10K369k547J404j437J416k15m22O31j611K180j809J519l70R37j159o55
6278d49J550j598J297p98O39n44q81J841j591L85m02J523j746K075q74J19q73
6295c27q38J226o25J586j952K027l46j197K71J49N73j197J555j341J012j278J390
6312F88Mj401J597j359J171j330P38o6m87M99q41Q45P27M87j334R44j178R56n98
$$ plain form
6331 62 -375 666 -1518 343 -306 492 -829 275 -17 -1 -78 188 998 -928 478 -226 114 -708 -430
6350 -430 1183 -1148 87 -580 802 -57 -343 -232 -730 790 -1552 833 -504 722 -632 85 -160
6367 -160 -433 1134 -951 390 -1089 945 -1480 286 537 -316 391 13 283 258 598 663 1363 856
6385 856 221 -108 324 1059 -646 -214 -46 624 402 -654 548 -975 227 -346 756 -56 778 224
6403 224 534 602 -1234 -49 -266 1126 -848 -87 781 359 -137 -143 1029 -526 484 -17 -292 225 559
6422 559 218 -105 54 -641 827 70 961 -84 -497 454 -477 624 -11 165 -1339 -956 -461 -715 61
6441 61 380 114 -1138 79 760 918 226 -1288 1285 -1088 591 -479 -276 -1082 -145 787 681 427
6459 427 -993 747 -492 379 -303 402 -465 -213 554 -603 -817 -864 738 -267 333 955 -634 1295
$$ packed form
6331F2m37J041k184J861o49P98j321J104k92J6p7K66Q10j926J406p04L40q22K78
6350d30J613k331J235o67J382q59k86J11m98J520k342K385j337J226j354P17k45
6367a60k73J567k085J341j479K034k425J766K51q53P07l78K70k5L40O5P00n07
6385H56o35l29M32P35j705M32J68O70k22j056J202j523J202n73J102q12Q34n54
6403B24L10O8j836J185k17J392j974P61Q68m22m96oJ172j555J010n01k75N17L34
6422E59l41l23J59o95J468p57Q91j045m13R51r31J101o35J76j504L83M95k54P76
6441F1L19k66j252J217O81J58o92j514K573k373J679j070K03q06R37R32j06k54
6459D27j420J740j239Q71o82P05q67K52P67j157k14m7J602j005O00O22j589J929
$$ plain form
6477 1295 322 177 -185 57 220 451 -197 14 -199 -34 742 -712 1680 146 566 -3 90 468 303
6496 303 1756 -908 161 796 -973 132 343 -64 21 184 -707 146 -790 51 196 -95 142 342 -95
6515 -95 -153 586 -117 323 -189 -293 -439 -382 276 -632 26 190 -318 -114 -291 879 -611 942 357 591
6535 591 1063 -41 1363 391 733 -314 1481 -913 -72 484 634 562 -865 1159 348 -681 -339 1169
6553 1169 -307 1123 -478 -203 731 -800 -142 -30 985 -682 -541 -828 -618 495 -120 -322 -1392
6570 -1392 1841 -1462 -605 -1308 -1330 957 237 708 247 1640 -486 427 -613 -206 531 -637 1338
6587 1338 -1247 -1103 -873 -9 180 -6 87 -425 610 -761 18 180 -1195 -133 1216 -197 -407 -702
6605 -702 1245 -336 275 -490 927 -1074 65 -729 722 -535 496 441 -108 1975 -223 828 -162
$$ packed form
6477A295r73j45l62K42J63K31o48K11k13J65P76j454K392j534M20n69R3L78j65
6496C03J453k664J069O35j769J105K11m07Q5J63q91Q53r36Q41J45k91K37K00m37
6515i5n8P39p03M40n12j04j46N7O58r08O58J64n08K04j77J170j490J553n85K34
6535E91M72j104J404r72L42j047J795k394Q41N56J50p2j427K024q11j029L42J508
6553A169j476J430j601K75R34j531O58J12J015j667J41k87K10J113o15k02j070
6570a392L233l303Q57p03k2K287p20M71m61J393k126R13j040M07P37j168J975
6587A338k585J44K30Q64J89j86R3n12J035j371P79J62j375J062J349j413k10k95
6605g02J947j581O11p65J417k001J139p94J451j257J031n5n49K083k198J051r90
$$ plain form
6622 -162 1046 312 1989 -176 85 -232 -347 587 -591 -261 -183 -169 -976 124 485 -479 -870 10 109
6641 109 -1240 679 -1731 -426 -280 -703 990 -549 1019 362 430 293 -503 -521 160 543 -259 1572
6659 1572 220 356 -904 -525 222 -816 -564 -1395 1878 -583 683 -116 1023 -191 -186 495 888 154
6677 154 -1115 1814 -418 -1747 311 251 -60 -923 1091 -168 490 -945 160 -406 46 201 -301
6694 -301 1065 -1062 -642 -1279 693 -191 792 -144 -586 301 -177 -71 -933 101 32 -556 219 -16 31
6713 31 -271 754 169 -1178 21 -996 -759 -1243 217 99 261 -593 -803 -477 -519 233 -290 -75 -493
6732 -493 519 -532 -1179 -94 -8 -860 -856 386 537 72 -509 446 840 -611 -83 679 -37 -1981 854
6751 854 -324 -699 -561 27 224 -1020 -73 -1731 386 -193 -1118 127 -639 107 -664 64 189 -84
$$ packed form
6622a62J208p34J677k165K61l17j15R34j178L30P8J4q07J100L61r64l91Q80R9
6641A09j349J919k410J305J46m23J693j539J568o57O8j37p96j8O81L83q02J831
6659A572j352J36j260L79P47j038K52q31L273k461J266p99J139j214NO81L93p34
6677A54j269K929k232j329K058o0l11q63K014j259O58j435J105n66M52J55n02
6694c01J366k127M20o37J972q84R83r36m42Q87m78J06q62J034o9n88P75k35M7
6713C1l02J025n85j347J199j017K37m84J460j18J62q54k10L26m2P52n23K15m18
6732d93J012j051o47J085Q6q52MJ242J51m65n81R55L94j451N28P62p16j944K835
6751H54j178l75J38N88J97j244R47j658K117n79r25J245p66P46p71P28J25k73
$$ plain form
6769 -84 -938 356 486 -742 334 -760 631 440 -305 1238 -162 -544 -369 331 -387 172 -690 -197
6787 -197 847 -88 -790 -241 171 1159 631 -1580 -509 -604 198 586 310 904 485 -799 -228 -1337 -608
6806 -608 280 342 -700 253 -1529 1423 -491 -211 -859 763 811 120 532 -533 1120 79 1567 36
6824 36 124 -504 377 -253 -1573 849 -325 -255 4 571 -262 -184 -199 -365 594 -354 251 -222 546 -802
6844 -802 -630 -204 306 -662 141 30 -304 199 724 387 1148 -2815 84 -357 -671 -602 136 -265 698 522
6864 522 849 -205 -615 495 540 259 -926 -303 -1097 94 1000 -503 801 -106 -181 -182 -1187 1168 -374
6883 -374 94 209 773 76 -1057 1509 383 -17 421 502 1858 152 1074 -1355 446 -322 -875 -448
6901 -448 -552 0 1059 142 814 265 852 38 -1150 1230 -128 291 276 -66 170 -673 -1033 -378 -536
$$ packed form
6769h4q54J294J30j228J076j094J391j91p45J543j400l82J75P00p18N59q62M93
6787a97J044r35p02N49M12R88n28k211J071r5Q02L88k76N94m19j284N71j109P29
6806f08Q88O2j042R53j782K952j914K80o48J622M8o91M12j065J653j041J488j531
6824C6Q8o28Q81o30j320K422j174P0K59N67q33P8j5j66R59r48O05m73P68j348
6844h02J72M26N10r68Q03j11l34N03N25l37P61l963K899m41l14O9P38m01R63j76
6864E22L27j054m10J110M5k81j185O23p94J191R06j503J304r07p5jj005K355j542
6883c74M68J15N64o97j133K566j126m00M38Q1J356j706R22k429J801p68n53M27
6901d48j04N52J059r17O72n49N87q14j188K380j358M19j5l42K36q43l60O55j58
$$ plain form
6920 -536 -358 116 -54 -1017 22 -42 -1104 -534 699 292 216 -623 355 15 -146 444 -336 932 -930
6939 -930 107 -1278 -244 -576 -603 887 -719 687 361 985 -377 650 -194 -26 933 -596 486
6956 486 9 -132 386 748 -1321 -11 -780 340 -738 -871 -281 -1667 268 835 -1024 -20 261
6973 261 301 975 259 74 423 -649 165 -508 7 1094 -198 403 74 906 -371 -11 1022 -278
6991 -278 -191 -466 -729 -55 -456 -352 -932 36 -40 498 -24 -805 -256 255 -162 -198 961 -23 -201 -501 785
7012 785 666 489 114 -39 109 -221 478 -188 462 18 188 -266 662 484 -1163 636 -172 -520 619
7031 619 623 -368 843 -155 -541 -221 -529 528 868 156 -583 434 1035 -869 -254 583 1016 1135 -165
7050 -165 -338 -672 919 -346 181 121 1445 -809 -371 1058 371 136 -372 429 875 -217 -808 278
$$ packed form
6920e36J78M74j70r63J039o4j062N70J233m07p6q39R78l40j61N90p80J268j862
6939i30J037j385J034l32k7J490j606J406l26O24j362J027q44J68R59j529J082
6956D86m77j41N18L62k069J310p69J120j078j33N90j386J935N67j859J004K81
6973B61M0O74p16j85L49j072Q14o73N15J087j292O01l29Q32j277L60J033j300
6991b78Q7k75k63O74m01J04n80R68p6N38n22p81N49N11m17l6J159r84j78l00J286
7012G85j19j77l75j53J48l30O99o66O50m44J70m54R28j78j647J799q08l48J139
7031F19Mr91J211r98l86L20l08J057L40p12p39J017O01j904O15Q37M33J19j300
7050a65j73l34J591j265N27o0J324k254M38J429o87k35n08Q01M46j092n91J086
$$ plain form
7068 278 483 123 895 1100 92 -217 -95 -858 402 -1167 382 -47 -2148 -243 -1118 715 -71 -179
7086 -179 407 -55 -166 -561 1553 -729 837 -791 -94 125 -504 -229 -685 193 -609 -127 -605 -715 -305
7105 -305 229 825 75 1019 79 975 541 331 -123 354 -667 68 1259 -242 -12 -417 444 -930 -573
7124 -573 533 -27 427 -795 513 -525 67 -160 521 -164 -257 438 -594 202 -49 716 -374 -363 -837
7143 -837 720 -786 183 -92 -1204 396 -58 -264 -439 190 -792 -182 -245 -646 -53 514 -1169 546
7161 546 -406 759 -226 485 66 153 -536 -282 1298 813 292 70 482 -149 1364 178 92 625 -271
7180 -271 193 92 889 -419 222 712 37 -369 1011 402 -58 1257 -155 250 -478 -854 390 -1044
7198 -1044 -372 -615 702 -584 957 -360 127 -175 245 261 -264 -222 -83 132 361 959 -163 142 -433
$$ packed form
7068B78K05l60P72K05j008l09J22p63J260j569J549m29k101J905q75J833p86j08
7086a79N86m62j11l95K114k282J566j628O97K19o29K75m56Q78q02M82m78j10M10
7105c05N34N96p50R44r40Q96m34k10m54M77j021P35J191j501K30m05Q61j374L57
7124e73J106n60M54j222J308j038N92k27O81o85r3O95j032P96k51P65j090J1m74
7143h37J557j506R69k75j112J600m54k06j75O29r82O10o3m01N93N67j683J715
7161E46r52J165r85P11m19Q7o89K54J580m85n21k22M12o31J513j186q6N33q96
7180b71M64j01P97j308O41M90o75m06J380o09m60J315j412M05p28l76J244j434
7198a044O72k43J317j286J541j317M87l02M20J6n25M2J39K15K29N98j122L05n75
$$ plain form
7217 -433 -615 -321 138 -202 249 362 595 -540 704 -273 410 145 -249 -156 -557 -154 -58 -672 -398 1305
7237 1305 54 -242 -464 -826 24 -166 -126 -186 -292 -310 -77 192 654 128 91 -113 -505 106 -468 -197 -629
7258 -629 -417 984 39 1022 -340 3 447 -91 90 18 414 121 183 -1229 1241 -83 545 122 -43
7277 -43 -249 23 743 200 -83 533 -145 -291 629 830 -397 896 459 103 -474 -386 125 -101 -369 -432
7297 -432 1156 504 470 -562 389 92 84 -1104 143 -126 -289 570 342 -115 319 -304 494 354 790 -461
7317 -461 546 14 1064 -200 -286 954 83 -69 -1222 427 -168 135 752 -8 -179 -1327 -411 555
7335 555 -352 -801 238 605 547 -194 1780 -248 261 149 -1255 -802 -574 388 -866 -898 -49 453 574
7354 574 609 -276 221 -278 -341 1074 -312 128 -100 -1401 84 366 -665 28 -1797 484 -525 -213
$$ packed form
7217d33j82K94M59l40M51J13K33j135J244r77O83k65l94R3m01M03R6o14K74J703
7237A305j251k96k22l62Q50j90M0o0j06j8K33K69M62n26l7k04l92O11n74K71m32
7258f29K12J401r45R83j362L43M44n38J81p2L96k93O2j412K470j324O28m23j65
7277d3k06K72P20n43k83O16o78j46R20K01j227J293m37l56n77Q8N11k26k68o3
7297d32J588o52l4j032R51k97qj188J247k69j63Q59k28m57M34o23P98j40M36j251
7317d61J007n32J050j264q6J240q71j52j153J649n95L03O17p60j71j148R16R66
7335E55r07m49J039L67n8p41J974k028N09j12j404M53K28R62j254l2Q49N02J21
7354E74L5q85M97m99o3J415j386M40k28j301J485K82j031O93j825K281j009L12
$$ plain form
7372 -213 1350 735 -792 338 -229 -221 -267 -172 -53 -308 -1052 653 404 510 747 114 -150 -989 -731 562
7392 562 -627 -87 712 137 -526 -650 1029 617 -852 -264 545 -50 -533 196 -399 1024 613 415 840
7411 840 -79 292 415 -500 501 325 -763 1018 -532 -98 -202 -643 -101 -1162 -615 336 -595 -652 433
7430 433 -450 -4 114 -1299 -1643 -654 100 617 -1 -158 -315 49 -595 -133 -637 683 -361 772 61
7449 61 -570 1011 304 662 -118 467 -496 -65 -43 1152 706 -864 -223 26 341 160 138 -916 -15 -493
7469 -493 -523 216 -829 135 330 170 1732 -101 636 144 -1205 -516 -894 -1697 -68 -1017 -249 -649 -197
7488 -197 1241 8 -105 1165 -193 -553 -688 659 -416 376 240 78 -542 138 1252 -118 950
7505 950 77 -41 -949 822 -319 221 -522 -932 -386 695 847 371 -34 -1462 -1574 -821 408 587
$$ packed form
7372b13J563o15j527J130n67Qm6R5J19k55p44J705k49J06K37o33k64q39K58J293
7392E62j189N40P99n75o63j24J679m12j469N88Q09n95m83P29n95J423m11j98M25
7411H40r19L71J23r15J001j76j088J781j550M34j04m41N42j061N47R51r31n7J085
7430D33q83M46J18j413l44R89P54N17o18j57j57L64o44M62n04J320j044J133p11
7449F1o31J581p07L58p80N85r63M31K2J195m46j570O41K49L15j81k2j054R01m78
7469d93l0P39j045R64J95j60J562j833P37m92j349O89l78q03J629r49P68m00M52
7488a97J438j233j13J270j358l60j35J347j075P92j36j62o20O80J114j370J068
7505I50q73j18r08J771j141N40p43m10N46J081J52m76m05j428j12P53J229J79
$$ plain form
7523 587 205 -259 -216 -135 -996 292 -330 -509 31 -431 142 -291 11 179 153 -393 -788 169 -173 667 396
7544 396 -722 315 84 -233 315 997 -79 672 205 431 -565 -432 488 938 704 -371 198 65 115
7563 115 -965 -209 -481 -259 396 -312 -1096 525 123 -892 130 -254 -148 -657 -202 363 -527 87 -121
7582 -121 385 192 -795 -305 -611 199 -232 414 -1398 658 -284 -447 792 690 -24 -526 439 -1068 391
7601 391 181 431 -187 -195 107 -650 -774 -526 75 -722 -400 204 -717 98 -253 631 99 415 -519 712
7621 712 289 -279 -354 203 468 554 -884 207 369 -36 -495 -195 390 860 1019 -406 -980 -920 501 -909
7641 -909 367 -892 -530 -739 7 -742 65 -229 -247 54 -57 1238 -449 1336 859 395 948 999 -420
7660 -420 84 261 -825 -451 222 -508 899 -145 959 -307 -84 -1060 652 38 850 173 -555 1119
$$ packed form
7523E87l82m64M3Q1q61J288o22j79N40m62N73m33L02J68k6n46l95R57l42Q40k71
7544C96j118J037k31l17N48O82j076P51m67K26r96J33R20M50k34j075N69j33N0
7563A15j080P56k72K22O55p08p84J621m02j015J022l84J06n09M55N65q90O14k08
7582a21N06j93r87M90l06Q10m31O46j812K056r42j63J239j02p14n02R65j507J459
7601C91k10K50o18qL02p57j24K48O01p97L22O04r21Q15l51Q84n32L16r34J231
7621G12m23n68p5N57K65Q6j438J091J62m05m59L00N85M70J59j425n74O0J421j410
7641i09J276j259L62k09P46p49Q07k94j8L01j11J295j687J785m77m64N53N1j419
7660d20N04J77j086L74O73p30J407j044J104j266K23r76J712o14Q12o77p28J674
$$ plain form
7678 1119 587 -836 378 -300 293 98 -483 -618 -649 -191 -86 165 -69 502 156 348 -412 783 -724
7697 -724 -129 467 198 619 201 366 461 177 794 768 -352 224 -395 -133 413 -110 -853 -1745 395 307
7717 307 -842 -486 -1176 247 -27 -60 -197 23 307 -46 -1083 -179 143 -1137 54 154 -397 -912 344
7736 344 789 -1206 -474 -575 -82 -161 517 -664 100 -390 197 1265 -1664 151 374 34 -368 -360 -565
7755 -565 1086 394 -27 -195 -48 226 -39 -4 -999 -743 776 1111 139 416 1141 -338 -261 -389 174 -224
7775 -224 -18 1740 -1427 362 756 304 363 -1094 9 -91 221 -67 976 -1322 1253 833 590 323
7793 323 -687 1426 1114 -98 -529 180 -160 -362 -277 -461 1261 442 -1127 -749 -219 1053 -142 -514
7811 -514 -514 -730 316 52 987 -111 119 -465 710 152 93 65 -242 -167 -757 25 -176 -157 -222 -85 -428
$$ packed form
7678A119n32j423J214o78N93j95n81j35l1M58J05K51k34N71l46J92p60J195j507
7697g24N95N96k69M21m18J65R5k84O17k6j120N76o19K62N46n23p43q92K140q8
7717C07j149L56o90J423k74l3j37K20K84l53j037R04L22j280J191J00n51n15J256
7736C44M45j995P32j01M93p9O78j181P64m90N87J068k929J815K23l40m02Qk05
7755e65J651o92m21j68J47K74k65L5r95K56J519L35r72K77P25j479P7j28N63l98
7775b24K06J758l167J789L94m52N9j457J103j00L12k88J043k298K575m20k43k67
7793C23j010K113l12j212m31P09l40k02Q5j84J722q19j569L78N30J272j195l72
7811e14%k16J046k64R35j098K30n84J175n58n9k8l07P5n90P82k01J9o5J37l43
$$ plain form
7832 -428 179 540 -101 1014 -163 1701 487 -276 220 751 -1477 627 458 -235 703 -401 331 -809
7850 -809 -7 -555 -43 332 -7 373 301 869 608 350 -130 417 809 322 -67 -183 724 102 -257 1087
7870 1087 339 508 -813 863 -404 -509 787 -672 -162 -242 1493 -125 115 -706 623 -530 298
7887 298 -554 -532 442 -125 -24 -268 493 -805 1722 -201 -1141 -139 1041 462 -871 118 -371 1043
7905 1043 159 -586 626 286 874 660 -292 -679 1325 -61 -204 989 -96 1115 -1473 286 191
7922 191 206 -72 385 -75 6 -281 14 -1015 -287 -105 -673 23 -262 -128 -354 -386 188 -608 543 137
7942 137 -151 615 193 1437 -263 -39 -428 2 -54 338 -536 -1109 429 676 -282 287 -268 -87 309
7961 309 312 -711 213 741 850 -431 -883 -615 394 -317 492 805 -866 492 153 513 -764 32 -19
$$ packed form
7832d28O07L61o41J115j177J864j214p63M96N31k228K104j69o93R38j104P32j140
7850h09Q02n48N12L75l39L80p2N68k61k58m80N47L92m87l89j16R07o22l59J344
7870A087p48J69j321J676j267j05J296j459N10q0J735j618K40q21J329j153Q28
7887B98q52K2R74n67J01k44P61j298K527j923r40J002J180n79j333R89m89J414
7905A043q84p45J212l40N88k14r52l87K004j386j43J193j085J211k588J759r5
7922A91J5k78M57m60Q1k87K95j029P28J82n68O96k85J34k26l2N74p96J151m06
7942A37k88P66m22J244j700K24l89M30n6L92q74n73J538K47r58N69n55J81L96
7961C09Lj023R24N28J09j281m52K68J009p11Q09L13j671J358l39L60j277P96n1
$$ plain form
7980 -19 -223 479 275 502 93 -30 1061 -201 268 445 1781 -1391 -363 -385 244 -1325 612 -248
7998 -248 40 860 392 561 -238 -411 -757 -42 -285 -789 852 -397 -620 -61 468 -838 127 620 -126
8017 -126 -245 146 404 -350 945 399 -722 -180 -191 137 -119 437 -699 -712 274 211 832 -633 401
8036 401 -256 -123 163 -160 293 595 125 -148 -57 168 -122 -620 358 337 610 224 155 -30 148 -97 -386
8057 -386 858 -583 -96 -442 51 2 25 396 -399 -71 143 -541 133 200 572 417 305 -1095 185 -630
8077 -630 -633 212 -196 1532 -405 462 -1050 740 -209 -266 -782 -781 -302 275 133 -60 -89 -239 -256 -478 -142
8098 -142 90 -357 260 -285 -712 334 -423 -659 -262 547 -567 -334 -244 515 -565 -121 401 -491 24
8117 24 348 459 225 287 1148 -335 -603 -831 -367 285 49 -817 63 618 -47 -277 50 839 193 544
$$ packed form
7980a9k04P02k04K27m09j23J091j262M69J77J336l172J028k2O29j569J937q60
7998b48K88Q20m68J69p99j73l46P15k43n04J641j249k23N59N29j306R65M93p46
8017a26j19L91K58p54J295n46j121N42j1L28k56N56j136j3R86o3O21j465J034
8036D01o57J33K86l23M53L02m70k73R1K25k90m98R78k1K73l86o9j85J78k45k89
8057c86J244j441M87l46M93m9K3L71p95L28K14o84O74O7L72j55j12j400J280q15
8077f30lQ45m08J728j937Q67j512J790r49n7n16JM79N77j42j93k9j50j7k22L36
8098a42K32m47O17n45m27J046p57k36L97Q09j114K33R0P59j080M44N22q92N15
8117B4L24J11k34O2Q61j483k68k28M64O52k36q66Q80N55o65k30L27P89o46L51
$$ plain form
8137 544 -737 -17 -101 448 472 -285 4 -40 -248 -164 1395 -939 244 46 261 535 -216 -195 -594 -431
8157 -431 -19 669 594 391 148 -436 7 498 848 -543 666 -41 263 348 310 -210 240 171 -648 86 643
8178 643 82 94 -761 781 -966 -98 -724 -348 238 -581 374 -474 561
$$ packed form
8137E44j281P20q4N49K4p57K89m4k08Q4J559k334J183j98K15K74p51K1l99J63
8157d31M12O88p5k03k43n84M43M91L50j391J209p07L04Q5l8n20M50o9q19P34N57
8178F43n61J2q55J542j747Q68o26L76N86q19R55q48J035
8191E61
$$ Imaginary data points
##PAGE= N=2
##DATA TABLE= (X++(I..I)), XYDATA
$$ plain form
0 0 0 0 0 0 0 0 0 0 0 0 0 0 0 0 -99 108 -108 108 -108 215 -216 219 -323 369 -432 539 -646 742 -854 971
30 971 -1082 1285 -1446 1645 -1872 2127 -2396 2690 -3024 3381 -3783 4214 -4684 5201 -5766
45 -5766 6375 -7054 7780 -8586 9460 -10430 11481 -12648 13936 -15359 16956 -18749
57 -18749 20770 -23085 25753 -28883 32607 -37142 42834 -50217 60317 -75308 100682 -157844
69 -157844 662429 77905 391719 35484 171336 393587 545348 477211 -172375 -84869
79 -84869 -769834 51935 -418972 699944 23283 181822 51246 -559403 126923 -334094
89 -334094 248035 -186768 180210 -546412 -393185 -224804 -219760 358416 -143847 664054
99 664054 -200568 252183 -48036 116175 282011 78717 333240 -210853 286781 -337597
$$ packed form
0@%%%%%%%%%%%%%%r9K07k16K16k16L23m31M35n42O92q01R71j185J388j596J825
30I71k053K367k731L091l517L999m523N086n714O405p164P997q898R885j0967
45e766J2141j3429J4834j6366J8046j9890K1911k4129K6584k9295L2315l5705
57a8749L9519m3855M8838n4636O1490o9749P9976r3051J10534j35625J75990k58526
69a57844Q20273n84524L13814l56235J35852K22251J51761o8137o49586Q7506
79h4869o84965Q21769m70907J118916o76661J58539j30576o10649O86326m61017
89c34094N82129m34803L66978p26622J53227J68381N044N78176n02263Q07901
99F64054q64622M52751l00219J64211J65836k03294K54523n44093M97634o24378
$$ plain form
109 -337597 466241 146387 431020 539492 236631 627287 -76664 582694 97067 432434
119 432434 50014 215079 87794 -118110 295473 -109208 577734 -76403 477182 38552
129 38552 118402 161372 -148874 256299 -317932 114154 -366098 40502 -341798 -3537
139 -3537 63318 -107846 263215 -230141 342515 -297983 156108 -127517 -51969 -38139 -244557
150 -244557 101272 -277891 264435 -161604 388652 61482 251251 271020 49582 378462
160 378462 -121633 396535 -126102 218536 -28577 156952 151890 52125 425626 18711
170 18711 510912 -37961 400471 49197 111066 121849 -121201 168646 -261029 178529
180 178529 -229687 197136 -100619 135124 108341 -88583 233076 -244765 190767 -332310
$$ packed form
109c37597Q03838l19854K84633J08472l02861L90656p03951O59358m85627L35367
119D32434l82420J65065j27285k05904M13583m04681O86942o54137N53585m38630
129C8552P9850M2970l10246M05173n74231M32086m80252M06600l82300L38261
139c537O6855j71164L71061m93356N72656o40498M54091k83625P5548J3830k06418
150b44557L45829l79163N42326m26039N50256l27170J89769J9769k21438L28880
160C78462n00095N18168n22637L44638k47113J85529n062r9765L73501m06915
170A8711M92201n48873M38432l51274O1869J0783k43050K89847m29675M39558
180A78529m08216M26823k97755K35743k6783j96924L21659m77841M35532n23077
$$ plain form
190 -332310 37328 -231343 -150705 -119632 -210948 89551 -238367 239972 -189012 246671
200 246671 -73973 56736 59031 -147372 141895 -262058 161463 -224451 154096 -58929
210 -58929 136737 143986 58904 351734 -56755 360980 -85636 246508 -53652 39765 53324
221 53324 -94527 172396 -150004 270708 -98632 281769 -10240 134060 106528 -86680
231 -86680 149204 -263934 102914 -304957 27119 -226975 -72214 -46855 -139127 114886
241 114886 -217292 188385 -233197 94771 -200234 -89837 -101076 -255067 -8032 -316929
251 -316929 92946 -246361 122477 -100170 74431 73292 -50821 172514 -179438 181781
261 181781 -210740 93546 -141417 9221 23062 -65290 195548 -85410 295180 -60948
$$ packed form
190c32310L69638k68671Q0638L1073r1316L00499l27918M78339m28984M35683
200B46671l20644J30709K295k06403K89267m03953M23521l85914L78547k13025
210e8929J95666P249q5082K92830m08489M17735m46616L32144l00160R3417J3559
221E3324j47851K66923l22400M20712l69340L80401k92009J44300k7532j93208
231h6680K35884m13138L66848m07871L32076k54094J54761K5359r2272K54013
241A14886l32178M05677m21582L27968k95005J10397j1239j53991K47035l08897
251c16929M09875l39307L68838k22647J74601j139j24113K23335l51952L61219
261A81781l92521L04286k34963J50638J3841q8352K60838k80958L80590l56128
$$ plain form
271 -60948 245913 -16853 96137 50889 -104434 100313 -212047 128335 -216045 114201
281 114201 -107536 49341 47296 -71800 137673 -179462 132700 -259302 22345 -235777
291 -235777 -117507 -137435 -237067 -1741 -266707 97775 -233544 90157 -137597 -14370
301 -14370 -52805 -176862 14274 -285434 38767 -297363 25245 -170043 -11142 144
311 144 -65995 158323 -108472 206793 -134791 145819 -95431 13495 -16636 -110303 98678
322 98678 -154052 174724 -115201 193190 -12192 109691 78164 -25931 135748 -160980
332 -160980 114475 -218504 53889 -162549 -39983 -40536 -109027 88771 -159855 135671 -175579
343 -175579 86559 -156753 -59437 -105523 -205327 -29493 -289629 21465 -256510 37813
$$ packed form
271f0948L06861k62766J12990m5248j55323K04747l12360L40382l44380L30246
281A14201k21737J56877k045j19096K09473l17135L12162l92002K81647k58122
291b35777J18270j9928r9632K35326k64966L64482l31319L23701k27754J23227
301a4370l8435j24057J91136k99708L24201l36130L22608j95288J58901J1286
311A44o6139K24318k66795L15265l41584K80610k41250J08926l0131r3667K08981
322I8678k52730L28776k89925L08391k05382J21883l1527j04095J61679k96728
332a60980K75455l32979K72393k16438J22566n53o8491J97798k48626K95526l11250
343a75579K62138k43312R7316m6086r9804J75834k60136L11094k77975K94323
$$ plain form
353 37813 -146545 -8261 -18417 -85215 77092 -184800 98277 -217498 47051 -166879
363 -166879 -42112 -36009 -99431 99080 -110235 184669 -76637 188505 -25668 88518
373 88518 43252 -45842 103713 -155377 130294 -143061 109528 -59715 66837 62651 1829
384 1829 143918 -84067 165045 -141394 91197 -137813 -34616 -63131 -147772 29232 -189933
395 -189933 84475 -153533 83584 -106992 15696 -30313 -106912 17656 -218749 50631
405 50631 -240901 9617 -156319 -28487 -21444 -74887 94196 -88727 148015 -108159 134053
416 134053 -88770 31866 -5819 -78990 84398 -131650 152551 -82431 149095 5726
426 5726 124657 86777 30838 143064 -60168 160215 -134270 117367 -79016 18990 20283
$$ packed form
353C7813j84358J38284j0156o6798J62307k61892K83077l15775K64549k13930
363a66879J24767O103o3422J98511k09315K94904k61306K65142k14173J14186
373H8518m5266q9094J49555k59090K85671k73355K52589j69243J26552m186o0822
384A829J42089k27985K49112l06439K32591k29010J03197k8515q4641J77004k19165
395a89933K74408k38008K37117j90576J22688m6009p6599J24568k36405K69380
405E0631k91532K50518j65936J27832P043n3443J69083j82923K36742k56174K42212
416A34053k22823J20636l7685p3171J63388k16048K84201k34982K31526j43369
426E726J18931l7880n5939J12226k03232K20383k94485K51637j96383R8006J293
$$ plain form
437 20283 -44810 114547 -73889 149474 -71847 121636 -78367 40474 -36810 -104091 22241
448 22241 -189495 65298 -194601 47832 -82178 6085 -3210 -38578 75322 -103919 90228
459 90228 -153281 82553 -140645 -9520 -21733 -83596 83610 -94998 156726 -55171
469 -55171 145650 6050 112037 32871 10065 113666 -87848 141744 -113000 144875
479 144875 -28152 63648 89029 35891 147018 -14800 172401 -47653 132934 -74855
489 -74855 60201 -20037 -74609 78626 -122799 109177 -102156 103609 -27903 35968 3819
500 3819 -12798 39888 -133082 70957 -167437 55538 -137938 -4360 2500 -68116 82369
511 82369 -62838 122717 -68137 109449 -51227 58859 -28511 -28407 77190 -117353 131110
$$ packed form
437B0283o5093J59357j88436K23363k21321J93483k00003J18841p7284o7281J26332
448B2241k11736K54793k59899K42433j30010Q8263r295l5368J13900j79241J94147
459I0228k43509K35834k23198J31125j2213o1863J67206j78608K51724k11897
469e5171K00821j39600J05987p9166k2806J03601k01514K29592k54744K57875
479A44875j73027R1800K5381n3138J11127j61818J87201k20054J80587k07789
489g4855J35056q0238n4572J53235k01425K31976k11333K05765j31512O3871l2149
500C819j6617N2686j72970K04039k38394K22975j93476J33578O860p0616J50485
511H2369j45207J85555j90854J77586j60676J10086q7370J04J05597j94543K48463
$$ plain form
522 131110 -77284 139494 -5289 90208 99679 46958 116555 -11919 154513 -75785 123521
533 123521 -64222 73033 16528 -27007 131131 -52711 145922 -33696 132269 -20443
543 -20443 56807 2345 -17315 23764 -124530 90012 -146439 67236 -82786 28684 21904
554 21904 -43999 75110 -58396 77823 -106704 68594 -105105 10002 -52418 -54869 54304
565 54304 -112569 123901 -66991 106595 -12763 74381 40487 1354 64345 -50971 106349
576 106349 -108644 112641 -50062 68751 39718 7935 139250 -28068 140159 -25290
586 -25290 116945 -42001 58753 -10658 -23185 44835 -88800 115033 -103282 102005 -28067
597 -28067 49931 21911 -20100 59453 -74418 48939 -124726 57151 -119549 5058 -34109
$$ packed form
522A31110k08394K16778j44783R5497R471n2721O9597j28474J66432k30298J99306
533A23521j87743J37255n6505m3535J58138j83842J98633j79618J65965j52712
543b0443P7250n4462j9660M1079j48294K14542k36451K13675j50022J11470o780
554B1904o5903J19109j33506J36219j84527J75298j73699J15107o2420k451J09173
565E4304j66873K36470j90892J73586j19358Q7144l3894l9133O2991j15316J57320
576A06349k14993K21285j62703J18813k9033l1783J31315j67318J68227j65449
586b5290J42235j58946J00754o9411j2527O8020j33635K03833k18315K05287j30072
597b8067P7998k8020m2011P9553j33871J23357j73665J81877j76700J24607l9167
$$ plain form
608 -34109 -49054 57035 -90375 104192 -73439 72799 -49948 30720 -26970 -39058 24697
619 24697 -91989 74025 -111743 101035 -46156 51930 39199 9778 96418 -42099 103023
630 103023 -60423 85080 -69433 46134 -12023 -18022 69926 -58018 125819 -59138 116416
641 116416 -18067 52098 9817 -14369 38643 -86830 58217 -110849 67458 -89844 30609
652 30609 -1030 -24244 60522 -70890 84071 -89944 51819 -84286 4574 -52122 -54140
663 -54140 14133 -97687 72005 -95059 84752 -51223 41476 10127 -19512 43050 -75635
674 -75635 63886 -98469 57661 -77177 37282 -5039 -9921 72881 -41384 114194 -55131
685 -55131 95321 -41045 39451 -10251 -26076 31976 -76252 77539 -84953 85186 -49567
$$ packed form
608c4109j4945J06089j47410J94567j77631J46238j22747Q0668n7690j2088O3755
619B4697j16686J66014j85768K12778j47191R8086j2731k9421Q6640j38517J45122
630A03023j63446J45503j54513J15567n8157n999Q7948j27944J83837j84957J75554
641A16416j34483P0165m2281k4186N3012j25473J45047j69066J78307j57302J20453
652C0609l1639k3214Q4766j31412J54961j74015J41763j36105Q8860n6696k018
663e4140O8273j11820J69692j67064J79811j35975R2699l1349k9639O2562j18685
674g5635J39521j62355J56130j34838J14459m2321m882Q2802j14265J55578j69325
685e5131J50452j36366Q0496m9702j5825N8052j08228J53791j62492J70139j34753
$$ plain form
696 -49567 55768 11623 -10243 55360 -65862 67998 -100428 45426 -90365 9122 -39805
707 -39805 -38674 29945 -73746 78828 -82676 73605 -60690 25575 -25199 -44347 13166
718 13166 -94185 45841 -106979 55318 -67600 37307 -3185 -8618 59792 -50965 82473
729 82473 -76355 67471 -65319 23188 -21926 -25544 41293 -56446 86033 -59767 96955
740 96955 -31711 55103 5980 -8937 42944 -67199 60296 -92396 58291 -67991 30876
751 30876 -11978 -11077 51012 -52324 77933 -75998 64779 -70285 13083 -38594 -44766 11721
763 11721 -86534 50954 -90311 64949 -58056 35434 -10194 -16824 33332 -70987 53868
774 53868 -94929 46253 -74884 17414 -18280 -15974 44510 -47254 84921 -55607 82715
$$ packed form
696d9567J05335m4145k1866O5603j21222J33860j68426J45854j35791R9487m8927
707c9805J131O8619j03691J52574j61504J56281j34295Q6265n0774j9148N7513
718A3166j07351J40026j52820J62297j22918J04907m0492n433O8410j10757J33438
729H2473j58828J43826j32790Q8507m5114l618O6837r7739J42479j45800J56722
740I6955j28666Q6814m9123j4917N1881j10143J27495j52692J50687j26282R8867
751C0876m2854R01O2089j03336J30257j53931J40777j35064Q3368n1677o172N6487
763A1721r8255J37488j41265J55260j23005R3490m5628o630N0156j04319J24855
774E3868j48797J41182j21137R2298l5694K306O0484r1764J32175j40528J38322
$$ plain form
785 82715 -44903 38752 -8975 -16247 30780 -64808 63502 -71292 73173 -43776 50711
796 50711 8030 5603 53229 -46405 73338 -73560 57316 -68285 20009 -26505 -24052 27791
808 27791 -58530 70030 -68357 71892 -53389 34391 -17676 -27220 16185 -77303 42819
819 42819 -92826 46932 -68297 29811 -15007 -8798 42204 -47645 73042 -69497 61408
830 61408 -59729 24186 -21570 -22703 25551 -50339 69636 -58492 80762 -35510 56112
841 56112 3595 -1573 43560 -49869 61706 -69566 56028 -53861 34089 -10814 -822 40641
853 40641 -37298 78817 -62142 70198 -51532 27729 -21953 -29540 17158 -62270 44649
864 44649 -72957 60243 -54002 41272 -12036 -5736 33942 -57671 57793 -79344 46051
$$ packed form
785H2715j27618Q3655m7727p272M7027r5588J28310j34794J44465j16949R4487
796E0711m2681k427M7626r9634J19743j46898J30876j25601Q8294m6514K453N1843
808B7791q6321J28560j38387J40249j25281Q7780n2067r544M3405r3488J20122
819D2819j35645J39758j15229R8108m4818O209N1002q9849J20687j42539J30905
830F1408j21137Q3915m5756j133M8254p5890J19975j28128J39254j16272R1622
841E6112n2517n168M5133r3429J11575j31272J25594j09889Q7950m4903R992M1463
853D0641p7939J16115j40959J32340j21730P9261m9682p587M6698p9428J06919
864D4649j17606J33200j14245R5274n3308O300L9678r1613J15464j37137J25395
$$ plain form
875 46051 -62837 20093 -23395 -12490 28158 -37975 70518 -58051 81558 -43329 41686
886 41686 -9711 -11625 33185 -54983 52750 -58936 59379 -43908 49203 -2738 10690
897 10690 44083 -36197 72996 -66382 61768 -49676 21716 -19077 -14836 24063 -43670
908 -43670 52416 -54386 72122 -51345 42363 -12804 -12798 25750 -63227 47805 -73112 39717
920 39717 -54689 30369 -21709 1660 29765 -35919 64411 -64046 69572 -56012 24099
931 24099 -13991 -16318 21313 -46825 53859 -47886 64650 -42841 57106 -6788 4082
942 4082 37413 -44115 61885 -68208 53405 -45376 23363 -12137 3169 26888 -30151 63340
954 63340 -49114 70104 -54508 39279 -14316 -21656 20561 -52330 46379 -60783 46312
$$ packed form
875D6051j08888Q2930m3488J0905M0648o6133J08493j28569J39609j24887Q5015
886D1686n1397j914M4810q8168J07733j11686J18315j03287R3111n1941J3428
897A0690L3393q0280J09193j39378J28150j11444P1392m0793M241L8899o7733
908d3670R6086j06802J26508j23467R3708n5167OL8548q8977J11032j20917J12829
920C9717r4406Q5058n2078K3369K8105o5684J00330j28457J33618j25584Q0111
931B4099l8090k327L7631o8138J00684j01745J12536j07491R9947o3894J0870
942D082L3331q1528J06000j30093J21613r8781O8739l5500J5306K3719n7039R3491
954F3340j12454J19218j24612R3787n3595p340M2217p2891R8709j07162J07095
$$ plain form
965 46312 -41058 39744 -19111 6821 26451 -42549 57012 -69171 54547 -59373 18301
976 18301 -12644 -13488 17348 -32122 54616 -49151 62875 -45047 50728 -20386 -7311 28971
988 28971 -51311 50335 -61766 50503 -39836 31696 -9074 13140 24609 -27465 61218
999 61218 -58387 60321 -54112 31944 -16712 -19829 24279 -37117 44819 -48399 55838
1010 55838 -38286 41921 -21161 6259 22345 -50600 50788 -65276 45798 -49282 22654
1021 22654 -10403 -3252 20451 -22049 50530 -52493 60947 -51467 34997 -24960 -12835
1032 -12835 24619 -50573 44139 -47139 50698 -38385 38250 -11922 11193 17970 -34826 53525
1044 53525 -65675 52153 -51299 25231 -16061 -8494 24618 -28234 45045 -41521 59729
$$ packed form
965D6312q7370Q0802n8855K5932J9630o9000R9561j26183J23718j13920P7674
976A8301l0945q44L0836m9470Q6738j03767J12026j07922R5775p1114J3075L6282
988B8971q0282J01646j12101J12269r0339P1532m0770K2214J1469n2074Q8683
999F1218j19605J18708j14433Q6056m8656l117M4108o1396Q1936r3218J04237
1010E5838r4124Q0207o3082K7420J6086p2945J01388j16064J11074r5080P1936
1021B2654l3057P151K3703m2500P2579j03023J13440j12414Q6464n9957J2125
1032a2835L7454p5192R4712r1278R7837q9083P6635n0172K3115O777n2796Q8351
1044E3525j19200J17828j03452P6530m1292P567L3112n2852P3279q6566J01250
$$ plain form
1055 59729 -45737 38617 -20809 -1903 16648 -48936 47002 -56095 44807 -39144 32314
1066 32314 -10004 4836 20071 -25514 45823 -56481 55648 -53097 25885 -18410 -8889
1077 -8889 21695 -38239 45528 -40703 50879 -38606 38876 -16407 2181 13843 -38529 45824
1089 45824 -61659 46564 -43851 27890 -12117 2225 21566 -25402 44953 -45703 51651
1100 51651 -50917 32724 -22018 -7510 14754 -38017 46135 -47530 47266 -35518 36790 -14326
1112 -14326 5323 15187 -31215 40478 -55938 47142 -48278 27041 -14824 -1975 20531 -25721
1124 -25721 45209 -40340 48532 -40311 34959 -21396 -2904 13416 -35501 39516 -50864 47505
1136 47505 -37558 32446 -11100 6244 16891 -26005 38806 -49405 45133 -48972 27889 -20740
$$ packed form
1055E9729j05466Q4354n9426J8906J8551o5584R5938j03097J00902q3951P1458
1066C2314m2318J4840J5235m5585P1337j02304J12129j08745P8982m4295R521
1077h889L0584n9934Q3767q6231R1582q9485P7482n5283J8588J1662n2372Q4353
1089D5824j07483J08223r0415P1741m0007J4342J9341m6968P0355r0656R7354
1100E1651j02568Q3641n4742J4508K2264n2771Q4152r3665R4796q2784P2308n1116
1112a4326J9649R864m6402P1693r6416J03080r5420P5319m1865J2849K2506m6252
1124b5721P0930q5549Q8872q8843P5270n6355J8492J6320m8917P5017r0380R8369
1136D7505q5063P0004m3546J7344J0647m2896O4811q8211R4538r4105P6861m8629
$$ plain form
1148 -20740 -3547 16487 -28632 42235 -42372 48231 -37090 34479 -20488 1474 11320 -33156
1160 -33156 36509 -51070 45589 -43582 30896 -13042 3812 18350 -22751 40798 -43854 45922
1172 45922 -43192 28273 -22236 -1673 13271 -29850 38890 -42372 48985 -34617 32516 -13810
1184 -13810 4789 12530 -28362 33129 -49117 41678 -43132 27659 -16304 2566 16059 -24266
1196 -24266 38229 -40311 44832 -40152 27644 -20254 -965 8379 -30727 34710 -42805 44365
1208 44365 -37074 32591 -13535 5208 13267 -25157 34144 -43730 40320 -42576 27834 -18403
1220 -18403 3176 12793 -22498 39229 -36900 45479 -36897 31181 -17010 2113 9302 -26642
1232 -26642 32708 -40886 40898 -37284 31784 -12729 6404 13686 -21305 35430 -40347 39398
$$ packed form
1148b0740J7193K0034m5119P0867q4607R0603q5321P1569n4967K1962R846m4476
1160c3156O9665q7579R6659q9171P4478m3938J6854J4538m1101O3549q4652Q9776
1172D5922q9114P1465n0509K0563J4944m3121O8740q1262R1357q3602O7133m6326
1184a3810J8599P741m0892O1491q2246R0795q4810P0791m3963J8870J3493m0325
1196b4266O2495p8540Q5143q4984O7796m7898J9289R344l9106O5437p7515Q7170
1208D4365q1439O9665m6126J8743Q059l8424N9301p7874Q4050q2896P0410m6237
1220a8403K1579R617l5291O1727p6129Q2379q2376O8078m8191J9123P189l5944
1232b6642N9350p3594Q1784p8182O9068m4513J9133P282l4991N6735p5777P9745
$$ plain form
1244 39398 -39452 26443 -20677 -668 8673 -24458 33686 -37745 41036 -33995 30627 -16362
1256 -16362 1959 8253 -25030 29323 -42285 37176 -38437 29319 -16518 5277 12491 -19491
1268 -19491 34861 -36557 39383 -36838 27030 -20100 1991 8123 -21556 31254 -37260 41867
1280 41867 -32993 31610 -14479 5999 8380 -20255 29563 -38687 36579 -36971 27036 -17932
1292 -17932 5597 11337 -18790 32517 -34439 38522 -33417 25715 -19848 2431 4410 -22919
1304 -22919 27581 -37983 37341 -34215 27837 -15354 5176 11000 -20050 27126 -35999 35938
1316 35938 -37147 25283 -19749 5473 8452 -20688 31239 -33493 39448 -30689 28463 -15551
1328 -15551 6096 5223 -18447 25943 -34995 38151 -35230 29414 -15498 6705 11900 -17696
$$ packed form
1244C9398p8850O5895m7120K0009R341l3131N8144p1431P8781p5031O4622m6989
1256a6362J8321O294l3283N4353p1608P9461p5613O7756m5837K1795P214l1982
1268a9491N4352p1418P5940p6221O3868m7130K2091O132k9679N2810o8514P9127
1280D1867p4860O4603m6089K0478K381k8635M9818o8250P5266p3550O4007m4968
1292a7932K3529N740l0127N1307o6956P2961p1939N9132m5563K2279J979k7329
1304b2919N0500o5564P5324p1556O2052m3191K0530N824l1050M7176o3125P1937
1316C5938p3085O2430m5032K5222K979k9140N1927o4732P2941p0137N9152m4014
1328a5551K1647q73k3670M4390o0938P3146p3381O4644m4912K2203N195k9596
$$ plain form
1340 -17696 28630 -31272 33278 -33469 25357 -20206 6498 3967 -17660 29483 -33481 38347
1352 38347 -31250 25901 -15095 4264 5799 -19272 22584 -30954 32392 -34554 27750 -18152
1364 -18152 6090 7896 -17563 30567 -31542 32855 -29771 23814 -16416 5509 2330 -14625
1376 -14625 23966 -32022 38352 -32048 28579 -13638 6601 9042 -17075 26180 -28325 29419
1388 29419 -31039 27332 -20354 7764 4185 -14979 29957 -32238 36613 -27789 22988 -14232
1400 -14232 4691 2307 -14230 20098 -29245 31960 -35380 28651 -15980 5264 7853 -16343
1412 -16343 26350 -30216 27562 -26381 22284 -19610 9224 2519 -13960 23436 -30591 37477
1424 37477 -31422 24115 -12450 3946 5212 -13808 21389 -27196 27843 -28846 30940 -20038
$$ packed form
1340a7696M6326n9902O4550o6747N8826m5563K6704k531k1627M7143o2964P1828
1352C8347o9597N7151m0996J9359J535k5071M1856n3538O3346o6946O2304m5902
1364a8152K4242J806k5459M8130o2109O4397o2626N3585m0230K1925l179j6955
1376a4625L8591n5988P0374p0400O0627m2217K0239K441k6117M3255n4505N7744
1388B9419o0458N8371m7686K8118l579j9164M4936o2195O8851o4402N0777l7220
1400a4232J8923k384j6537L4328m9343O1205o7340O4031m4631K1244K589k4196
1412a6343M2693n6566N7778n3943M8665m1894K8834o705j6479L7396n4027O8068
1424C7477o8899N5537l6565J6396J266j9020L5197m8585N5039n6689N9786n0978
$$ plain form
1436 -20038 10714 7463 -15235 26327 -29125 32674 -25121 20180 -14888 7479 -146 -10842
1448 -10842 21150 -27437 33379 -32050 29368 -15996 4100 7901 -15455 19192 -27294 26032
1460 26032 -26806 21788 -20120 10768 2423 -14170 24791 -29117 32018 -29563 21219 -12947
1472 -12947 3541 1587 -10508 18042 -24553 29943 -29324 27852 -18819 8634 7233 -15761
1484 -15761 22299 -25857 26762 -25581 20428 -14718 10456 -2770 -8681 22901 -27479 32754
1496 32754 -29204 24676 -15087 4013 5107 -13224 17247 -22590 25943 -26875 24613 -18250
1508 -18250 10786 1681 -13115 23913 -28489 27092 -27900 19188 -14342 4730 -510 -8656
1520 -8656 16643 -25215 29176 -28128 23999 -17419 7708 4113 -15112 18537 -23579 22543
$$ packed form
1436b0038L0752l251k2698M1562n5452O1799n7795M5301l5068K2367p625j0696
1448a0842L1992m8587O0816o5429O1418m5364K0096L801k3356L4647m6486N3326
1460B6032n2838M8594m1908L0888q345j6593L8961n3908O1135o1581N0782l4166
1472a2947J6488j954j2095K8550m2595N4496n9267N7176m6671K7453j401k2994
1484a5761L8060m8156N2619n2343M6009l5146K5174j3226n911L1582n0380O0233
1496C2754o1958N3880l9763J9100J094j8331L0471l9837M8533n2818N1488m2863
1508a8250K9036r105j4796L7028n2402N5581n4992M7088l3530J9072n240q146
1520h656K5299m1858N4391n7304N2127m1418K5127l595j9225L3649m2116M6122
$$ plain form
1532 22543 -25531 23542 -16572 9662 -895 -8301 20991 -25861 29802 -26818 21458 -14624
1544 -14624 4976 3021 -9263 16190 -20941 25917 -27103 25360 -17299 8934 718 -11514
1556 -11514 20451 -26896 23907 -24666 20943 -16690 8326 -484 -7364 16245 -23963 28996
1568 28996 -27629 22029 -16627 5551 1759 -12090 16602 -22064 23743 -24664 23009 -17560
1580 -17560 9212 575 -9733 17893 -25105 25371 -25537 19416 -15361 6730 492 -8011
1592 -8011 16010 -21438 26172 -25991 22900 -16372 7782 2144 -9843 17152 -22567 24190
1604 24190 -24207 20541 -15707 9886 -1389 -8137 16220 -22917 26120 -25965 20911 -16051
1616 -16051 7901 139 -10220 15535 -20146 23649 -25601 23051 -17527 9407 -154 -9549
$$ packed form
1532B2543m8074M9073m0114K6234j0557p406K9292m6852N5663n6620M8276l6082
1544a4624J9600j955j2284K5453l7131M6858n3020N2463m2659K6233q216j2232
1556a1514L1965m7347N0803m8573M5609l7633K5016q810o880K3609m0208N2959
1568B8996n6625M9658l8656K2178l792j3849K8692l8666M5807m8407M7673m0569
1580a7560K6772q637j0308K7626m2998N0476n0908M4953l4777K2091o238q503
1592h011K4021l7448M7610n2163M8891l9272K4154n638j1987K6995l9719M6757
1604B4190m8397M4748l6248K5593j1275o748K4357l9137M9037n2085M6876l6962
1616a6051K3952p762j0359K5755l5681M3795m9250M8652m0578K6934r561r395
$$ plain form
1628 -9549 16233 -21828 23387 -25133 20539 -15837 7928 -569 -7061 14874 -20999 25106
1640 25106 -24504 21429 -16568 8220 -207 -8351 14907 -19838 22920 -23221 21632 -15796
1652 -15796 8983 109 -7321 15362 -21705 23856 -24244 19377 -15869 8541 -745 -6656 15492
1665 15492 -21196 23504 -23579 20863 -16339 8601 -1685 -7882 13487 -21045 22746 -23173
1677 -23173 21333 -17159 8767 -1553 -7455 14106 -20586 22201 -24961 21831 -16321 9096
1689 9096 -1936 -6398 14301 -18972 22663 -22983 22236 -16159 9018 -1186 -6713 14653
1701 14653 -19455 21518 -22771 20458 -15499 8868 -616 -6483 13327 -18021 21813 -22466
1713 -22466 20627 -17448 8247 -1015 -5244 13148 -19994 22409 -22412 21474 -15907 9491
$$ packed form
1628i549K5782l8061M5215m8520M5672l6376K3765q497o492K1935l5873M6105
1640B5106m9610M5933l7997K4788q427q144K3258l4745M2758m6141M4853l7428
1652a5796K4779q874p430K2683l7067M5561m8100M3621l5246K4410r286n911K2148
1665A5492l6688M4700m7083M4442l7202K4940j0286o197K1369l4532M3791m5919
1677b3173M4506l8492K5926j0320n902K1561l4692M2787m7162M6792l8152K5417
1689I096j1032m462K0699l3273M1635m5646M5219l8395K5177j0204n527K1366
1701A4653l4108M0973m4289M3229l5957K4367r484n867J9810l1348L9834m4279
1713b2466M3093l8075K5695r262m229J8392l3142M2403m4821M3886l7381K5398
$$ plain form
1725 9491 -2755 -6699 12889 -19753 22960 -23202 20211 -15410 9871 -1252 -6029 11962
1737 11962 -17865 21148 -22908 21382 -17514 9634 -1581 -6215 12891 -18625 20920 -21512
1749 -21512 20342 -15580 10384 -2778 -4688 12948 -18077 21948 -22942 20691 -16837 8942
1761 8942 -1986 -5972 12350 -17382 20930 -21433 20666 -16374 10278 -2611 -6065 12810
1773 12810 -18307 21191 -22267 20167 -14980 9610 -3407 -4595 12400 -17631 21164 -21600
1785 -21600 20930 -15817 10527 -2441 -5787 11931 -17131 20797 -20067 19918 -15493 10365
1797 10365 -3666 -2952 12434 -17541 21609 -22232 21012 -16258 8844 -2555 -5437 10395
1809 10395 -16890 18912 -21960 20897 -15986 10979 -3573 -5054 12318 -17776 19233 -21041
$$ packed form
1725I491j2246l944J9588l2642M2713m6162M3413l5621K5281j1123m777J7991
1737A1962k9827L9013m4056M4290l8896K7148j1215m634J9106l1516L9545m2432
1749b1512M1854l5922K5964j3162j910J7636l1025M0025m4890M3633l7528K5779
1761H942j0928l986J8322k9732L8312m2363M2099l7040K6652j2889l454J8875
1773A2810l1117L9498m3458M2434l5147K4590j3017j188J6995l0031L8795m2764
1785b1600M2530l6747K6344j2968l346J7718k9062L7928m0864L9985l5411K5858
1797A0365j4031P14J5386k9975L9150m3841M3244l7270K5102j1399k882J5832
1809A0395k7285L5802m0872M2857l6883K6965j4552j481J7372l0094L7009m0274
$$ plain form
1821 -21041 19172 -15363 9083 -3331 -3148 10028 -16037 21341 -22046 20610 -15850 9861
1833 9861 -2134 -5086 11655 -16592 18696 -19653 20709 -16516 11589 -3824 -2459 11396
1845 11396 -17755 20787 -20554 19651 -15558 9224 -2517 -3713 7787 -14665 18899 -21196
1857 -21196 21784 -17255 12103 -2795 -4358 11107 -17000 18896 -18749 17440 -15633 10686
1869 10686 -4392 -1937 8472 -15498 19777 -22863 20356 -14967 9607 -1962 -4149 9685
1881 9685 -14605 16467 -19024 19418 -17783 11924 -3436 -3369 9562 -16980 20907 -19193 17504
1894 17504 -14023 10820 -4550 -2017 7738 -14094 17907 -21876 21577 -16907 10862 -2982
1906 -2982 -3586 10295 -15741 18585 -17786 17201 -15968 12434 -5691 -1404 8672 -14861 20660
$$ packed form
1821b1041M0213l4535K4446j2414J83J3176k6065L7378m3387M2656l6460K5711
1833I861j1995k952J6741k8247L5288l8349M0362l7225K8105j5413J365J3855
1845A1396k9151L8542m1341M0205l5209K4782j1741j196J1500k2452L3564m0095
1857b1196M2980l9039K9358j4898j563J5465k8107L5896l7645L6189l3073K6319
1869A0686j5078K455J0409k3970L5275m2640M3219l5323K4574j1569k187J3834
1881I685k4290L1072l5491L8442l7201K9707j5360O7J2931k6542L7887m0100L6697
1894A7504l1527K4843j5370K533R755k1832L2001l9783M3453l8484K7769j3844
1906b982o04J3881k6036L4326l6371L4987l3169K8402j8125M287J0076k3533L5521
$$ plain form
1919 20660 -22112 18509 -14630 8359 -3572 -1066 8170 -12804 17264 -19268 19066 -18238
1931 -18238 12140 -2034 -3820 10596 -15809 19384 -18370 16250 -13937 9649 -5262 -561
1943 -561 9079 -14512 18151 -21280 21845 -16760 10119 -3189 -3716 8463 -13519 16399 -17767
1956 -17767 17802 -16599 12628 -6563 -916 9220 -15028 17880 -19592 17653 -15561 9728
1968 9728 -3779 29 6573 -13194 17623 -19671 19003 -16582 11957 -4663 -2872 8881 -13196
1981 -13196 17521 -18221 17287 -14729 10894 -7517 -206 6758 -15979 18884 -20742 17837
1993 17837 -16318 9765 -3768 -1060 7885 -11920 16271 -18136 18507 -16647 11238 -5375
2005 -5375 -2034 7359 -14489 17187 -18123 17421 -15123 10677 -5329 348 7066 -11411 19630
$$ packed form
1919B0660m2772M0621l3139K2989j1931K506R236k0974L0068l6532L8334l7304
1931a8238L0378j4174j786J4416k6405L5193l7754L4620l0187K3586j4911M701
1943e61R640k3591L2663l9431M3125l8605K6879j3308n27J2179k1982K9918l4166
1956a7767L5569l4401K9227j9191N647J0136k4248L2908l7472L7245l3214K5289
1968I728j3507L808O544j9767L0817l7294L8674l5585K8539j6620J791J1753k2077
1981a3196L0717l5742L5508l2016K5623j8411P311O964k2737L4863l9626L8579
1993A7837l4155K6083j3533K708Q945j9805K8191l4407L6643l5154K7885j6613
2005e375L341R393k1848L1676l5310L5544l2544K5800j6006N677O718j8477L1041
$$ plain form
2018 19630 -19575 19747 -15779 11462 -5709 -2574 8530 -12555 15866 -19189 17562 -16282
2030 -16282 12557 -7107 361 7146 -13368 16826 -19082 17072 -14728 10975 -5456 -395
2042 -395 5649 -11366 16308 -19098 18639 -16820 10515 -5681 -1555 7118 -12819 15796 -18605
2055 -18605 17429 -16024 12335 -6307 -364 6362 -11067 17012 -17725 19342 -16021 10499
2067 10499 -5727 -30 7023 -11957 14730 -16752 17611 -16250 11740 -7268 -192 6609 -11855
2080 -11855 15068 -18329 17615 -15366 11810 -6830 1115 6126 -10477 15111 -17980 18123
2092 18123 -16119 10706 -5746 -200 6911 -11646 15620 -17470 17364 -14986 12124 -6736
2104 -6736 378 5888 -11847 15552 -18879 17747 -15760 10427 -6669 1425 5721 -10833 14776
$$ packed form
2018A9630l9205L9322l5526K7241j7171L135J1104k1085K8421l5055L6751l3844
2030a6282K8839j9664P468O785k0514L0194l5908L6154l1800K5703j6431N061
2042c95O044j7015K7674l5406L7737l5459K7335j6196M126Q673j9937K8615l4401
2055a8605L6034l3453K8359j8642N943O726j7429K8079l4737L7067l5363K6520
2067A0499j6226N697P053j8980K6687l1482L4363l3861K7990j9008P076O801j8464
2080a1855K6923l3397L5944l2981K7176j8640P945N011j6603K5588l3091L6103
2092A8123l4242K6825j6452N546P111j8557K7266l3090L4834l2350K7110j8860
2104f736P114N510j7735K7399l4431L6626l3507K6187j7096Q094M296j6554K5609
$$ plain form
2117 14776 -17313 17764 -15476 10860 -6894 342 5148 -12211 14068 -17367 17493 -14493
2129 -14493 12022 -7275 38 4902 -11552 13473 -17352 17371 -15922 11841 -6526 384
2141 384 4858 -10079 14421 -16739 16961 -15526 11686 -6647 1549 5456 -10974 13992 -17492
2154 -17492 16752 -15158 11495 -6497 1511 4287 -9574 14733 -17064 16276 -14851 11113
2166 11113 -6449 104 4666 -9901 14119 -15817 16367 -13835 12279 -7364 1391 4916 -9280
2179 -9280 13405 -16942 16818 -13946 11640 -6420 987 4548 -9680 13815 -15688 16837
2191 16837 -15048 11714 -7047 1064 4574 -9056 13008 -16019 15974 -14827 11933 -7387
2203 -7387 1617 4357 -8461 12292 -15107 16821 -14865 11896 -7865 1905 5242 -8971 13493
$$ packed form
2117A4776l2089L5077l3240K6336j7754P236M806j7359K6279l1435L4860l1986
2129a4493K6515j9297P313M864j6454K5025l0825L4723l3293K7763j8367O910
2141C84M474j4937K4500l1160L3700l2487K7212j8333Q196L907j6430K4966l1484
2154a7492L4244l1910K6653j7992Q008K776j3861K4307l1797L3340l1127K5964
2166A1113j7562O553M562j4567K4020k9936L2184l0202K6114j9643Q755L525j4196
2179i280K2685l0347L3760l0764K5586j8060P407L561j4228K3495k9503L2525
2191A6837l1885K6762j8761Q111L510j3630K2064k9027L1993l0801K6760j9320
2203g387R004K740j2818K0753k7399L1928l1686K6761j9761R770L337j4213K2464
$$ plain form
2216 13493 -14396 16290 -14986 11493 -7051 1807 3995 -9880 13047 -16068 15196 -14101
2228 -14101 12446 -6001 1623 3475 -8345 11868 -15426 15777 -14969 11401 -7114 1475
2240 1475 4693 -8345 12952 -14927 14644 -14001 11579 -8264 2957 2838 -8534 13677 -14089
2253 -14089 15314 -14211 11054 -6670 1844 2606 -8152 12012 -14267 16899 -15612 12120
2265 12120 -7223 2257 4998 -8203 13516 -13615 15409 -13845 10918 -6337 2775 3562 -6184
2278 -6184 12028 -14068 15826 -13453 11127 -5573 2503 4001 -7817 12006 -14082 14370
2290 14370 -13888 10986 -7586 2335 2945 -7410 11812 -14519 13598 -14863 11164 -6198
2302 -6198 1580 2177 -6388 9949 -13123 14148 -14149 12583 -8136 663 2245 -7310 11210
$$ packed form
2216A3493k7889L0686l1276K6479j8544Q858K188j3875K2927k9115L1264k9297
2228a4101K6547j8447P624J852j1820K0213k7294L1203l0746K6370j8515Q589
2240A475L218j3038K1297k7879K9571k8645K5580j9843J1221j19j1372K2211k7766
2253a4089K9403k9525K5265j7724Q514P62j0758K0164k6279L1166l2511K7732
2265A2120j9343R480K741j3201K1719k7131K9024k9254K4763j7255R112P87r746
2278f184J8212k6096K9894k9279K4580j6700Q076J498j1818J9823k6088K8452
2290A4370k8258K4874j8572R921O10j0355J9222k6331K8117k8461K6027j7362
2302f198P778N97q565J6337k3072K7271k8297K6732k0719Q799J582r555J8520
$$ plain form
2315 11210 -12572 13371 -12110 9850 -7502 3253 2200 -5986 10230 -13213 15869 -13534
2327 -13534 11405 -7414 2003 3257 -7477 8949 -12408 14096 -13699 11537 -7610 3548
2339 3548 1932 -8068 11594 -14166 13537 -13541 10149 -7181 1493 653 -5229 9390 -13070
2352 -13070 15718 -13802 11115 -6367 903 2290 -7371 9129 -11859 13807 -12661 11326
2364 11326 -8614 4309 1515 -5864 10117 -13626 14149 -11614 10717 -6158 3159 819 -5607
2377 -5607 8355 -12288 12658 -13813 11880 -7685 2674 2275 -6903 10763 -12703 12576 -12155
2390 -12155 9753 -7943 3700 245 -5774 8072 -12993 14339 -14444 10505 -6021 1542
2402 1542 1875 -6476 7971 -12089 11273 -13100 10343 -6719 4162 372 -5426 10491 -12575
$$ packed form
2315A1210k3782K5943k5481K1960j7352J0755j053q186J6216k3443K9082k9403
2327a3534K4939j8819R417J254j0734J6426k1357K6504k7795K5236j9147J1158
2339C548j616j0000J9662k5760K7703k7078K3690j7330Q674q40n882J4619k2460
2352a3070K8788k9520K4917j7482P270J387r661J6500k0988K5666k6468K3987
2364A1326j9940J2923k794p379J5981k3743K7775k5763K2331j6875R317k340o426
2377e607J3962k0643K4946k6471K5693j9565J0359l99r178J7666k3466K5279k4731
2390a2155K1908j7696J1643l455o019J3846k1065K7332k8783K4949j6526P563
2402A542L33q351J4447k0060K3362k4373K3443j7062J0881l790n798J5917k3066
$$ plain form
2415 -12575 12871 -12993 10562 -6236 3343 409 -5140 9197 -12138 14015 -13326 12452
2427 12452 -8007 2901 1989 -6390 9494 -11528 11700 -12733 9618 -7520 3693 -302 -5428
2440 -5428 8126 -12019 13088 -12879 9651 -6130 1704 145 -4162 7628 -11616 11422 -12289
2453 -12289 10945 -8751 3138 214 -6537 7834 -11185 11289 -10861 9118 -7183 3527
2465 3527 319 -4709 7790 -11110 13135 -11118 9961 -5777 3423 193 -3717 7997 -11264
2478 -11264 12541 -11700 10907 -8629 3349 -130 -5783 8753 -10453 10618 -11577 9709
2490 9709 -7829 2357 138 -4072 6089 -9790 12118 -13007 9553 -8343 3264 163 -4824
2503 -4824 7514 -10916 10769 -10938 8118 -8559 4345 -1139 -3974 8378 -10699 12248
$$ packed form
2415a2575K5446k5864K3555j6798R579k934n549J4337k1335K6153k7341K5778
2427A2452k0459J0908r12q379J5884k1022K3228k4433K2351j7138J1213l995n126
2440e428J3554k0145K5107k5967K2530j5781P834j559m307J1790j9244K3038k3711
2453a2289K3234j9696J1889k924o751J4371j9019K2474k2150J9979j6301J0710
2465C527l208n028J2499j8900K4245k4253K1079j5738R200l230l910J1714j9261
2478a1264K3805k4241K2607j9536J1978l479n653J4536j9206K1071k2195K1286
2490I709j7538J0186k219m210J0161j5879K1908k5125K2560j7896J1607l101m987
2503d824J2338j8430K1685k1707J9056j6677J2904n484k835J2352j9077K2947
$$ plain form
2515 12248 -11463 10418 -6441 3346 684 -3440 6438 -9591 11797 -11031 10367 -7860 3604
2528 3604 109 -4281 8847 -9776 11161 -11408 9670 -6565 4636 411 -3220 8062 -10142
2541 -10142 11130 -11607 9695 -6622 3378 -269 -4544 5367 -10103 10782 -11231 10286
2553 10286 -8358 3516 -1108 -3943 7196 -10114 11894 -10898 9309 -7169 4375 -697
2565 -697 -2729 5944 -8380 11113 -11701 10287 -7570 4005 -1156 -2881 7362 -8566 11170
2578 11170 -9945 8757 -7321 4881 12 -3235 6998 -9298 10990 -11058 10368 -6588
2590 -6588 3970 -931 -2450 6070 -8270 11434 -9396 9568 -7164 3913 -1338 -3045 6004
2603 6004 -9124 10639 -11017 9409 -6642 3712 -1224 -2710 6568 -9025 11027 -11554 9949
$$ packed form
2515A2248k3711K1881j6859R787k662m124R878j6029K1388k2828K1398j8227J1464
2528C604l495m390J3128j8623K0937k2569K1078j6235J1201m225l631J1282j8204
2541a0142K1272k2737K1302j6317J0000l647m275R911j5470K0885k2013K1517
2553A0286j8644J1874m624k835J1139j7310K2008k2792K0207j6478J1544n072
2565f97k032Q673j4324J9493k2814K1988j7857J1575n161j725J0243j5928J9736
2578A1170k1115J8702j6078J2202m869l247J0233j6296K0288k2048K1426j6956
2590f588J0558m901j519Q520j4340J9704k0830J8964j6732J1077n251j707R049
2603F004j5128J9763k1656K0426j6051J0354m936j486R278j5593K0052k2581K1503
$$ plain form
2616 9949 -7494 5244 -838 -2479 5701 -8675 10770 -9332 9744 -6609 5369 -823 -2868
2629 -2868 6871 -8246 10557 -9679 9285 -7133 4564 -155 -2106 5503 -7448 11255 -10312
2642 -10312 10163 -7214 5885 -1220 -2375 6240 -8357 9590 -10595 9884 -7204 5741
2654 5741 -927 -2379 6000 -8546 9734 -10712 9227 -7695 5272 -1057 -2293 6066 -7144
2667 -7144 10565 -9347 10857 -6672 5715 -643 -1219 6543 -7467 10456 -9285 9737 -6640
2680 -6640 5609 -494 -1844 5868 -7376 10383 -10919 10033 -6522 5249 -2110 -2303 5455
2693 5455 -6552 9005 -8864 9325 -7058 5875 -1927 -1518 5292 -7442 8730 -10460 9281
2706 9281 -6877 4944 -1363 -1551 4959 -7169 8824 -8863 8880 -6816 5296 -1478 -1978
$$ packed form
2616I949j7443J2738o082j641Q180j4376J9445k0102J9076j6353J1978o192k045
2629b868R739j5117J8803k0236J8964j6418J1697m719j951P609j2951J8703k1567
2642a0312K0475j7377J3099p105j155Q615j4597J7947k0185K0479j7088J2945
2654E741o668j452Q379j4546J8280k0446J9939j6922J2967o329j236Q359j3210
2667g144J7709j9912K0204j7529J2387o358n76P762j4010J7923j9741J9022j6377
2680f640J2249o103j350P712j3244J7759k1302K0952j6555J1771p359j93P758
2693E455j2007J5557j7869J8189j6383J2933p802M09O810j2734J6172j9190J9741
2706I281j6158J1821o307j88O510j2128J5993j7687J7743j5696J2112o774n00
$$ plain form
2719 -1978 5494 -7591 9750 -8988 9375 -7394 5091 -2528 -997 4830 -6850 8990 -9509
2732 -9509 9163 -7129 5921 -1018 -429 5150 -7394 8272 -9182 9151 -7459 4567 -1935
2745 -1935 -1616 4784 -7071 8858 -9605 9927 -7549 4359 -1517 -1011 3666 -7152 9425
2758 9425 -9157 8296 -7975 5201 -2212 -1909 5247 -7736 8487 -9825 8271 -6926 4080
2771 4080 -1894 -1298 4204 -6766 8853 -9064 8866 -7575 5496 -1608 -1599 4620 -6299 8785
2785 8785 -8989 9174 -7013 6333 -1938 -738 4013 -5832 8497 -9119 7721 -7589 4685
2798 4685 -2216 -328 2655 -6940 7978 -10669 9221 -6385 5794 -3070 -1531 3799 -6515
2811 -6515 7392 -8346 8650 -7933 4540 -3118 -127 3560 -7158 7200 -9266 8910 -7463
$$ packed form
2719a978P472j3085J7341j8738J8363j6769J2485p619J531N827j1680J5840j8499
2732i509J8672j6292J3050o939N89N579j2544J5666j7454J8333j6610J2026o502
2745a935L19O400j1855J5929j8463J9532j7476J1908n876N06M677j0818J6577
2758I425j8582J7453j6271J3176p413L03P156j2983J6223j8312J8096j5197J1006
2771D080n974N96N502j0970J5619j7917J7930j6441J3071p104RO219j0919J5084
2785H785j7774J8163j6187J3346q271J200M751r845J4329j7616J6840j5310J2274
2798D685o901J888K983r595J4918j8647J9890j5606J2179q864J539N330j0314
2811f515J3907j5738J6996j6583J2473p658K991L687j0718J4358j6466J8176j6373
$$ plain form
2824 -7463 4971 -2068 -1071 3492 -6191 7444 -9377 9947 -6907 5295 -3113 -1844 4713 -6487
2838 -6487 8313 -7727 8350 -6855 4704 -2525 626 2206 -5731 8051 -9230 8591 -8028
2851 -8028 5243 -2084 -2028 3293 -6830 8299 -8084 8459 -7560 4940 -3284 54 3730 -7323
2865 -7323 8485 -9270 8136 -7561 4671 -3247 477 2606 -6021 7166 -9876 8764 -8441
2878 -8441 4488 -3799 -412 2956 -5492 7638 -8675 7508 -8530 5729 -4501 350 2326
2891 2326 -6635 8065 -9894 8677 -8174 5040 -3365 -237 2645 -5696 6973 -8700 9579
2904 9579 -8198 6014 -3401 -702 2586 -6483 7197 -9346 7661 -7970 4325 -3621 33
2917 33 2130 -6074 6035 -9300 8318 -7952 5604 -3192 24 2643 -5498 6835 -9110 8339
$$ packed form
2824g463J2434p039R97M563r683J3635j6821J9324j6854J2202q408J269O557j1200
2838f487J4800j6040J6077j5205J1559p229L151J580p937J3782j7281J7821j6619
2851h028J3271p327N6N321j0123J5129j6383J6543j6019J2500q224L338L676j1053
2865g323J5808j7755J7406j5697J2232p918L724K129q627J3187j7042J8640j7205
2878h441J2929q287L387L368q448J3130j6313J6183j6038J4259j0230M851J976
2891B326q961J4700j7959J8571j6851J3214q405L128K882q341J2669j5673J8279
2904I579j7777J4212r415K699L288r069J3680j6543J7007j5631J2295p946L654
2917C3K097q204J2109j5335J7618j6270J3556q796L216K619q141J2333j5945J7449
$$ plain form
2931 8339 -7851 6677 -3563 -423 2783 -6069 7582 -8894 7632 -6753 5569 -3472 823
2944 823 2274 -5087 7882 -8621 8251 -7844 5380 -3390 -109 2278 -4655 6420 -8951
2957 -8951 8259 -7907 5406 -4893 795 2103 -5355 6399 -9462 8550 -8264 4241 -3381
2970 -3381 -96 2712 -5029 6388 -7576 8596 -7818 4805 -4002 67 2753 -4491 7069
2983 7069 -7856 8312 -7353 5520 -4537 1259 2092 -4540 6995 -7692 8709 -7832 6050
2996 6050 -3691 569 997 -5256 6688 -7282 7832 -7636 5632 -4794 1772 1772 -3982 6301
3010 6301 -8421 8693 -8288 5653 -3825 521 2174 -4679 6731 -8178 8282 -7157 5662
3023 5662 -4072 1624 1490 -4571 7484 -7479 7911 -6657 6031 -4354 1254 1540 -4926 5909
$$ packed form
2931H339j6190J4528j0240L140L206q852J3651j6476J6526j4385J2322r041M295
2944H23J451p361J2969j6503J6872j6095J3224q770L281K387o933J1075j5371
2957h951J7210j6166J3313j0299N688J308p458J1754j5861J8012j6814J2505p622
2970c381L285K808p741J1417j3964J6172j6414J2623q807M069K686p244J1560
2983G069j4925J6168j5665J2873j0057N796Q33o632J1535j4687J6401j6541J3882
2996F050r741M260M28o253J1944j3970J5114j5468J3268j0426O566%n754J0283
3010F301j4722J7114j6981J3941r478M346J653o853J1410j4909J6460j5439J2819
3023E662r734N696j34o061J2055j4963J5390j4568J2688j0385N608K86o466J0835
$$ plain form
3037 5909 -7970 8660 -7071 4576 -3793 1357 1548 -4217 6920 -7792 7866 -7506 6331
3050 6331 -3778 1210 2858 -3375 5958 -7564 8340 -7406 5963 -3857 821 1142 -4182 6452
3064 6452 -7763 7249 -7584 5649 -2875 519 1736 -4453 6284 -6610 7418 -8123 6032
3077 6032 -3030 1918 1843 -4589 5907 -6536 8626 -6581 4881 -3853 1567 837 -3400 4963
3091 4963 -7581 9063 -6764 6883 -3467 1062 1829 -3919 5545 -6350 8293 -6544 6079
3104 6079 -4073 1578 2255 -3011 5510 -6500 8459 -7016 6655 -3361 1658 1513 -3906 5011
3118 5011 -6672 7697 -6395 5428 -3733 2590 1516 -3552 6209 -6927 7375 -6994 6636
3131 6636 -3449 1253 1955 -3131 6036 -6391 7254 -7021 5193 -3216 1455 923 -3962 5844
$$ packed form
3037E909j3879J6630j5731J1647q369N150J91n765J1137j4712J5658j5372J3837
3050F331j0109M988J648o233R333j3522J5904j5746J3369r820M678L21n324J0634
3064F452j4215J5012j4833J3233q524L394J217o189J0737j2894J4028j5541J4155
3077F032r062M948p5o432J0496j2443J5162j5207J1462q734N420p30m237Q363
3091D963j2544J6644j5827J3647j0350M529P67n748R464j1895J4643j4837J2623
3104F079j0152N651O77n266Q521j2010J4959j5475J3671j0016N019j45n419Q917
3118E011j1683J4369j4092J1823r161O323j074n068R761j3136J4302j4369J3630
3131F636j0085M702P02n086R167j2427J3645j4275J2214q409M671n32m885R806
$$ plain form
3145 5844 -6695 7910 -6554 5942 -3890 2162 595 -3202 4471 -7026 8031 -5991 5679
3158 5679 -3872 2509 1392 -3923 5587 -6259 6853 -6372 5967 -4405 1931 478 -3390 4955
3172 4955 -7102 7233 -6480 5410 -3644 1782 967 -2879 5120 -5956 7775 -6581 6141
3185 6141 -3174 2179 1356 -2508 5757 -6556 6775 -7358 5431 -4988 2779 244 -3184 5518
3199 5518 -5846 7621 -6979 5906 -3780 1650 -304 -3559 4220 -5357 6798 -6691 5329
3212 5329 -4266 1958 -4 -3044 4054 -6603 6452 -7584 6245 -3421 1764 -285 -2807 5579
3226 5579 -6519 7116 -7353 5639 -4206 1734 618 -2725 4825 -5493 6145 -6861 6040
3239 6040 -5095 1896 595 -4109 4498 -5816 6394 -6746 5368 -4050 1555 517 -2988 4999
$$ packed form
3145E844j2539J4605j4464J2496r832O052j567l797P673j1497J5057j4022J1670
3158E679r551O381j117n315R510j1846J3112j3225J2339j0372O336j453l868Q345
3172D955j2057J4335j3713J1890r054N426q15l846P999j1076J3731j4356J2722
3185F141r315N353q23l864Q265j2313J3331j4133J2789j0419P767k535l428Q702
3199E518j1364J3467j4600J2885r686N430j954l255P779r577J2155j3489J2020
3212E329r595O224j962l040P098j0657J3055j4036J3829r666N185k049k522Q386
3226E579j2098J3635j4469J2992r845N940j116l343P550j0318J1638j3006J2901
3239F040j1135O991j301m704Q607j0314J2210j3140J2114r418N605j038l505P987
$$ plain form
3253 4999 -6437 6692 -7183 5676 -4578 1762 759 -1735 4396 -5367 6452 -6240 6491
3266 6491 -4364 1356 -101 -2130 3999 -5951 7474 -6535 5739 -3326 1873 909 -3087 3693
3280 3693 -6049 6126 -7199 5966 -4245 1626 -81 -3098 4522 -6651 5818 -7114 4947
3293 4947 -4086 2027 -912 -2402 4065 -5503 6512 -7042 5246 -4285 2920 -135 -1840 3546
3307 3546 -6022 5773 -5709 5645 -4465 3341 -402 -1698 3448 -5103 6998 -6445 4856
3320 4856 -4213 1771 -306 -2680 3793 -5772 5738 -6246 5389 -4789 2468 -582 -2131 3066
3334 3066 -4310 5227 -5446 4776 -3575 2153 -682 -1050 3688 -6089 5897 -5587 5866 -4225
3348 -4225 2249 511 -1875 3305 -5628 5841 -5933 6101 -6000 3222 -483 -2533 2991 -5260
$$ packed form
3253D999j1436J3129j3875J2859j0254O340j003k494O131r763J1819j2692J2731
3266F491j0855N720j457k029O129r950J3425j4009J2274r065N199r64l996O780
3280C693r742J2175j3325J3165j0211N871j707l017P620j1173J2469j2932J2061
3293D947r033O113k939j490O467r568J2015j3554J2288r531P205l055j705N386
3307C546r568J1795j1482J1354j0110P806l743j296N146q551J2101j3443J1301
3320D856r069N984k077k374O473r565J1510j1984J1635j0178P257l050j549N197
3334C066p376R537j0673J0222q351N728k835l68M738r777J1986j1484J1453j0091
3348d225O474j738k386N180q933J1469j1774J2034j2101R222l705k050N524q251
$$ plain form
3362 -5260 5883 -5875 4494 -3944 2265 -669 -1826 3249 -5386 5308 -6146 4432 -4839
3375 -4839 2963 185 -1487 3462 -5915 5880 -5846 4689 -4518 2142 11 -1760 3374 -5336
3389 -5336 5854 -5588 5026 -4110 3186 240 -1794 3616 -4637 5848 -5850 5815 -3925
3402 -3925 2987 -33 -2205 3051 -3895 5282 -5505 4522 -4112 2482 -1021 -1126 3333 -3513 5593
3417 5593 -6521 4962 -3576 2409 -636 -1116 4149 -4837 5051 -5403 5345 -4158 2263 799
3431 799 -856 3045 -4570 4776 -5397 4372 -4136 2343 -542 -1346 3126 -4349 5036 -6102 4628
3446 4628 -3136 2287 -483 -2076 3274 -4191 5717 -5550 4223 -3952 3260 -1627 -930 2249 -4347
3461 -4347 4466 -5525 4541 -4293 2185 -524 -1406 3146 -3582 5622 -5735 4541 -3233 3815
$$ packed form
3362e260J1143j1758J0369q438O209k934j157N075q635J0694j1454J0578r271
3375d839P802k778j672M949r377J1795j1726J0535r207O660k131j771N134q710
3389e336J1190j1442J0614r136P296k946k034N410q253J0485j1698J1665r740
3402c925O912l020k172N256o946R177j0787J0027q634O594l503j05M459o846R106
3417E593j2114J1483q538N985l045m80N265q986R888j0454J0748r503O421j464
3431G99j655L901p615R346j0173R769q508O479k885q04M472p475R385j1138J0730
3446D628p764N423k770j593N350p465R908j1267R773q175P212m887O97L179o596
3461d347Q813r991J0066q834O478k709q82M552o728R204j1357J0276p774P048
$$ plain form
3475 3815 -389 -481 2521 -4014 5633 -5411 5469 -4270 1817 -572 -744 3740 -4168 4202 -5335
3490 -5335 4648 -3861 2337 -777 -156 1881 -4152 4689 -5418 4463 -4290 2745 -375 -1087 2922
3505 2922 -4754 4955 -5852 4525 -4364 2707 -757 -869 1844 -3420 4084 -5549 4130 -3905 2788
3520 2788 -851 -1550 2487 -3842 4727 -5180 4795 -3911 2971 -1024 -1263 3180 -3539 4936 -4776
3535 -4776 5147 -5105 1923 -1267 -5 2272 -3485 4597 -4815 4756 -3786 2166 -156 -1563 2591
3550 2591 -2783 4169 -4743 5179 -4629 2740 -1176 78 2017 -4002 4540 -6212 4373 -3644
3564 -3644 2529 -999 -311 1845 -3568 4361 -3642 4216 -3880 2194 -1704 -623 3107 -3213 4573
3579 4573 -4831 3964 -3542 2610 -1258 -589 3165 -3151 5183 -4619 4465 -3247 2609 -1146 -1110 2227
$$ packed form
3475C815m204r2L002o535R647j1044J0880r739O087k389j72M484p908Q370r537
3490e335R983q509O198l114O21K037o033Q841j0107R881q753P035l120p12M009
3505B922p676R709j0807J0377q889P071l464j12K713n264P504r633R679q035O693
3520B788l639o99M037o329Q569r907R975q706O882l995k39M443o719Q475r712
3535d776R923j0252P028l190J262K277n757Q082r412R571q542N952k322j407M154
3550B591n374O952q912R922r808P369l916J254J939o019Q542j0752J0585q017
3564c644O173l528O88K156n413P929q003P858q096O074l898J081L730o320P786
3579D573r404Q795p506O152l868O69L754o316Q334r802R084p712N856l755L6L337
$$ plain form
3595 2227 -2725 4771 -4704 3966 -3815 3339 -922 -757 2470 -3263 5679 -4545 4274 -3367 2774
3610 2774 -1145 -1322 1872 -3247 3713 -3892 4409 -3428 2330 -1439 -545 2043 -4060 3902 -4467
3625 -4467 3748 -3717 2548 -1002 316 2583 -2818 3992 -4527 5573 -3222 1665 -999 608 1609
3640 1609 -3253 4618 -4030 4088 -3986 2363 -2265 -928 1964 -3307 4402 -4764 3649 -3382 2989
3655 2989 -671 -1209 1183 -2651 4102 -4405 4170 -3658 3037 -2000 -810 1762 -3374 4394 -4245
3670 -4245 4851 -4113 1958 -2042 -964 1833 -4085 3500 -3937 3885 -3782 2646 -994 -342 2106
3685 2106 -3175 4314 -4434 5288 -3104 3582 -1316 -48 2605 -2604 3783 -4284 3453 -2463 3247
3700 3247 -1130 288 1898 -2997 4171 -4297 4720 -3067 2722 -2518 -411 1458 -2955 2873 -3741
$$ packed form
3595B227m952P496r475Q670p781P154m261J65L227n733Q942j0224Q819p641O141
3610B774l919j77L194n119O960p605Q301p837N758l769Q94K588o103P962q369
3625d467Q215p465O265l550J318K267n401O810q519J0100q795M887k664J607J001
3640A609m862P871q648Q118q074O349m628J337K892n271P709r166Q413p031O371
3655B989l660n38K392l834O753q507Q575p828O695n037J190K572n136P768q639
3670d245R096q964O071m000J078K797n918P585p437P822p667O428l640O52K448
3685B106n281P489q748R722q392O686m898J268K653n209O387q067P737n916N710
3700C247m377J418J610m895P168q468R017p787N789n240K107J869m413N828o614
$$ plain form
3715 -3741 4629 -4370 3251 -1258 588 1654 -2223 4232 -4581 4317 -4473 3067 -761 -1301 1123
3730 1123 -2705 4005 -3805 2927 -3551 3658 -1694 -76 1798 -2223 4060 -4518 4996 -2771 3080
3745 3080 -957 970 2007 -2385 4453 -3999 4169 -3836 2524 -2158 -8 1396 -1643 3323 -4187
3760 -4187 4055 -3644 3117 -1772 -264 571 -2524 4402 -4232 4803 -2230 2428 -1262 -128 1584
3775 1584 -2612 3237 -4135 4344 -4155 2736 -1485 -334 1273 -2103 3344 -4411 4091 -3217 3343
3790 3343 -2081 -640 958 -2226 2949 -3866 4858 -3714 2778 -1818 830 1469 -3108 3997 -4211
$$ packed form
3715c741Q370q999P621m509J846J066l877O455q813Q898q790P540l828n40K424
3730A123l828O710p810O732o478P209n352J618J874m021O283q578R514p767N851
3745C080m037J927J037m392O838q452Q168q005O360m682K150J404l039M966p510
3760d187Q242p699O761m889J508Q35l095O926q634R035p033M658l690J134J712
3775A584m196N849p372Q479q499O891m221J151J607l376N447p755Q502p308O560
3790C343n424J441J598l184N175o815Q724q572O492m596K648O39m577P105q208
$$ [...]
8191H51
##END NTUPLES=NMR FID
##END=
