##TITLE=1H_SAM_30.235.2.Py
 Py, 108 sc, 
 26.11.2020
##JCAMPDX= 6.0         $$ Bruker NMR JCAMP-DX V2.0
##DATA TYPE= NMR FID
##DATA CLASS= NTUPLES
##ORIGIN= UXNMR, Bruker Analytische Messtechnik GmbH
##OWNER= root
$$ XWIN-NMR		Version 3.5
$$ Thu Nov 26 13:06:39 2020 Russian Standard Time (UT+4h)  she@DPX200
##.OBSERVE FREQUENCY= 200.1315066352
##.OBSERVE NUCLEUS= ^1H
##.DELAY= (6, 6)
##.ACQUISITION MODE= SIMULTANEOUS
##.ACQUISITION SCHEME= undefined
##.AVERAGES= 108
##.DIGITISER RES= 18
##SPECTROMETER/DATA SYSTEM= spect
##.PULSE SEQUENCE= zg30
##.SOLVENT NAME= Pyr
##.SHIFT REFERENCE= (INTERNAL, Pyr, 0, 15.7039)
##AUDIT TRAIL= $$ (NUMBER, WHEN, WHO, WHERE, WHAT)
$$ ##TITLE= Audit trail, XWIN-NMR		Version 3.5
$$ ##JCAMPDX= 5.01
$$ ##ORIGIN= Bruker BioSpin GmbH
$$ ##OWNER= she
$$ F:/spectra/data/she/nmr/H-F/1/audita.txt
$$ ##AUDIT TRAIL=  $$ (NUMBER, WHEN, WHO, WHERE, WHAT)
(   1,<2020-11-26 13:05:17.60 +0400>,<she>,<DPX200>,
      <continue with go, POWCHK disabled, PULCHK disabled
       configuration hash MD5:
       00 E9 B6 7A A2 85 ED C7 34 08 36 98 17 FE 4E 26
       data hash MD5: 16K
       56 C5 56 5A 87 BF B2 25 90 3C 65 1C 32 78 07 00>)
$$ ##END=
$$ 
$$ hash MD5
$$ 44 13 0F E8 95 CF 4F 05 18 68 CE B2 45 98 11 47
##$RELAX= 
##$RELAX= 
##$RELAX= 
##$RELAX= 
##$RELAX= 
##$RELAX= 
$$ Bruker specific parameters
$$ --------------------------
##$DU= <F:/spectra>
##$EXPNO= 1
##$NAME= <H-F>
##$PROCNO= 1
##$TYPE= <nmr>
##$USER= <she>
##$AMP= (0..31)
100 100 100 100 100 100 100 100 100 100 100 100 100 100 100 100 100 100 
100 100 100 100 100 100 100 100 100 100 100 100 100 100 
##$AQSEQ= 0
##$AQ_mod= 1
##$AUNM= <au_zg>
##$AUTOPOS= <>
##$BF1= 200.13
##$BF2= 200.13
##$BF3= 200.13
##$BF4= 200.13
##$BF5= 200.13
##$BF6= 200.13
##$BF7= 200.13
##$BF8= 200.13
##$BYTORDA= 1
##$CFDGTYP= 0
##$CFRGTYP= 5
##$CHEMSTR= <none>
##$CNST= (0..31)
1 1 145 1 1 1 1 1 1 1 1 1 1 1 1 1 1 1 1 1 1 1 1 1 1 1 1 1 1 1 1 1 
##$CPDPRG= <>
##$CPDPRG1= <>
##$CPDPRG2= <>
##$CPDPRG3= <>
##$CPDPRG4= <mlev>
##$CPDPRG5= <mlev>
##$CPDPRG6= <mlev>
##$CPDPRG7= <mlev>
##$CPDPRG8= <mlev>
##$CPDPRGB= <>
##$CPDPRGT= <>
##$D= (0..31)
0 1.2 0 0 0 0 0 0 0 0.06 0 0.03 0 0 0 0 0.0002 0 0 0 0 0 0 0 0 0 0 0 0 
0 0 0 
##$DATE= 1606381090
##$DBL= (0..7)
120 120 120 120 120 120 120 120 
##$DBP= (0..7)
150 150 150 150 150 150 150 150 
##$DBP07= 0
##$DBPNAM0= <>
##$DBPNAM1= <>
##$DBPNAM2= <>
##$DBPNAM3= <>
##$DBPNAM4= <>
##$DBPNAM5= <>
##$DBPNAM6= <>
##$DBPNAM7= <>
##$DBPOAL= (0..7)
0.5 0.5 0.5 0.5 0.5 0.5 0.5 0.5 
##$DBPOFFS= (0..7)
0 0 0 0 0 0 0 0 
##$DE= 6
##$DECBNUC= <off>
##$DECIM= 32
##$DECNUC= <off>
##$DECSTAT= 4
##$DIGMOD= 1
##$DIGTYP= 9
##$DL= (0..7)
0 120 120 120 120 120 120 120 
##$DP= (0..7)
150 150 150 150 150 150 150 150 
##$DP07= 0
##$DPNAME0= <>
##$DPNAME1= <>
##$DPNAME2= <>
##$DPNAME3= <>
##$DPNAME4= <>
##$DPNAME5= <>
##$DPNAME6= <>
##$DPNAME7= <>
##$DPOAL= (0..7)
0.5 0.5 0.5 0.5 0.5 0.5 0.5 0.5 
##$DPOFFS= (0..7)
0 0 0 0 0 0 0 0 
##$DQDMODE= 0
##$DR= 18
##$DS= 0
$$ [...]
##$SUBNAM2= <"">
##$SUBNAM3= <"">
##$SUBNAM4= <"">
##$SUBNAM5= <"">
##$SUBNAM6= <"">
##$SUBNAM7= <"">
##$SUBNAM8= <"">
##$SUBNAM9= <"">
##$SW= 16.9725356469052
##$SWIBOX= (0..15)
0 0 2 0 0 0 0 0 0 0 0 0 0 0 0 0 
##$SW_h= 3396.73913043478
##$TD= 16384
##$TD0= 1
##$TE= 0
##$TE2= 300
##$TE3= 300
##$TEG= 300
##$TL= (0..7)
0 120 120 120 120 120 120 120 
##$TP= (0..7)
150 150 150 150 150 150 150 150 
##$TP07= 0
##$TPNAME0= <>
##$TPNAME1= <>
##$TPNAME2= <>
##$TPNAME3= <>
##$TPNAME4= <>
##$TPNAME5= <>
##$TPNAME6= <>
##$TPNAME7= <>
##$TPOAL= (0..7)
0.5 0.5 0.5 0.5 0.5 0.5 0.5 0.5 
##$TPOFFS= (0..7)
0 0 0 0 0 0 0 0 
##$TUNHIN= 0
##$TUNHOUT= 0
##$TUNXOUT= 0
##$USERA1= <user>
##$USERA2= <user>
##$USERA3= <user>
##$USERA4= <user>
##$USERA5= <user>
##$V9= 5
##$VALIST= <valist>
##$VCLIST= <CCCCCCCCCCCCCCC>
##$VD= 0
##$VDLIST= <DDDDDDDDDDDDDDD>
##$VPLIST= <PPPPPPPPPPPPPPP>
##$VTLIST= <TTTTTTTTTTTTTTT>
##$WBST= 1024
##$WBSW= 4
##$XGAIN= (0..3)
0 0 0 0 
##$XL= 0
##$YL= 0
##$YMAX_a= 937060
##$YMIN_a= -792983
##$ZGOPTNS= <>
##$ZL1= 120
##$ZL2= 120
##$ZL3= 120
##$ZL4= 120
##$ABSF1= 10
##$ABSF2= 0
##$ABSG= 5
##$ABSL= 3
##$ALPHA= 0
##$AQORDER= 0
##$ASSFAC= 0
##$ASSFACI= 0
##$ASSFACX= 0
##$ASSWID= 0
##$AUNMP= <proc_1d>
##$AZFE= 0.1
##$AZFW= 0.1
##$BCFW= 1
##$BC_mod= 2
##$BYTORDP= 1
##$COROFFS= 0
##$CY= 11.3945322036743
##$DATMOD= 1
##$DC= 2
##$DFILT= <>
##$DTYPP= 0
##$F1P= 15.9154993809931
##$F2P= -4.1035820241983
##$FCOR= 0.5
##$FTSIZE= 0
##$FT_mod= 4
##$GAMMA= 1
##$GB= 0.15
##$INTBC= 1
##$INTSCL= 1
##$ISEN= 128
##$LB= 0.24
##$LEV0= 0
##$LPBIN= 0
##$MAXI= 10000
##$MC2= 0
##$MEAN= 0
##$ME_mod= 0
##$MI= 1.114404
##$NCOEF= 0
##$NC_proc= 0
##$NLEV= 6
##$NOISF1= 3.799351
##$NOISF2= 2.8
##$NSP= 1
##$NTH_PI= 0
##$NZP= 0
##$OFFSET= 15.70392
##$PC= 1
##$PHC0= -11049.11
##$PHC1= 10.20088
##$PH_mod= 1
##$PKNL= yes
##$PPARMOD= 0
##$PSCAL= 0
##$PSIGN= 0
##$REVERSE= no
##$SF= 200.130013532006
##$SI= 16384
##$SIGF1= 3
##$SIGF2= 2
##$SINO= 400
##$SIOLD= 16384
##$SREGLST= <1H.CDCl3>
##$SSB= 0
##$STSI= 0
##$STSR= 0
##$SW_p= 3612.71676300578
##$SYMM= 0
##$S_DEV= 0
##$TDeff= 0
##$TDoff= 0
##$TI= <>
##$TILT= no
##$TM1= 0
##$TM2= 0
##$TOPLEV= 0
##$USERP1= <user>
##$USERP2= <user>
##$USERP3= <user>
##$USERP4= <user>
##$USERP5= <user>
##$WDW= 1
##$XDIM= 8192
##$YMAX_p= 0
##$YMIN_p= 0
$$ End of Bruker specific parameters
$$ ---------------------------------
##NTUPLES= NMR FID
##VAR_NAME=  TIME,          FID/REAL,        FID/IMAG
##SYMBOL=    X,             R,               I
##VAR_TYPE=  INDEPENDENT,   DEPENDENT,       DEPENDENT
##VAR_FORM=  AFFN,          ASDF,            ASDF
##VAR_DIM=   8192,          8192,            8192
##UNITS=     SECONDS,       ARBITRARY UNITS, ARBITRARY UNITS
##FACTOR=    0.0002944,     1,               1
##FIRST=     0,             0,               0
##LAST=      2.4114304,     0,               0
##MIN=       0,             -792983,         0
##MAX=       2.4114304,     937060,          0
$$ Real data points
##PAGE= N=1
##DATA TABLE= (X++(R..R)), XYDATA
0@%%%%%%%%%%%%%%%%%%J08k16K16k16K16k83L91m32N03o11O85p93R63j103J225
33F53j411J627j854K120k416K719l051L426l834M277m776N309n892O539p227P990
49D199q831R730j0711J1798j2997J4311j5757J7368j9173K1192k3475K6096k9125
62a5375L2685l6958M2222m8956N8034p1705R7856l23977M52146l38754N29411
73C76629o57582j03583j45586L39371M86218K07644L90557q99012K96323j004137
83g13158P70022n7243L58429J46503n29969O7650o03815O97129j73636Q61034
93H22946l80102j04319l39633n74663N01453l47148P65346m46155K00049o10204
103e12430K4176M2609J95178O56621m84719M56153r67690K30503k98429K42926
$$ y = [0, 0, 0, 0, 0, 0, 0, 0, 0, 0, 0, 0, 0, 0, 0, 0, 0, 0, 0, 108, -108, 108, -108, 108, -175, 216, -216, 287, -324, 361, -432, 531, -572, 653, -758, 869, -985, 1135, -1281, 1438, -1613, 1813, -2021, 2256, -2520, 2789, -3103, 3436, -3791, 4199, -4632, 5098, -5613, 6185, -6812, 7499, -8258, 9110, -10063, 11129, -12346, 13750, -15375, 17310, -19648, 22574, -26382, 31652, -40053, 57803, -266174, 185972, -152782, 376629, -280953, -384536, -530122, -190751, 295467, 503111, 893668, -5344, 290979, -713158, 56864, -379, 358050, 504553, -25416, 42234, -561581, 135548, -38088, 822946, 442844, 338525, -1108, -575771, -74318, -421466, 343880, -102275, 97774, -512430, -488254, -445645, -250467, 406154, -78565, 377588, -590102, -359599, -658028, -415102]
113d15102L38078j35554K01397o45443L41724m20662P74662q1052L48461q4143
123B22366m86931J72330n39399O81126k60275N31010l87679j7472j24814j39410
133c49148N62333j86579O64340n56287J89731n29547N3376J07390j833L90169
143C43945m67905L03815o48190M17681j64435L77707J64144k38470J21615o40169
153d30262L33438l98475M97036j83341J34663j57124k90421K54166k68348O68747
163A60079l00811L98103m23096l4509r9891j32870M11355k62374M46965n24251
173c61300K61214l03135K63571J86005K9978L18873m60256K68570n41369L82185
183D4336j80632K60942J1930k19609J62131m03725M72155k61061N16821k25713
$$ y = [-415102, -77024, -212578, -11181, -656624, -314900, -735562, 39100, -41952, 306509, 222366, -264565, -92235, -631634, 49492, -210783, 320227, -67452, -84924, -209738, -349148, 213185, 26606, 690946, 134659, 324390, -205157, -151781, -44391, -46224, 343945, -123960, 179855, -468335, -50654, -215089, 162618, 326762, 88292, 209907, -430262, -96824, -495299, 1737, -181604, -46941, -204065, -494486, -240320, -508668, 160079, -140732, 257371, -165725, -200234, -300125, -432995, -21640, -284014, 162951, -361300, -100086, -403221, -139650, 46355, 76333, 395206, -65050, 203520, -337849, 44336, -136296, 124646, 136576, -83033, 79098, -324627, 147528, -113533, 403288, 177575]
193A77575P2303j68238k62247K23971k85417M64499l82565K83013l74232Q2262
203a69076L803J0884L73130k78578L32457n28646K27500k98850J77870N8852q0803
214a71457J86519l95929K97101l42279M61473j30144K41208m6044j98794J32895
224C4549l63353M00400k89147L78133k68734Q4062q5023o6063L10260j77781M50728
235D08031l68132K61730l55776R1411j1642l6116K38107l08602K75791m18091
245b23289L28061k06021K62655M6011q8008J32035l92767K65186l49687L44598
255A18774k26016J40179j03593j33970J61857k28477M29770k65429L33129k94764
265f8540O3946r6480q6437K05446k23556L19015l65771K58746k63774K10069N3618
$$ y = [177575, 249878, 81640, -180607, 43364, -242053, 222446, -160119, 122894, -251338, -169076, -165273, -154389, 218741, -59837, 272620, -256026, -28526, -327376, -149506, -90654, -171457, 15062, -380867, -83766, -426045, 35428, -94716, 146492, 100448, -98346, 34549, -328804, 71596, -217551, 160582, -108152, -24090, -109113, -175176, 135084, -42697, 408031, 39899, 301629, -54147, 37264, 25622, -10494, 227613, -80989, 194802, -223289, 104772, -101249, 161406, 207417, 119409, 251444, -141323, 123863, -225824, 118774, -107242, 32937, -70656, -204626, -42769, -271246, 158524, -106905, 226224, -68540, -4594, -101074, -187511, 17935, -205621, 113394, -252377, 6369, -257405, -47336, 6282]
276F282J5778K17764k79316K50704l75388K86089k12262J98616l7774q8071J21254
287A03676k67753L47484k48234L80503j96346J41246j08113j22763J29746k31166
297g1720L22659l18804K66922k93875J31325m3539m302K25785j98795K79044l67265
308g2565K20974k71679J55292m8186m7562J22282k69938K51471k99165L36533
318G7457j62944K01707n4243q3714R5873k51025K74527k73720K91483k34010J26296
329G687q3549l0102J90985j43783L25025k69091K56215k62691J21305o4064k0820
340B7117J48086k16235K33519l10263K75630j89974K09329j4955j6727J10806
350B56333k52645K18030k96867K70818k23211J38224j02402o0433J10865j85860
$$ y = [6282, 22060, 239824, -39492, 211212, -164176, 121913, -90349, 108267, 70493, -17578, 103676, -164077, 183407, -64827, 315676, 119330, 260576, 152463, 29700, 159446, -71720, 250939, -67865, 199057, -94818, 36507, -7032, -11334, 214451, 15656, 294700, -72565, 148409, -123270, 32022, -16164, -63726, 58556, -211382, 40089, -259076, 77457, -85487, 116220, 61977, -21737, 74136, -176889, 97638, -176082, 115401, -118609, 7687, -75862, -105964, 85021, -58762, 266263, -2828, 253387, -9304, 112001, 47937, 27117, 175203, -41032, 192487, -117776, 157854, -32120, 177209, 162254, 145527, 256333, 3688, 221718, -75149, 195669, -27542, 110682, 8280, -52153, 58712, -127148]
360a27148K96550k33649K85653k42226J10499j04084m6907J14123j90607K34595
370I6799k90727K35513k30607J71833k1977K8162J46031j90058K14687k83228
380a23572K39073k11909J59093o4726l0270Q7869j87205K53324k07778L00419
390B14318j78465J56285q3475m2219Q2859j78358K31995k52586K30773k39335
400e8208J36892o3901J3997J35533j47097K30249k69931K11033k39141J38522
410H7948q1069k0309P0679j94526K01001k48606K62728j76580J82944o6468k3197
421e455O6276j83504K04717k41777K33259k16982J36306r0518k251J12056j15902
432a03775K48232k15769K31498k12681J37372q3798o36Q3594j52877J89308k41352
$$ y = [-127148, 169402, -64247, 221406, -20820, 89679, -14405, -61312, 52811, -137796, 96799, -193928, 41585, -189022, -17189, -39166, -11004, 135027, -55031, 159656, -123572, 115501, -96408, 62685, -2041, -32311, 55558, -131647, 121677, -86101, 214318, 35853, 192138, 108663, 66444, 149303, -29055, 202940, -49646, 181127, -58208, 78684, 14783, 28780, 164313, 17216, 247465, -22466, 188567, -50574, 87948, 6879, -13430, 57249, -137277, 63724, -184882, 77846, -98734, 84210, 17742, -5455, 60821, -122683, 82034, -159743, 73516, -143466, -7160, -97678, -99929, 12127, -103775, 144457, -71312, 160186, -52495, 84877, 1079, 443, 84037, -68840, 120468, -120884]
443a20884K28096j75790J82596m5651J9364P7812j58385J77832k40861K17752
453A61881k03901J36713j07257j4446O6602j36056K16021k00170K40464k00034
463d0183J32048j07185j1117N9411j44868J74485k41019K08616k09184J58095
473b0901o3617L7961R1946j28460J77083k26217K10300k00257J50539r3769M103
484f1289N6420j34811J92351j82977K46538j63307J59574q5359R442M9259j28323
495d2482J69901k10278K04092k06355J35491q1341L3032Q0923j02521J79467k01356
506d1427J92578k03458J33822j00354J0917L5974j40387J53496k01728K15752
516E5185j72846J67016p9352K0862L6613j27697J57163k06034J97950k02014J33916
$$ y = [-120884, 107212, -68578, 114018, 68367, 87731, 165543, 7158, 184990, -55871, 161881, -42020, 94693, -12564, -27010, 39592, -96464, 119557, -80613, 159851, -40183, 91865, -15320, -26437, 32974, -111894, 62591, -178428, 30188, -178996, -20901, -84518, -46557, 45389, -83071, 94012, -132205, 78095, -122162, 28377, -65392, -61289, -4869, -139680, 52671, -130306, 116232, -47075, 112499, 27140, 36582, 85841, -42482, 127419, -82859, 121233, -85122, 50369, -30972, 2060, 82983, -19538, 159929, -41427, 151151, -52307, 81515, -18839, -7922, 28052, -112335, 41161, -160567, 55185, -117661, 49355, -29997, -9135, 27478, -100219, 56944, -149090, 48860, -153154, -19238]
527a9238r9144K3948N7782q7878J86610j72028K09914j92182J49320r8880K3522
538a8254M2656j17315J53501j96462J97506j70484J67832o9106M8898M5121j03398
549a9505J51307j93540J87792j89863J35787j03555J3621K9230r4556J64110j65312
560h4484K02488j75385J42173j00438J6031K5128j07021J35955j96576J72850
570C0721j84932J47654q6292N1857M5483q4085J48298j85311J83750j83154J43133
581B7122j04260K3124K3128r3590J45424j62383K08371j57572J62170r0838L6251
592A6947K6152q8609J34785j80139J78349j84264J41225r8749M8149M3573o9289
603c1870J46183j63877J79245j74908J34910j08174L0548R997r3474J19242j69994
$$ y = [-19238, -118382, -94434, -36652, -124530, 62080, -109948, 99966, -92216, 57104, -41776, -18254, 24402, -92913, 60588, -135874, 61632, -108852, 58980, -10126, 38772, 83893, -19505, 131802, -61738, 126054, -63809, 71978, -31577, -17956, 11274, -83282, 80828, -84484, 118004, -57381, 84792, -15646, 385, 25513, -81508, 54447, -142129, 30721, -154211, -6557, -92849, -40992, 4491, -79594, 68704, -116607, 67143, -116011, 27122, -77138, -54014, -30886, -124476, 20948, -141435, 66936, -90636, 71534, -19304, 16947, 43099, -45510, 89275, -90864, 87485, -96779, 44446, -54303, -6154, 37419, -31870, 114313, -49564, 129681, -45227, 89683, -18491, 12057, 22054, -71420, 47822, -122172]
614a22172J82959j58186J53102q7568M2624K0084q4227J18108j68006J66994j79259
625a15547J29543j08944M0860K3423o5804J39789j45532J83778j65545J42582
635E8603j04052M4085J0508q2994J17211j65294J74482j63546J54980q4945O3204
646B2242K3061o5433J20407j55859J69959j76708J35544j10299M0671N919o8468
657e8964J25164j38340J78836j58418J44200j01772M5047K112p5167J05127j59968
668i2143J53848j70248J37120r3501N8715J5786n5664J17276j46835J61711j67217
679h1152J34902j07537L9892n061o5241J08144j37060J72826j49949J54744r6566
690c2058N7853K839o0056J05565j47375J52187j67405J36336j04442O0896Q091
$$ y = [-122172, 60787, -97399, 55703, -31865, 10759, 30843, -53384, 64724, -103282, 63712, -115547, 13996, -94948, -54088, -30665, -96469, 43320, -102212, 81566, -83979, 58603, -45449, -1364, 9144, -73850, 43361, -121933, 52549, -110997, 43983, -40962, 22242, 45303, -20130, 100277, -55582, 114377, -62331, 73213, -37086, 3585, 9504, -58964, 66200, -72140, 106696, -51722, 92478, -9294, 35753, 37865, -37302, 67825, -92143, 61705, -108543, 28577, -64924, -6209, 9577, -46087, 71189, -75646, 86065, -81152, 53750, -53787, -13895, -18956, -84197, 23947, -113113, 59713, -90236, 64508, -32058, 25795, 28634, -31422, 74143, -73232, 78955, -88450, 47886, -56556, 4340, 12431]
701A2431m0804J16373j35537J62933j58315J38540j07356M8294j1464o0421R1736
712E6410j41397J57651j51342J50431r7938O0538J600n2409R6508j41366J44796
723H3482j61894J28512j15594N4075m821m3945J04755j25284J60327j49100J38290
734F8803j05524N3916q963n3478Q6227j37303J49417j52478J44031r6415O9658
745A7891L946l9491R6027j27900J49100j55722J32476j15148N6414j4030m1698
756c8135R4526j21595J60087j43351J40947j03432O2997j4065m6149P9900j33770
767f2040J40851j59692J33864j04912O8005n049l4686R0737j20285J43366j50720
778f0561J29292j11878N5744k1800m5258Q0576j16176J45817j39518J39745r5959
$$ y = [12431, -28373, 88000, -47537, 115396, -42919, 95621, -11735, 36559, 25095, -35326, 56410, -84987, 72664, -78678, 71753, -26185, 34353, 35953, -16456, 80052, -61314, 83482, -78412, 50100, -65494, -11419, -16240, -60185, 44570, -80714, 79613, -69487, 68803, -36721, 17195, 8232, -45246, 40981, -96322, 53095, -99383, 44648, -51767, 17891, 21837, -17654, 78373, -49527, 99573, -56149, 76327, -38821, 17593, 3563, -38135, 56391, -65204, 94883, -48468, 92479, -10953, 52044, 37979, -8170, 71730, -62040, 78811, -80881, 52983, -51929, 16076, 11027, -23659, 67078, -53207, 90159, -60561, 68731, -43147, 12597, -9203, -54461, 26115, -90061, 55756, -83762, 55983, -39976]
789c9976O7047j3150l5741Q0266j22694J35899j53352J27266j04646O5047j0824
800d858k5550Q8714j08278J45373j43762J34748j07930O4046k4850l8741P3341
811E2253j18190J37660j42664J39531j00710P4620j8191k8039P6589j17505J31920
822H7274j50418J25312j13943O3513k5672k5677P8450j04624J38500j38377J34842
833F9180j05832O4904k4915l1977O6108j14481J25115j39881J33930j01699P5213
844A5665j7233j7969P4353j04675J30379j40199J26205j09574O3152k7247k3132
855c0275O8689j00120J34639j31027J34051j01534P1782k5554k1924N9685j07617
866d9205J20525j41657J26743j10443P5782k3156j6345O9822j00885J28092j35005
$$ y = [-39976, 27071, 13921, -21820, 58446, -64248, 71651, -81701, 45565, -59081, 5966, -4858, -30408, 58306, -49972, 95401, -48361, 86387, -21543, 42503, 17653, -21088, 52253, -65937, 71723, -70941, 68590, -32120, 42500, 24309, -3730, 72859, -44646, 87274, -63144, 62168, -51775, 11738, -13934, -39611, 38839, -65785, 72715, -65662, 69180, -36652, 28252, 3337, -28640, 37468, -77013, 48102, -91779, 42151, -59548, 15665, -1568, -19537, 54816, -49859, 80520, -59679, 66526, -43048, 20104, -7143, -30275, 38414, -61706, 72933, -58094, 75957, -25577, 46205, 20651, -1273, 58412, -49205, 71320, -70337, 56406, -54037, 21745, -1411, -17756, 52066, -48819, 79273, -55732]
877e5732J26753j13700O7891l6031k3361N9075j01676J27615j30906J33358j01590
888d8304P5143k6174j5432N9040r9380J18001j37573J22400j09161P3583k7428
899a5285j0008O2446q8487J25495j26568J26221j05691P1353l5615j8308N2187
910C7740r5589J18427j30643J27577j01001P9042k9709r529N5928r1774J15605
921G6074j34677J20447j12322P1163l7571j1101N4823q6089J20492j25741J28253
932F3751j05150P5545l9678j0539M8084r3037J09403j29497J24753j04543Q2072
943B1164l4706j721N3838q4127J14555j27147J21970j07886O9640m0250p380M7913
955B5863q1578J13032j19648J26658j01293P8505l8526m593M4743q6464J03848
$$ y = [-55732, 71021, -42679, 25212, -10819, -34180, 24895, -76781, 50834, -80072, 53286, -48304, 26839, 665, -14767, 44273, -55107, 62894, -74679, 47721, -61440, 12143, -15285, -25293, 37153, -51334, 74161, -52407, 73814, -31877, 39476, 3861, -14447, 37740, -57849, 60578, -70065, 57512, -43489, 35553, 5844, -3685, 52243, -39531, 76074, -58603, 61844, -50478, 20685, -16886, -27987, 26836, -59253, 61239, -64502, 63751, -41399, 34146, -5532, -16071, 32013, -61024, 48379, -81118, 43635, -60908, 21164, -13542, -15263, 38575, -45552, 69003, -58144, 63826, -44060, 25580, -14670, -22050, 25863, -55715, 57317, -62331, 64327, -36966, 41539, 3013, -1580, 43163, -43301, 60547]
966F0547j26000J18586j05797P7053l8282K233M8270p9115J08784j20310J20626
977F6595j08101P4149m6739k583L8453q1934J08095j21034J25519j03625Q2732
988C1527l9436L133M0430p9074J01168j21760J16834j10504P7497m2211M831M3282
1000B5717p3748J07852j14704J20655j06107P7792m4097J073L2811p7374R9364
1011D9234j15431J18951j03946Q3372m0462P517L7239p2667R9193j16993J14752
1022F0759j09533P6193m6997M416L4932o8771J02935j11573J17905j02674Q1172
1033C8764m6066N797K8332p1973R5454j16904J14877j05238Q4233m3581J0393
1044e912L3527o4210R6729j12550J12636j05518Q0300n4174Q153K8639o5190R5836
$$ y = [60547, -65453, 53133, -52664, 24389, -13893, -11660, 36610, -42505, 66279, -54031, 66595, -41506, 32643, -14096, -16679, 21774, -60160, 47935, -73099, 52420, -51205, 31527, -7909, -4776, 35654, -43420, 57748, -64012, 52822, -57682, 19815, -22396, -17565, 25717, -48031, 59821, -54883, 65772, -40335, 37457, -6640, -5567, 27244, -50130, 49234, -66197, 52754, -51192, 32180, -8282, -765, 36474, -36193, 63000, -53993, 60759, -48774, 27419, -19578, -15162, 19770, -49001, 53934, -57639, 60266, -42408, 38764, -7302, -1505, 26827, -45146, 50308, -66596, 48281, -56957, 27276, -16305, -5912, 27615, -36595, 60134, -52416, 60220, -45298, 35002, -19172, -11019, 17620, -47570, 48266]
1056D8266j08706J17125j02358Q5671m8192J0087K7760o5970Q8822j13213J10039
1067D9331j02791Q0000m8966J4525K9194n8080R2435j07443J12774j02884P8575
1078C6670n2245Q833K4332o1695Q7284j04611J13111j00685Q5184m9762J6406
1089B822K4036n8486Q4660j07273J09315j05356P9945n4400J7472K3601n5172
1100c8836Q8245j01466J12037j01230Q2169n5381J6184J9276n8885Q0914j03433
1111f0406J08638r9922Q2979n1324K2443K1728n3638Q1509j01575J05161j01908
1122d6315P7517n4765J7900J7068n0496Q2299r6781J08740r8040Q2385n2596J8372
1134E288J4634n2125P5486r8711J03075r8479Q1138n2491K3959J6397m6623P7927
$$ y = [48266, -60440, 56685, -45673, 39998, -8194, 1893, 29653, -36317, 52505, -60708, 49331, -53460, 26540, -22426, -7901, 21293, -36787, 55648, -51795, 60979, -41905, 36670, -15575, -6742, 17590, -44105, 43179, -61432, 51679, -49006, 36178, -13584, 2822, 26858, -31628, 53032, -54241, 55074, -50282, 29663, -24737, -7265, 16336, -38836, 49409, -52057, 59980, -41250, 40919, -14462, 1722, 20998, -37887, 43027, -60406, 48232, -51690, 31289, -20035, 2408, 24136, -29502, 52007, -49568, 55593, -46315, 31202, -23563, -5663, 11405, -39091, 43208, -53573, 55167, -42873, 39512, -13084, 5288, 19922, -32203, 43283, -55428, 47647, -50832, 30306, -22185, 1774, 18171, -28452, 49475]
1146D9475r4433J02570j00875Q1047n8556K1183J1004m8910P7871r4735J05075
1157E0716r7734Q4693n4222K5587R734m6715P3496r5775R9226r9876Q1453n5868
1169b5285K4704J2378m3421P5841r0123R9084r6598Q1389n6481K0764Q371m3950
1181c3327P0061q9972R8397r3366Q2757n4094K7107R281l9411O7697r0250R6225
1193E1105r7121P9666n7685K5505Q846l9796O9821q5789R7837r3363Q1922n7864
1205a6916K5674M290l9930O5002q8502R5693r3945Q3402n8398L0149N277l3943
1217b2147O5341q7070R5480r5807P9465o1543K9443J750l3940O3615q1952R5382
1229D8017r1373Q2752n9799L0935J771l4924O0482q3893R0087r1239P9539n7704
$$ y = [49475, -44958, 57612, -43263, 37784, -20772, 411, 11415, -37495, 40376, -54359, 50716, -47018, 37675, -16547, 9040, 18774, -27941, 45555, -50220, 49006, -50870, 30583, -25285, -581, 11797, -31624, 44217, -45906, 53178, -43420, 37969, -18512, 2252, 10623, -33327, 36734, -53238, 45159, -48207, 34550, -19544, 7563, 16844, -22567, 45130, -45120, 51105, -46016, 33650, -24035, 1470, 10316, -29480, 40341, -45448, 52389, -40974, 40948, -16916, 8758, 13048, -26882, 38120, -50382, 45311, -48634, 34768, -23630, 6519, 11796, -22147, 43194, -43876, 51604, -44203, 35262, -26281, 3162, 4912, -29028, 34587, -47365, 48017, -43356, 39396, -20403, 10532, 12303, -22621, 37861, -46032, 44055, -47184, 32355, -25349]
1241b5349L1380L763l1280O1353q0026R2156r1742P7647n9515K8854O50l2714
1253b4823N7915p9030R1565q7749Q0263n8479L3768j312l1673N6284p8654Q5817
1265D3892r0349P7630n9146L4475k538k7660N6942p3746Q7520q7503P8408o0787
1277b2862L2687n351k8732N3750p4265Q6369q8020Q0460n8038L5446l703k5413
1289a7672N3515p4442Q4438q8077P6903o0487L4092m153k5123N2446o9127Q4007
1301D6320q4382P7214n9053L4427p916k4933M9440p1334Q1418q4629P6719n8069
1313b4778L4992m635k2181M9267p0016Q2475q5067P5055o0884L4546r032k1431
1325b1689M8621o7620Q1504q2653P7613n8940L6661r604j9965M4939o7396P8360
$$ y = [-25349, 6031, 9794, -21486, 39867, -40159, 51997, -39745, 37902, -21613, 7241, 7891, -24823, 33092, -45938, 45627, -42122, 38141, -20338, 13430, 12118, -19555, 36729, -41925, 43892, -46457, 31173, -27973, 6502, 3964, -23696, 33246, -40500, 47020, -40483, 37925, -22862, 9825, 4474, -24258, 29492, -44773, 41596, -46424, 34036, -24002, 11444, 7741, -17672, 35843, -38599, 45839, -42238, 34665, -25822, 8270, 4117, -21006, 31440, -37687, 46320, -38062, 39152, -19901, 14526, 6610, -18323, 31117, -40217, 41201, -43428, 33291, -24778, 10214, 5579, -16602, 32665, -37351, 45124, -39943, 35112, -25772, 8774, -258, -21689, 26932, -40688, 40816, -41837, 35776, -23164, 13497, 3893, -16072, 28867, -38529, 39831]
1337C9831q3685P6822n9822L7192r730j5208M5687o6346P9468q0912P3877o1174
1349b4000L7487j1318j7886M3730o5541P7597p9073P4965o0276L8822r646j7122
1361a2261M1462o3736P3903p8614P1985o0559L7548r939j5556M0590n9240P6071
1373D1654q0142P4268o0665L7978j1872j7397L8937o0516P4464p8861P3992n9124
1385b7284L9970j2746j2024L9446n9708P2712p9826P3838o0758L8891j3210j3521
1397a4220L7303n6137P2960p6631P2353n9427M0179j5685j1342L4035n5958P0586
1409C8016p7969P2115n9180M0136j4058j0320L5661n4587O8838p4766O9533n8743
1421b5324L8978j7181j0870L4744n3190O7402p3667P1656n7649L9844j7159q684
$$ y = [39831, -43854, 32968, -26854, 10338, 608, -14600, 31087, -35259, 44209, -36703, 37174, -24000, 13487, 2169, -15717, 28013, -37528, 40069, -39004, 35961, -24315, 14507, 4861, -12261, 29201, -34535, 39368, -39246, 32739, -27820, 9728, -211, -15767, 24823, -34417, 41654, -38488, 35780, -24885, 13093, 1221, -16176, 22761, -37755, 36709, -42152, 31840, -27284, 12686, -60, -12084, 27362, -32346, 40366, -39460, 34378, -26380, 12511, -699, -14220, 23083, -33054, 39906, -36725, 35628, -23799, 16380, 695, -10647, 23388, -32570, 38016, -39953, 32162, -27018, 13118, -940, -11260, 24401, -30186, 38652, -36114, 33419, -25324, 13654, -3527, -14397, 20347, -32843, 34559, -39108, 32548, -25101, 14743, -2416, -11100]
1433a1100L2166n2734O7583p5577P1036n9468M0609j6583o520L1904n0132O5663
1445C6847p3258P1333n9311M0837j9131p086L0010n1352O5022p1168P0473n8443
1457b5227M1909k0376l488K9330n0507O2347p1094O9089n8955M1274j9310m819
1469i827K8234m7279O3753o9934O7986n8780M1535k0383l787K6030m8190O0327
1481B9685o6593O7148n8239M3186k0706k715K6308m5126O0638o8095O7463o0235
1493b7281M2834k2533j453K5192m4925O0286o7121O7706n8159M4057k3579o52
1505e628K4450m6405O0608o6634O5832n9753M4871k3463K14K3694m3472N9850
1517C4164o6861O4784n8628M4015k3062p92K1438m2500N7755o5276O6893n8166
$$ y = [-11100, 21066, -31668, 35915, -39662, 31374, -28094, 12515, -4068, -10588, 21316, -28816, 36847, -36411, 34922, -24389, 16448, -2683, -9769, 20241, -31111, 33911, -37257, 33216, -25227, 16682, -3694, -7182, 22148, -28359, 33988, -37106, 31983, -26972, 14302, -5008, -9827, 18407, -28872, 34881, -35053, 32933, -25847, 15688, -4695, -8482, 17548, -30642, 29685, -36908, 30240, -27999, 15187, -5519, -8234, 18074, -27052, 33586, -34509, 32954, -27281, 15553, -6980, -8433, 16759, -28166, 32120, -35001, 32705, -25454, 18603, -4976, -5628, 18822, -27583, 33025, -33609, 32223, -27530, 17341, -6122, -5908, 17786, -25686, 34164, -32697, 32087, -26541, 17474, -5588, -6380, 15058, -27442, 30313, -34963, 31930, -26236]
1529b6236M4241k2617L78K0164m1977N6809o5682O6121n9520M4913k4105O09K1735
1542A4833m0048N5819o3336O3389n8030M5841k6106K814J9186l9031N4607o4371
1554c4433O5924n8128M5054k5300M221J8198l8252N2419o2754O4637n8540M4648
1566A7694k6829N035J8320l7425N4068o1923O2244n6643M4347k6026M188J6015
1578A3065l6318N1576o1309O3612n7580M5946k7218M936J7044l5908N1318o0646
1590c1482O1902n7832M5179k6943O149J5996l5400N1024o0550O2686n6520M4888
1602A9097k7185P163J4632l4833M8705n8448O1587n7469M5129k8421Q725J3271
1614A1953l1707M8986n9574O2205n7374M5281k9304R628J1707l3376M7763n7677
$$ y = [-26236, 18005, -4612, -4234, 15930, -26047, 30762, -34920, 31201, -28319, 16594, -7511, -6902, 14833, -25215, 30604, -32732, 30657, -27373, 18468, -7638, -4824, 14362, -24669, 29938, -34433, 31491, -26637, 18417, -6883, -2662, 15536, -22716, 29703, -33051, 31586, -26954, 17694, -9135, -4100, 14220, -23205, 30863, -31060, 31184, -25459, 18888, -7138, -2950, 13065, -23253, 28323, -32986, 30626, -26954, 18992, -8226, -3290, 13754, -22154, 29164, -31482, 30420, -27412, 17767, -9176, -3027, 12969, -22431, 28593, -31957, 30729, -25791, 19097, -8088, -925, 13707, -21126, 27579, -30869, 30718, -26751, 18378, -10043, -1318, 11953, -19754, 29232, -30342, 31863, -25511, 19770, -9534, 94, 11801, -21575, 26188, -31489]
1626c1489O2021n6825M7093l0605R692J2619l3191M7772n6390N9475n7756M7182
1638A9598l0530J0245J1068l0941M7619n7812O1345n6411M5542k9217Q864J1102
1650A0472l0904M7057n6321N9247n6018M6973l0508J0908J0195k9323M4483n5538
1662b9277N9758n6236M5539l0854J1604R385k7233M4267n6489O0459n7011M7802
1674B1714l1177J2138O716k8276M5544n6193O0096n7039M6617l1981J4119N885
1686H163k5743M3044n4115N7491n4647M5919l2693J4798N750k6510M2168n2825
1698b9200N7960n5322M7858l2910J3710O699k4719M1703n4563N7897n5272M7407
1710B1248l3790J4452O440k4157M0415n2147N7672n7316M9145l4723J6110M813
$$ y = [-31489, 30532, -26293, 20800, -9805, -113, 12506, -20685, 27087, -29303, 30172, -27584, 19598, -10932, -687, 10381, -20560, 27059, -30753, 30592, -25819, 19723, -9494, -630, 10472, -20432, 26625, -29696, 29551, -26467, 20506, -10002, 906, 11101, -18222, 26261, -29277, 30481, -25755, 19784, -11070, 534, 9919, -17314, 26953, -29536, 30923, -26088, 21714, -9463, 2675, 9391, -18885, 26659, -29534, 30562, -26477, 20140, -11841, 2278, 8163, -17580, 25464, -28651, 28840, -25807, 20112, -12581, 2217, 7967, -18543, 23625, -29200, 28760, -26562, 21296, -11614, 2096, 8795, -15924, 25779, -28784, 29113, -26159, 21248, -12542, 1910, 8350, -15807, 24608, -27539, 30133, -27183, 21962, -12761, 3349, 8162]
1722H162k4500L9250n0704N7695n5706M6766l3576J6352K232k2178L9369n1197
1734b8035N7711n7337M8602l4563J8028J903k3063L9439n0635N7506n6660M8386
1746B1282l4495J7105K993k2112L8231n0376N6261n5997M7886l4499J8251Q68
1758E398j9699L6191m9140N6366n4299M6693l5397J8640J595k1376L7693m8425
1770b5760N4544n4583M7994l6914K0416j181j8308L5090m7326N5415n7638N0478
1782B2227l6422J9524r25j9238L6547m7334N3875n4515M7581l6359K1119k263
1794C817j6972L4744m8354N5160n5543M9889l6746J9471r11j8073L4403m6301
1806b5416N3335n4971M9539l7017K1180k820j6361L3670m7574N4288n3716M8909
$$ y = [8162, -16338, 22912, -27792, 29903, -25803, 20963, -12613, 3739, 5971, -16207, 23162, -28035, 29676, -27661, 20941, -13622, 4406, 6309, -16754, 22685, -27950, 29556, -27104, 21282, -13213, 3892, 6885, -15227, 23004, -27372, 28889, -27108, 20778, -13721, 4530, 5398, -14301, 21890, -27250, 29116, -25183, 21510, -13887, 4753, 6348, -15028, 22665, -25760, 28784, -25799, 22195, -14719, 5697, 4516, -13792, 21298, -26028, 29387, -28251, 22227, -14195, 5329, 4404, -14834, 21713, -25621, 28254, -26261, 21320, -15039, 6080, 3817, -13155, 21589, -26765, 28395, -27148, 22741, -14005, 5466, 4555, -13518, 20885, -25416, 27919, -27052, 22487, -14530, 6650, 3830, -12531, 21139, -26435, 27853, -25863, 23046]
1818B3046l8035K1403m050j5293L3589m6181N2999n3490M7986l7748K2607m048
1830B785j5183L1936m6165N3741n3195M8298l7728K2250l780j5181L2415m6198
1842b6005N2861n3587M9794l8695K2859n389j2468K9385m4073N2682n3788M9560
1854B3136l9298K3748n226j3464L0182m3764N1921n2906M9506m0202K4674o151
1866B156j3022K9598m3301N1477n3770M9975l9630K4538n878j2393K8388m2312
1878b4174N0695n3512N0201m0089K4736o317j1428K7513m1283N0669n3405M9843
1890B3449m0591K5601o979j0360K7291m2275N0838n3215N0087m1397K6648r074
1902B3r880K7358m1570N0539n2998N0401m1486K8261j0639q815K6004l9876M9413
$$ y = [23046, -14989, 6414, 2364, -12929, 20660, -25521, 27478, -26012, 21974, -15774, 6833, 2785, -12398, 19538, -26627, 27114, -26081, 22217, -15511, 6739, 2959, -12222, 20193, -26005, 26856, -26731, 23063, -15632, 7227, 1838, -10630, 18755, -25318, 27364, -26424, 23136, -16162, 7586, 2360, -11104, 19078, -24686, 27235, -25671, 23835, -16367, 8307, 2156, -10866, 18732, -24569, 26908, -26862, 23113, -16517, 8021, 2143, -10250, 18138, -24174, 26521, -26991, 23210, -16879, 7857, 1540, -9888, 17625, -23658, 27011, -26394, 23449, -17142, 8459, 1480, -8880, 18411, -23864, 26974, -26241, 23846, -17551, 9097, 23, -9857, 17501, -24069, 26470, -26528, 23873, -17613, 10648, 9, -8806, 17198, -22678, 26735]
1915B6735n3676N0301l9537K4925r065p643K5078m0185M9480n2905M9524m0370
1927a7338K7048j1046p169K4534l8988M9738n3223N0364m2098K8686j1665p787
1939h944K5866l9537M8528n2830N1000m1776K6686r789p653K4849l8672M8905
1951B6633n2889M9835m1767K7354j1243n944K3759l7797M7911n2242M9761m1979
1963a8608K9210j2594n261K4110l8013M7165n2476N0285m3448L0754j3438n927
1975h241K3412l6965M6265n0261M9760m2667L0533j4311m225K0427l5494M7133
1987B5366n2002M9625m1706L0384j3518m504K1249l5598M6030n0880M9487m2333
1999a8400L0674j6234j958K1047l5538M5123n1549N1564m3694L0600j3572l510
$$ y = [26735, -26941, 23360, -16177, 8748, -317, -7960, 17118, -23067, 26413, -26492, 23032, -17338, 9710, -1336, -8505, 16029, -22959, 26779, -26444, 23920, -18178, 10508, -1157, -8944, 16922, -22615, 25913, -26917, 24083, -17693, 8993, -796, -8449, 16400, -22272, 26633, -26256, 23579, -18188, 9166, -2077, -8021, 15738, -22059, 25852, -26390, 23371, -18608, 10602, -1992, -7253, 16857, -21156, 26009, -26467, 23818, -19630, 11124, -2314, -8241, 15171, -21794, 24471, -25790, 23970, -18697, 11836, -2475, -6700, 13727, -21767, 25366, -26636, 22989, -18717, 11667, -1851, -6355, 14894, -20704, 25326, -25554, 23933, -18400, 12274, -3960, -5918, 15129, -20409, 24714, -26835, 24729, -18965, 11635, -1937, -5447]
2011e447J8338l3705M6153n1922N0271m3617L2815j7527k181K0760l3612M4759
2023B5085n1109M9992m3793L1898j6082j071J8012l3153M4346m9932M9734m2863
2035a8936L2321j7380r47J8073l2816M3682m9397M9347m4085L2785j6472j22J7632
2048A3685l2901M3842m9797M8832m2260L1610j6633r05J7256l2083M2254m8552
2060b5652M9615m2847L1402j7833K203J5249l0256M1433m8436M9697m4811L3090
2072A2854j8675K834J4570l0329M2038m7937M8709m2222L3295k1488L750J3874
2084A1273l0185M1662m7984M9118m4292L4149j9925L601J3986k9418M1542m7944
2096b4417M9427m5256L4284k0378K608J4065k8892M1366m7555M8675m4444L4621
$$ y = [-5447, 12891, -20814, 25339, -26583, 23688, -19929, 12886, -4641, -6822, 13938, -19674, 25085, -26024, 23968, -19825, 12073, -4009, -5080, 12932, -20221, 24125, -25807, 23927, -18936, 13385, -3995, -4942, 13131, -19685, 23997, -25400, 23947, -20138, 12647, -3825, -3947, 13685, -19216, 24626, -25171, 23661, -18599, 13011, -3622, -4527, 12729, -19354, 22900, -25652, 23963, -18884, 12518, -5315, -3112, 12137, -18119, 23314, -25122, 24575, -20236, 12854, -5821, -2987, 11583, -18746, 23292, -24645, 24064, -18158, 15137, -6351, -2601, 11273, -18912, 22750, -25234, 23884, -20408, 13741, -6184, -2583, 11403, -18015, 23527, -24417, 25010, -20246, 14038, -6340, -3732, 10333, -18559, 22807, -24748, 23927, -20517, 14104]
2108A4104k0563M351J2531k8372L9548m5644M8269m5137L4832k0415M799J2601
2120A0904k8158L9873m6426M8200m4670L4372k0586N474J0532k7037L9604m6216
2132b4134M7668m3693L5177k1163N251J0464k5997L7487m5515M7286m3589L4683
2144A3925k0592N555J0124k5366L8235m4745M6987m5127L6328k1587N401R985
2156I123k5288L7105m4725M5905m2362L5360k2071O118Q968k3935L7368m4856
2168b3290M6740m4125L5099k1679O221Q749k3446L6277m3867M7664m3254L5041
2180A6130k3754Q026P655k2080L4850m4186M6522m3569L5694k4445J0282O260
2192G385k1698L5072m3149M5998m3265L5077k4725Q971P310k1723L4055m1537
$$ y = [14104, -6459, -2108, 10423, -17949, 21599, -24045, 24224, -20913, 13919, -6496, -1697, 10904, -17254, 22619, -23807, 24393, -20277, 14095, -6491, -1017, 9515, -17522, 22082, -24134, 23534, -20159, 15018, -6145, -894, 9570, -16427, 21060, -24455, 22831, -20758, 13925, -6667, -1112, 9012, -16354, 21881, -22864, 24123, -21004, 15324, -6263, -862, 9123, -16165, 20940, -23785, 22120, -20242, 15118, -6953, -835, 8133, -15802, 21566, -23290, 23450, -20675, 14424, -7255, -1034, 7715, -15731, 20546, -23321, 24343, -18911, 16130, -7624, 402, 8057, -14023, 20827, -23359, 23163, -20406, 15288, -9157, 1125, 7385, -14313, 20759, -22390, 23608, -19657, 15420, -9305, -334, 6976, -14747, 19308, -22229]
2204b2229M5241m3029L4501k3040J0509N556k2911L3918m1146M4886m2789L5416
2216A4883k4423R921O544k0477L2226l9849M4779m4013L6225k5218J1111N124
2228F833k1039L2256m0272M5584m3875L6973k5326J0646N269j9353L0882l9932
2240b1354M3315m2151L5175k4359J1364M155j9251L1287m0358M4083m2568L6643
2252A5981k5138J0942L623j8006L0333l8969M2537m1325L5053k4099J1929J363
2264D224j8393L1464l8590M3396m2019L5938k5414J2573J315j6811K9675l6896
2276a9538M1764m1966L5299k4875J2966P62j4739K9145m0379M2605m1328L6480
2288A6196k5966J2217K799j6443K9653l9930M3850m2021L5525k5587J1360K178
$$ y = [-22229, 23012, -20017, 14484, -8556, 1953, 7509, -15402, 18516, -22630, 22256, -20533, 14883, -9540, 381, 6925, -13552, 18674, -21175, 23604, -20409, 15816, -9402, 1709, 6833, -14206, 18050, -22222, 23362, -20513, 16460, -8866, 1780, 7049, -12304, 18578, -21354, 21961, -20190, 14985, -9374, 1990, 6145, -13106, 18181, -22177, 21906, -20662, 15981, -9157, 1785, 5408, -12598, 17735, -21234, 21303, -20022, 15031, -9068, 2861, 4224, -14169, 17295, -21295, 22101, -19918, 16020, -9394, 3179, 4494, -12317, 17358, -19538, 22226, -19740, 15559, -9316, 3650, 4412, -10327, 18818, -21561, 21044, -20284, 16196, -9770, 2447, 5246, -11197, 18456, -21474, 22376, -19645, 15880, -9707, 1653, 3831]
2300C831j5634K8400l6883M1359m0789L4749k5387J3391R28j3712K5934l6613
2312b0426M1078m0334L5029k6314J4022J5j3488K6671l5930M1641m2424L6647
2324A6187k6980J4189j386j2948K7636l6396M0993m0858L5620k5799J3846j41
2336C963j3558K6711l6332M0571m1507L6225k6700J4231j074j2163K4894l4674
2348a9413L9074l8722L5153k7071J5720k466j1852K4465l4751L9559l9369L5665
2360A5992k7652J5201j493j1581K3170l2304L8090m0251L6337k8148J6683k915
2372A129j0372K2930l2089L8700m0228L6994k7676J5869k442j1112K2265l2165
2384a8197L8581l9791L5585k6899J5812k721j0357K2190l2354L8642l9038L4092
$$ y = [3831, -11803, 16597, -20286, 21073, -19716, 15033, -10354, 3037, 3965, -9747, 16187, -20426, 20652, -19682, 15347, -10967, 3055, 3070, -10418, 16253, -19677, 21964, -20460, 16187, -10793, 3396, 2010, -10938, 16698, -19698, 21295, -19563, 16057, -9742, 4104, 3963, -9595, 17116, -19216, 21355, -20152, 16073, -10627, 3604, 2530, -9633, 15261, -19413, 19661, -19061, 16092, -10979, 4741, 2275, -9577, 14888, -19863, 19696, -19673, 15992, -11660, 3541, 2048, -9533, 13637, -18667, 19423, -20828, 15509, -12639, 4044, 1129, -9243, 13687, -18402, 20298, -19930, 17064, -10612, 5257, 2815, -8297, 13968, -18197, 20384, -19407, 16178, -10721, 5091, 2370, -7987, 14203, -18151, 20491, -18547, 15545]
2396A5545k7019J6397l498j0007K2062l1909L7596l8548L5353k7846J7555m592
2408A089r657K0579k9801L5827l7089L3879k7409J8088n265q545K0732l0068L6583
2421A8943l7987L3807k6220J7011n163q321K1688l1353L6710l8463L5759k8128
2433a1717J7956m816q130K0346k8768L4004l7156L4280k6759J8141o472p135J8908
2446A2682k8849L5751l6395L3197k7708J6878o591n406J8029k9645L6611l7974
2458a9420L5048k7215J7170n200o821J8150k8562L3973l6267L4344k6515J7161
2470E846p037n125J8167k7580L2860l4642L3137k7405J9848q170m848J6154k5813
2483a4608L3101l6097L3921k7791J8605o757m607J6368k4825L1330l6451L3664
$$ y = [15545, -11474, 4923, 1425, -8582, 13480, -18429, 19167, -19381, 15972, -11874, 5681, 1089, -8568, 12011, -17790, 18037, -19052, 14827, -12582, 5506, 241, -8304, 12428, -17640, 18943, -19044, 14763, -11457, 5554, 391, -7930, 13758, -17595, 19115, -19348, 16411, -11717, 6239, 1423, -6707, 13639, -15129, 18875, -18281, 15999, -10760, 7381, 909, -6226, 12682, -16167, 19584, -16811, 16386, -11322, 5556, -1035, -6441, 11588, -18057, 18554, -19420, 15628, -11587, 5583, 383, -6438, 11712, -16850, 17123, -19144, 15200, -11315, 5846, -1191, -6316, 11851, -15729, 17131, -17511, 15626, -11779, 8069, -101, -4949, 11205, -14608, 18493, -17604, 16317, -11474, 7131, 374, -4233, 12135, -12690, 18640, -17811, 15853]
2495A5853k8403K0342q669m829J6523k5840L2517l5411L4404k8624K0070q898
2507i65m304J5333k5583L3028l5172L2736k8147J9566p851l646J6218k6248L3044
2520A8009l5599L3725k8796K0062r082k732J5060k5630L2352l4179L2743k7170
2532a1237J9402r004k295J4055k4933L0982l3236L3185k7673J9441r320k677J4397
2545A1087k4898L1961l4729L3267k8062K0253j0669k128J3829k4013L0368l3867
2557a7601L2872k8421K1653r685l427J3864k2376K9724l4119L3059k8588K0832
2569G787j0187j538J2895k1169K8764l3113L2482k8306K0653r528j750J3001k2522
2582a2531K8547l1803L0902k6741K1856j1755l6J1706k2282K9417l1993L1184
$$ y = [15853, -12550, 7792, -877, -5706, 10817, -15023, 17494, -17917, 16487, -12137, 7933, -965, -5269, 10064, -15519, 17509, -17663, 15073, -13074, 6492, -1359, -5005, 11213, -15035, 18009, -17590, 16135, -12661, 7401, -1681, -4413, 10647, -14983, 17369, -16810, 15933, -11237, 8165, -839, -3134, 10921, -14012, 16970, -16266, 16919, -10754, 8687, -633, -3310, 11087, -13811, 18150, -16579, 16688, -11374, 8879, -1790, -3918, 9911, -14102, 16266, -17601, 15271, -13150, 8503, -1182, -4609, 9255, -13121, 16603, -17516, 15543, -13045, 7787, -2400, -3938, 8957, -12212, 16552, -16561, 15921, -12385, 8268, -1260, -3010, 9991, -12531, 16016, -15787, 15115, -11626, 10230, -1525, -1561, 10145, -12137, 17280, -14713, 16471]
2594A6471k8233K1625j1808J248R183k1451K9186l3244L3841k8744K0686j0864
2606b104J326R856k1239K8238l1468L1263k8710K1704j1663n97J1143k0621K8448
2619A5576l2149L1623k7431K0573j2080P30J0956j9598K7170l1813L1223k7135
2631a2355K0813j1987J920R997k0313K7472l1557L2129k8456K1625j2086J836
2643i62Q634j8346K6581l0582L1323k8934K2026j3077J642J0024j9708K4991k8761
2656a5149L1207k8154K2162j3798K145P902j7179K5612l0948L1351k8571K2715
2668I295j4313K766P732j6957K4077k9048L0733k7879K2479j3529L026P023j6552
2681a1147K4810k9378L1281k8100K1611j2575K195P854j7940K5550k9048L0533
$$ y = [16471, -11762, 9863, -1945, -697, 8486, -12965, 16221, -17023, 16818, -11926, 8760, -2104, -778, 9078, -12161, 16077, -15391, 15872, -12838, 8866, -2797, -3394, 7749, -12872, 15576, -16573, 15050, -12381, 8192, -3888, -3158, 7798, -11800, 15370, -16443, 14780, -12355, 8458, -3529, -1609, 8388, -11925, 15547, -16010, 16119, -12337, 9288, -2798, -962, 7672, -10674, 15907, -14675, 16648, -12286, 9740, -3337, -1695, 8329, -11379, 13612, -15149, 16058, -12096, 10066, -3732, -1587, 6315, -10864, 14748, -16200, 15151, -13420, 9295, -5018, -2252, 5480, -11477, 12600, -16448, 14285, -13594, 8885, -4644, -1618, 5405, -11147, 13663, -15715, 15566, -12534, 9077, -3498, -1303, 6551, -11389, 14161, -14887, 15646]
2693A5646k8065K1631j4239M944O656j6239K4369k9947L0962k8724K2581j4902
2705e327N111N360j5001K4503l0645L1368k8832K2807j4424M595N567j5441K3303
2718A2944k8733L0634k8341K2725j4828M871O301j6006K3392k9595L0324k7415
2730a3727K2548j5307N725N489j5486K3374k8287L0290k8973K3343j4513N778
2742B54N371j6090K4703k9207L0423k8232K2156j5462P128L666j4764K2824k7799
2755a5029L0318k8424K3152j5884O301L647j3302K1166k7770K9945k8241K3357
2767I236j5251N833K740j2218K0534k6515K9293k7348K2971j6137O499L172j3429
2780a0620K2069k7684K9795k8080K4045j5954O087M245j3748K1649k6179K8654
$$ y = [15646, -12419, 9212, -5027, -83, 6573, -9666, 14703, -15244, 15718, -13006, 9575, -5327, -216, 5144, -9857, 14646, -15999, 15369, -13463, 9344, -5080, -485, 5082, -10359, 12944, -15789, 14845, -13496, 9229, -5599, -728, 5573, -10433, 12959, -16636, 13688, -13727, 8821, -6486, -761, 4728, -10758, 12616, -15671, 14619, -14354, 8989, -5524, 254, 5625, -10465, 14238, -14969, 15454, -12778, 9378, -6084, 1044, 4710, -10054, 12770, -15029, 15289, -13135, 10017, -5867, 434, 4081, -9221, 11945, -15825, 14120, -14121, 9236, -6015, -182, 2558, -9660, 10874, -15641, 13652, -13696, 9275, -6862, -363, 2809, -10620, 11449, -16235, 13560, -14520, 9525, -6429, -342, 3903, -9845, 11804, -14375, 14279]
2792A4279k8005K3583j7385Q752K580j2370K0276k6548K8287k7404K5060j7369
2804f264O866L886j3024K0604k6507K9413k9526K4481j8154R212K849j2187J9849
2817A1498k6425K9275k8544K4431j8316Q796J666j1899K0191k5965K8662k7322
2829a3952K4024j6460R201l15j0410J9086k5657K8581k8731K5307j8084R237N73
2842B400r693J7612k4064K9073k9295K4844j7388R198J787j1280J7943k3745K7248
2855A4640k8324K4669j7988Q984K35r247J7203k4061K7704k8136K4468j7831R945
2868B261m20j0210J9262k5016K8546k8200K4287j8400J0609r11r345J7821k4782
2881a4498K7838k7705K5216j8441J0946k060q634J7853k4093K8252k9200K5487
$$ y = [14279, -13726, 9857, -7528, 1224, 3804, -8566, 11710, -14838, 13449, -13955, 11105, -6264, 602, 4488, -8536, 12068, -14439, 14974, -14552, 9929, -8225, 987, 3836, -8351, 11498, -14927, 14348, -14196, 10235, -8081, 715, 2381, -9518, 10673, -15292, 13370, -13952, 10072, -6388, 2813, 2498, -7912, 11174, -14483, 14098, -14633, 10674, -7410, 1827, 2400, -7293, 10319, -13745, 15328, -13967, 10877, -6511, 2687, 4474, -6806, 11137, -12608, 14640, -13684, 10985, -7003, 1981, 2216, -7031, 10172, -13889, 13815, -14321, 10147, -7684, 2261, 1841, -8369, 10893, -14123, 14423, -13777, 10510, -7890, 2719, 1808, -7537, 10284, -14498, 13340, -14365, 10851, -7590, 3356, 1296, -7338, 10515, -13578, 14674, -14526, 10961]
2893A0961j8331J0265n25r268J7980k4512K7035k6619K4508j8649J0517k70j0007
2906f915J8385k4741K7329k8032K5103j8991J1875k885p580J7770k4499K8147
2918A4966k8011K4859j9994J1695k255q059J7367k3576K6817k7304K5228j9806
2930h073J2030k058q684J5694k1556K6663k6795K4810k0265J2062k131p169J5858
2943A0386k3632K7384k7533K5403j9731J2950m147o666J6250k2626K5920k7405
2955a3447K6142k0328J1953l278o494J5895k1783K5516k6911K4665j9641J2363
2967D652l454o475J5094k1824K7133k8906K4451j8526J2641l756n875J4387k1693
2980a2151K5786k6915K5334k0697J3764m382n454J4386k0912K5230k7490K6505
$$ y = [10961, -7370, 2895, 2370, -6898, 11082, -13430, 13605, -13014, 11494, -7155, 3362, 3092, -6915, 11470, -13271, 14058, -13974, 11129, -7862, 4013, 1128, -6452, 11318, -13181, 14966, -13045, 11814, -8180, 3515, 1260, -6799, 10568, -13008, 13809, -13495, 11733, -8073, 3957, 1899, -6785, 8909, -12647, 14016, -12779, 12031, -8234, 3828, 1697, -5472, 10386, -13246, 14138, -13395, 12008, -7723, 5227, 1080, -5586, 10664, -11962, 13958, -13447, 12695, -7633, 4320, 1042, -5452, 10443, -11340, 14176, -12735, 11930, -7711, 4652, 1198, -5277, 9817, -12007, 15126, -13780, 10671, -7855, 4786, 1030, -4845, 9542, -12151, 13635, -13280, 12054, -8643, 5121, 739, -4715, 9671, -11241, 13989, -13501, 13004]
2992A3004k1032J2268l801n883J4799k1245K5188k6145K4987k0100J2932n352
3004c80l138J3461k2361K6210k6669K6326k1905J4983n387m937J3186k1659K6417
3017A4147k7599K5523j9906J4255n455n072J2990k0783K6122k7159K4893k0384
3029h428J3458n912l150J3058k0650K6197k7621K5306k0058J3454o067l309J1758
3042H036j9112K5071k7353K5855k1636J5218o285l826J3620k0549K4930k6532
3054a2563K5882k1342J3840n316n548J3764j9594K5104k8807K7891k2107J4121
3066E325n784l785J2980k0377K5167k6438K6105k2806J5179o994j250R669j7599
3079a0608K3586k5441K4647k1160J3784o690j908J1686j8770K3169k5705K4967
$$ y = [13004, -8028, 4240, 439, -5444, 9355, -11890, 13298, -12847, 12140, -7960, 4972, -380, -3518, 9943, -12418, 13792, -12877, 13449, -8456, 6527, 1140, -3797, 9389, -12270, 14147, -13452, 12071, -7835, 6420, 965, -4107, 8883, -11900, 14222, -12937, 11956, -8428, 5030, -882, -4032, 9026, -11624, 14573, -13048, 12258, -7800, 5654, -413, -3722, 8036, -11076, 13995, -13358, 12497, -9139, 6079, -206, -4032, 9588, -10961, 13969, -12563, 13319, -8023, 5817, 501, -5047, 8717, -10877, 14227, -14580, 13311, -8796, 5325, -459, -4244, 8736, -11641, 13526, -12912, 13193, -9613, 5566, -1428, -2678, 6991, -10608, 12978, -12463, 12184, -8976, 4808, -1882, -3790, 7896, -10874, 12295, -13410, 11557]
3091A1557k0776J5366o470l803J1102j8108K4130k6653K5737k0771J4451p478
3103a716r96J0146j7414K2233k5082K5089k1566J4303p132j226J0427j6934K2770
3116A2902k5354K3982k0701J5207p620p26Q696j7505K3250k5527K5381k1705J6874
3129G154q515j673J0224j8559K4043k5499K4737k1782J5083p136j094R458j5700
3142i259K1438k5479K4805k2054J5519o456j723R191j6139K1144k4248K5689k2273
3155i845J5587q259M83P980j5365K0637k3918K4678k1618J6029q433Q60P001j6269
3169a0452K2821k5712K5359k1703J5694q788J75Q530j5517K0963k3673K3940k2400
3182a0763J7973j0056K261N586j4720K1089k4055K3801k0409J5673r067J110P395
$$ y = [11557, -9219, 6147, -323, -4126, 6976, -11132, 12998, -13655, 12082, -8689, 5762, -1716, -2712, 7434, -9980, 12253, -12829, 12260, -9306, 4997, -2135, -3361, 7066, -9868, 12902, -12452, 11530, -9171, 6036, -1584, -2310, 6386, -11119, 12131, -13396, 11985, -9720, 7154, -1361, -3034, 7190, -11369, 12674, -12825, 11912, -9870, 5213, -1923, -3017, 6441, -9259, 12179, -13300, 11505, -10549, 4970, -1486, -3209, 5982, -10157, 10987, -13261, 12428, -9845, 5742, -2517, -2034, 5946, -9419, 11218, -12700, 11978, -9640, 6389, -2044, -1184, 5817, -10452, 12369, -13343, 12016, -9687, 6007, -2781, -2606, 5924, -9593, 11370, -12303, 11637, -10763, 7210, -2846, -585, 5001, -9719, 11370, -12685, 11116, -9293, 6380, -2687, -1577, 5818]
3195E818j4594J9820k3562K4414k1965J5947r686K202O213j3957K0235k2732K3771
3208A1924k1327J5612r350K252N392j3365J8711k2190K4254k1844J6475j0773
3220d229L419N189j2081J7790k1642K3082k1383J6664r721J148O283j1935J7687
3233A0271k1021K3443k2473J7201j0206K495N765j5015J8913k2441K4624k1903
3245a0347J6315r457J869O079j3835J9177k1550K2526k0756J6667q380q10O826
3258D324j2114J8176k2396K3499k2028J7386j0856K932O005j2900J8139k2263
3270a2096K3722k1765J6185r890K593N668j2293J7419k1200K3439k0999J6251
3282G034j0541K987M056j2263J9718k2912K2415k0234J7825j2523M551M302j1878
$$ y = [5818, -8776, 11044, -12518, 11896, -10069, 5878, -3808, -1606, 4607, -9350, 10885, -11847, 11924, -9403, 6209, -3141, -889, 4503, -8862, 9849, -12341, 11913, -9931, 6544, -4229, -810, 4379, -7702, 10088, -11554, 11528, -9855, 6809, -2912, -1764, 4519, -7416, 10271, -10750, 12693, -9780, 7421, -2785, -290, 5475, -9540, 9373, -13068, 11556, -10347, 5968, -3489, -1620, 4459, -9376, 9801, -11749, 10777, -9979, 6688, -1692, -2502, 4324, -7790, 10386, -12010, 11489, -10539, 6847, -4009, -1077, 4928, -7972, 10167, -12096, 11626, -10139, 6046, -3844, -1251, 4417, -7876, 9543, -11657, 11782, -9217, 7034, -3507, -520, 3536, -8727, 10991, -11921, 10494, -9740, 8085, -4438, 113, 4415, -7463]
3295g463J7819k1591K2836k1609J6684j0763K987N237j2367J7863k1227K2575
3307A0981k0887J6587j0100J901N103j1611J8094j9809K1068k1655J6224j0155
3319d259L175N058j1540J7362k0625K1714k0335J6851j1892N286L075j1223J6958
3332I605j9728K0955k0406J6928j1443M475L103j0055J6109j9336K0781k0302
3344i314J6484j2014N650J998q519J5266k0630K2503k1140J7886j2509M230L441
3357C332r185J4754j8713K0863k0196J6667j1749M844K072r870J5816j9667K2020
3370A0988k0452J6652j1600L755L412r518J6661k0089K0211j8899J6505j2751
3382e125N170K788q641J4813j9424K2002k0072J7011j4101P265J264q352J3986
$$ y = [-7463, 10356, -11235, 11601, -10008, 6676, -4087, -1100, 4137, -8230, 9633, -11594, 10981, -9906, 6681, -3419, -1518, 3585, -8026, 10068, -9741, 11327, -10328, 5896, -4259, -1084, 3974, -7566, 9796, -10829, 10885, -9450, 7401, -4491, 795, 3870, -7353, 9605, -10123, 10832, -9574, 7354, -4089, 386, 3489, -6566, 9543, -9793, 10988, -9314, 7170, -4844, 806, 2804, -5715, 9551, -11079, 11424, -9716, 8170, -4339, -109, 3332, -5853, 8901, -9812, 11051, -9145, 7522, -4227, 617, 2689, -7181, 8635, -11032, 10988, -9464, 7188, -4412, -657, 2755, -6763, 9898, -10191, 10020, -8879, 7626, -5125, 45, 2833, -5808, 9005, -10419, 11583, -8489, 8522, -5579, 1686, 2950, -5402, 8584]
3395H584j8505K0503j9302J6511j1315L568K248p628J2329j6002J9910k0663J6690
3408F928j1990P189j99o069J2533j7682K0629k1359J7730j1896N445J712p496
3421d525J2179j6636K0027k0829J5612j1236P006J013q561J3381j7412J9793j8379
3434h567J5935j1413N969J05o389J3312j8684J9555j9251J6992j1656N628J4o458
3448d908J3565j6994J7835j8617J6050j0638O167m12o760J1926j5999J8439j8174
3461h520J6378j3012O794J02p119J2676j6872J9478j8783J5747j2448Q419j589
3474A251n122J1637j6496J8816j9438J5961j1168M622Q98o116J2671j6241J8771
3487A0046j9030J6532j2304P227j457n370J1680j6710J8815j8467J6092j1677
$$ y = [8584, -9921, 10582, -8720, 7791, -3524, 44, 2292, -5336, 6993, -9009, 10901, -9762, 6928, -5062, 2127, 1928, -4141, 8392, -9290, 11339, -10020, 7710, -4186, 1259, 2971, -4525, 7654, -8982, 11045, -9784, 5828, -5408, 1598, 2611, -5950, 7431, -9981, 9812, -8567, 7368, -4045, 1924, 2029, -4360, 8952, -9732, 9823, -9428, 7564, -4092, 1536, 1550, -4908, 8657, -8337, 9498, -9119, 6931, -3707, 2460, 2048, -4712, 7214, -8785, 9654, -8520, 7858, -5154, 1640, 1742, -5377, 7299, -9573, 9905, -8878, 6869, -5579, 2840, 1251, -3871, 7766, -8730, 10086, -9352, 6609, -4559, 63, 961, -5155, 7516, -8725, 10046, -8984, 7548, -4756, 2471, 1014, -4356, 7324, -9386, 9429, -9038, 7054, -4623]
3499d623N928Q4n257J1094j5840J7835j6811J5717j3444P477j912l991J0519j5970
3513i194J9674j9359J6418j2402O657j360n915J1871j4405J7835j8576J5312j1129
3526d573P095m206k532J1043j4818J7008j7943J6665j3150P067r00m417J0226
3539F565j4493J7459j8202J6105j2040P405k119l134R482j4469J6620j8224J6507
3552G462j2780Q694k380m426R279j3987J8026j8184J6850j5043Q669j878m473
3565d171J0827j4404J6297j7049J6076j3471Q100j372l377P495j2859J5382j6405
3578h931J6563j3440Q718j981m253Q856j3428J6387j7306J6466j3145Q278j554
3591A230m881R720j3712J6615j8275J6631j2453P577k209l371R440j3742J6743
$$ y = [-4623, 1305, 1389, -3868, 7226, -8614, 9221, -7590, 8127, -5317, 2160, 248, -3743, 6776, -9194, 10480, -8879, 7539, -4863, 1794, 434, -5481, 6390, -8015, 9820, -8756, 6556, -4573, 2522, -1684, -4216, 6827, -7991, 9017, -8926, 7739, -5411, 1656, 756, -3661, 6565, -7928, 9531, -8671, 7434, -4606, 2799, 680, -2454, 7028, -7441, 9179, -9045, 7462, -5318, 3376, 996, -3430, 5849, -8138, 9888, -8296, 8554, -6489, 2180, 302, -4171, 6656, -7748, 8549, -8500, 7576, -5895, 2205, 833, -2544, 4951, -7908, 7474, -8931, 7632, -5808, 2910, 929, -3324, 5532, -7896, 8491, -8815, 7651, -5494, 2784, 1230, -3651, 6069, -7643, 8972, -9303, 7328, -5125, 2452, 243, -3128, 6312, -7430, 9313]
3604I313j8004J6163j2463Q148l708k044Q166j3584J6527j6586J4663j2810R124
3617B905k687l806Q884j2251J5367j6591J5153j2582Q688l547k476P646j1743
3630g040J5473j7431J5379j1727P957k960k219P517j1742J4378j5943J4648j1868
3643e578P706j771l106Q112j1206J3653j5137J5389j2644Q360l595k675P154j1628
3657f966J5212j6445J4847j2660R313l505k254P396j2926J6628j7248J5561j2268
3670e315Q483m257k103Q075j1469J4278j6467J6684j3365Q048l736n91O697j2482
3684g520J4886j5509J4459j2011J0113m886j821P259j2218J5128j5575J5073j2736
3697e358P776l069j296O414j1012J4670j5262J4843j2947R587n776q43O912j1245
$$ y = [9313, -8691, 7472, -4991, 3157, -551, -2595, 5571, -8013, 8514, -8072, 6591, -6219, 2905, 218, -3588, 5296, -6955, 8412, -8179, 6974, -5608, 3080, -467, -2943, 4703, -7040, 8433, -8998, 6381, -5346, 2611, -349, -2568, 4949, -6793, 7585, -8358, 6290, -5578, 2128, 357, -2749, 5363, -5843, 7810, -7327, 8062, -4582, 3778, 183, -2492, 4662, -6966, 8246, -8199, 6648, -6012, 3301, -204, -2458, 4938, -7988, 8640, -8608, 6953, -5315, 3168, -1089, -3192, 4883, -6586, 7692, -8775, 7909, -5456, 2592, -1144, -1735, 4962, -7520, 7366, -8143, 6316, -5695, 4418, -468, -2289, 4970, -7248, 7880, -7695, 7378, -5358, 2418, -651, -1947, 4467, -6545, 8125, -7137, 7706, -5241, 4346, -1430, -2273, 4639, -6606]
3711f606J4010j5465J5414j3453R453l390j286N887j0515J3421j5185J5363j3078
3724e430R339m312j579O848j1216J3649j4771J4444j2663R655m596n17N077r915
3738e987J3405j5851J6192j3172R126m397j159N773r974J3218j4871J5364j4071
3751f404J0283m131q58N435r474J2656j5341J4638j2797R917m789m09M993r124
3765e405J2725j4719J4318j2832R479m672k7M935r178J2410j5030J4304j2421
3778f113J0341o218J116N210r411J2440j5218J4939j2589Q864m466n46N087r047
3792e611J3078j4602J4658j3574J0069n132J80M639q441J2096j4855J5154j4108
3805f449R854m820L01M033q050J2026j3696J4181j2827Q583m383P03M389q892
$$ y = [-6606, 7404, -8061, 7353, -6100, 3353, -37, -1323, 4564, -5951, 7470, -7715, 7648, -5430, 3909, -403, -1982, 4866, -6350, 7299, -7472, 6972, -5691, 3964, -632, -1149, 3928, -5987, 7418, -8433, 7759, -5413, 3713, -684, -1843, 3930, -6044, 7174, -7697, 7667, -6404, 3879, -252, -1110, 4325, -5149, 7507, -7834, 6804, -5993, 3924, -865, -1274, 3719, -5405, 7320, -7399, 6919, -5913, 3566, -1106, -1133, 3802, -5376, 7034, -7996, 6308, -6113, 4228, -1990, -874, 4336, -5075, 7365, -7853, 7086, -5503, 3361, -1105, -1651, 3436, -5611, 7467, -7135, 7523, -6051, 4018, -1114, -934, 3705, -4736, 7360, -7495, 7659, -6449, 3405, -1415, -1114, 2919, -5131, 6895, -6801, 7380, -5447, 3136, -1247, -544, 3845, -5047]
3819e047J1356j3680J5022j3726J0867o501J59M666p945J1341j4398J4334j2878
3832f430R908o133K016M533r850J2162j3566J4060j2783R548n594N06M518q083
3846e188J1571j3823J4778j3593J1316o310O86L100p008J0934j3837J5892j4251
3859e733R567o454K822K955q108J1309j4281J4848j2905J0030n398J615K834q509
3873e408J2409j4788J5006j3309J1446p445J511L550p203J0923j3610J3075j1882
3886e725J0628p546K608K050p825J1233j2459J3566j3098J1347p419K625K793
3899B778p582J1589j4057J4085j2360J0732p719K285K324p220J1418j3343J4269
3912G199j2622R408o470J823K450o508J1474j4148J3852j3054J0988o042J373
$$ y = [-5047, 6309, -7371, 7651, -6075, 4792, -1709, -1550, 3116, -4829, 6512, -7886, 6448, -6430, 3478, -2655, -639, 3894, -5956, 6206, -7360, 6700, -6083, 3465, -2129, -1623, 2895, -5188, 6383, -7440, 7338, -6255, 5061, -1249, -563, 2537, -4471, 6463, -7374, 8518, -5733, 3834, -2620, 202, 3157, -4951, 6358, -7923, 6925, -5980, 4050, -1348, 267, 3101, -5408, 7001, -7787, 7219, -6090, 5356, -2089, -578, 2972, -4231, 6692, -6918, 6157, -5725, 4903, -2643, -35, 2015, -5810, 5423, -7036, 6530, -6568, 4779, -2640, -15, 2778, -4804, 6785, -7272, 6813, -5547, 5185, -2534, -249, 2075, -5145, 6273, -7070, 7199, -5423, 3985, -2485, -662, 1788, -4720, 6754, -7394, 6458, -6596, 4392, -1650, -277]
3925b77K133n731R746j2921J3913j2089R478o574K617K160o308J0317j3686J4894
3939G672j4076J1477p583K389L017o882J0071j2618J3494j3152J0293o471K507
3952A38K280o800J0256j3197J4039j3597J1535p034L042K065o542R767j2939J2941
3966E954j2599J1434p100L764O65n616R773j3537J3775j2253J0796p046J730K028
3980A768o494R585j2119J3635j2787J0940p085L217J210n435R072j1920J2818
3993F405j2915J0880o709K924J657n932R125j2418J2908j1994J1471p223J316
4006e05J796n728R691j1583J2705j2185J0039o555L358P01n866R536j1971J3037
4020F470j2136J1591q822K984J441n476R681j1946J2100j1930R868p691N005K59
$$ y = [-277, 1856, -3875, 5871, -7050, 6863, -5226, 4252, -2322, 295, 2455, -3853, 6464, -7222, 7672, -6404, 5073, -2510, -121, 2896, -3986, 6085, -6533, 6961, -6191, 4102, -2369, 138, 2418, -4382, 5874, -7323, 6716, -6881, 4654, -2380, 662, 2727, -3815, 5952, -6987, 5954, -6645, 4789, -2311, 1453, 2118, -3498, 6275, -7262, 6513, -5740, 5056, -1990, -260, 1768, -4726, 4859, -7260, 6375, -6412, 4528, -2557, 660, 1870, -3565, 5507, -6413, 6405, -6510, 4370, -2339, 585, 2242, -3690, 5435, -6983, 5925, -6069, 5402, -1821, -505, 1291, -4437, 5254, -6329, 6376, -5809, 4230, -2325, 1033, 1734, -4132, 5404, -6567, 6470, -5666, 5925, -2897, 87, 1528, -3948, 5733, -6213, 5887, -6043, 3825, -3866, 1139, 1398]
4034A398n198R392j1300J2089j2180J0784q149L311J917n806Q837j1849J4360
4047G606j4258J0773p771M017P59m898Q715j1193J2395j2021J1050q560M034J015
4061A663m920P636j0550J2834j3218J1221q569N922q7n267Q805j1093J0887j1330
4075f066J0989q553M867q61l849Q067j0115J1946j1586R461p437M482j64m043
4089b862Q839j0935J1516j3454J1213o752K283J715m308Q484j1329J2024j1633
4102e199J0355q020L752m09l883P882j0468J2201j1453R609p100L622j96l056
4116b363O761r933J1664j2157J1522p378L877j130l794P591j0472J2267j1019
4129d564J0172j0070O292k3l945P514j0620J1666j2154J0027q202M960j063l028
$$ y = [1398, -3800, 5592, -5708, 6381, -5799, 4985, -3164, 147, 2064, -3742, 5095, -6754, 7606, -6652, 4121, -3650, 367, 1126, -3772, 4943, -6250, 6145, -5876, 5174, -3386, 648, 1663, -3257, 4379, -6171, 6663, -6555, 4666, -3903, 2019, 1932, -3335, 5470, -5623, 5264, -6066, 4923, -3630, 1237, 376, -3473, 4594, -5521, 6425, -5161, 4300, -3137, 1345, 1181, -2862, 5977, -4958, 6558, -6896, 4317, -2435, -152, 1563, -2745, 5739, -5590, 6434, -5199, 5156, -2864, 888, 479, -3404, 4478, -5990, 6211, -5242, 4367, -2733, 889, 693, -2363, 4398, -5535, 6129, -6028, 5494, -1884, 1993, 863, -2931, 4660, -5812, 6455, -4564, 5608, -4462, 1830, 1807, -2138, 5376, -5244, 6422, -5732, 4295, -3907, 1053, -10, -3038]
4143c038P380r910J1772j2547J1863r471N191j065k664O783j0551J2370j2065
4156e952J1183q867N166j217l384P179r946J1764j1767J0635q413N960k044k880
4170b583P093j0522J1986j1827J0419o761L642j557j635N994r179J1041j1370
4183e259R981q068M963n37l073O113j0248J1724j0773R964p744N074j202l521
4197b606N985p228J0001j0552J0151q343M435k027j665N830r334J1149j0941R946
4211D801q088N249j280m415P069q192J1171j2172J0189q219N704j823k691O255
4225C558q505J0396j0586R375q270O297k471k581O450r097J0733j1013J1157p800
4239b357L879q18l477O629q949J0998j2123J1792r063O279l183j716N721r110
$$ y = [-3038, 4342, -5568, 6204, -6343, 5520, -3951, 1240, 175, -2489, 4294, -6257, 6113, -5952, 5231, -3636, 1530, 313, -3071, 4108, -5838, 5926, -5841, 4794, -3619, 2341, 297, -2583, 4510, -6012, 5974, -5853, 4566, -2195, 1447, -110, -1745, 4249, -4930, 6111, -5259, 4722, -3346, 1617, 1080, -1993, 4120, -6128, 5596, -5177, 4787, -2957, 2117, 915, -2606, 3379, -3849, 6152, -4400, 5751, -2592, 1843, -184, -1849, 3981, -5353, 5796, -5145, 4801, -3287, 1962, 682, -3733, 3336, -4856, 6315, -5857, 4332, -3887, 1817, -6, -2697, 3558, -4947, 5449, -5137, 4238, -4032, 2265, -206, -2787, 3663, -5434, 5299, -5714, 5443, -2357, 1522, 704, -2773, 3856, -5093, 5905, -6218, 5574, -3489, 2790, -393, -2109, 3612, -5498]
4253e498J1657j1210R969r159N998j561k069M334o292Q877r784R924q648M890
4267A428j688j432M952q310Q992r405J0319q760O708j979l197O515q206J0189
4281F126j2219J1773q763M316j119j922M335p289R368r069R537p788L566j870
4295a018j661O207p108R290j0991J0084q081O650l849n30L880q660J1222j0482
4309e047J0559r499N926k240j733N050q790J1636j0002P725o450M155k516o75
4323a901M804p287Q939r795J0513r098O373j958j550L973p564R831j1178J0274
4337D376p876O237l354j037N358q236R037r811R912q328N778k460j993N177o757
4352c977Q803r122R296q150N485l611M04L175o934R275j0068J0055p712N460l511
$$ y = [-5498, 6159, -5051, 4918, -4241, 1757, 196, -1873, 2461, -3831, 5046, -4738, 5186, -3462, 1428, -260, -1692, 3260, -5050, 3942, -5463, 4856, -3904, 2804, 825, -2372, 4143, -4063, 6126, -6093, 5680, -3083, 1233, 114, -1808, 2527, -4762, 4606, -4463, 5074, -2714, 852, -1018, -2679, 3528, -3580, 5710, -5281, 4803, -3278, 3372, -477, -1007, 2873, -5787, 5435, -5047, 5512, -3987, 1939, -301, -2034, 3016, -5774, 5862, -4140, 3585, -2865, 1290, -1226, -1901, 2903, -4384, 4555, -5240, 5273, -3825, 2548, 590, -960, 3013, -4551, 5280, -5898, 4376, -3500, 2737, -617, -1654, 3704, -4532, 4505, -5306, 4606, -3722, 2056, -404, -2397, 2780, -3977, 4826, -4296, 5000, -3150, 2335, -1276, -872, 2303, -4631, 4644, -5424, 4631, -3081, 2379, -1132]
4367a132l29M694p428Q919j0221J0620q873N788k886q23M749p267R445r720R258
4382D794q199N026l145n02M332o403R362j0244R531r031O944k054k108L648o755
4397d804R288r615R653r309P167l534Q54L140n614P768j0004R613r046O082k333
4412f94K75L180o616Q927r734Q514p312N685l737M93L813p121R353j0215R699
4427D510r044Q150m012l75K343n342Q282r742R109q394O804k637m87L785o553
4442c603P411r946R697p250O454l602Q37K381n505Q742j0113Q783p497N386k899
4457g24J59K871n617P364q651R674q768N481k678L71K472n352P362q623Q808p519
4473c370N924l508K48L547n504O108p710R271r121O586l123M4L248o669P567q035
$$ y = [-1132, -1461, 3233, -4195, 4724, -5497, 5123, -3750, 2038, -848, -1671, 3078, -4189, 5256, -4464, 4794, -3405, 1621, -1524, -2026, 2306, -4097, 5265, -4979, 4552, -4479, 2465, 411, -1697, 1951, -4804, 4484, -5131, 4522, -4787, 2380, -1154, -300, 2840, -2774, 4994, -5010, 4603, -4443, 1639, -694, -419, 2761, -3855, 5072, -4662, 3852, -3460, 2225, -1512, -1019, 2794, -4327, 5026, -5189, 4510, -4534, 3616, -396, -771, 1572, -3770, 4512, -5230, 3879, -4515, 2289, -348, -835, 2950, -3603, 3808, -6138, 3559, -3691, 2763, -839, -2, 2379, -3126, 5616, -4497, 4286, -3211, 2175, -724, -565, 2306, -3311, 4053, -4598, 5076, -3692, 1789, -889, -518, 1954, -3398, 3964, -4659, 4149, -3370, 2554, -954, -706, 2841, -2663, 3445, -4265, 5006, -4115, 2471, -652, -608, 2640, -4029, 3538, -4497]
4489d497Q363p548O599l950L85K275n339Q635r674R728p764M871l814K272J425
4504A967m922P389q693R452q923N842l398J169K380n464O910q481Q997p237N697
4519B685l965O50L100n835P002q411R153q055N812l378N41J876m048P145p668
4534c396Q108q545O473l821M66J845l853N883p430Q332q092O288l720J623K432
4549B593n940P052q040P607o463N905k900jJ950n954P623q288P888o108N111k980
4565i45J738J067o014O735p135P958o390N890l358J93K117m152O054q401P982
4580C339p324O685l951K143M54m580O834p306P591p167N644l116J271J310n149
4595c322O901p312P354q048P075l891N91L521n093O781q426P108o472N824m770
$$ y = [-4497, 3866, -3682, 2917, -1033, -648, 1627, -3712, 4923, -4751, 4977, -2787, 2084, -1730, 542, 1967, -2955, 4434, -4259, 5193, -3730, 2112, -1286, -117, 2263, -3201, 3709, -4772, 4225, -3012, 2685, -1280, -630, 2470, -3365, 3637, -4774, 4379, -3676, 2136, -1242, -701, 1175, -2873, 4272, -3396, 4712, -3833, 2640, -1181, -715, 1130, -2723, 3160, -4270, 4062, -4030, 2258, -1462, 161, 2593, -3347, 3705, -4335, 3272, -3191, 2714, -186, -187, 1763, -4191, 3432, -4856, 3032, -3076, 2035, -945, 793, 1860, -4154, 2581, -4554, 3404, -2986, 2904, -454, -261, 1856, -2296, 3758, -4643, 3339, -3985, 2700, -1251, 892, 1346, -3234, 3600, -3706, 3885, -3282, 2362, -754, 517, 1827, -3322, 3579, -3733, 3621, -4427, 2648, -1243, -652, 2869, -2224, 4557, -3869, 3239, -3233, 2591, -2179]
4610b179J972J701l260N218p039Q422r349O402k549J247J728n574O317o857P249
4625C449o375N635l536M44J229l575N788p607Q636p303N402l185J283J281l818
4640b252O188p965Q320p612O578m404J076J553m242O141o444O841p546O513m332
4655a587J283J852l947N188o079O919p494O349l564J572J000n110O342o726P534
4670C532o651O386m688J308K123l488M648o988P924p660O224m538J951J544l899
4685b272M865n923O178o646P046l951R36J329m088N787o553P344p265N479l812
4700a546J634J33k160N027o391P309q194N487j785K33P96j494M211p528P255p155
4716d168P080m124O90J926m249O579q370P660o724O939n203K745K60m576O152
$$ y = [-2179, -207, 1494, -1766, 3452, -3587, 4835, -4514, 1888, -661, 586, 2314, -3260, 3057, -3800, 3449, -2926, 2709, -827, -383, 846, -2729, 3059, -4548, 4088, -3215, 2187, -998, 285, 1566, -2252, 3936, -4029, 4291, -3321, 3257, -1147, -71, 1482, -2760, 3381, -3063, 3778, -3768, 2745, -1587, -304, 1548, -2399, 2789, -3290, 3629, -3865, 2484, -1080, 492, 1492, -3618, 2724, -4002, 3532, -3119, 3267, -1421, -113, 2010, -1478, 3170, -3818, 4106, -3554, 2670, -1868, 83, 1627, -2272, 2593, -3330, 2848, -3798, 3248, -703, 233, 1562, -2526, 3261, -3292, 4052, -3213, 2266, -1546, 88, 221, -1939, 3088, -3303, 4006, -4188, 1299, -486, -253, 543, -951, 3260, -4268, 2987, -4168, 2912, -1212, -522, 1404, -2845, 3734, -4636, 3024, -3700, 3239, -1964, 781, 1041, -3535, 2617]
4731B617n358O978p185O196n265K530j20k248M657o391P269o866O144m496K469
4746I31k31k953N747p596Q150p259N474l611J577M60k293M971o578P236p130N516
4762B411m413L226K8l823N063o195P364o620N458m346K285N38k417M785o688O673
4778C329n606L967m489K631Q2k676N621p235P975o686O556o088L048O99l869O197
4794C456p300P242p300O140m117J442J091k657M960o880P155p469O908m876K290
4809H5L18k489N730p685P342o259N248m096J955J42l005N186o494Q042p237N878
4825B661l985K029k39j706L506n377P173p611O524n063L416m16l059L884n532
4840c795P415o974O326m096K589K74m428M612n106O436o546N360l956K140J52
$$ y = [2617, -2741, 4237, -2948, 3248, -2017, 513, 393, -1855, 2802, -3589, 3680, -3186, 2958, -1538, 931, 700, -2253, 3494, -4102, 4048, -3211, 2263, -1348, 229, 689, -1604, 3367, -3211, 4025, -3105, 2411, -2002, 1224, 1252, -2571, 2492, -3703, 3661, -2959, 2499, -1847, 438, 976, -1441, 3344, -3344, 3329, -2277, 1690, -2799, -168, -86, -2762, 2859, -4376, 3599, -3087, 3469, -2619, 429, 1128, -2741, 3456, -3844, 3398, -3902, 2238, -1879, -437, 654, -2003, 2957, -3923, 3232, -4237, 2671, -2205, 85, 403, -2086, 3644, -4041, 3301, -2958, 2290, -1806, 149, 291, -2714, 2472, -4022, 4020, -3217, 2661, -1324, 705, 466, -1240, 2266, -3111, 4062, -3549, 2975, -2088, 1328, 912, -2147, 1737, -3795, 3620, -3354, 2972, -1124, 1465, 1739, -2689, 1923, -3183, 3253, -3293, 2067, -1889, 251, 403]
4855D03k938O210o886O490o397N618l493K947j053j530K991n192O996p930O936
4870C172m994K644r45j557L548o350Q157o310N586n110M226r13l293M395n504
4885c248O410o180N898n054L471j288l146N740n174N878o879O193m762L295p57
4900C97k247M081o092P906p345N592l726J943n33j795N241n972O397p184O515
4915C178n208K794l53k012M357o021P535q143O768n765L834n60j755L425n697
4930c623P192p654O932m822L162j180m21L180o436O692o173P051n565L282l74
4945A243k139L617n882O258o644O543m816K548q90j336M449n953O447o850P272
4960C867o799M018j467n11K616m816O692p312O722n661L572j216n09L108n445
$$ y = [403, -2535, 3675, -3211, 3279, -3118, 2500, -993, 1954, 901, -629, 2362, -2830, 4166, -3764, 3172, -1822, 822, -123, -1680, 1868, -4482, 3675, -2635, 2951, -2159, 2067, 1154, -2139, 2256, -3248, 3162, -3018, 2880, -2174, 1297, 9, -3137, 2603, -2571, 3307, -3572, 2621, -2141, 1154, 397, -1850, 2231, -3861, 4045, -3300, 2292, -1434, 509, -24, -1819, 3422, -2550, 3847, -3337, 3178, -2030, 764, 411, -1601, 2756, -3265, 4270, -3873, 2895, -2870, 964, 404, -1351, 2074, -3623, 3569, -4085, 2847, -1975, 1187, 7, -414, 2766, -3670, 3022, -3151, 3900, -1665, 1617, 1243, -896, 2721, -3161, 3097, -3547, 2996, -1820, 728, -162, -1498, 2951, -3002, 3445, -3405, 3867, -2932, 1086, -381, -892, 1724, -3092, 3600, -3712, 3010, -2651, 921, -295, -804, 2304, -3141]
4975c141P196q069O276m711L930j861r13L971o008P012p308O358n005L996j680
4990D3j211L382n863P840p641N809n296M751j305k116K887m611P253p727O968
5005C163m096K620k437o13M036n716O391p352O950o070N197k355j189M343o391
5020c519P138p277O021m955L499o52j172M549o723O026o281O288o013L476M5j816
5036a366L328n143O488p064P056n917M378j753j299L387n720O969o845O731n541
5051b311M431j722m57J951m288N518o307N186n088M023j225r79L766n004O706
5066D200p846P238o307L379j117k47K547n475P282p462O394n361M323k317L30
5081d39K659m888N739o810O524n682M017j416l01K961m977N172n412N766n064
$$ y = [-3141, 4055, -4014, 2262, -2449, 1481, -380, -1293, 2678, -3330, 3682, -3626, 2732, -2273, 1723, 43, -1168, 2214, -3649, 4191, -3450, 2359, -2937, 1814, 509, -1607, 1280, -3331, 3922, -3805, 3163, -933, 1687, -750, -1363, 2673, -3043, 3348, -4004, 2946, -3124, 2073, -282, -1471, 2872, -3519, 3619, -3658, 2363, -2592, 907, 255, -917, 3632, -3091, 2935, -3346, 2942, -3071, 405, 450, -1366, 1962, -3181, 3307, -3757, 3299, -2618, 1760, 7, -1292, 2095, -3625, 3344, -3501, 3230, -2311, 2120, 398, -59, 1892, -2396, 3122, -3185, 2001, -3087, 936, -289, -1268, 2498, -2506, 4200, -3646, 3592, -2715, 664, -453, -700, 1847, -3628, 3654, -3808, 2586, -2775, 1548, -769, -439, 2220, -2668, 3071, -3739, 2785, -2897, 1120, -296, -597, 2364, -2613, 2559, -2853, 2913, -2151]
5096b151L182j685r11L723m771O196p481O813n979M739k438O4K732m160M855n099
5112b371N565o069M723k624q15K630l122M862o410P729o179L626k040o14K544
5127A435m950O465o722O458n189K926j698J424J889m341M446m773M905n517N333
5142B091j532j376J700l923P450q358P610n832L145p86p42K411l881L354o448
5157e117P755n761M453j481j525L754m688N318m882O646o770M199j061j373K055
5172A522m485N670o428N738m371L164j256j359L550n399O518o743O154m133M568
5187B710k694r95L212m658N931o925O971o252M050j792q94L053n203P882p206
5202b810O389o645M488j602K07K155m967O100o809O524n891M623k084K7K359m589
$$ y = [-2151, 1031, -654, -1565, 2158, -2613, 3583, -3898, 2915, -3064, 1675, -763, -699, 2033, -2127, 2728, -2371, 3194, -2875, 1848, -776, -1591, 1039, -2083, 2779, -3631, 4098, -2081, 1545, -495, -1109, 1435, -3515, 2950, -3772, 2686, -2503, 423, -1275, 149, 2038, -2303, 2143, -2630, 2275, -3242, 2091, 559, -817, 883, -3040, 4410, -3948, 3662, -2170, 975, 189, -553, 1858, -2023, 1331, -5117, 2638, -3123, 1330, -151, -1676, 2078, -2610, 2708, -2174, 4472, -2298, 1901, 840, -533, 1522, -2963, 2707, -3721, 2017, -2354, 810, -446, -1805, 1745, -3654, 2864, -3879, 2275, -1858, 2710, 16, -979, 2233, -2425, 3506, -3419, 3552, -2700, 1350, -442, -1336, 1717, -3486, 4396, -2810, 3579, -3066, 1422, -180, 27, 2182, -2785, 3315, -3494, 3030, -2861, 1762, -322, -295, 2064, -2525]
5218b525N579o949P265n845M648k328P18J069l922O232q198P039n540N065l742
5233a434L78K911n071O200o015N777n006M697l237J055J796l875N688q172P603
5248C295m220J794j173L47J644m270N866p185O576n112L522j622N40K274m627
5263b351N576o306P578q152M928j435k9J747k944L997n691O262o264N021j440
5278D97k55J617l534M770o512P030p049N360l867Q06J614l240O517p682Q119n361
5294a170L098j968M58K598n699O093p571O383n554M702k300j76K351l253M927
5309B919o040O166n404M029j934Q45O48l815M958n238O171n383M150m108J463
5324e73J613l330M974n757O078o128M644l164J504K306m553N530o441O545n918
$$ y = [-2525, 3054, -3895, 3370, -2475, 2173, -155, 563, 1632, -2290, 3942, -4256, 2783, -2757, 2308, -1434, -1056, 1855, -3216, 2984, -3031, 2746, -2260, 2437, -800, 255, 2051, -1824, 3864, -4308, 3295, -925, 869, -304, 43, 1687, -2583, 3283, -3902, 2674, -2438, 1084, -538, 2, 2276, -2351, 3225, -3081, 4497, -3655, 1273, -162, -191, 1556, -1388, 2609, -3082, 3180, -3084, 1937, 497, 242, 1859, -1675, 3095, -3417, 3613, -3436, 1924, -1943, -1137, 477, -2763, 3754, -3928, 4191, -1170, 1928, -40, 418, 3016, -2683, 3410, -4161, 2222, -3332, 1370, -930, -1106, 1245, -2008, 2919, -3121, 3045, -2359, 1670, -264, 581, 1229, -2586, 2372, -2866, 3305, -2078, 2072, -2036, -573, 1040, -2290, 2684, -3073, 3005, -3123, 1521, -1643, -139, 2167, -2386, 3144, -3297, 3248, -2670]
5339b670M054j951O63J086k767M335n553O242n382M234l099P05J602l422L980
5354B057m740N653m202J272K3N52j33k857M450n453P658p588N788k863j50J831
5370A298l898N783n977O804o192L755l142K256J022l862N214o397O788o461N328
5385B319l109MK296k285L915o520O316n850M949k600J855p20k738L736n113N912
5401B367m738M674m021J307J304l832O544n289M704m004K958l342K05K958l798
5416b003N684n896N115n299L884l298Q80J988l029L858m842N727n096M004l108
5431a431J720R76k842M476o277O585n202M625l561O86J594l529M860n346O363
5446C697m694L337l422J241Q96l413N080n537N881m808L764k725N39K147l008
$$ y = [-2670, 1384, -567, 96, 1182, -1585, 2750, -2803, 3439, -1943, 2291, -808, -103, 1499, -1923, 2057, -2683, 2970, -1232, 40, 63, 615, 482, -2375, 2075, -3378, 4280, -3308, 2480, -383, -533, 1298, -2600, 3183, -2794, 4010, -2182, 1573, -1569, 687, 1709, -2153, 3061, -3336, 3452, -3009, 2319, -790, -786, 1510, -775, 3140, -3380, 2936, -2914, 2035, -565, 1290, 570, -2168, 1568, -3545, 2367, -2371, 2303, -1718, -411, 893, -2939, 3605, -1684, 3020, -984, 1974, -1368, -1163, 1795, -2003, 3681, -2215, 2900, -2399, 1485, -1813, -933, 1055, -1974, 1884, -2958, 2769, -2327, 1677, -1431, 289, 1265, -1577, 2899, -3378, 3207, -1995, 2630, -931, -245, 1349, -2180, 2680, -2666, 3697, -997, 2340, -1082, 159, 1055, -2358, 2722, -2815, 3066, -1742, 2022, -703, -164, 1983, -1025]
5461a025M036o449N433m084M439l733R40k94j337N131n519M664m095M995l897
5476g95M10K00r71L718m878N112n559M589l216J854J083l621L441m752N857n157
5492b685M295l102J843Q82k933L563m685O193p020N582k773Q01m55j654M880m697
5508a965N320o099M974k995J360j87j950L425m741O362o005N239l593J650J51
5523I46l633M594n103O424n858M588k667P70P34j459L059m948O268o157N446m381
5539a377J722N46k435L389m313N422n299M471l262J335Qk297M446n531N115m447
5555b507L653k397O85J821l365L887m492N989n765M006k003J123n4k235L038l874
5571b490M925m874M503l153J932k53k693M470m978N183n014M009l036J695L06
$$ y = [-1025, 3011, -3438, 1995, -2089, 2350, -1383, -443, -737, -2074, 3057, -2462, 2202, -1893, 3102, -795, -385, -185, -1156, 2562, -2316, 2796, -2763, 1826, -1390, 464, 1547, -2074, 1367, -3385, 2472, -2685, 1610, -1492, 351, 1233, -1700, 1863, -2822, 3371, -3649, 1933, -840, -39, -494, -2148, 2732, -1965, 3355, -2744, 2230, -765, 595, 408, -1542, 1883, -2858, 3504, -2501, 2738, -855, 795, 946, -2687, 1907, -3196, 3228, -2630, 1958, -709, 61, 795, -664, 2395, -2553, 3715, -2442, 3004, -1377, 345, 891, -1544, 1845, -2468, 2954, -2345, 2126, -1136, 199, 207, -2090, 2356, -3175, 1940, -2507, 1146, -1251, -566, 1255, -2110, 1777, -2715, 3274, -2491, 1515, -488, 635, 581, -1654, 1384, -2490, 2435, -2439, 2064, -1089, 843, 590, -2103, 2367, -2611, 2572, -2442, 1567, -1469, 226, 532]
5586E32k392L410m482N176n264M819l069K356p82j121K428l735L736m562M210
5601A260k228J189o18j195K629l870N366n465N230l836K346m62j678K838l169
5616a663L932l739K894k331J341P90j545K044m436O184n757L540l270J652J165
5631H01k025L731n498N861n695M307l163K244o24j661L403n051N275m206L918
5646A617k527Q76N78j498L222m655M625n440N465l656J679J69k814L683l935O022
5662C411m790K894k896N29J443j379L200m663M470m983M649k050J041j291j48
5677e63P12k612N857m676K569k707L567k064k81K463m890M707n282M888l161J785
5693C12Q01k854K860l409N635n061K914j964J753p44k033M004m877N159n071M552
$$ y = [532, -1860, 1550, -2932, 2244, -3020, 1799, -1270, 1086, 304, -817, 1611, -2124, 1612, -2950, 1260, -968, 221, -397, -1592, 1037, -2833, 2533, -2932, 2298, -1538, 808, 346, -1332, 1506, -1663, 2269, -1470, 1424, -907, 434, 1224, -321, 1723, -2713, 3471, -2286, 1254, -2016, -364, 801, -1224, 2507, -2991, 2870, -2825, 1482, -1681, 563, -61, -1722, 1681, -3370, 1905, -2301, 1617, -910, -34, 544, -954, 2268, -2387, 2238, -3202, 2263, -1393, 286, 455, -2359, 1324, -2611, 3411, -1379, 1515, -1381, -852, 591, -788, 2412, -2251, 2219, -2764, 1885, -165, 876, -415, -563, 149, -2463, 3394, -1282, 1287, -1420, 2147, 83, -198, 2265, -2625, 2082, -3200, 1688, -1473, 312, 1113, -1741, 1119, -2290, 3345, -1716, 1198, -766, 987, 243, -1790, 2214, -2663, 2496, -2575, 1977]
5709A977k680J661l15j795K929l509L945m339M071l260J784n48r07K919m048M500
5725B385m506L939l422J849J20j634L390n056N286m334L460j806L82J30j388L130
5741A925m436N683m951L765l830K173j9j370K469l472M985n610M741m289L426
5756A190j255m71K290m118M766n216M848l539J768Q72k525K783l516M761m826
5771b188L602j881R37j418Q64K486m708M604l874M761m892K212q09j141L137l838
5787b146M272n307O053l374J468j063o8J889l929M806n233M747m099K545m79l11
5803b29J249j853L355m906M352l272J049J006j948K398k994M481n607N486m372
5818a805M20Q26r23M224n236M794n182N165m109J838l42m39L635n920N926n308
$$ y = [1977, -703, 958, 643, -1152, 1777, -1732, 2213, -2126, 1945, -1315, 469, -79, -986, 1933, -2115, 2385, -2121, 1818, -1604, 245, 365, -1269, 2121, -2935, 2351, -1983, 1477, -329, 53, 183, -1205, 1925, -2511, 3172, -1779, 1986, -1844, 329, 310, -1060, 1409, -2063, 2922, -2688, 2053, -2236, 1190, -65, -536, 1754, -2364, 2402, -2814, 2034, -1505, 263, 1135, -1390, 1393, -2123, 2638, -2188, 1414, -467, 470, -948, -84, 2402, -2306, 2298, -1576, 3185, -1707, 505, -304, -1445, 1692, -2146, 2126, -3181, 2872, -502, 966, -97, -165, 1724, -2205, 2601, -2632, 2115, -1984, 561, 82, -229, 1020, -833, 2522, -2384, 1968, -1304, -255, 751, -1197, 1201, -1793, 2688, -2919, 2567, -1805, -1385, -559, -1482, 2742, -2494, 2300, -2882, 2283, -1826, 12, -330, -769, 2866, -3054, 2872, -2436]
5834b436M401k982K273j686q51L092l092L743m946M761m787L661j390r60K305
5849A106l591M183l504L622k864K843j392j395K734l921M669m907M620m103K827
5864I27j367n54K301k753L298m169N632n105K060L66j334K143l629M484m511M132
5880A921l655K091m65j230K874m137M641m061M419l593K318j355J23J670k602
5895a041K776l532L692m543M164j417m51J384k546L309l530M875n686L659j488
5910c75m65K344k223L536n408N111l981K328r85m51K324l890M661n266M700l693
5926a733K085O55o34J465l982M323n708N682l294J919j786O58J525k952L205l602
5942b174M619m136K927r06m10J885l883M802m623L796l477J914l85j2J300l852
$$ y = [-2436, 1965, -1017, 1256, -430, -1281, 1811, -1281, 2462, -2484, 2277, -2510, 1151, -239, -1199, 1106, -2485, 1698, -1806, 1816, -1048, 1795, 403, -992, 1742, -2179, 2490, -2417, 2203, -1900, 927, -440, -994, 1307, -1446, 1852, -2317, 3315, -1790, 270, 636, -698, 1445, -2184, 2300, -2211, 1921, -1734, 357, -108, -1338, 1536, -2601, 2040, -2021, 2398, -1195, 1123, -232, -109, 1561, -1041, 1735, -1797, 1895, -2648, 1516, 99, -352, 1032, -1514, 1795, -1735, 3140, -2546, 1113, -375, -840, 1504, -719, 2817, -2591, 2520, -1461, 867, -118, -569, 1755, -2135, 2526, -2740, 1960, -1733, 352, 1007, 373, 1838, -2144, 2179, -3529, 2153, -1141, 778, -1008, -350, 1175, -1777, 1428, -2174, 2445, -1691, 1236, 330, -80, 1805, -2078, 2724, -1899, 1897, -1580, 334, -51, -63, 1237, -2615]
5958b615N293m943M716m153K748r55J9J456m198M523m279M286l498K701k728J49
5974a478K166k465M524n131M926l938K495j428j54J825k455M478n801M263m180
5989b353M116k264K04J709l021L704l956L743m306L180q52O78O46j227K447m685
6005b237M853m423L948l089l20K852m261N116m014L820m326K849j110n89J756
6020H25l334M187m022M141m544N668k803k125K690k732M725m984M761l659K133
6035I27j150N21L47j982M229n208L775k567K441j361J99O88k349L251m186M625
6051B200m139L757j849q27K000l264N806o557M989m271M971l571J46Q02j853N309
6067C649o454N271m288K776j435K42R79k847N925p231O899m920K075j736J416
$$ y = [-2615, 2678, -2265, 2451, -1702, 1046, 91, 110, 1566, -2632, 1891, -2388, 1898, -1600, 1101, -1627, -1478, 688, -1777, 2747, -2384, 2542, -1396, 1099, -329, -483, 1342, -1113, 3365, -2436, 1827, -2353, 1763, -501, -297, 1412, -1609, 2095, -1861, 1882, -2424, 756, -96, 582, 1228, 1, 2448, -2237, 2616, -1807, 2141, -948, -1268, 1584, -2677, 2439, -1575, 2245, -2081, 768, -342, -931, 825, -2509, 1678, -2344, 1797, -2747, 2921, 118, -2007, 683, -2049, 2676, -2308, 2453, -1206, 927, -223, 298, 645, -1337, 2892, -2316, 1459, -1108, 1333, -28, 171, 859, -1490, 1761, -2425, 2200, -1939, 1818, -31, -858, 1142, -2122, 3684, -2873, 2116, -2155, 2816, -755, -609, 193, -1660, 3649, -2805, 2466, -1822, 954, -481, -239, 740, -2107, 3818, -3413, 3486, -1434, 641, -1095, 321]
6082C21P90l430N635m947M026m426L602k558J042J56k321M718m507M614m807K112
6098B0k02O86j99k027M438n303M261l066K473k414J453J412l016L700m464L236
6114I88m169M490k418mK400l529N161n418M748l211K213k994J972j03j875M451
6130B702n484N561m894L538j528r96K000l497N647o230N366l916J442m72Q26J806
6146A871k067L390n449M831l807M439m307J399R07k598L612n867N866m748L994
6161A466k455J27J733l366M122l687L807m051L811k958J098J178k154L637m459
6176b151M116l995L663k478R42P02k604L724l798M374m103K851j426K10Q97k854
6192a930M318m654M204m222M275l447K182Q70l043K785l712M787l935K280j413
$$ y = [321, 1111, -2319, 3316, -1631, 2395, -2031, 1571, -987, 55, 211, -2110, 2608, -1899, 2715, -2092, 20, -182, 504, 305, -1722, 2716, -2587, 1674, -1392, 1081, -1333, 120, 1532, -1484, 2216, -2248, 988, -3181, 1309, -1109, -1113, 1287, -2242, 2919, -2499, 2249, -962, 1251, -1743, 229, 126, -1749, 2702, -2782, 2779, -2115, 1423, -105, -1101, 899, -2598, 3049, -3181, 2185, -1731, -289, -761, 65, 1871, -196, 3194, -2255, 2576, -1231, 3208, -1099, 300, 1207, -1391, 2221, -3646, 2220, -2528, 1466, -989, -862, 871, -2495, 1627, -2060, 1747, -2304, 1507, -1451, -353, 825, -1329, 2308, -2151, 1965, -2030, 1633, -845, 97, 799, -1805, 1919, -1879, 2495, -1608, 1243, -183, 27, 924, -1930, 2388, -2266, 1938, -2284, 1991, -1456, 726, 1596, -1447, 1338, -2374, 2413, -1522, 758, -655]
6207f55J327p16j323L240l806M377m637M470k430nJ671l484M230m827N096n397
6223b869N520l008L57L30k872L667l277N171m199K174k043O43J039k006L027l579
6239a925M193l792K552k510J421R58k026L425m648M590l783L978k822J174k73
6254E12k313L093l181M398n280M752l018R59J380k374K994m335M195l733L081
6269A130l056K794M56k850L004l216L356l756M548k739K71J076k213L228l685
6284a652L350k821J999j848J541L21j448L061m659L821l504L899j705l7J53j767
6300a296L536n179M353l418M274l579J681J52j621J488k862N044l675L519l508
6315a091J575j56r53K326l804N415o046L994k380P70J269j676K901m097L981m946
$$ y = [-655, 672, -44, -1367, 1873, -1933, 2444, -2193, 2277, -153, -158, 1513, -1971, 2259, -2568, 2528, -2869, 2651, -357, 0, 330, -2542, 1125, -2152, 3019, -1180, 994, -1049, -406, 633, -1373, 1654, -1925, 2268, -1524, 1028, -1482, -61, 897, -1129, 2296, -2352, 2238, -1545, 2433, -389, 785, 512, -1801, 1292, -1889, 2509, -2771, 1981, -1037, -78, 1302, -1072, 1922, -2413, 1782, -1951, 1130, -1926, 868, 1324, -1526, 1478, -1738, 1618, -2138, 2410, -329, -58, 1018, -1195, 2033, -1652, 1698, -1123, 876, -972, 569, 890, -558, 2503, -2156, 1665, -1839, 2060, 355, 318, 471, -1296, 2240, -2939, 1414, -2004, 2270, -1309, 372, 524, -1097, 391, -2471, 2573, -1102, 2417, -1091, 484, 328, -625, 1701, -2103, 3312, -2734, 1260, -1120, -350, 919, -757, 2144, -1953, 2028, -2918]
6331b918M179k290J551l74k177L667l842M406n318M412k105J485j85k965M293
6346A819m861N492m296L310l000K205j12j794K310j490K239m157M214j869J012
6361A022k61k058L092l988L497k072K577k419P46K72k536M447m513L830l082L039
6377A593k395J132J675l650L756m256M049m935M718l152J678q69k69K583l786
6392b128M192l241L025l391J910q8o70L015m045L387l480L749m700L455l01j655
6408i66L167m370M486l844K660j858N80J192k509K261k686M268l083K704l351
6423a349K387l76j469L130l740L055k512K620l202P03J092j641K184l342M450
6438A990l196L004l851K493k90p34K489m325L625k584K164k064K466j725m6J973
$$ y = [-2918, 1261, -1029, 522, 148, -2029, 1638, -2204, 2202, -3116, 1296, -809, 676, 491, -2474, 1819, -3042, 2450, -1846, 1464, -1536, 669, 557, -1237, 1073, -417, 1822, -2335, 1879, 10, 1022, 761, -1297, 1795, -2193, 1304, -768, 1809, -610, 136, 408, -2128, 2319, -2194, 1636, -1446, 1593, -802, 330, 2005, -1645, 2111, -2145, 1904, -3031, 1687, -1465, 213, -656, -925, 1658, -2128, 2064, -1177, 1848, -1543, 367, 279, -391, 2624, -1421, 1966, -1514, 2235, -2465, 990, 689, -966, 2201, -2169, 2317, -1527, 1133, -725, -145, 1047, -1462, 799, -1887, 2381, -702, 2002, -1349, 1038, 662, -807, 2323, -1417, 1638, -874, 1746, -1456, -753, 339, -1302, 882, -2460, 1990, -1206, 1798, -2053, 440, 150, -584, 1905, -2420, 1205, -1379, 785, -1279, 1187, -538, -584, 1389]
6454A389m437O011l955K668l079K774r86j300K098l320M976m463L630l248J544
6469C02R19j074J456l282L412l600L155k385J393k86j228K714l221M162l818K280
6485H99j810J276p1r47K490l103K955m240M190l333J996q66M28J596l829M253
6501A884m438L780k577K899n54j992K716l542N471m173K225k668J097P3q86P22
6517C7j765L809l008J184j384K468j897n05L188m050L654l877M016j964q52O22
6533c24q01K975l099L300l528M009m189K160m01k98J474l381M306m801M319j688
6549C3O17m86j205K406l591M888m617L828k680J042K78k025L173l365L111n231
6565c824N526l335K974j622l40K075l557M710m413L024k344K677j548j10J389
$$ y = [1389, -3048, 2963, -992, 1676, -1403, 1371, 385, -915, 1183, -2137, 2839, -1624, 2006, -1242, 302, 1221, 147, 1603, -1679, 1733, -1867, 1288, -1097, 296, 10, -1218, 1496, -1725, 2437, -1381, 899, -911, 365, 294, -653, 1837, -1266, 1689, -2551, 1639, -1694, 302, -564, -136, 1460, -2369, 1884, -2554, 1226, -1351, 1548, 994, -998, 1718, -1824, 3647, -526, 1699, -969, 128, 201, -685, 37, -1728, 2081, -927, 257, -1127, 1341, -556, -1061, 2127, -1923, 1731, -2146, 1870, -94, -946, -324, -1125, 1850, -1249, 2051, -1477, 2532, -1657, 503, 102, -196, 1278, -2103, 2203, -2598, 1721, 33, 650, 164, -1041, 1365, -2226, 2662, -1955, 1873, -807, 235, 513, -1512, 1661, -1704, 1407, -3824, 1702, -1633, 1341, -281, -621, 1454, -2103, 2607, -1806, 1218, -1126, 1551, 3, -107, 1282]
6580A282k707L465k972L519l927K332r02m88K375l189K803l127L192k744J740
6595F52p01N7Q52l247M633m635L338k632J619J8j723L302m159L990l599L924k613
6612i24J762o31n18J054j763L392m188L784l550L363j404M31l09l184M649m200
6628b236L892m666M370j142j069J640j888K793m062M093k943J502r34k60K012
6643A102k908L516l951M425k426K43n10O92O80j633J281k956M899m757K991j31
6659E57q95J733l378L884k997L355n032L951j670p80L163k713K965l917M179m387
6675a982K785m69j128J991l381M122k654J511k380J123j201Q32J994l388L286
6690A061l184M032l208J768j31o8J057k324K203l467M066l240K328p34p39J391
$$ y = [1282, -1425, 2040, -932, 2587, -1340, 992, 90, -398, 1977, -1212, 1591, -1536, 1656, -1088, 652, -49, 8, 860, -2387, 2246, -2389, 949, -1683, -64, -46, -1769, 1533, -2626, 1364, -2235, 1689, -924, 838, 207, -311, 743, -1020, 2372, -1816, 1968, -1582, 1781, 377, 808, 499, -2685, 1964, -2236, 1656, -3010, 1360, 218, -851, 789, -1099, 1694, -2368, 1725, -1218, 284, -650, -910, 1102, -1806, 1710, -2241, 2184, -242, 1, -509, 183, 863, -770, 511, -2445, 2454, -2303, 688, 557, -338, 1395, -1983, 1901, -1096, 2259, -2773, 1178, -492, -1272, 1891, -822, 2143, -1774, 2405, -1982, 803, 334, -794, 1197, -2184, 1938, -716, 795, -1585, -462, -1663, -831, 1163, -2225, 1061, -2123, 1909, -1299, 469, 338, 270, 1327, -997, 1206, -2261, 1805, -1435, 893, 159, -580, 811]
6706H11k479L302l142K943k933K662j496o23J718k974M352l750K905l025K056
6721C27j57j528K528k183L021m623M332k982K473j028l37J367l079M048l499M264
6737B944l648R05N51m88J027k661L356m115L032j614J866j950Q2K139l260L175
6753A341m000L026j857K289r61N8J990l480L153l260M548n236L590p15p16J512
6769A282l854M730l501K906k868K801j154o64J560k381K996m031M124m210L676
6784A412j399K71o31m14K395l385L249l284K116n09O5J345k881K994l670L474
6800A148k707L510k344O64K77j666L408m737L823k734K587p90j44R98k495K569
6816A367k413L161l229K062m11r76J769k820L288l854L763l620K348j650P64N92
$$ y = [811, -1668, 1634, -1508, 1435, -1498, 1164, -332, -955, 763, -2211, 2141, -1609, 1296, -1729, 327, 170, -1358, 1170, -1013, 2008, -2615, 1717, -1265, 1208, 180, -157, 1210, -1869, 2179, -1320, 2944, -704, 201, 752, 264, 1291, -1370, 1986, -2129, 903, -711, 1155, -795, -713, 1426, -1834, 1341, -2659, 367, -1490, 799, -162, -104, 1886, -1594, 1559, -1701, 2847, -2389, 1201, 486, -230, 1282, -2572, 2158, -1343, 1563, -1305, 1496, 342, -322, 1238, -1143, 1853, -2178, 1946, -2264, 1412, 13, 284, -347, -761, 1634, -1751, 1498, -1786, 330, -179, -114, 1231, -1650, 1344, -2326, 1148, -1559, 1951, -393, 271, 548, -1118, 2290, -2447, 1376, -1358, 1229, 439, 295, 1293, -1202, 1367, -1046, 2115, -1114, 948, 537, -439, 1330, -1490, 1798, -2056, 1707, -1913, 435, -1215, -451, 141]
6832A41o61J806k690K705l515K544q69P95R72k286K563k779M033l363J716q98
6848B14o9J98p33J942l644K778j510J655k139R35R91j039J235k057L374l449L691
6865B373k996N8J767k033K310k761L983n558L852j811P15P06j392K979m772M736
6881B156m226K625j906J115L91j099K659l167L547m051K715k64j229O81j277L099
6897A769k630L825m218J923q09m91J339j765K882m261M841m037K737k445J020
6912c20J07j034L183m507M050k271K084q38l12J011j911J433j944K541k697K424
6928I99j783K85J940k184K362l972L561l224L417k330Q39N64j387K927l745L261
6944A530m261M287k419Q21J115j350K941l871K399k283K772k484M35J38q37K412
$$ y = [141, -520, 1286, -1404, 1301, -2214, 330, -539, 256, 1228, -1058, 1505, -1274, 2759, -604, 1112, 214, 145, 343, -390, 1552, -2092, 686, -824, 831, -1308, -373, 618, -421, 814, -1243, 2131, -1318, 2373, -623, -565, 1202, -831, 1479, -1282, 2701, -2857, 995, -816, -101, 605, -787, 2192, -2580, 2156, -2070, 555, -1351, -236, 155, -944, 1715, -1452, 2095, -1956, 759, 495, -734, -53, -1330, 1769, -861, 2964, -1254, 669, -140, -631, 708, -1057, 1825, -2436, 2405, -1632, 1105, -1340, -320, -213, -1247, 1936, -2571, 1479, -792, 1292, 454, 142, 1153, -758, 675, -1269, 1272, -1425, 999, -784, -499, 1441, -743, 1619, -2353, 1208, -2016, 1401, -929, -90, 474, -913, 2014, -1731, 1530, -2731, 1556, -863, -42, 1073, -277, 2664, -1207, 1192, -1091, 1681, -803, -368, -230, -1067, 1345]
6960A345k959L742m005K774j751M25J66l88J785l027M027k574J907k674Q92Q28
6976E13j772K426k849L180k334K580j988R9J103k426L051l431L239k220J963j783
6992f49J433n72p55K415l894M236m195L273l566L183j476M52J320l276L805k840
7008a106K704l197J609o89M7J959l762M546m429L731k226P96P78j249J040l227
7024b675M712m143L834l054K233o13j694L201k886K807l092K410k705J911L45
7039E91m79J466l259K633k796L104k156J380j068J27J969l276L564m251M347k734
7055h38Q10M45j181K783l808L275l546K878k125K770j455j221L190l546L899m214
7071a884K131j540K729r38j421K289l144M039m336M655m643J938m59n51L144l728
$$ y = [1345, -1614, 2128, -1877, 897, -854, -429, -263, -651, 1134, -1893, 2134, -440, 1467, -1207, -315, 513, -1259, 1167, -1682, 1498, -836, 1744, -244, -145, 958, -1468, 1583, -1848, 1391, -829, 1134, -649, 784, 212, -543, 1872, -2022, 2214, -1981, 1292, -2274, 909, -567, -115, 1205, -2071, 1734, -1106, 1598, -1599, 10, -679, -632, 1327, -2435, 2111, -2318, 1413, -813, -17, 761, -488, 552, -2675, 2037, -2106, 1728, -1326, 907, 294, -1400, 1801, -1085, 1722, -1370, 1040, -1665, 246, 591, 112, 1578, -1681, 952, -1844, 1260, -896, 484, -584, -457, 1512, -1764, 1800, -2451, 1896, -838, -28, 417, -764, 2019, -1789, 1486, -2060, 818, -1307, 1463, 8, -1213, 1977, -1569, 2330, -1884, 247, -1293, 1436, 498, -923, 1366, -1778, 2261, -2075, 2580, -2063, -125, -584, -1135, 2009, -1719]
7087a719L501l902M309l499K118l55m12J013l181L881k918L052k388J791j085
7102B06m96K260l928L387l166L604k345K335j552k12J759m035L648l684L125j651
7118g45K692j672j704M230l223K704m929N100l957K584k081q5J580q20K574l593
7134a345K913j868L46q37J43K759k911J945l057K857j192J403k49j375J801k645
7150a312K850k804K696j148P82j341k89Q14k868L666l174L103j548O81J12p83
7166e63J830l779M876m485L991k265J451k132R94P45k168K997l450L307k914K671
7182A106j419l60J506l033M409m799L974k889K787j686J45J391k680M194m921
7197b275M625l755J936q50p2R46k578L467l443L686k302P03m33j80J840k513K427
$$ y = [-1719, 1782, -2120, 2189, -1310, 808, 453, 41, 1054, -2127, 1754, -1164, 1888, -500, 1291, 206, -290, 1970, -1958, 1429, -1737, 1867, -478, 1857, 305, 93, 1852, -2183, 1465, -2219, 906, -745, 1947, 275, -1429, 2801, -422, 2282, -2647, 2453, -1504, 1080, -1001, -1086, 494, -326, 2248, -1345, 1568, -300, 46, -791, -648, 2111, -800, 1145, -1912, 945, -247, 1156, 907, -468, 1333, -1312, 1538, -1266, 1430, 282, 1064, -277, -566, 248, -2620, 1046, -2128, 975, -573, 108, 220, -563, 1267, -2512, 2364, -2121, 1870, -395, 1056, -1076, -82, 663, -1505, 1492, -1958, 1349, -1565, 1106, -313, -673, 833, -2200, 2209, -2590, 1384, -1505, 1282, -404, -259, 1132, -1548, 2646, -2275, 2350, -1405, 531, -319, -391, 555, -2023, 1444, -1999, 1687, -615, 88, -345, -525, 1315, -1198, 1229]
7214A229k690L131l864J273L83j0K164l379L756l742M332l238J070o87k17J436
7230I47j799K176l203M578l714J510j322L7K863l868L324l949L198j922K678j889
7246c55q99J676j260L385m527L825l185K483k001J033J152l274M702m045J968
7261F78k248K135j417M30N60k017M582m568M153m153K321j612O60N03k011L358
7277A354m598N083k470N09m69J319P15l301M038m205M138l018K005j237J14R25
7293I02j074K238m181L717l371L188j978J170k1k592L703m082M471l929K802p99
7309A64l54J94j827L929m237L953m199K941j026k54J632k953M051l979K859k092
7325a198J555L51j782K576l193L250l237L803l998K631j227k40J710k374L274
$$ y = [1229, -1461, 1670, -2194, -921, -538, -548, 1616, -1763, 1993, -1749, 2583, -655, 415, -272, -489, 947, -852, 1324, -1879, 2699, -1015, 495, -827, -790, 2073, -1795, 1529, -2420, 778, -1144, 1534, -355, -1254, 422, -838, 2547, -1980, 1845, -1340, 1143, -858, 175, 1327, -1947, 2755, -1290, 678, -1570, 565, -852, -422, 138, -1879, 2703, -1865, 2288, -1865, 456, -1156, -496, 7, -2004, 1354, -3244, 1839, -631, -122, -591, 728, 1443, -1858, 2180, -2025, 2113, -905, 1100, -137, -23, 902, -172, 2066, -2115, 1602, -1769, 1419, -559, 611, 590, -2002, 1701, -2381, 2090, -1839, 963, 164, -190, 4, -1823, 2106, -2131, 1822, -2377, 564, -462, -716, 916, -2037, 2014, -1965, 894, -1198, 357, 708, -1074, 1502, -1691, 1559, -1678, 2125, -1873, 758, -469, -709, 1001, -1373, 1901]
7340A901m200L997l436K411j020LJ193j887K428l811M439k982K010j498q19K675
7356A404j541J076l515M049l757K368r5M77N9j517J551j899L553m467L659m68
7372I37q1r9j041K426m688M556k405K269j926m34M45n49K465l425K592l460K829
7389D11j659J830k70j945L054l642M226l030K904k944K10J419j661K967l563L889
7405B196m142M321l209K71J503k335L332m655M283k485K676k275O01P76l064L702
7421A496m631M403l639L674j774p57K328l133M526l414J985k196K415k054L66
7436d05R2n77L600m828L885l049L232j911L90j03j139J997l568M886n042L261
7452G21q89j18J338k410J654o61J318j949K347j239O54l89k276L015k117M008
$$ y = [1901, -2299, 1698, -1738, 673, -347, -344, 849, -1038, 1390, -2421, 2018, -964, 1046, -452, -1271, 1404, -137, 939, -2576, 1473, -2284, 84, -11, 466, 525, -992, 559, -1340, 2213, -2254, 1405, 937, 856, 757, -284, 2142, -2546, 2010, -395, 1874, -52, -486, -41, -590, 1875, -1550, 1042, -2418, 411, -1248, 582, 312, -1633, 1421, -2221, 2005, -1025, 1879, -1065, -855, 564, -1097, 1870, -1693, 2196, -1946, 2375, -834, -563, 940, -1395, 1937, -2718, 1565, -920, 1756, -519, 82, 858, -2206, 1496, -3135, 1268, -2371, 1303, -471, -1228, 1100, -2033, 2493, -921, 1064, -1132, 1283, -771, -405, -313, -890, 2710, -2118, 1767, -1282, 1950, 39, 429, 326, -813, 1184, -2384, 2502, -2540, 721, -168, -286, 1052, -1358, 296, -365, 953, -996, 1351, 112, 766, 377, -1899, 1116, -1001, 3007]
7468C007m937L501k064J393j004o37K509m193M429l618K047o32J551p93j627K238
7484A170k651L090m324M638j963N57q41r39L882n341L971k686K207k278L070n45
7500A017p64O05j924K969l746K979p49P3L07j514J759l177L024k150L071k046
7516b66J140O22k547J894j946L706l534K025j218M87J16j294J906k131K387l447
7532b100L411j637j38J518j473J207k088L193k677K102k395P11N1j183L499l098
7548a097L049m322L626j819m7R98j639J759j814L495k871K889m511J654J030j949
7564a569K843l672M245k530K949l012J124O9j663J530j983L007j794K352k903
7579a007P62J048k538K612k014L393l259K564k956J983K08j557J594k968L972
$$ y = [3007, -1930, 1571, -493, 900, -104, -741, 1768, -2425, 2004, -1614, 433, -199, 1352, 559, -1068, 1170, -1481, 1609, -2715, 1923, -40, 517, -324, -1263, 2619, -2722, 1249, -1437, 770, -1508, 1562, 1017, 253, 858, -1066, 1903, -1843, 1136, 387, 460, 767, -747, 1012, -2165, 859, -1291, 1780, -266, 874, 1496, -1051, 843, -1103, 2603, -931, 1094, -124, 363, 479, -815, 1091, -1040, 1347, -2100, 1311, -326, -464, 1054, -419, 788, -1300, 1893, -784, 1318, -1077, -366, -315, -1498, 2001, -1097, 1952, -2370, 1256, -563, -610, 388, -1251, 508, -1306, 2189, -682, 2207, -2304, -650, 380, -1569, 1274, -2398, 1847, -683, 2266, -746, 378, 447, -1216, 314, -1669, 1338, -456, 1896, -1007, -245, 803, -1735, 877, -1137, 2256, -1003, 1561, -1395, 588, 796, -761, 833, -2135, 1837]
7594A837l726L460k527J651l72j319K074k497L812m221M059l085J389n54j037
7609a056K048j080K541l866K037l88K53p79p91K474l465K996k877L426k430J736
7625G79m70k18O20k156K193k422K906l249K645K81j318J875k848L666m246L493
7641A531k825K094O4q28O43j385K057k536K546k110J275M14k323K320k439L876
7657B374l818J508j583K694j741Q15J074k497K449k979J961q32N36m84q16L675
7673B336k698J947k950K229n34n94P84m18J927l153L022l784K762k495K736p94
7689C23j438K955m532M152k901L490l041J335J98j569J635j444K765l905K888
7704I11k266K048j194m69J929j981K555k956L168l347L412k036k4J468k444K218
$$ y = [1837, -1889, 1571, -956, 695, 323, -996, 1078, -1419, 2393, -1828, 2231, -854, 535, -19, -1056, 992, -88, 2453, -1413, 624, 236, 489, -290, -1081, 1393, -2072, 924, -1953, 1473, -957, 779, 309, 91, 711, -1445, 748, -1674, 1232, -2017, 628, 909, -409, 1466, -1382, 2284, -1962, 1531, -1294, 800, 864, 36, 679, -706, 1351, -1185, 1361, -749, 526, 940, -1383, 937, -1502, 2374, -1444, 64, -1519, 1175, -566, 249, 1323, -1174, 1275, -1704, 257, -575, -39, -523, -1339, 2336, -362, 1585, -1365, 864, 330, -264, 520, 102, 2029, -1124, 1898, -1886, 876, -1619, 1117, 323, -1115, 1840, -2692, 1460, -1441, 2049, -992, 343, 541, -1028, 607, -837, 1928, -1977, 911, -1355, 693, -501, -970, 959, -1022, 1533, -1423, 1745, -1602, 1810, -226, -250, 1218, -1226, 992]
7720I92k535K540k906J996m36l98J974j580J765k681L188l608K276j359J301L70
7736H99k303K758k805L510l130J563m99o26J571j978K750l997K516q78R08J81
7752D40j572K573l865L533k801K947k266J699j109k9J398k276K032k100K691k338
7768a043J658q64Q29Q85l231K483k292K546k549K616p91l98J325k748K520k395
7784a449K108j567J014l04q7J596k371K689k492J146l49Q88k55j227J744k368
7800a284K778l207L774l193J691j018k50J807k419K626l803K664q62J600j397
7815d93L24J888k847L474l032J155j587K296p59j097K107k325K026j158J325k114
7831h17J761j373p8J727k151J568k679L632l122K277j322l0K190k646K619k737
$$ y = [992, -1543, 997, -1909, 87, -349, -747, 1227, -353, 1412, -1269, 1919, -1689, 587, -772, 529, 899, -1404, 1354, -1451, 2059, -1071, 492, -7, -633, 938, -1040, 1710, -2287, 229, -649, 259, 440, -1132, 1441, -2424, 1109, -1692, 1255, -1011, 688, -421, -450, 948, -1328, 704, -1396, 1295, -1043, 615, -249, 580, 1465, -1766, 717, -1575, 971, -1578, 1038, 247, -151, 1174, -1574, 946, -1449, 659, -908, 106, -198, -285, 1311, -1060, 1629, -863, 283, -66, 822, 567, -660, 1084, -1284, 1494, -1713, 2061, -1132, 559, -459, -709, 1098, -1321, 1305, -2498, 166, -696, 904, -493, -169, 1719, -1128, 2346, -686, 469, -1118, 1178, 419, -678, 1429, -896, 1130, -28, 1297, -817, 944, -429, -507, 1220, -931, 637, -2042, 1590, -1532, 745, -577, -607, 1583, -1063, 1556, -1181]
7847a181L387m235L675j235L32n66j959L242k585K362j221O25n00q08J145k146
7863a668L555l157K008j945J102k97P5J100k020K619l099L249l174K480j188J85
7879a75J391k502K835k544Q53j022K503j218J58R78k039J973j951J954j844J069
7895D19m00o11J484k539L750l221K928l977L882o06j163N16k168K777l465M216
7911A822k334J870k279J57J653q50J369l339L767k389J673j618L62J126q74J116
7927A232k996K342k351L178k017L04L42j174K954k734J992k774K420j058O5J060
7943G85k287K561l060L019k278K458k167Q39R20j583J983j964R71j925K642j349
7959d35O94K03j853K135k606L487k260P88o7N85o57n50J487k844L419k665K329
$$ y = [-1181, 2206, -2029, 1646, 411, 743, 177, -1782, 1460, -1125, 1237, 16, 641, 141, -667, 478, -1668, 1887, -1270, 738, -1207, -105, -402, -327, 773, -1247, 1372, -1727, 1522, -1652, 828, -360, -175, 1216, -1286, 1549, -995, -142, -1164, 1339, 121, 279, 1257, -782, 1191, -760, 1194, -650, 419, 19, -592, 892, -1647, 2103, -1118, 1810, -2167, 1715, 1109, -54, 462, -1706, 1071, -2394, 1822, -512, 1358, -921, -764, 889, 39, 1408, -1931, 1836, -553, 1120, -498, -136, 990, 116, 1232, -1764, 578, -1773, 1405, -612, -308, 34, -1140, 1814, -920, 1072, -1702, 718, -340, -275, 785, -1502, 1059, -2001, 1018, -1260, 1198, -969, -130, 790, -793, 1190, -774, 197, -1728, 914, -435, 259, 462, -1391, 744, -1862, 1625, -635, 153, 86, 671, 14, -536, 951, -1893, 1526, -1139, 1190]
7976A190k053J177N41r37J458k931L850m208K390r43R55P93j689K235l247K287
7992H68k990K524j735O69P56n54K529l577K428k368K040q01l76J350q34J419l370
8009b022K089j839K308j786J447L57j651K287k696L011l449L234k245J964p42
8024B67j273J747k748L260j849J709j486N06Lj337K539l207L867k989J252o02
8040c41N42Q51j762J390k311K896l294L531k096J325m39j027K462l482L267l334
8056a822L076k173j2J157j711K782k640K285k091J227l58N88N69l59O99k561K547
8073A203k645K785j804R58m2j016J399k628L068k238K011j523M32O89j785K390
8089A254k910L509k914K510j716Q44j061p84J822j781J939j826J568r78M66J169
$$ y = [1190, -863, 314, 855, -82, 1376, -1555, 2295, -1913, 477, -466, 489, 1282, -407, 1828, -1419, 868, -2122, 402, -1333, -664, 92, -462, 2067, -1510, 918, -1450, 590, -211, -587, 763, -71, 1348, -2022, 67, -1772, 536, -1250, 197, 554, -1097, 1190, -1506, 1505, -1944, 1290, -955, 1009, 267, -1006, 741, -2007, 1253, -596, 1113, -373, 133, 136, -1201, 1338, -1869, 1998, -991, 261, -341, 201, 1052, -710, 680, -1631, 1265, -2029, 1502, -594, 731, 292, -735, 1727, -1755, 1512, -1822, 1254, -919, -931, 226, -1485, 1297, -1343, 942, -1149, 78, -280, 308, 877, 518, 1217, -1344, 1203, -1442, 1343, -461, 497, 455, -561, 838, -1790, 1278, -960, 1051, -472, -40, 649, -1136, 1254, -1656, 1853, -1061, 1449, -267, 577, -484, -1268, 554, -1227, 712, -1114, 454, -524, -58, 1111]
8105A111r62J3j708K840l407L280j645N22j45p55J806k463K377k244K638k058
8121h00J031N93j293P92j024J183j241J879k506K066J3r66J623l172L666k957
8137a113K319k152K192j630J63J445k177K922k501J698j982J737j371k89K086
8152A347l072K523j926J984j789J298j17l23J376k498L035l653K935k443J706
8167C83q75lJ325k440L070l169J852o04J341k54j668J467k429L473j649J169j481
$$ y = [1111, 149, 162, -1546, 1294, -2113, 1167, -478, 44, -101, -856, 950, -1513, 864, -1380, 1258, -800, 231, 824, -469, 323, -701, 482, -759, 1120, -1386, 680, 693, -273, 1350, -1822, 1844, -1113, 1206, -946, 1246, -384, -221, 1224, -953, 1969, -532, 1166, -816, 921, -450, -739, 1347, -1725, 798, -1128, 856, -933, 365, 248, -75, 1301, -1197, 1838, -1815, 1120, -1323, 383, -492, -495, 830, -1610, 1460, -1709, 143, -461, 880, 626, -1042, 425, -2004, 1469, -180, 989, -492]
$$ [...]
##END NTUPLES=NMR FID
##END=
