##TITLE=1H_SAM_30.235.2
 CDCl3, 108 sc, 
 23.11.2020
##JCAMPDX= 6.0         $$ Bruker NMR JCAMP-DX V2.0
##DATA TYPE= NMR FID
##DATA CLASS= NTUPLES
##ORIGIN= UXNMR, Bruker Analytische Messtechnik GmbH
##OWNER= root
$$ XWIN-NMR		Version 3.5
$$ Mon Nov 23 13:08:17 2020 Russian Standard Time (UT+4h)  she@DPX200
##.OBSERVE FREQUENCY= 200.1315066352
##.OBSERVE NUCLEUS= ^1H
##.DELAY= (6, 6)
##.ACQUISITION MODE= SIMULTANEOUS
##.ACQUISITION SCHEME= undefined
##.AVERAGES= 108
##.DIGITISER RES= 18
##SPECTROMETER/DATA SYSTEM= spect
##.PULSE SEQUENCE= zg30
##.SOLVENT NAME= CDCl3
##.SHIFT REFERENCE= (INTERNAL, CDCl3, 0, 15.7039)
##AUDIT TRAIL= $$ (NUMBER, WHEN, WHO, WHERE, WHAT)
$$ ##TITLE= Audit trail, XWIN-NMR		Version 3.5
$$ ##JCAMPDX= 5.01
$$ ##ORIGIN= Bruker BioSpin GmbH
$$ ##OWNER= she
$$ F:/spectra/data/she/nmr/H-F/1/audita.txt
$$ ##AUDIT TRAIL=  $$ (NUMBER, WHEN, WHO, WHERE, WHAT)
(   1,<2020-11-23 13:06:13.28 +0400>,<she>,<DPX200>,
      <continue with go, POWCHK disabled, PULCHK disabled
       configuration hash MD5:
       00 E9 B6 7A A2 85 ED C7 34 08 36 98 17 FE 4E 26
       data hash MD5: 16K
       01 6B A0 68 22 5E 44 7A 2E AC 2A 6C 48 6D 7C 58>)
$$ ##END=
$$ 
$$ hash MD5
$$ FB 72 35 A1 D2 BA C5 90 9D 61 C1 50 EF DE 1C 38
##$RELAX= 
##$RELAX= 
##$RELAX= 
##$RELAX= 
##$RELAX= 
##$RELAX= 
$$ Bruker specific parameters
$$ --------------------------
##$DU= <F:/spectra>
##$EXPNO= 1
##$NAME= <H-F>
##$PROCNO= 1
##$TYPE= <nmr>
##$USER= <she>
##$AMP= (0..31)
100 100 100 100 100 100 100 100 100 100 100 100 100 100 100 100 100 100 
100 100 100 100 100 100 100 100 100 100 100 100 100 100 
##$AQSEQ= 0
##$AQ_mod= 1
##$AUNM= <au_zg>
##$AUTOPOS= <>
##$BF1= 200.13
##$BF2= 200.13
##$BF3= 200.13
##$BF4= 200.13
##$BF5= 200.13
##$BF6= 200.13
##$BF7= 200.13
##$BF8= 200.13
##$BYTORDA= 1
##$CFDGTYP= 0
##$CFRGTYP= 5
##$CHEMSTR= <none>
##$CNST= (0..31)
1 1 145 1 1 1 1 1 1 1 1 1 1 1 1 1 1 1 1 1 1 1 1 1 1 1 1 1 1 1 1 1 
##$CPDPRG= <>
##$CPDPRG1= <>
##$CPDPRG2= <>
##$CPDPRG3= <>
##$CPDPRG4= <mlev>
##$CPDPRG5= <mlev>
##$CPDPRG6= <mlev>
##$CPDPRG7= <mlev>
##$CPDPRG8= <mlev>
##$CPDPRGB= <>
##$CPDPRGT= <>
##$D= (0..31)
0 1.2 0 0 0 0 0 0 0 0.06 0 0.03 0 0 0 0 0.0002 0 0 0 0 0 0 0 0 0 0 0 0 
0 0 0 
##$DATE= 1606121928
##$DBL= (0..7)
120 120 120 120 120 120 120 120 
##$DBP= (0..7)
150 150 150 150 150 150 150 150 
##$DBP07= 0
##$DBPNAM0= <>
##$DBPNAM1= <>
##$DBPNAM2= <>
##$DBPNAM3= <>
##$DBPNAM4= <>
##$DBPNAM5= <>
##$DBPNAM6= <>
##$DBPNAM7= <>
##$DBPOAL= (0..7)
0.5 0.5 0.5 0.5 0.5 0.5 0.5 0.5 
##$DBPOFFS= (0..7)
0 0 0 0 0 0 0 0 
##$DE= 6
##$DECBNUC= <off>
##$DECIM= 32
##$DECNUC= <off>
##$DECSTAT= 4
##$DIGMOD= 1
##$DIGTYP= 9
##$DL= (0..7)
0 120 120 120 120 120 120 120 
##$DP= (0..7)
150 150 150 150 150 150 150 150 
##$DP07= 0
##$DPNAME0= <>
##$DPNAME1= <>
##$DPNAME2= <>
##$DPNAME3= <>
##$DPNAME4= <>
##$DPNAME5= <>
##$DPNAME6= <>
##$DPNAME7= <>
##$DPOAL= (0..7)
0.5 0.5 0.5 0.5 0.5 0.5 0.5 0.5 
##$DPOFFS= (0..7)
0 0 0 0 0 0 0 0 
##$DQDMODE= 0
##$DR= 18
##$DS= 0
$$ [...]
##$SUBNAM2= <"">
##$SUBNAM3= <"">
##$SUBNAM4= <"">
##$SUBNAM5= <"">
##$SUBNAM6= <"">
##$SUBNAM7= <"">
##$SUBNAM8= <"">
##$SUBNAM9= <"">
##$SW= 16.9725356469052
##$SWIBOX= (0..15)
0 0 2 0 0 0 0 0 0 0 0 0 0 0 0 0 
##$SW_h= 3396.73913043478
##$TD= 16384
##$TD0= 1
##$TE= 0
##$TE2= 300
##$TE3= 300
##$TEG= 300
##$TL= (0..7)
0 120 120 120 120 120 120 120 
##$TP= (0..7)
150 150 150 150 150 150 150 150 
##$TP07= 0
##$TPNAME0= <>
##$TPNAME1= <>
##$TPNAME2= <>
##$TPNAME3= <>
##$TPNAME4= <>
##$TPNAME5= <>
##$TPNAME6= <>
##$TPNAME7= <>
##$TPOAL= (0..7)
0.5 0.5 0.5 0.5 0.5 0.5 0.5 0.5 
##$TPOFFS= (0..7)
0 0 0 0 0 0 0 0 
##$TUNHIN= 0
##$TUNHOUT= 0
##$TUNXOUT= 0
##$USERA1= <user>
##$USERA2= <user>
##$USERA3= <user>
##$USERA4= <user>
##$USERA5= <user>
##$V9= 5
##$VALIST= <valist>
##$VCLIST= <CCCCCCCCCCCCCCC>
##$VD= 0
##$VDLIST= <DDDDDDDDDDDDDDD>
##$VPLIST= <PPPPPPPPPPPPPPP>
##$VTLIST= <TTTTTTTTTTTTTTT>
##$WBST= 1024
##$WBSW= 4
##$XGAIN= (0..3)
0 0 0 0 
##$XL= 0
##$YL= 0
##$YMAX_a= 1555143
##$YMIN_a= -542220
##$ZGOPTNS= <>
##$ZL1= 120
##$ZL2= 120
##$ZL3= 120
##$ZL4= 120
##$ABSF1= 10
##$ABSF2= 0
##$ABSG= 5
##$ABSL= 3
##$ALPHA= 0
##$AQORDER= 0
##$ASSFAC= 0
##$ASSFACI= 0
##$ASSFACX= 0
##$ASSWID= 0
##$AUNMP= <proc_1d>
##$AZFE= 0.1
##$AZFW= 0.1
##$BCFW= 1
##$BC_mod= 2
##$BYTORDP= 1
##$COROFFS= 0
##$CY= 11.3945322036743
##$DATMOD= 1
##$DC= 2
##$DFILT= <>
##$DTYPP= 0
##$F1P= 15.9154993809931
##$F2P= -4.1035820241983
##$FCOR= 0.5
##$FTSIZE= 0
##$FT_mod= 4
##$GAMMA= 1
##$GB= 0.15
##$INTBC= 1
##$INTSCL= 1
##$ISEN= 128
##$LB= 0.24
##$LEV0= 0
##$LPBIN= 0
##$MAXI= 10000
##$MC2= 0
##$MEAN= 0
##$ME_mod= 0
##$MI= 1.114404
##$NCOEF= 0
##$NC_proc= 0
##$NLEV= 6
##$NOISF1= 3.799351
##$NOISF2= 2.8
##$NSP= 1
##$NTH_PI= 0
##$NZP= 0
##$OFFSET= 15.70392
##$PC= 1
##$PHC0= -11046.01
##$PHC1= 10.00089
##$PH_mod= 1
##$PKNL= yes
##$PPARMOD= 0
##$PSCAL= 0
##$PSIGN= 0
##$REVERSE= no
##$SF= 200.130013532006
##$SI= 16384
##$SIGF1= 3
##$SIGF2= 2
##$SINO= 400
##$SIOLD= 16384
##$SREGLST= <1H.CDCl3>
##$SSB= 0
##$STSI= 0
##$STSR= 0
##$SW_p= 3612.71676300578
##$SYMM= 0
##$S_DEV= 0
##$TDeff= 0
##$TDoff= 0
##$TI= <>
##$TILT= no
##$TM1= 0
##$TM2= 0
##$TOPLEV= 0
##$USERP1= <user>
##$USERP2= <user>
##$USERP3= <user>
##$USERP4= <user>
##$USERP5= <user>
##$WDW= 1
##$XDIM= 8192
##$YMAX_p= 0
##$YMIN_p= 0
$$ End of Bruker specific parameters
$$ ---------------------------------
##NTUPLES= NMR FID
##VAR_NAME=  TIME,          FID/REAL,        FID/IMAG
##SYMBOL=    X,             R,               I
##VAR_TYPE=  INDEPENDENT,   DEPENDENT,       DEPENDENT
##VAR_FORM=  AFFN,          ASDF,            ASDF
##VAR_DIM=   8192,          8192,            8192
##UNITS=     SECONDS,       ARBITRARY UNITS, ARBITRARY UNITS
##FACTOR=    0.0002944,     1,               1
##FIRST=     0,             0,               0
##LAST=      2.4114304,     0,               0
##MIN=       0,             -542220,         0
##MAX=       2.4114304,     1555143,         0
$$ Real data points
##PAGE= N=1
##DATA TABLE= (X++(R..R)), XYDATA
0 0 0 0 0 0 0 0 0 0 0 0 0 0 0 0 0 -94 108 -108 108 -108 108 -216 216 -238 324 -331 432 -526 545 -648 756
31 756 -864 982 -1139 1290 -1454 1634 -1835 2060 -2310 2574 -2866 3185 -3535 3919 -4336 4786
47 4786 -5284 5822 -6416 7063 -7784 8571 -9450 10425 -11515 12733 -14127 15709
59 15709 -17560 19726 -22309 25463 -29399 34498 -41393 51266 -67054 98256 -364894 778114
71 778114 -522981 -542220 843367 -306634 604084 746463 -162849 607512 556212 -27712
81 -27712 455518 16622 168860 246348 -48207 200840 158432 79778 260172 162393 106923
92 106923 284360 6996 48317 173030 -367487 -61023 -46393 -525651 -248916 -216254 -467233
103 -467233 -137750 -374605 -359746 110321 -303927 -113735 29275 -48453 186024 -104703
113 -104703 63201 201503 -9639 140179 57861 -11436 290392 -25591 1729 271937
123 271937 -79255 140349 118414 -7478 130795 23793 70511 49474 -18530 -166 -8920
134 -8920 -78027 -8488 -121554 -80873 14449 -189525 -41123 -36874 -139296 -58387 -54490 -128309
146 -128309 17298 -41029 -168561 139222 -51508 -74219 92803 -61373 54215 37110
156 37110 -58774 93296 50032 -33466 127069 -33721 75507 103454 -107897 177794 16955
167 16955 -32166 144125 -19890 46913 112528 -47451 65046 100304 -77553 106023 -4373
178 -4373 -32538 78173 -76789 23628 6268 -67631 14943 9473 -70438 43420 -28966 -42640
190 -42640 87800 -114564 25437 44725 -97401 30585 -11705 -69068 33956 -43550 -81034
201 -81034 71926 -90231 -10992 21904 -75170 63973 -55738 -21278 35245 -57669 -12763
212 -12763 2446 -75977 21224 -22340 -94209 76480 -82095 -20627 50222 -76117 36962
223 36962 14573 -34018 39652 19044 -37162 75578 -27474 -4256 69525 -63941 59198
234 59198 6746 -24782 56609 -1838 -3985 55074 -14419 13601 64154 -64748 77933 7637
246 7637 -39160 79347 -35144 20219 36956 -28773 28801 38413 -40912 60201 4459 -22853
258 -22853 88393 -52843 39817 36093 -35556 49117 -1737 -12592 39242 -12470 -22351 57043
270 57043 -60598 16427 14534 -69991 42851 -40035 -27345 9604 -42451 -25067 11211 -61361
282 -61361 -12749 6422 -77496 35613 -53978 -28556 24320 -63503 3095 -4850 -41008 10043
294 10043 1479 -54236 51820 -30616 -19825 51362 -60752 43166 3256 -23842 41855 -6242
306 -6242 -5801 44020 -18384 3528 57971 -50368 52865 9275 -19626 67964 -24290 22194
318 22194 35648 -8702 21417 33435 -25163 48521 15266 -22973 69912 -32884 27807 28619
330 28619 -29401 34522 8835 -16160 28503 2208 -25263 52631 -42900 8145 24509 -52305
342 -52305 39126 -27153 -18350 22503 -26220 -17682 19180 -42101 250 11614 -66071 38109
354 38109 -36364 -23622 21476 -53190 4612 -3417 -38149 -1068 555 -46707 26039 -32502
366 -32502 -24155 34594 -56395 19669 -6372 -28357 21994 -9390 -20986 26284 -10237 -15858
378 -15858 42699 -43135 35809 12567 -26640 50052 -14237 11314 31075 -10356 13636 41703
390 41703 -24890 41846 20033 -19485 68797 -26836 21480 36366 -18541 33405 11873 -8714
402 -8714 34879 8614 -17050 48230 -27906 16792 22945 -38860 40102 -11172 -8368 18641 -11441
415 -11441 -11766 21189 -28052 -6410 19405 -47517 26777 -23868 -22791 19641 -35551 -7574 3206
428 3206 -30357 -8258 6244 -51815 19979 -22628 -36844 26039 -52468 8233 -5081 -39404
440 -39404 9396 -9988 -29360 17159 -21907 -21821 34175 -47951 20028 1873 -29832 36494 -21109
453 -21109 1714 20104 -8125 2982 29278 -20229 28267 16877 -19840 51188 -16442 16504
465 16504 27052 -8284 24182 19380 -3746 22141 22241 -13660 47804 -12577 10334 35890 -21383
478 -21383 31059 5898 -4673 21685 6599 -9812 26654 -13341 792 25287 -37276 33598
490 33598 -12180 -14383 22745 -24042 -1456 6920 -22191 -6018 12051 -39983 18495 -16492
502 -16492 -27308 23503 -43294 3529 -4422 -28839 2501 -10806 -26739 9484 -18286 -27588
514 -27588 22859 -44342 8999 -2437 -34335 19351 -19725 -7634 6466 -11130 -8366 20991
526 20991 -22919 13106 11226 -25336 36950 -16320 6025 18591 -8763 13867 15743 -4195
538 -4195 16699 19688 -15288 41428 -7038 6715 34028 -16668 30993 10051 -1584 23074
550 23074 10136 -8916 33245 -8491 -1396 35320 -29675 29662 -1463 -12604 26509 -14392
562 -14392 1332 11790 -15460 -954 15836 -32495 18926 -10528 -22231 22497 -35252 4859
574 4859 -3628 -21960 503 -6177 -23665 3113 -8649 -27173 16870 -33392 -2880 -2912 -26343
587 -26343 6981 -16162 -12670 1668 -8202 -21739 15251 -25518 -182 12455 -32550 24375
599 24375 -13093 -7093 16867 -11473 760 16164 -12083 8783 18432 -22869 36003 -7521
611 -7521 3463 31394 -17276 25914 11347 -1337 20792 12642 -2850 28752 -60 4283 31194
624 31194 -17455 30163 3876 -2683 22047 66 4131 13046 1751 -4050 23027 -17972 13926
637 13926 2544 -16619 21701 -17087 -35 3935 -11605 -4250 7011 -22628 1483 -994 -27973
650 -27973 19986 -29526 -4347 1463 -28973 8244 -13303 -17767 472 -9753 -20489 9779
662 9779 -25456 -1622 4767 -30318 15565 -17956 -6658 4607 -13323 -2793 3696 -10745 -1082
675 -1082 11801 -20192 21975 -8015 -4375 20069 -11167 12243 6836 64 8677 14364 -7386
688 -7386 22897 4300 -742 31125 -14812 23171 10641 -3076 21866 3592 4248 18604 1789
701 1789 -36 27406 -13976 20097 6045 -9893 27095 -13732 7225 7144 -4548 2655 6228
714 6228 -12915 5964 2662 -20033 17565 -19370 15 627 -18586 2585 -8432 -11156 -5368
727 -5368 -4211 -21772 9700 -21259 -10670 6386 -29041 8140 -15007 -13067 2651 -11916 -11676
740 -11676 2448 -14532 -7310 9910 -27062 14871 -9960 -9603 13732 -18321 8336 1448 -5920
753 -5920 4178 9697 -10120 16902 -817 -4651 23481 -13659 18102 4952 -101 15923 4586
766 4586 4375 13402 8598 -1595 24690 -7634 17102 11746 -6297 23948 -4459 8493 10991
779 10991 2914 2664 14930 -6217 6983 10661 -13890 21733 -13508 2012 9323 -13204 6292
792 6292 -3166 -7826 -553 -516 -16833 10857 -16167 -6624 4859 -24322 9299 -13814 -9512 -2357
806 -2357 -9950 -10349 -1232 -12312 -10652 4683 -23381 7176 -11650 -11319 6189 -15958 773 -3226
820 -3226 -6350 -5638 5871 -13568 7847 -1406 -10518 19515 -14429 9814 3555 -4791 11148 2687
834 2687 566 9356 6453 -2275 21162 -8995 15493 11490 -6435 22480 -3153 10054 9524 3324
848 3324 4835 13165 -1116 7755 11755 -7897 22731 -7838 5935 9094 -6378 8761 364
861 364 -1251 1626 5879 -12031 10774 -9360 -6381 8159 -19683 8141 -8173 -7443 -852 -8051
875 -8051 -10284 490 -11432 -11933 6024 -25271 6279 -11626 -13535 5788 -17828 -1260 -5361
888 -5361 -10859 -5736 887 -15837 4456 -4951 -11740 11684 -18729 6793 -1641 -5594 4914 -264
902 -264 -2130 3601 3864 -6057 16294 -7605 7881 8749 -5830 15657 -1763 6603 9331 6905
916 6905 1771 16621 -1818 8111 16908 -8440 22335 -1991 6184 14669 -2416 10367 6947
929 6947 -266 4958 9463 -7465 16869 -6014 1432 12820 -14920 12648 -4674 -2384 3560
942 3560 -3429 -6034 2064 -5039 -8526 5939 -16956 5904 -8979 -10058 3439 -13493 -2768
955 -2768 -4779 -6306 -10482 3597 -15392 -1773 -2942 -15915 7377 -16640 -163 -2155 -10084
968 -10084 -991 36 -8197 1437 636 -12377 14411 -13058 4772 6617 -11594 13033 -5436
981 -5436 3695 5969 631 578 12245 -2121 7367 11148 -6756 20221 -3634 8416 9684 92
995 92 8702 2875 4042 4427 11843 -4136 14221 988 -199 13606 -7034 10173 1645 860 2619
1010 2619 5351 -4741 6529 -186 -7226 12605 -16804 7250 -4050 -10687 6036 -10398 -3764
1023 -3764 -2022 -6862 -7887 3756 -16195 1251 -5880 -15535 7623 -17778 1207 -5864 -9697
1036 -9697 -1843 -6841 -8820 -3548 -857 -13683 6533 -12016 928 219 -9698 6474 -5419 740
1050 740 -824 2706 -6296 9503 -2238 524 11782 -10299 13671 -2214 2595 9486 -442 5689
1064 5689 7859 2580 3662 12926 -6583 16639 1584 2051 15262 -6754 14063 2834 1943 5737
1078 5737 3675 -665 7819 2324 -2170 12542 -9778 9329 -651 -4185 6637 -5336 2081 -2152
1092 -2152 371 -7286 4539 -9537 -417 -732 -13826 7563 -13121 -3300 -3339 -8399 -6465 -3387
1106 -3387 -10013 -5554 -1248 -15089 7523 -14602 -3829 809 -13940 3387 -8140 -3421 -1557
1119 -1557 -2107 -7457 5335 -6813 -1124 5938 -12167 10810 -5576 707 5370 -1574 4391 2576
1133 2576 3143 1385 10751 -5015 12051 2438 662 13511 -2354 10430 5321 5487 4430 7757
1147 7757 217 8963 5077 -2249 15661 -6671 10291 3616 -2722 9018 -1323 3136 2945 2086
1161 2086 -4152 8438 -8181 3696 1036 -9761 8542 -10504 1391 -1889 -6025 -2720 -2105
1174 -2105 -6016 -4403 -1337 -12703 4133 -11939 -4691 -1070 -10994 873 -8187 -4766 -5938 -1403
1188 -1403 -11013 653 -6792 -6405 4732 -12667 5987 -5882 -2476 1585 -3966 -1168 2174 -566
1202 -566 -2391 8865 -8530 9415 926 -1815 11325 -4303 8156 1844 3890 4357 6997 -38
1216 -38 7880 5145 -622 14004 -4649 10631 3896 1158 8754 764 4376 3352 5809 -2425 9390
1231 9390 -1615 4706 5284 -7033 8933 -5150 2173 153 -1602 -1606 1790 -3167 -1978 2152 -11965
1246 -11965 7065 -9209 -2255 358 -10761 1014 -7151 -4360 -5547 -2986 -10647 1480 -8191
1259 -8191 -6318 2230 -13217 3106 -7752 -4084 -1740 -5383 -3488 -989 -1459 -5634 5565 -8739
1273 -8739 5303 -1939 -3229 6947 -6532 5107 1079 1275 1815 5715 -1530 5744 4420 -3302
1287 -3302 12769 -4679 8324 3911 987 9194 2897 4681 4908 6837 -856 11487 -3055 5641
1301 5641 6127 -3394 11378 -2041 5197 2773 976 955 3429 -630 28 5441 -7427 7718 -6393
1316 -6393 -697 1483 -5486 1662 -3502 -1596 -4012 -367 -8719 1146 -4959 -7596 3394 -11989
1330 -11989 2313 -6964 -4487 -1741 -5589 -4227 -2234 -3817 -6976 4173 -11452 2970 -4457 -6283
1344 -6283 4558 -7667 1093 -1870 -612 -792 2293 -3250 2667 2529 -4426 9079 -5135 6619
1358 6619 1947 881 5820 1246 2790 2981 5688 -1196 9568 -1178 4915 7597 -1392 10286
1372 10286 165 6128 4293 3316 1899 5985 2229 1971 7082 -5157 7571 -2928 1531 4849
1386 4849 -3194 3933 -1390 -585 -1337 2668 -7103 2867 -3958 -4871 4307 -10056 2202 -6270 -3689
1401 -3689 -1840 -4860 -4235 -3421 -3158 -6725 1665 -10958 1151 -4654 -6787 1332 -8500 -1275 -4029
1416 -4029 -2965 -4177 1546 -4673 70 572 -6412 6631 -7401 2735 2336 -1193 4061 37 1163
1431 1163 1355 4682 -2579 9262 -2242 4703 6381 -2642 9781 -59 5604 3824 3642 2743 6358
1446 6358 2209 3037 8706 -2638 9959 -1102 3082 4832 -1174 5298 610 2098 558 3730
1460 3730 -4080 4366 -732 -3838 4998 -6948 3348 -3493 -2958 -548 -2699 -3669 -1760 -2273 -6462
1475 -6462 2687 -9830 469 -4070 -6588 1650 -8474 -1296 -3909 -3394 -4794 -85 -6570 -2474
1489 -2474 -1015 -7274 3676 -8551 230 -451 -2863 152 -2763 -648 -946 2683 -4765 5818 -2043
1504 -2043 2324 4722 -3091 7025 -880 2848 2588 4024 384 5561 1537 1650 7832 -2533 9888
1519 9888 339 3192 6241 -946 5243 2491 2641 1038 4967 -1122 6543 320 -567 6545 -4544
1534 -4544 4744 -694 424 588 -119 -853 -621 -421 -4557 4013 -6789 1220 -1823 -5593 428 -5965
1550 -5965 -1336 -3944 -2081 -6028 1118 -6634 -2999 -1498 -9139 2947 -8272 -1293 -2154 -4110 -818
1565 -818 -2912 -2317 -3344 -3 -6324 3855 -4568 -87 2113 -3742 4693 -3156 2013 -18 2417
1580 2417 120 3364 1901 480 7093 -3575 7835 465 2752 4676 881 4475 2761 4369
1594 4369 1410 6430 -1132 6424 2867 879 8622 -2088 5458 1340 1164 1148 2924 -172 2111
1609 2111 2055 -3230 6465 -5761 2966 -70 -3080 2797 -4842 187 -2360 -2023 -4824 1245 -5075
1624 -5075 -2014 -1176 -7288 2201 -7135 -1662 -2723 -4262 -2440 -3494 -3588 -4048 636 -7562 2143 -4745
1640 -4745 -3279 757 -5929 2034 -3488 -1977 -535 185 -2602 2279 -1010 -1669 5363 -5347 5637
1655 5637 -515 1237 4445 -446 4021 2381 3119 1604 6606 -1227 6552 2810 838 7344 -1627
1670 -1627 6133 1285 2683 2524 4723 2797 2385 3500 -2155 6245 -3807 4008 1022 -811 2977
1685 2977 -939 1714 -324 1683 -3430 3183 -3305 -299 1100 -7400 3151 -5316 -1824 -2271 -3963
1700 -3963 -2287 -3235 -3223 -3376 -183 -7407 2016 -6837 -2883 -853 -7272 1390 -5439 -1881 -2882 -1879
1716 -1879 -4190 -240 -1879 -3397 2984 -6344 3591 -2323 732 1974 -242 1283 1043 2348 -1614
1731 -1614 5540 -2132 4166 2550 -570 6816 -1976 5214 2847 2661 2923 4591 1642 2973 4268
1746 4268 -1641 8603 -2451 5996 3138 -586 6265 329 2916 705 2180 -1076 3502 -1157
1760 -1157 570 2616 -4521 3782 -4400 775 -1080 -1527 -921 -1680 -710 -3817 1307 -5952 1462 -5477
1776 -5477 -3741 -396 -6168 -372 -4119 -1339 -4353 -1165 -4708 -1056 -2581 -4555 2543 -7331 1287
1791 1287 -3010 -2229 -11 -2515 -530 -1191 -83 -1876 3543 -3476 3263 920 -2056 5011 -2992
1806 -2992 3843 722 1651 1558 3057 965 2222 4142 -854 7369 -1179 4465 2982 605 4761 2413
1822 2413 3473 1571 3730 -1262 4534 305 1833 4725 -3565 5876 -1247 1869 717 -201 548
1837 548 445 -932 -2780 2783 -4355 2963 -4031 -316 255 -5207 673 -4200 -1209 -3518 -1053 -3881
1853 -3881 -1685 -3587 -4587 1283 -6920 129 -5097 -2230 -1943 -3904 -1891 -3373 -932 -5248 1830
1868 1830 -6107 -160 -984 -2308 3351 -3612 1895 -15 1194 -1071 3343 -335 1348 3748 -2929
1883 -2929 6471 -1340 3871 2624 292 5407 530 4101 2193 4664 325 5943 -183 2855 3135
1898 3135 -1833 5605 -392 3673 906 1526 1079 1298 2617 27 4222 -2281 4360 -2090 -325 2013
1914 2013 -3590 1399 -2784 -574 -4053 -340 -4418 -840 -2441 -4670 1691 -6524 813 -3454 -2313
1929 -2313 -1033 -2786 -2133 -2900 -1911 -4971 601 -5265 576 -1854 -3859 2049 -4495 127 -3337 -92
1945 -92 -1189 521 -1690 -433 2187 -3030 3471 -2549 1698 1615 129 2943 425 2564 145 4208
1961 4208 -759 5476 1542 2338 5151 -625 6090 -29 3418 2374 2860 1013 3845 2115 529
1976 529 5493 -3256 5447 -133 546 3453 -1578 2801 -1282 647 -1025 1374 -2557 1292 -308
1991 -308 -3380 3033 -5542 951 -2728 -2334 -870 -2125 -1510 -3365 -795 -6360 4 -5740 -689 -2054
2007 -2054 -4992 761 -4677 -370 -3663 -1010 -2732 241 -2684 -1587 818 -4563 2419 -4386 1038
2022 1038 -699 -1574 443 -1403 1025 -1249 3483 -1899 4471 197 338 4111 -1557 4181 -1741
2037 -1741 3544 1276 2615 2051 2439 2999 86 4901 -1878 5263 721 1877 3962 382 3633 609
2053 609 2001 -446 4345 -455 2830 1673 -926 3685 -3220 2277 -1512 -1329 890 -1104 -674 -706
2069 -706 126 -4355 2161 -5054 -60 -1469 -3605 673 -4679 -734 -2997 -1602 -3606 -1019 -3429
2084 -3429 -2019 -549 -5797 2193 -4542 697 -2451 -3258 -1255 -1407 -1277 -2957 1787 -4135 3255 -1646
2100 -1646 -1065 2782 -3019 3577 -1204 1280 371 1807 1201 3520 2632 582 5543 -1764 5180 767
2116 767 458 5035 214 3923 2243 3349 1039 4686 670 3494 2199 282 4656 -920 4502
2131 4502 -818 410 208 288 214 -1076 2117 -3573 3244 -3172 -118 104 -2982 1596 -4029 -39
2147 -39 -3064 -350 -3766 -778 -3508 -2275 -50 -6529 946 -4533 -400 -2430 -3463 -1014 -2911
2162 -2911 -634 -3370 -1094 -4953 655 -3613 -646 489 -3545 3794 -1481 604 -657 724 -781
2177 -781 1714 1381 -1284 3696 -1979 3908 807 1297 3361 413 3542 1199 3211 -97 4670 -246
2193 -246 3090 3390 935 4406 -1806 3508 598 2561 1383 2427 1970 626 1927 -2341 3443 -2091
2209 -2091 1719 775 -1213 2761 -2535 1032 -1893 547 -2322 503 -1452 -1267 1181 -5307 413
2224 413 -4356 -1382 -1636 -3196 -2004 -2614 -1258 -3541 1087 -5558 -356 -2457 -2926 945 -4626 1670
2240 1670 -3412 19 -2260 283 -1449 337 738 -2509 3749 -2903 2278 -1118 -47 2606 -1124
2255 -1124 2488 155 2656 152 4297 253 3153 2848 -366 5676 -1269 4146 1522 1610 2627 2522
2271 2522 1859 1764 4254 -2684 5382 -208 1997 2093 -1117 3265 -666 1676 -107 2166 -2095 1757
2287 1757 -1842 -2182 1355 -3686 2646 -3357 -695 -1681 -1375 -1320 -1284 -1175 -3183 -107 -5749 617 -4523
2304 -4523 -2756 -46 -4352 -489 -3222 -1208 -2731 -1468 -3785 -962 -1270 -3624 1999 -3585 2095
2319 2095 -1521 -479 734 -916 666 -930 1983 -1411 2468 -1557 1061 1612 -189 4377 -1355
2334 -1355 2952 399 2641 1682 2162 1689 1475 3931 -1190 5353 -1291 2784 2193 598 3402 356
2350 356 2398 89 2878 -480 2919 444 56 1737 -1944 2945 -1291 1184 -638 -314 -534 -1745
2366 -1745 -144 -2591 977 -4187 906 -2879 -2093 168 -3286 -346 -3132 -1235 -1774 -660 -3186
2381 -3186 -1822 -1917 -4557 1580 -4734 513 -2258 -1150 26 -1964 -106 -2534 784 -1422 1664
2396 1664 -2063 1554 1851 50 2054 -1200 1789 -572 263 1485 1541 1138 747 2881 -1040 3428
2412 3428 1073 3044 2575 -292 2617 680 2793 633 3518 537 3756 985 820 3691 -1248
2427 -1248 2900 553 1278 724 1296 672 1102 1350 -2296 2076 -2739 501 -854 -84 1708 -1855 1499
2444 1499 -3255 325 -2057 -126 -3768 -1510 -608 -4588 822 -4141 -128 -3861 -1780 -1042 -2154
2459 -2154 -170 -3821 443 -3229 -67 -2594 7 458 -2795 1397 -2594 -871 -1244 717 -395
2474 -395 1077 104 486 1141 -1443 3255 -1766 1663 2195 -840 3059 896 2623 988 2089 370
2490 370 3695 1134 1756 3916 -26 3574 -594 3523 1313 1975 1402 611 1993 -748 4448 -828
2506 -828 2615 -55 405 1894 -1834 1877 -1017 188 -1619 462 -1634 -946 -349 -4045 2384 -3968
2522 -3968 169 -2003 -2478 -1285 -3103 -1314 -2704 -632 -3820 145 -4121 -692 -1206 -3303 480
2537 480 -4645 313 -1574 -26 -768 -1051 -690 -2524 1210 -1883 2691 -1447 817 476 -321 2492
2553 2492 -425 1835 -199 2794 262 2622 398 1776 3612 -698 3608 525 2231 1619 1495
2568 1495 1799 1458 2467 -654 3894 -938 3284 240 980 2045 -579 3246 332 1224 -278 1607
2584 1607 -1235 435 755 -1710 2256 -2956 1107 -1766 -1815 -796 -1428 -63 -2265 -568 -3363 862
2600 862 -3655 -938 -1125 -2667 750 -3308 -1314 -2649 -892 -2834 -147 -2766 -2211 180 -4042 1512
2616 1512 -2558 -412 -871 -1545 798 -606 720 -242 275 -556 906 375 826 1920 -926 2957 -74
2633 -74 2504 1395 1645 1264 1033 2505 -232 3589 -626 2707 1797 1515 1961 184 2868 1117 1236
2650 1236 354 2254 -879 1703 1635 -765 2435 -1103 2271 -246 -776 -484 -1026 623 -1918 173
2666 173 -2950 1231 -2395 -47 -1259 -2180 298 -3541 85 -2586 -235 -1584 -287 -929 -1992 430
2682 430 -3515 590 -1931 -157 -1198 -1931 739 -2114 196 -2486 1564 -2340 1538 -945 -585 1820
2698 1820 -2159 2660 -1097 2596 -584 1258 671 904 988 91 3394 -144 3122 502 1154 2119 590
2715 590 2310 111 2329 -11 1909 731 2207 2120 -129 3593 -1271 3558 328 197 -1240 351
2731 351 418 -1500 258 -1517 56 -2376 -189 481 -1944 688 -2246 -808 -2180 -644 -2831 -249
2747 -249 -930 -2644 -225 -2916 917 -2305 -1304 -1119 -1142 -191 -3183 -958 -2638 340 -2384 -452
2763 -452 -1803 -2358 -350 -3019 1288 -617 274 -552 94 -457 505 782 -1214 2618 -512 2318 916
2780 916 862 2369 798 1681 1040 2052 -80 2838 132 1391 3007 -334 3742 -249 2732 1677
2796 1677 1340 1617 1189 1211 98 3331 -423 2222 -1105 1191 114 -652 1166 -1993 460 -659
2812 -659 351 -1584 -223 -829 -1454 87 -3061 1260 -1899 -1050 -547 -1893 -1460 -1728 -366 -2441 -716
2829 -716 -3410 -130 -2419 -2175 678 -2519 236 -2197 -17 -1716 97 -154 -331 301 -2409 2128
2845 2128 -1671 2055 -516 -403 1235 -416 1053 -965 2612 -146 1940 348 1239 2516 -269
2860 -269 2412 -205 2666 437 2169 512 1472 2167 122 3272 -1326 4320 68 426 2926 -217
2876 -217 1513 -396 715 -361 1306 -1713 1418 995 -300 1459 -1726 2441 -1709 -165 -887 42
2892 42 -365 -1444 -1432 -1845 674 -2835 -114 -1227 -2184 599 -2511 340 -2662 -1130 -1158 -337 -2098
2909 -2098 -1415 904 -2979 1098 -2389 320 -1691 -534 582 -851 92 -339 2052 -758 1473 -114
2925 -114 605 1845 -1602 2214 -695 2040 901 1526 1053 426 1406 1235 2183 -1352 2829 201 1468
2942 1468 1235 -459 2075 -134 2741 -12 1213 396 1402 418 -861 2126 -1474 2064 136 1177
2958 1177 -569 246 376 -355 1515 -2047 701 -984 599 -2264 -1072 159 -2796 14 -2955 -300
2974 -300 -1561 -189 -2349 -1529 -1038 -2807 439 -3020 580 -1355 -639 -613 -1842 -144 -1677 1238
2990 1238 -1503 1038 -961 520 389 -885 1768 -1944 1762 -290 1025 -998 213 547 1108 2565
3006 2565 -898 2899 -1096 1495 2233 906 1953 -117 2453 -191 2105 1297 1539 -135 -182 1700
3022 1700 -298 1763 -814 1745 474 1253 1114 -807 646 -1763 2500 -1035 1367 179 -147 811
3038 811 -2022 1081 -2875 11 -982 -569 -336 -578 -378 -3203 -221 -2598 1023 -1732 -1319 -1325 -2140 287
3056 287 -2378 -421 -2308 76 -2345 -944 -32 -1953 1088 -2790 579 -988 -52 162 -802 209
3072 209 -107 2684 -1760 1843 -587 357 864 -138 1352 262 2336 -475 2416 543 2155 409
3088 409 1091 1509 -1466 2665 406 2027 906 1244 1008 724 2748 -709 2114 -880 1781 753
3104 753 -109 1532 -857 945 -1403 176 -247 1273 -434 -761 296 -2114 936 -2387 -340 277
3120 277 -547 -405 -865 -1314 -2443 -115 -2303 133 -2025 -734 170 -1958 723 -2513 54 -1894
3136 -1894 -523 -1318 -670 107 -1045 1283 -2403 661 -1068 51 239 -43 1269 -1320 1701 -61
3152 -61 1102 -560 1926 779 -535 2473 -146 2305 -24 1678 765 1535 1202 169 1897 -20
3168 -20 2847 -957 1401 1278 1090 1456 101 1948 -1265 1252 1 1277 625 775 608 -2042 1011
3185 1011 -2053 522 -1175 -444 515 64 141 -2587 321 -2018 -116 -1696 -1271 -660 -2473 139 -2169
3202 -2169 -836 -2711 -39 -1542 -528 -825 -1976 -37 -1242 1194 -1756 -588 -383 -1256 172 -2025
3218 -2025 147 -1747 1210 -374 214 406 -666 802 -1760 1665 -46 1995 822 983 711 306
3234 306 1861 -912 1822 -578 2173 594 889 1764 -851 2521 789 2205 341 1448 295 225
3250 225 2158 -380 1738 -881 1393 -1360 86 240 -441 446 -1318 1331 -1588 323 -1998 -705
3266 -705 137 -1287 -91 -1237 -603 -1849 -1623 -469 -1378 1004 -2497 7 -2356 187 -3003 -986
3282 -986 -654 -1656 -126 -2393 -245 -1223 119 -1168 288 63 -1444 976 -1529 1386 -891 9
3298 9 -15 1016 420 341 478 -116 2410 -591 2124 188 416 1209 288 3104 -273 1034 423 1521
3316 1521 591 702 1453 -262 2236 -1448 2168 398 701 559 183 942 -300 2098 -1071 1934 368
3333 368 -263 632 -1075 805 -2004 1285 -883 185 -1491 -900 -448 -1765 7 -1904 370 -1969
3349 -1969 -190 -1685 -1080 229 -1597 562 -2303 1034 -854 -183 -941 -1961 228 -2492 1003 -422
3365 -422 -245 -593 14 -211 -918 998 -912 1734 -931 514 1060 -584 929 12 592 23 2074
3382 2074 196 2288 686 1443 1173 -1796 2168 -333 2454 13 1011 1599 890 1593 -915 1502
3398 1502 -691 1369 -107 -58 589 -682 750 -1170 1014 -578 88 -792 -329 -79 -826 -164 -2055
3415 -2055 440 -915 -154 -708 -696 12 -849 -1002 -1029 193 -1804 -460 -1221 -1501 -568 -1720 -413 -2177
3433 -2177 -85 -106 -821 -1195 -1188 448 -1018 683 -1562 845 -14 79 1744 -895 757 -742 1240
3450 1240 -76 1282 16 261 1394 400 1579 -267 2139 620 1816 938 613 1130 254 1869
3466 1869 -140 2089 465 1585 1079 358 2666 -585 1455 -835 703 -114 619 450 -1341 1543
3482 1543 -1958 339 -1613 386 557 -1863 699 -1949 206 -2090 1051 -1944 507 -579 -1100
3497 -1100 641 -1977 551 -2606 -613 -1499 -1173 -503 -661 -305 -1866 -825 -2251 -110 -1665 -610
3513 -610 242 -1546 642 -1831 1253 -909 1241 -922 720 601 -1211 2090 -581 826 123 576
3529 576 1251 1104 -147 -157 2386 -570 1622 578 839 1549 279 2277 76 1906 -510 1456 94
3546 94 1206 1255 -196 1657 -166 975 266 478 446 -288 711 -720 733 -1661 1206 -839 145 -1022
3564 -1022 -419 963 -1012 -11 -1890 253 -2510 -699 -2322 -1719 341 -1576 -771 -3522 -61 25
3580 25 -1551 -111 -1311 252 -686 677 -219 47 -543 -314 116 -1055 974 -1762 1158 135 106
3597 106 587 424 299 535 2107 -1275 2025 649 1618 722 88 2201 588 1406 -105 1713 -33
3614 -33 734 979 226 1328 128 2203 518 2195 1243 -69 1375 -125 1216 -65 633 -646 559
3631 559 -506 -756 404 -667 272 -471 -352 -597 -24 -1040 168 580 -1065 630 -1280 437 -696
3648 -696 -1622 -939 -1434 -812 -2053 -548 -1482 150 -1681 -1286 568 -572 953 -597 32 -1565 -206
3665 -206 721 -966 -235 224 833 -1094 379 -110 434 1128 -13 1119 -536 2335 10 855 633
3682 633 1364 724 -345 2001 -536 852 197 1746 659 1857 2147 391 968 -56 1382 -399
3698 -399 1104 546 -467 392 -268 599 38 1069 -977 876 -400 -1375 655 -2007 124 -1248 237
3715 237 -865 -1364 -1301 -1318 331 -1367 372 -2663 -814 -891 -1083 -366 -1839 -183 -2736 -207 -1367
3732 -1367 431 -604 -1023 143 -1002 144 -1225 1205 -949 -252 -494 -8 799 347 903 472 847
3749 847 -888 -165 666 -486 1495 -639 2011 -65 1551 1165 692 852 -701 1385 -415 493 -103
3766 -103 633 863 -134 1578 175 732 -687 1469 -195 1535 -125 164 1190 -1560 1730 -758
3782 -758 -108 117 17 1203 4 130 144 564 -2048 939 -606 -556 -337 -1476 -565 -2109 143 -1303
3800 -1303 -387 -642 -208 673 -750 -375 -389 -199 -1716 -1138 -1103 -1523 967 -491 590 -251 43 -524 475
3819 475 330 -1183 1046 -1011 1601 322 2076 800 538 802 -51 1885 540 1255 912 496 1378
3836 1378 1282 1130 58 1503 -299 1338 158 67 836 965 916 -792 2015 -341 723 207 613 564
3854 564 80 693 333 688 -423 624 -786 112 340 -512 828 -1283 -407 -874 -812 -541 -665 -445 -1376
3873 -1376 1064 -1775 -477 -1875 -498 -98 -1462 107 -1265 -731 -2070 -580 -2015 -194 367 -1546
3889 -1546 169 -734 270 -903 312 -414 -139 1182 -1682 1010 570 1249 -689 -161 1203 -1214
3905 -1214 203 -222 2038 541 1028 -588 27 -150 1282 810 -510 1358 694 1358 -254 936 1024
3922 1024 894 1053 -316 2174 -776 1195 627 227 403 -1008 1611 -43 925 -795 308 -515 -387
3939 -387 -259 -525 278 -1019 37 -204 -977 -791 -324 -275 -1408 -1263 -1597 -367 -1423 -1264 -392 -1041 -555
3958 -555 -2078 1030 -228 214 -1152 -604 878 -990 547 -192 1392 209 -343 603 311 1121 -397
3975 -397 1549 -277 1315 642 1282 339 945 2239 -594 1555 -793 1234 382 724 549 3 339
3992 339 -142 1789 -219 602 304 113 1232 -561 1469 341 -306 -193 516 -393 -575 664 -974
4009 -974 150 -1707 849 -1051 409 -266 -789 -557 -979 -256 -475 188 -580 82 -772 -1211 779 -832
4027 -832 -14 -1910 456 -1138 -670 -136 -1673 -555 -2117 296 -636 -878 -70 -786 -725 -271 1032 -1254
4045 -1254 424 -1026 587 1248 -377 944 -1246 2248 -1015 986 200 1007 177 -9 1115 726
4061 726 1357 110 1441 -5 1151 1446 -1399 1226 -1287 348 -176 412 865 674 943 287 998
4078 998 -548 -225 917 -109 -363 1 175 -948 165 -1550 784 -1165 -927 -194 -944 618 -1577
4095 -1577 -257 -1191 265 -1022 -669 282 -1304 -768 -1325 -429 -1467 -233 -1070 -683 14 -1473 376
4112 376 -948 874 -388 219 -300 42 732 -1241 263 89 534 968 1039 18 804 734 -1064 2614
4130 2614 -1015 1219 655 309 1078 250 1701 -1268 1116 -205 1764 1186 233 1620 -775 2065
4146 2065 298 876 504 405 630 142 1059 -299 1142 -282 313 -1358 -403 -141 -234 953 -1393 1594
4164 1594 -985 278 -554 -389 -523 -611 82 -708 1504 -691 -672 -353 240 718 -722 -192 -2029 240
4182 240 -616 -768 -1021 -627 1113 -1268 110 -1308 -636 -321 -341 517 -507 787 -1000 830 -244
4199 -244 1043 -484 -341 1257 -657 1136 688 1205 741 1164 806 723 1143 -584 775 -189 483 623
4217 623 730 755 -353 -41 -119 672 -710 217 -557 -25 136 -1091 160 -480 -148 -671 282 -630 -780
4236 -780 -1066 -887 226 -469 572 33 -90 -1101 -1310 -768 21 -685 -1549 -660 -1431 102 -459 -717 319
4255 319 -669 144 -666 -931 -1649 -928 310 -857 -1490 -1207 974 -877 461 69 61 934 -240 977
4273 977 58 1542 48 718 725 545 1561 -114 1650 1013 2015 440 550 -109 438 1493 375 1362
4291 1362 41 1265 -802 1163 814 -77 1037 181 1614 650 1011 682 1069 295 -228 420 -1407
4308 -1407 862 -491 -351 681 -571 20 -1043 -78 -938 -265 -859 -493 -900 -131 -332 -779 728 -766
4326 -766 380 -1062 -67 -698 -1090 -273 -65 -257 -1863 -553 -572 906 -711 158 1147 -1584 207 123
4344 123 786 637 232 365 -262 860 -909 389 207 -10 333 -457 728 782 1267 359 1884 242
4362 242 686 649 366 1215 175 1291 275 623 -482 654 102 -746 1108 -1510 1626 308 956
4379 956 619 -264 310 -938 271 -1379 338 -680 211 -929 -1143 -90 -1883 270 -981 131
4395 131 -753 -877 -1107 -930 73 -752 -363 -2315 -131 -1090 -159 -371 71 1205 -711 928 -123 959
4413 959 -1224 49 -420 -1339 620 -350 965 -870 1261 573 910 348 -1044 476 832 1679 98
4430 98 323 421 -11 724 547 1422 110 1085 1318 136 546 -497 390 1071 857 -294 502 184 702
4449 702 673 26 1146 -945 919 -289 1375 93 743 237 -1550 839 -810 240 -1161 -410 -410
4466 -410 -728 1288 -1289 678 -797 -662 -52 293 863 -265 -746 -1887 -98 -1294 904 -939 -1311
4483 -1311 401 -604 -49 -52 -446 -895 -1156 -596 -442 457 -1008 -39 -1551 182 -836 560 49 -248
4501 -248 374 110 932 -1017 1908 -323 591 366 -432 929 44 520 373 -75 885 -946 785 -619
4519 -619 1167 -372 1097 299 -166 36 -425 629 -648 730 -584 553 -435 -601 223 -401 254
4536 254 -1200 -663 -783 -257 -279 -279 -418 -897 134 -999 308 -790 52 -900 -1430 -398 -1385 -414 -1242
4555 -1242 191 -300 -888 -282 -879 -196 -34 217 -885 303 -427 400 -385 -925 -199 10 -232 -556 -470
4574 -470 -746 54 1134 -603 927 -542 1287 631 1083 662 337 160 694 900 -665 829 867 991
4592 991 399 490 334 715 762 -932 443 834 467 466 114 1162 -960 1419 667 -174 -13 -137 777 -596
4612 -596 389 -1660 507 -1230 -976 -219 -845 188 -1466 392 -651 -1056 -623 -1269 -551 132 -345 -598
4630 -598 591 -878 295 -749 280 -117 -1122 181 -1438 -167 -819 -813 -459 -816 243 297 518 -590
4648 -590 321 -24 930 -174 1295 988 162 1371 -993 1037 -288 39 471 15 1225 1213 809 -379
4666 -379 525 684 754 810 329 1252 288 412 190 596 -436 708 571 948 907 -809 1119 -730 598
4685 598 -1227 118 -496 -1073 405 -1678 371 -662 -571 -954 -146 -122 -689 -67 -449 992 -324 -731
4703 -731 -1439 -78 -581 -248 -146 -905 -734 -656 722 -1360 234 1390 -368 46 -446 -828 -257 -594
4721 -594 1437 -764 -115 468 1047 450 815 1397 355 714 -246 650 -189 240 18 1429 561 112 859
4740 859 -512 1268 376 27 846 878 1074 216 128 -404 -414 448 291 -293 -644 29 -450 1125 127 172
4760 172 96 199 -812 188 -767 -824 596 -1073 699 -1007 -691 -544 -1530 -87 -508 -863 -849 47 -852
4779 -852 -139 -222 -1283 -310 -263 710 -633 -222 -555 -463 181 -303 523 305 -139 -227 338 -372 -304 245 -853
4800 -853 333 1 707 29 87 53 -467 715 232 1030 502 375 -728 481 637 -270 521 580 1623
4819 1623 531 769 196 719 1719 797 1234 -43 697 277 -100 -481 8 601 -1463 819 -789 136
4837 136 -862 357 25 -288 534 86 -771 -1407 -55 -650 -737 -17 -412 -109 -1159 63 -648 -1285 -284
4856 -284 -16 551 -1627 708 -218 304 -494 197 -217 -91 348 -611 760 -649 147 -785 262 955
4874 955 748 205 263 1318 11 998 1187 83 -75 -56 265 -427 1372 393 1034 347 -99 1267 -151
4893 -151 577 -798 769 -330 589 323 -528 879 183 240 252 1151 837 265 -488 -853 246 -854 87
4912 87 -386 57 -605 -425 371 -595 -532 -1287 -236 -968 540 -299 -886 -154 -522 29 -1013 1436 -1103
4931 -1103 -211 -679 -826 -516 -1559 -1109 -432 258 -366 282 602 -44 -3 -765 93 169 40 66 544 1244
4951 1244 -476 231 -574 1135 -683 446 -51 7 648 1413 1094 -653 1238 -95 234 -393 59 246
4969 246 515 1147 -121 -113 -264 -129 198 -1024 -309 -733 669 -849 258 134 -33 1415 -1030 568
4987 568 -135 -107 -624 -976 -841 -930 316 -1015 368 -319 -334 -953 -734 -1137 -621 78 -650 -282 276 -1026
5007 -1026 237 -528 -1272 -416 -587 263 1213 -507 -560 -1278 423 1324 -199 677 786 -105 659 290 -557
5026 -557 -280 187 -204 -679 -684 1508 965 589 -631 357 1715 992 495 205 128 -446 234 1262 -139
5045 -139 330 43 468 407 106 221 303 21 312 269 -726 255 -132 99 -1456 -847 -51 -284 474 -1044
5065 -1044 -718 -164 165 -120 -463 556 -451 -364 -516 359 -651 -105 -635 -808 -1032 -570 813 -1041
5083 -1041 170 -1156 -121 424 -799 -202 -309 887 -502 12 81 114 1177 -52 718 -606 216
5100 216 99 -119 -658 268 1158 418 655 239 1178 -858 -278 634 -50 585 737 282 -946 887 120
5119 120 -362 60 -28 800 698 1113 223 -83 1155 -570 565 -384 164 -661 148 -556 -268 184 -1051
5138 -1051 -265 -523 -4 -413 740 -339 1335 583 -629 -580 84 -149 -1683 -328 -924 -517 -126 -1296
5156 -1296 -106 -710 644 -507 -502 215 459 -378 -1415 453 -312 841 -430 -1123 -253 -1039 608 -4
5174 -4 -208 -182 364 -331 -454 -210 433 709 494 404 201 1044 419 237 1287 -179 915 915 384 -139 107
5195 107 1018 619 723 51 929 650 354 -758 875 212 170 662 -133 676 -742 366 -716 -1 -510
5214 -510 -706 320 329 377 -485 430 -535 30 493 -303 292 -867 -309 -632 -361 -807 510 -285 -727 -572
5234 -572 -754 -979 -639 -176 -201 324 797 -3 308 -472 311 171 -622 -546 -325 706 -709 1397 572 967
5254 967 593 -274 481 235 876 475 9 127 -4 -81 439 84 312 145 -333 361 -107 -85 -485 454 1729
5275 1729 249 915 190 368 132 -414 187 -227 323 -1523 325 -773 -345 -976 -547 -676 -803 339
5293 339 -1309 -492 -541 269 -336 -186 -301 16 155 -893 192 -301 104 332 266 772 -54 525 -309 418
5313 418 -896 -92 265 125 145 -870 -123 -430 714 217 467 387 669 367 2 741 152 1061 -160
5332 -160 79 471 -739 90 45 1128 -268 744 -634 682 818 -245 751 -491 1715 40 710
5349 710 143 -1210 232 -172 79 -282 1148 473 574 903 -776 117 244 1053 -217 470 35 -112
5367 -112 102 -900 354 83 -136 207 -387 -207 -935 289 -1069 -303 -525 -132 -943 -619 926 -881
5385 -881 -241 -802 283 -492 757 -267 -494 228 32 -228 94 -11 233 1449 -442 -59 1189 416
5403 416 366 -536 -37 -245 567 1638 -427 667 -530 -619 510 2505 -220 -277 -352 297 88 162 1455
5422 1455 -1374 100 -73 260 -76 1087 542 -666 -285 -316 133 179 1173 145 -779 61 27 -850 194
5441 194 718 -84 -937 -1063 -400 1298 -516 -902 349 -238 -524 -801 -561 -1185 -283 177 1684 -1682
5459 -1682 -7 -833 -331 1181 -533 353 -71 320 -456 144 -439 -594 110 -214 1044 -285 -97 558
5477 558 604 -146 177 376 -92 2603 -517 416 1571 -594 120 204 320 1186 -274 583 502 148 227 1447
5497 1447 -484 774 609 826 -153 791 918 1016 407 -55 872 -683 693 1023 -267 494 -66 1250
5515 1250 -258 1167 -876 995 954 -792 -561 -838 705 -504 -137 -264 -99 -40 -477 -279 -72 -324
5533 -324 -624 1165 -469 -1685 -872 -720 -55 596 -1128 -439 -1117 -198 747 -651 -464 648 476 -649
5551 -649 -79 726 -8 -211 1298 250 930 264 772 233 -703 99 -480 1155 -252 271 181 -93 898
5570 898 895 236 710 516 204 612 49 27 465 254 -302 -1145 390 -403 543 -1184 -177 -72 550 701
5590 701 320 838 378 -50 440 44 422 -547 -55 -789 462 251 547 645 -328 414 -813 45 -1286
5609 -1286 628 -471 431 222 -227 417 29 1542 217 -146 222 93 -306 1359 446 -603 -75 369
5627 369 552 -110 -6 -344 -797 520 -71 305 115 980 -564 -918 733 -148 567 344 1137 -439 -195
5646 -195 366 -149 388 201 309 149 89 1390 32 -574 166 -344 -406 -1341 -410 150 -272 -524 -416 -70
5666 -70 575 64 455 -1671 -161 127 -364 -359 -448 -305 488 202 37 449 19 -454 -462 -1089 970 -594 420
5687 420 344 -158 -84 -1175 -496 -1126 -189 355 337 22 -94 533 -776 -45 -1095 107 1163 -572 86
5706 86 955 848 -460 717 -391 553 1058 -163 155 623 -130 704 474 389 93 358 -563 -363 -214
5725 -214 1125 -739 1089 -49 -347 436 -327 401 -1487 -226 -475 -637 46 1198 -145 -325 44
5742 44 -746 -944 313 -483 -184 -700 -93 -623 149 -386 -854 -692 -63 -496 632 -87 82 -284 -969 906
5762 906 -392 -150 -18 801 -366 784 88 -34 1362 313 -275 -98 -160 -102 -710 524 -856 615
5780 615 474 2 316 437 303 -183 509 172 1057 124 175 496 -880 -46 89 1066 -405 -567 62 555
5800 555 375 -12 95 -329 -109 44 597 253 -598 -137 262 -166 159 176 133 -322 -950 -28 82 -147 -249
5821 -249 -1238 636 -497 -501 -452 -671 587 -532 333 -652 -200 -118 -218 -153 104 219 -268 291 45 458
5841 458 -542 -98 725 -1575 497 -765 -51 458 -453 -60 402 554 416 60 549 1260 -894 303
5859 303 -338 -234 -131 642 754 854 24 514 551 148 932 674 -409 471 -44 159 -658 98 56 -213
5879 -213 -229 938 -175 -233 -744 1004 656 -266 155 55 -93 -289 -811 -572 477 -486 -81 -104 92 -478
5899 -478 61 -388 -115 -300 -524 108 200 232 233 -67 -1154 -417 -304 -122 271 -199 566 -546 1005 -90
5919 -90 32 443 -777 632 319 77 83 744 321 357 1034 190 80 -774 482 178 130 315 -339 273 313
5940 313 779 286 -74 -542 442 281 -402 632 -394 40 -51 -384 -634 337 -125 -361 1115 -293 1063
5959 1063 199 334 -6 -536 -4 -566 -338 -280 -701 -234 -365 81 -266 485 -903 329 -974 37 268
5978 268 -373 287 -1335 867 55 -183 246 363 -199 126 -69 -387 403 -474 754 -27 -832 -239 51
5997 51 1779 36 -92 -425 118 -130 217 493 271 699 -267 -46 -991 227 568 -17 707 401 758
6016 758 200 -218 -294 136 -346 331 710 -340 1300 751 679 159 391 462 -66 -370 -549 -307 -537 73
6036 73 -273 -204 1539 575 -41 207 197 -582 315 -497 234 668 -1387 180 -195 663 -632 -1243 802
6055 802 -849 611 -161 667 -382 -995 -277 -216 5 -1161 717 -223 265 303 876 546 -34 -221 672
6074 672 787 -400 364 -225 732 -73 897 173 -89 328 376 15 270 -343 -45 1275 873 529 197 464
6094 464 190 224 -218 407 292 1023 159 317 -699 394 947 -89 681 -526 -317 742 126 -934
6112 -934 -224 -894 39 526 -1263 444 1243 785 -735 -245 11 115 822 -577 -401 -972 410 -1144
6130 -1144 -738 448 -125 -105 213 429 -453 654 -429 -675 -104 -615 471 -217 -83 58 -860 805
6148 805 744 4 673 -215 672 -395 -1124 -917 970 -728 -207 -249 -302 -656 777 -602 -498 -138 -120 39
6168 39 10 418 -751 1000 -986 152 125 -302 -61 -366 656 8 205 -204 -1141 581 -54 -494 -1136
6187 -1136 189 -98 -15 -168 -664 893 170 -161 -165 342 88 -851 53 -490 404 -597 -413 -426 -700 477
6207 477 1091 -1011 -186 663 -964 975 -341 63 173 -80 -301 172 361 -386 286 -280 125 168 390
6226 390 1251 620 -383 -1105 1544 1053 1033 -25 300 -773 -1760 344 -566 1094 1458 793 -372 202
6244 202 1813 549 -454 -526 -277 130 484 196 -840 148 316 566 -692 302 183 -762 1383 -609
6262 -609 542 -527 991 497 676 1131 398 -135 -539 163 65 -347 -328 172 -233 -39 -457 -222 -490 271
6282 271 1167 -426 -755 -86 -151 -349 73 -237 251 916 202 -288 224 176 1098 305 -110 -352 -297 -615 557
6303 557 -738 -396 -74 266 -45 976 -344 33 325 -550 -497 -228 1157 -46 1531 31 725 -479
6321 -479 555 451 -153 377 -270 -137 864 126 -1278 -86 -470 301 283 635 -310 101 91 663 226
6340 226 234 51 -734 -713 -697 -930 -339 222 330 78 -83 640 -143 -425 -210 322 -1301 30 -1233 -87
6360 -87 -339 -624 289 -403 1321 -398 -660 -1073 -181 273 -754 192 407 283 -40 377 11 -73 -1478
6379 -1478 411 341 -1443 443 20 17 -557 -314 -132 -47 674 -145 876 749 697 -1162 -614 349 381 -282
6399 -282 -38 429 -239 162 714 -700 823 231 282 142 343 -748 -794 159 -559 403 227 52 -504 -385
6419 -385 -558 -1313 41 -23 924 -587 259 -150 38 351 11 19 -480 -163 -1996 -21 -328 561 466 -157
6439 -157 -574 -200 378 -211 -502 320 -691 -306 171 968 1075 317 -329 407 -89 18 450 -310 -417 -686
6459 -686 1465 -718 548 -411 -821 -66 656 1081 -496 42 257 -583 715 -580 494 17 -572 266
6477 266 -221 788 1122 277 283 248 47 856 -429 231 -315 93 731 -174 1394 -778 1314 -221 -255
6496 -255 266 359 -1091 -161 377 -977 -161 210 -661 -405 -1022 -186 560 -599 -1332 -642 -42 181 -186
6515 -186 -550 282 417 761 -656 -299 508 -246 572 -37 223 -332 -444 317 -70 866 -77 654 806 863
6535 863 -20 179 -101 -658 787 23 -363 629 344 -72 -207 498 191 602 -439 -12 -559 -56 -815
6554 -815 1182 488 118 392 -542 32 -463 -40 -200 -149 356 -240 -662 252 -571 -399 259 -1314 -74
6573 -74 -46 80 94 -1208 -497 -813 -171 -217 -625 -251 -208 99 572 332 -23 205 -793 -915 599 -493 -88
6594 -88 398 -283 -102 -238 -103 -218 269 -1016 -485 -737 895 1302 -4 -78 -388 1098 870 -305 -207
6613 -207 860 803 -54 -453 32 -77 -509 -480 -436 -991 -678 782 194 -521 342 69 -20 889 -341 174
6633 174 818 415 327 170 -302 42 -640 -571 -218 -102 -335 -295 577 100 21 406 -1133 -331 106 -406 -568
6654 -568 -518 90 72 -17 -205 -147 737 257 -839 68 -1195 -78 -170 -300 898 -651 103 -1021 65
6673 65 168 93 -306 -868 -576 -181 110 792 -97 -88 -136 415 -147 -526 -21 89 -99 214 -282 578 -1 982
6695 982 322 1019 169 -343 494 590 -487 305 415 283 471 -426 203 377 467 -189 -5 -557 -767 -493
6715 -493 -487 618 -235 389 -561 290 -355 -28 -1123 -606 -284 -822 -14 -157 -172 -802 -336 -934 -160 -607
6735 -607 -316 334 -971 208 -231 -228 61 -85 180 263 -1139 341 152 -240 524 -104 132 187 90 -694
6755 -694 -122 -62 -308 -93 -167 154 207 -725 716 -379 127 -417 84 -399 -350 -101 -584 77 -692 1105
6775 1105 398 -575 743 338 871 -35 5 -188 -5 -194 -854 496 -845 877 -320 -757 -634 53
6793 53 -128 -536 574 -1032 -161 -470 547 -864 657 -162 -346 -233 -125 895 399 773 -177 -540
6811 -540 -617 -540 -100 418 -253 207 575 82 378 -700 -86 5 7 422 -581 -171 157 -311 1189 -488
6831 -488 -22 415 228 -953 -406 476 346 714 -292 557 -356 -233 294 -692 -177 -240 -666 -60 -4 -26
6851 -26 -77 855 173 -699 -685 624 -55 962 -51 -485 336 859 -149 253 395 -528 596 -792 182
6870 182 -491 9 -232 331 -583 308 840 -1191 -606 72 -1010 -310 -451 80 -262 401 -219 601 256
6889 256 -619 942 -455 32 -314 575 -874 -150 -372 -684 756 -164 -783 -293 408 -490 -118 -548 -708
6908 -708 -142 125 710 1358 332 613 -333 -445 441 390 19 533 112 660 -125 251 185 101 -712 -274 496
6929 496 -689 -388 255 -173 875 -513 -25 -488 163 503 474 698 -557 348 -793 -377 4 156 -359
6948 -359 299 -362 27 -755 -514 -854 -125 -1072 -106 -252 512 -379 -311 -486 -58 96 571 -812 -341 -65
6968 -65 374 480 415 -883 567 243 -412 -678 229 -687 -522 -57 -461 819 -146 210 120 -112 -174 -29
6988 -29 -73 15 -418 102 -2 -384 735 -325 348 273 197 -7 482 771 -226 -254 550 -268 126 796 1112
7009 1112 -427 320 -700 83 -327 -190 -234 646 287 -298 720 774 488 -744 -193 -500 103 -137 546
7028 546 -365 -508 -248 -951 82 471 -510 502 -238 -566 -57 -873 -307 -416 -162 -249 355 -411 775
7047 775 -106 151 65 -111 451 -24 668 62 -49 361 -437 -393 -109 -78 180 -319 -282 -282 -218 550 -381 -384 393
7070 393 783 780 352 -186 737 -122 221 -339 1051 209 553 -392 888 -579 222 338 -1174 -434 330
7089 330 -196 430 672 261 273 313 630 354 673 -22 -40 755 624 197 -548 -15 -291 -575 2 -400 -182
7110 -182 659 -262 614 -157 203 437 -614 57 -706 396 412 1132 -547 -175 562 -286 -76 1403 614
7129 614 223 -203 -146 -419 -1007 -292 244 660 -512 115 97 -739 -251 -7 697 -387 22 895 313 -548
7149 -548 -390 -606 -737 -390 214 -473 224 -12 405 -380 -732 243 -424 29 222 216 371 -455 -437 -536 -138
7170 -138 -411 318 458 -750 131 1159 -456 -332 -1178 -541 -2051 -909 -536 198 -168 -351 715 -368
7188 -368 63 -571 -734 657 -277 -5 618 85 535 463 40 -799 1200 459 257 343 -88 -324 465 575
7208 575 388 -28 133 -425 -246 -139 207 -380 -130 185 -203 807 135 215 -1 160 -1132 -620 565
7227 565 -193 264 -643 773 -742 452 -101 304 75 -137 180 13 68 755 543 -169 542 461 553 -86
7247 -86 84 143 -234 -240 2 601 11 -489 1090 -510 373 -458 -3 578 -530 27 10 -1241 115 621
7267 621 26 506 1 334 797 -337 113 -817 -33 248 46 1037 433 259 47 -122 12 -448 -395 256
7287 256 193 95 662 -675 14 183 1125 304 212 205 496 661 142 -162 -474 358 55 -61 245 156 -129 683
7309 683 234 -624 665 211 67 -472 -432 1119 -235 371 471 -1008 -31 -822 -285 -588 -773 -365 463
7328 463 -736 -316 -68 -654 190 476 -443 245 350 -707 -176 -526 297 -36 -651 -412 -1270 -1378 -314
7347 -314 438 -576 -112 -375 -799 198 -94 -380 -102 -431 747 153 -115 -769 1528 214 611 34 -467
7366 -467 918 873 648 1117 93 3 204 861 67 585 124 548 -390 -145 586 -224 161 65 312 -341
7386 -341 859 -45 -180 -13 -160 688 -266 830 154 -131 -646 -31 967 144 250 -140 378 -191 -419
7405 -419 206 -46 802 169 -179 -60 -162 -601 -68 265 43 841 -482 160 474 -728 -123 1078 -70
7424 -70 -113 -28 289 -1209 999 860 -381 1067 -520 -65 -1029 122 229 138 78 106 -313 -518 629 780
7444 780 -556 1439 -60 -46 429 566 615 757 -1316 -462 506 -54 357 -212 657 236 478 799 -193
7463 -193 -776 -29 -267 509 -594 -421 -77 -412 -151 78 -637 895 -258 233 108 -10 223 -245 109
7482 109 -30 313 180 -973 -762 -783 -1247 586 556 525 -241 129 -410 384 -219 -427 599 156 406 2
7502 2 -240 -613 671 -286 309 492 1138 246 218 927 -976 272 -1100 -517 -63 629 -615 -99 301
7521 301 20 337 460 -937 -715 663 512 -238 267 205 669 -162 -411 948 -14 -124 412 546 70
7540 70 175 -162 -307 -526 -293 257 -212 -820 -196 356 62 339 -113 -326 448 -614 154 -184 578 -235
7560 -235 635 379 -889 488 -540 -235 -279 840 841 -164 -274 -148 872 550 -594 -626 -309 1206 576
7579 576 -39 -1348 216 -337 -283 704 -410 554 -633 89 602 21 336 584 455 540 78 -185 126
7598 126 -1127 498 217 -243 568 851 399 77 -501 -120 -203 218 -600 121 -138 -118 1036 -435 457
7617 457 -172 291 -352 -677 272 335 112 291 -405 -339 987 -86 524 -274 62 -91 -401 1069 -539
7636 -539 733 -634 564 473 938 1338 -8 -217 -53 524 -97 685 -68 609 -219 739 527 172 -703
7655 -703 -91 -462 -64 830 -205 -448 -334 133 990 -222 175 -191 187 580 -42 878 -264 305 295
7674 295 275 243 -1048 96 992 202 -417 -112 -390 -103 340 -667 -397 820 265 -242 505 -321 538
7693 538 -353 -235 428 433 171 -1115 56 23 -206 -74 194 -86 -280 177 -252 395 -838 709 115 355
7713 355 -379 129 -547 485 494 -366 132 -216 -158 -27 -231 -101 525 322 -1106 -62 468 92 -583 -791
7733 -791 -878 138 1049 -532 -485 971 -341 -199 -368 787 130 406 1163 -670 129 -890 -47 -437
7751 -437 876 314 -284 723 -724 198 -337 330 -337 310 -168 -146 325 -837 -103 329 853 -598 -27
7770 -27 785 -477 -378 238 311 -292 -1267 247 -256 -122 -644 -77 -442 268 270 -38 -390 -212 -218 -934 297
7791 297 -1134 616 -101 595 -59 384 627 -265 -33 742 162 -103 -920 476 -305 -442 624 330 -79
7810 -79 934 -13 -81 638 -523 117 -458 -164 -342 251 193 -248 13 941 64 -147 577 -206 34 -543
7830 -543 -209 350 -477 -338 -120 368 427 -87 -187 -394 -676 -440 322 716 -112 309 -431 -366 343 1350
7850 1350 33 461 -496 -1049 -165 -32 202 181 -383 119 296 -127 109 1220 698 -545 237 674 -1123
7869 -1123 -22 -838 1395 320 309 -524 -407 -146 477 517 -30 675 148 66 661 255 -125 108 534 205
7889 205 -164 424 -4 140 -631 462 -144 184 204 171 244 -413 593 434 450 933 135 -670 879 557
7909 557 -520 -1330 -880 295 -709 16 850 -438 423 998 -263 -439 46 -1128 -940 -726 -783 36
7927 36 -728 164 824 981 -404 338 -391 -215 -147 -298 663 -372 -259 338 -620 -111 82 -514 -144 806
7947 806 263 228 -686 -470 517 60 20 143 865 321 -47 1736 193 -406 13 115 557 -75 -467 -593
7967 -593 731 -364 148 -110 180 415 -446 247 43 875 -231 1114 -99 408 -191 608 796 375
7985 375 653 212 293 -635 201 25 854 98 -177 612 64 319 164 -324 -173 -37 720 516 569 -610
8005 -610 512 -163 280 -73 -697 -334 498 -580 -249 168 20 -462 -448 -649 313 -412 164 -80 82 -317
8025 -317 -385 66 -548 786 -301 -381 -1050 189 493 -49 -601 133 1904 548 394 585 1130 906 -710
8044 -710 195 509 1015 -40 135 -161 385 -10 -555 555 302 293 413 -195 -308 485 264 -970 -477 1098
8064 1098 98 263 -712 115 582 760 731 -786 -429 673 247 368 -315 513 71 19 -74 147 14 31
8084 31 -506 -97 401 -97 -234 70 47 -1009 -53 51 603 235 -147 -146 160 446 -30 -1097 -290 590 -166
8105 -166 -27 -59 -644 -236 320 282 84 -704 0 1228 -238 109 706 -321 -264 -710 -341 223 78 662
8125 662 96 11 -906 171 -216 -585 -433 1087 -93 441 51 -337 431 272 161 311 747 -591 511
8144 511 -629 -921 212 300 82 -778 239 -396 -1002 -300 -97 830 -182 -730 15 -192 -978 -232 376
8163 376 342 -189 -622 1360 -1389 -161 931 -382 -40 193 -76 542 -162 -513 152 -133 110 609 110
8182 110 -534 36 206 351 -184 -630 -1015 -697 -124
8191a24
$$ Imaginary data points
##PAGE= N=2
##DATA TABLE= (X++(I..I)), XYDATA
0 0 0 0 0 0 0 0 0 0 0 0 0 0 -75 108 -108 108 -108 216 -216 216 -324 324 -432 537 -540 648 -756 873 -1075
29 -1075 1188 -1388 1536 -1741 1989 -2264 2527 -2831 3178 -3555 3960 -4405 4887 -5420 5996
44 5996 -6635 7323 -8079 8904 -9807 10800 -11895 13107 -14444 15940 -17622 19512
56 19512 -21665 24154 -27047 30475 -34587 39648 -46051 54427 -65895 82615 -109263
67 -109263 158415 -278714 1195477 1224691 -384353 1555143 382969 324301 940836 -165412
77 -165412 139964 640392 -335379 110794 5491 -206979 112709 -225773 -100098 37114
87 37114 -182719 -13127 -66068 -204890 -92310 -203708 -386730 -93914 -488999 -383907
97 -383907 -39606 -490847 -283132 51827 -227391 25024 110875 -96829 406797 150490
107 150490 1545 380754 107944 249824 80388 11082 274569 3460 26487 98621
117 98621 -78624 144583 16269 -205495 179618 -100518 -113910 88673 -176719 -20929
127 -20929 -69930 -110722 -65256 -144259 -117277 -83876 -131355 -84688 -76129 -122644 48906 -105889
139 -105889 -55575 80792 -71169 5802 60078 -6385 57747 113940 -72640 153638 126378
150 126378 -91642 162782 34332 30871 112118 -25912 74145 107770 -45745 83262 38905
161 38905 -32431 134154 -109288 61408 93893 -133670 103990 -5261 -56412 73779 -63903
172 -63903 -50127 77914 -115152 -21830 26687 -134214 43054 -70200 -57206 27563 -80673
183 -80673 -9650 24858 -60987 -1380 27369 -82245 70048 -57129 -59073 91628 -104309
194 -104309 -10044 29890 -72657 10237 12005 -82898 66167 -6064 -61973 90363 -59439
205 -59439 40073 12759 -56737 65151 -30144 -21616 34980 -32224 6457 55336 -68301 77683
217 77683 29653 -50742 117768 -27796 24840 73654 -20449 35903 50306 -29463 44101 28684
229 28684 -51763 83417 -38292 6377 55488 -53000 47746 12315 -24925 34960 4025
240 4025 -33816 57614 -49529 432 55242 -88774 56439 -11602 -37381 44992 -36681 -5283
252 -5283 35599 -41885 785 35103 -70861 54057 -30971 -43445 53020 -72289 5416 -2031
264 -2031 -51795 4925 -13501 -60368 23002 -38927 -54188 40654 -85345 8585 -1580 -60964
276 -60964 22425 -25292 -25547 19104 -19717 -27141 48646 -47787 22998 24774 -43166 68736 -21622
289 -21622 5526 45068 -12318 22492 44694 -23024 41789 41159 -38871 81849 -17011 14374
301 14374 59254 -34885 48424 19105 -11966 37257 8551 -21161 60502 -25140 1844 54022
313 54022 -51384 51594 -7010 -21224 38344 -21148 -7429 21938 -27542 -2764 29254 -59140
325 -59140 34143 -16674 -38455 35432 -55285 340 3578 -40191 -4897 2052 -49697 15837
337 15837 -22542 -51416 39032 -62521 2866 -625 -50757 22256 -20258 -31215 14771 -18862
349 -18862 -30127 33963 -53379 13285 17392 -51395 45292 -28256 -3851 28279 -22164 3556
361 3556 27492 -21310 17930 22756 -33765 59759 -16516 3650 44848 -21171 36299 19077
373 19077 -6583 30394 25922 -16606 52144 -4515 5104 57714 -35510 44683 13539 -11319
385 -11319 40484 -4228 -1438 38428 -12564 -623 42723 -45845 38602 -4160 -32681 44568
397 44568 -37340 4323 9854 -28861 4581 6155 -41259 16964 -13195 -36584 32564 -54347
409 -54347 5272 1994 -42614 10852 -18604 -26424 3393 -16924 -36161 24903 -41081 -6386
421 -6386 10230 -46545 25016 -23143 -18757 12093 -17242 -15283 19437 -27982 1410 24578 -45607
434 -45607 39445 -14340 -7493 36393 -27258 20103 18200 -13566 21254 19358 -21254 49527 -6795
447 -6795 -1548 50145 -28087 40082 10847 -8635 35844 4519 1553 31746 -418 2533 36999
460 36999 -28570 32542 7484 -17981 36018 -17962 7553 14654 -11842 -1108 17710 -25221
472 -25221 12599 2292 -33964 32738 -34034 -3322 9086 -31424 2708 -5904 -23963 1066
484 1066 -4640 -33492 20686 -38159 -6589 9630 -47383 17595 -22694 -19803 8276 -20167 -18540
497 -18540 14048 -28077 -4582 14990 -42325 30832 -17748 -12852 25079 -24539 9299 8309 -12473
510 -12473 11493 15184 -22681 34914 -4093 -4839 40990 -26334 29105 13093 -5531 24687 8277
523 8277 545 29187 5324 174 39681 -19921 32069 15491 -11425 36335 -5127 10248 19141
536 19141 -158 3134 23730 -16057 16898 12403 -25447 33119 -21150 1134 13884 -22633
548 -22633 5173 2164 -21043 4094 -605 -34667 24456 -29659 -12151 11621 -41909 13705
560 13705 -17734 -22461 5678 -18221 -21208 10435 -29044 -9860 11345 -41975 20235 -20785
572 -20785 -17202 13488 -26439 1992 1759 -14784 -2945 11734 -25066 17987 -4654 -14579 26869
585 26869 -20759 14667 5173 -6240 13120 8624 -5061 19756 8200 -9069 38807 -17241
597 -17241 20133 22091 -13827 31449 1913 4738 25324 4344 341 31977 -12816 18055 19881
610 19881 -20177 38665 -12986 5948 19127 -13699 9295 7388 -9385 8517 5222 -21331
622 -21331 22378 -18571 -4047 11609 -28758 11367 -8893 -14029 -2438 -6186 -19343 4999
634 4999 -14515 -18240 11508 -33678 8565 -11610 -21627 7114 -18266 -9836 1416 -14090 -14550
647 -14550 12449 -28314 10559 -4781 -22454 22505 -24660 6614 4534 -15699 7631 6130
659 6130 -11992 12347 2223 -9738 29417 -17313 14592 13034 -9468 23472 -1013 6713 14758
672 14758 7235 1529 23136 -4295 13482 19248 -13592 31507 -1677 4490 17393 307 7262
685 7262 14255 -2262 5941 16905 -16922 24132 -8157 -4036 19992 -21444 10534 -1777 -8185
698 -8185 3936 -1745 -17113 11180 -12930 -12517 13587 -32054 10391 -11914 -17993 5971 -17889
711 -17889 -7274 -4508 -13273 -12171 5831 -26386 4643 -7667 -20182 11748 -22696 -163 -2620
724 -2620 -11871 -3374 736 -12110 3600 3284 -17900 21808 -15014 5100 9922 -12549 16072
737 16072 -215 -1415 10403 7277 -4387 22668 -6661 8914 19811 -12926 27522 -3311
749 -3311 7405 18761 -1030 10365 15972 969 8128 18391 -10192 25282 -3265 3090 18660
762 18660 -10077 14999 1337 406 4575 7161 -10219 10237 -3226 -10199 14654 -21287 7779
775 7779 -3607 -12372 4350 -11044 -8580 -779 -8959 -15330 7705 -24767 1109 -4773 -21583
788 -21583 10817 -22396 -4703 -3283 -13524 -6009 -996 -16401 -1110 -1350 -20134 14005 -19695
801 -19695 2550 3695 -15323 9331 -4635 -1634 2402 3204 -7340 15959 -6534 2854 14855
814 14855 -12089 19826 -3151 5122 12644 2753 4930 12876 3649 5115 19608 -9271 22489
827 22489 2909 1418 21451 -6887 14350 7544 2272 6492 11201 -5130 13109 902 -4356
840 -4356 20202 -16055 12551 -20 -7118 8990 -5892 -2238 2199 -3553 -9713 8530 -16996
853 -16996 3707 -3850 -16736 8285 -17044 -2379 -6204 -9968 -7415 -1027 -14539 -5964 -76
866 -76 -20873 9514 -17027 -4839 51 -15844 2420 -7474 -6733 -1154 -215 -12843 10904 -11216
880 -11216 -2616 12005 -15537 15760 -4816 -276 8863 -1294 3233 8054 -124 2521 15289
893 15289 -9821 19821 -212 3642 17263 -5868 14993 5203 5723 6592 11506 -788 12444
906 12444 7155 -3951 20378 -6958 11183 3566 -1788 8783 1842 435 4945 1745 -8030 14502
920 14502 -13410 4414 4236 -16676 10807 -11536 -3717 -1074 -7700 -6992 2489 -14324 -2532 -2155
934 -2155 -19102 10472 -20453 -4040 -111 -16826 1474 -8706 -6642 -5811 -2572 -13395 4399
947 4399 -11509 -4038 3932 -17364 8216 -7219 -2694 1387 -1646 -2950 4434 443 -4200 14109
961 14109 -11494 12885 2249 -3081 15311 -3694 7982 5598 3539 3943 13489 -4596 14873
974 14873 6324 -4460 22735 -7658 13891 7781 -571 11610 2367 2787 7677 4415 -2133 15974
988 15974 -10249 8971 5039 -8228 12550 -8277 4551 -20 -1028 -3229 2408 -7790 -3677
1001 -3677 3344 -15465 8366 -11235 -4605 -336 -10050 -2297 -5046 -6433 -7139 950 -16878 5216
1015 5216 -12065 -10321 6785 -19250 5173 -7876 -8368 130 -5023 -6872 2160 -6822 -5557 9203
1029 9203 -16173 10097 -4771 -3841 10294 -8008 6529 519 2326 1596 8285 -2713 9219
1042 9219 6185 -2417 16285 -4280 11205 5563 3499 8522 5880 3224 5278 10618 -3550 17212
1056 17212 -4396 7148 11221 -5442 14118 -1838 3790 6896 1227 -2332 8609 -5369 924
1069 924 7801 -12530 12612 -9364 -91 3367 -10427 3131 -4976 -5188 -3385 640 -13664 2915
1083 2915 -10176 -6759 2489 -16260 2458 -9296 -5954 -4536 -4403 -7979 -1829 -3078 -9931 6239
1097 6239 -15230 3181 -2763 -8456 5616 -7259 -2073 -867 193 -4734 8014 -7341 5806
1110 5806 4246 -7921 15295 -7958 7425 5704 -426 7893 4470 963 6908 7582 -2803 16201
1124 16201 -3762 8082 8419 -2699 14296 -717 6656 4986 4712 845 8612 487 1818 10333
1138 10333 -8501 12276 -3869 106 5088 -3917 927 59 -1253 -3674 5673 -12262 6259 -4652
1152 -4652 -6711 5857 -15046 2062 -5908 -6138 -3137 -4750 -9140 -677 -5484 -10168 4898 -16362
1166 -16362 2647 -6618 -8551 2228 -9816 -995 -4492 -2693 -6024 2275 -8679 1620 1266 -8775
1180 -8775 8830 -6836 3690 360 -1544 2441 3109 1315 1986 8040 -5019 13382 -2694 5408
1194 5408 8242 -3867 11100 1280 5297 5881 6153 959 10213 528 3923 11687 -5983 12479
1208 12479 -2872 2688 6177 -1738 4882 2180 1500 -57 6851 -7104 7280 -3424 -3459 6540
1222 6540 -9261 4210 -4723 -2109 -1510 -1753 -7417 -1423 -3301 -10460 3935 -13813 429 -5131
1236 -5131 -8731 766 -8749 -4066 -4510 -3281 -9225 1989 -10277 -246 -1220 -10854 6308 -9951
1250 -9951 494 -1445 -4604 -656 241 -2216 471 4039 -6943 8965 -5313 3177 6065 -3544
1264 -3544 8302 -478 3974 2864 6386 787 8332 2498 3060 10980 -4832 11927 413 5307
1278 5307 8136 1096 5402 5070 3908 335 10041 -4379 9378 1231 -1891 9495 -4548 4773
1292 4773 -1632 -744 288 1178 -4175 1625 -1042 -7517 6819 -10789 2928 -3164 -6256 1699 -7494
1307 -7494 -2105 -3815 -4288 -8074 2269 -8956 -2431 -2444 -9816 3290 -9841 -1617 -3771 -5054 -3801
1322 -3801 -1948 -4082 -3489 2715 -9800 6268 -5118 -1626 3195 -4762 5339 -1435 1248 597
1336 597 4733 -1951 7126 30 968 9519 -4942 11440 166 2593 6040 1782 5330 4988 4775
1351 4775 1917 9155 -2428 9554 2853 999 9110 -3655 6350 1580 1552 2241 3312 -1721 2058
1366 2058 3129 -5240 7290 -7374 3095 -248 -4155 2092 -3699 -1593 -2898 -196 -6837 2801
1380 2801 -8414 -1926 -1488 -9348 2701 -9371 -2156 -3208 -5407 -4199 -2992 -5466 -3903 400
1394 400 -9266 4386 -7923 -2636 1721 -7365 2608 -3941 -279 -1673 1548 -3416 4285 -1393 -724
1409 -724 6024 -5242 6657 -1588 2631 4448 1044 2637 3203 3888 255 9219 -2607 7796 3055
1424 3055 277 9623 -1091 6476 2415 2839 2150 5592 291 5082 2971 -1805 9543 -4381 5068
1439 5068 1134 -1162 3212 -1605 897 -806 1099 -5801 4761 -6198 -1124 959 -7470 3305
1453 3305 -7089 -1148 -3796 -2373 -4278 -1577 -4947 -4902 -437 -10132 3050 -7610 -4647 -453 -7159
1468 -7159 -12 -3669 -3586 -4186 816 -6495 2025 -3062 -3287 4731 -7741 4229 -2156 -551 1761
1483 1761 272 2344 2180 1121 -896 7612 -3144 5994 1423 -30 7328 -448 5234 2334 3795
1498 3795 1643 7061 621 4911 5561 -1830 9352 -1707 6639 2561 937 5698 635 2252 2030
1513 2030 4088 -3498 6081 -3440 2023 3637 -4863 5010 -4657 857 -1160 -571 -2568 -517 -3088
1528 -3088 -4906 -244 -9563 2707 -7251 -3931 -1424 -7457 62 -5468 -3102 -4868 -717 -7266 -145
1543 -145 -3257 -5758 1364 -8530 1930 -3952 -2089 -1232 -2598 -2458 -807 257 -4289 6048 -5392
1558 -5392 4123 527 -3145 6139 -2358 3939 1955 1887 1848 6066 -112 3790 3946 -978 9629 -1872
1574 -1872 6334 2727 1943 5304 2844 2958 1547 4976 -1133 6418 -428 2702 4336 -3074 6592
1589 6592 -2780 1785 599 1658 -1087 991 -1498 -1957 3688 -8453 3791 -4763 -2883 730 -5449
1604 -5449 -944 -3987 -2694 -2603 -1498 -7538 389 -4683 -4794 1384 -8807 553 -5322 -4455 -1872 -3404
1620 -3404 -2930 -2022 -1433 -4349 3893 -7489 2662 -665 -3027 3093 -4025 2195 -627 2098 -1026
1635 -1026 3558 -717 2139 4641 -2550 7698 -975 4672 3196 1260 4208 3409 3581 3655 5758 -666
1651 -666 9159 -313 4479 5744 -2458 6982 145 3603 2054 3333 516 3231 712 -450 5300
1666 5300 -4425 3940 -2679 -550 2108 -3216 1625 -3265 -856 -3953 1042 -5489 1366 -2613 -4254
1681 -4254 1434 -6847 -516 -4743 -3438 -2987 -2994 -5264 -2832 -2043 -6894 2243 -8331 -235 -2429 -5511
1697 -5511 2009 -3828 -451 -1326 -200 -3198 2743 -2578 1102 2578 -3558 5785 -3465 3400 2815
1712 2815 128 2766 622 2254 844 4555 -1275 6740 39 3046 5674 -825 7673 622 4571
1727 4571 1337 3640 1598 4978 2091 -279 6376 -2814 6637 -43 235 3396 125 1820 837
1742 837 915 -2337 2890 -3754 1255 -631 -4092 3885 -6183 778 -2870 -2912 -1634 -1899 -3417 -1399
1758 -1399 -686 -6892 1422 -7548 175 -2918 -5962 -182 -5122 -130 -3352 -1433 -3740 485 -4488
1773 -4488 -2283 491 -5638 3474 -4290 902 -66 -1397 -263 1145 81 402 4517 -3335 6206
1788 6206 -858 2301 4874 -1720 5958 1111 3519 2167 4025 277 5112 2298 1143 7319 -1644
1803 -1644 6561 699 2323 4191 482 3390 533 2744 -11 3811 -1984 3101 887 -2425 4628
1818 4628 -4006 2613 -1137 75 -629 -158 -1897 -1647 -1323 -5554 2295 -5483 -923 -1424 -5295 764
1834 764 -4888 -2269 -3309 -2509 -5259 571 -4224 -2244 -256 -6300 2923 -5440 -520 -2537 -2805 416
1850 416 -1689 -503 -1682 2744 -3217 4037 -1494 271 2098 -1840 4049 -1142 2587 616 3486
1865 3486 988 3626 2230 -580 6850 -1138 4973 1858 2016 4810 2089 3650 1498 4464 -611
1880 -611 5925 -1160 4178 2421 -869 5454 -2059 5393 537 1128 398 1468 -1288 -321 1222 -3412
1896 -3412 3262 -4809 926 -1738 -3505 1486 -4801 166 -3665 -735 -4889 650 -5004 -2435 -398
1911 -398 -5364 955 -4834 -1337 -2622 -2445 -3049 -1029 -1692 -2846 1893 -6375 2352 -3350 -1685 1828
1927 1828 -3851 3273 -1650 94 -473 996 -1264 3003 92 -1464 5580 -2620 4390 56 1793
1942 1793 3264 1381 3809 1562 3882 -504 4792 -535 4362 3338 1002 5973 -459 4431 1540
1957 1540 3021 1236 3302 1368 155 2888 -1316 5652 -3386 1222 1041 -2065 2019 -2075 232
1972 232 -1746 595 -3694 1352 -3657 -1859 928 -6806 1300 -5574 -1154 -2730 -3041 -1543 -2801
1987 -2801 -1579 -4723 -364 -5641 1229 -4878 -2664 -95 -4327 1596 -4569 -346 -3963 1081 -3245
2002 -3245 19 222 -2459 4573 -3280 3901 -1548 -94 1467 -254 1375 688 4470 -1165 5260
2017 5260 -1341 4378 3265 -608 5478 -725 4155 1341 2906 2759 3249 1815 2703 3682 -1471 6416
2033 6416 -1241 3644 2367 -752 3851 -349 3308 -1030 2982 -1314 1476 -1337 -1755 2268 -5513
2048 -5513 3058 -4173 -541 -1520 -1376 -1745 -2712 -1810 -4853 2024 -5485 112 -2972 -2627 -346 -5106
2064 -5106 -1170 -3823 -1053 -3537 -1171 -4694 -1170 -2264 -4389 2669 -5828 1683 -2922 579 705
2079 705 -1191 921 -621 2202 -1603 3058 -1821 2512 2013 -713 4253 -488 4727 1265 3695
2094 3695 1750 4110 1413 829 4568 -973 6322 -263 3654 2170 478 3022 137 2553 1592
2109 1592 3347 -2197 4419 -793 630 2698 -3873 4132 -2734 198 -748 537 -1103 -583 -937 -2540
2125 -2540 1561 -6051 1186 -2719 -1864 481 -4781 -703 -3846 -1193 -3550 -255 -4404 -1611 -1306
2140 -1306 -5117 1947 -5953 -14 -2947 -1710 -199 -410 -1430 -2172 536 -3572 3205 -3759 1567
2155 1567 845 -2058 4727 -2082 2049 1117 2052 -798 2129 536 1942 3308 -1083 6337 -943 3637
2171 3637 2799 604 4507 519 3274 270 3865 -728 5286 1267 1034 3132 -1158 3657 -69
2186 -69 2259 1072 810 -91 2225 967 -2073 3146 -3245 2701 -1002 -1195 519 -2450 868 -2605
2202 -2605 -822 -2918 700 -4137 -284 -1996 -4671 1485 -6108 7 -3370 -2129 -1425 -2289 -1741 -3058
2218 -3058 259 -4063 527 -3868 -782 -461 -2573 1197 -3107 1388 -1420 1219 -645 1962 -328
2233 -328 131 2719 -1804 5518 -555 1013 1990 -91 2192 743 2241 18 5162 -399 4676 490
2249 490 1898 4867 -728 5462 726 3461 968 1565 1509 1385 2063 -488 4055 -2844 4116 317
2265 317 -1382 987 -903 1466 -1552 420 -2530 1421 -2742 -278 -947 -3617 1659 -3243 -250
2280 -250 -2564 -2625 -1895 -1595 -1454 -4246 -645 -3858 1553 -3500 -1869 -1595 -3835 1377 -3455 -232 -3664
2297 -3664 573 -1623 -155 -1003 -986 2380 -2742 2890 -1642 138 722 -1048 1596 959 1777 -352
2313 -352 2912 -1445 4367 514 1404 3347 -673 4362 306 3072 685 2481 1540 2562 3632 180
2329 180 5151 -1015 2910 1006 271 2465 -131 1609 486 1716 -2073 2418 -2476 184 883 -2503
2345 -2503 2468 -3664 1065 -1514 -257 -696 -715 -577 -2321 -114 -4281 1245 -4307 -594 -2235 -4277
2361 -4277 104 -3876 -1177 -3992 -970 -3795 163 -3056 -2712 709 -4570 2272 -2972 -1215 -1084
2376 -1084 -1110 -680 -802 471 -2045 2217 -1619 2825 -940 440 3697 -1426 2667 360 3635 1382
2392 1382 2351 894 2613 2065 -49 4636 -851 4010 639 1285 3372 780 2560 264 3081 -1171
2408 -1171 1755 402 1761 2645 -498 2790 -2497 1292 -910 100 -627 196 -1039 -1756 -605 -2984
2424 -2984 2259 -4246 700 -1101 -4056 671 -3644 -1037 -2159 -670 -3210 36 -3037 -2488 7
2439 7 -3846 928 -4109 -1152 -1638 -3256 -768 -1034 12 -2732 1193 -2334 1722 -979 -1101 1905
2455 1905 -1806 1767 -1315 1502 -311 2724 153 1458 3003 -811 4126 -1531 4488 1649 1088
2470 1088 3473 1123 2849 1463 2894 -375 3221 -286 1980 3240 -60 3799 -1955 2470 -408
2485 -408 759 813 1152 50 -223 1405 -3036 2301 -1801 586 -93 -1701 -71 -2619 363 -2820
2501 -2820 -405 -3070 -151 -1885 -2636 -21 -3737 409 -3378 -1425 -1638 -2550 -1580 -1771 -1531 -3803
2517 -3803 8 -4545 478 -1780 -1449 1054 -3254 904 -1592 -152 -1029 770 -464 884 1267 -694
2533 -694 3388 -780 2282 -665 1307 1936 1074 2537 157 3360 -362 4008 1081 1062 2750 -260
2549 -260 4151 -298 2674 -263 2768 714 1986 1177 188 2810 -1804 3589 -971 927 698 -722
2565 -722 1136 -1264 989 -1268 390 -1457 579 -1533 -1913 133 -3783 667 -3172 -1066 -2410
2580 -2410 -1598 -1059 -1587 -993 -3090 107 -3439 153 -2436 -2396 -246 -3382 607 -1365 288 -1288
2596 -1288 57 -1745 -1407 123 -2650 1767 -2177 1123 -284 472 1155 -445 679 160 1885 -161
2612 -161 1991 -487 1583 2038 -591 3635 -128 2898 1641 1542 1876 2376 1095 1173 4227 -268 3688
2629 3688 -1244 1798 1237 1030 1017 -1105 1111 305 1236 -694 1142 -770 -715 1690 -2887 1486 -1002
2646 -1002 -1200 -633 -747 -1102 -1059 -662 -2560 -415 -3194 184 -2215 -2192 1041 -2967 877 -3316 -694
2663 -694 -1974 -515 -2981 -816 -192 -2631 959 -3087 718 -1865 -1057 560 -660 246 -771 1025
2679 1025 -1641 2338 -1133 70 1180 -328 3024 -464 2083 -456 2246 143 2104 962 1029
2694 1029 3434 -887 3421 305 1848 3344 1023 3053 588 1524 1360 3446 -381 2646 981
2709 981 13 1764 -1243 3051 -1710 2223 624 194 -367 -1158 -316 -2167 809 -3290 193 -1618
2725 -1618 -1094 63 -3252 1071 -2149 -611 -2133 -1172 -3698 -386 62 -3424 750 -3259 -98 -1943
2741 -1943 -2053 -765 -2025 -1101 -1691 -251 -2419 1542 -2227 -467 130 -1940 2332 -1893 713 12
2757 12 1305 -687 574 164 513 3502 -1717 3058 -750 1416 1025 94 2516 725 2967 284
2773 284 2816 -519 3253 1007 1968 2944 -965 1839 -154 2216 110 1123 335 436 147 -1601
2789 -1601 2069 -2789 606 -530 -981 109 -1625 692 -2914 26 -1936 207 -2157 -2397 -384
2804 -384 -3510 663 -2840 -888 -1821 -391 -1668 -1969 415 -3035 508 -2360 589 -2672 -924 75
2820 75 -1672 1353 -2055 600 -880 -730 -546 203 -373 75 991 -2398 2465 -613 1498 1937 30
2837 30 1478 172 2143 709 2902 511 2233 1254 1003 1909 -600 3903 424 2000 -26 1489
2853 1489 1317 556 1896 -88 3087 -699 2305 228 -174 1003 -1436 222 -714 1343 -915 1022
2869 1022 -1305 -1555 1067 -3183 415 -2362 286 -2400 -1262 -539 -629 -649 -2332 586 -3047 778
2885 778 -2719 -657 -694 -2382 -417 -2608 -930 -1705 -509 -754 318 -854 -1982 381 -2564 1340
2901 1340 -1351 347 -145 132 1827 -659 897 -543 2816 87 2017 994 455 2414 -430 3283
2917 3283 -928 1637 632 1231 885 979 2118 47 3472 -255 1815 490 710 1673 27 1634
2933 1634 -281 2073 364 2235 -796 -38 -335 -1656 1147 -1773 768 -1676 -344 -1198 -896 468
2949 468 -1523 368 -2576 604 -2639 -960 -1317 -2646 253 -2675 -52 -2264 -199 -1791 -1091 -1460
2965 -1460 -1990 -259 -3231 192 -2314 763 -1162 -1187 -77 -1899 626 -1272 1268 -1474 1629 66
2981 66 -793 1627 -451 1603 -911 1598 -1046 1855 1568 560 1542 216 1690 -343 3078 960
2997 960 1549 1874 338 2378 -444 1879 9 2100 553 943 1410 -212 1564 -758 888 366
3013 366 146 -89 -466 -736 -1610 1664 -956 1292 -1595 -493 -854 -3044 355 -2690 122 -2224 -288
3030 -288 -989 -844 -931 -1704 -623 -3266 433 -2340 -823 -2552 -1060 -1054 -1315 -160 -2188 559 -2081
3047 -2081 255 -456 -861 1523 -1811 796 -1147 845 -351 570 237 -453 1882 -775 2473 -1133
3063 -1133 2000 118 1283 1468 970 2206 235 2861 -128 2596 780 1418 2004 -480 2604 19
3079 19 2312 89 832 831 2857 793 -752 1802 -1633 875 -1866 881 521 -967 444 -1605 -210
3096 -210 -1868 -6 -2000 210 -187 -1740 705 -3002 443 -2762 -626 -1626 -537 -54 -1718 -327
3112 -327 -2461 604 -2055 479 -1037 -1895 1086 -2562 528 -534 656 -1448 498 -83 351 1360
3128 1360 -2662 2128 -1207 1516 -247 1131 732 -578 1594 -25 2214 -525 2587 466 1507
3143 1507 2285 190 2425 -754 1911 70 1648 1323 266 1486 534 2612 -613 2359 -1264 1298
3159 1298 658 -905 915 -608 870 -26 393 -1136 138 -628 -846 1215 -2230 1190 -1604 -321
3175 -321 -1067 -1434 -840 -1633 -109 -1473 345 -2781 -700 -398 -729 88 -2235 906 -1451 -298 -1811
3192 -1811 -283 -1106 -1226 -275 -881 1388 -2349 829 -715 -7 584 -86 1617 -1001 1069 -697 2050
3209 2050 191 653 1100 36 2273 301 1129 142 1675 681 530 810 -635 1958 -819 1998 269
3226 269 1759 1484 -233 1249 -321 1324 -629 2157 -1041 663 -290 -1518 1239 -1205 1357 -1754
3242 -1754 -168 -625 -256 -534 -1544 -217 -2373 1515 -1282 726 -1126 -1065 366 -1447 368 -1511
3258 -1511 -1229 -1850 -495 -1774 -772 -903 -1872 1472 -2228 440 -1448 -412 212 -1545 -294 -836
3274 -836 1437 -1318 1237 -1121 974 1653 -560 1732 -835 2340 -159 1496 1145 993 1242 653
3290 653 3669 -97 3445 -506 963 2190 246 1796 -527 2640 153 1738 1 1450 1082
3305 1082 18 1743 -942 2134 9 1108 -408 -147 -633 85 -146 -1817 1435 -1171 331 -597
3321 -597 -902 107 -1334 -356 -1478 539 -1735 -108 -1078 -1018 -413 -2411 600 -2073 50 -1090 -831
3338 -831 -868 -1534 -837 -2748 -1191 -1111 450 -646 -850 -283 -1445 -73 -822 1855 -334 307 -436 39
3356 39 1428 438 1754 -537 2738 788 671 889 -88 1487 -427 1790 -417 2508 393 1987
3372 1987 1511 -579 2349 -871 1480 -823 1983 383 781 535 537 294 -1072 1681 -1292 1592 -220
3389 -220 -663 565 -747 582 -1516 252 -974 -7 -1215 -936 -188 -1507 3 -2158 -298 -1604
3405 -1604 -234 -556 -1509 111 -1975 516 -1470 99 -447 -456 757 -1754 843 -1372 327 -1021
3421 -1021 -425 -698 -602 329 -47 526 -1219 509 -1042 187 971 401 1551 342 1629 -57 1793
3438 1793 -659 1282 497 866 2429 -405 1939 -17 1668 513 594 829 -340 2114 -1787 1956
3454 1956 892 1199 578 606 1115 -573 -53 -1036 895 -674 951 557 -290 1042 -1989 311 -1773
3471 -1773 -95 -682 -952 -907 -1141 360 -1823 684 -1911 -77 -1293 -568 -537 -1670 455 -308 -541
3488 -541 -546 322 -1713 -712 -838 -421 444 -822 1469 -1622 569 506 -1272 -49 -992 574 -175 1462
3506 1462 -729 -32 1318 237 1241 -1153 2111 281 1374 1000 1301 962 1280 1479 -811 1866
3522 1866 -514 209 -33 1217 2084 101 1269 -266 304 263 444 -511 638 677 -1148 960 -606
3539 -606 398 811 201 163 -324 -365 -1225 -40 -1162 386 -634 -468 359 -1501 145 -1890 -371 -1172
3557 -1172 -1554 -1678 -948 -670 -1875 949 -1513 1269 -1508 -120 -742 -527 -333 -572 654 -805 1231
3574 1231 -1526 239 -88 -623 791 -339 1299 -1191 1471 -241 1069 2107 -10 1662 -468
3589 -468 1763 -750 2040 866 743 1795 -57 938 -341 1634 349 1533 199 305 1244 -891
3605 -891 2421 -472 1253 -565 71 249 -1077 372 -1539 687 -698 938 -1013 103 -499 -784
3621 -784 -395 -1618 192 -1816 643 -1532 -785 -689 -1332 -133 -2054 470 -1967 -1300 -1471 -802 -563
3638 -563 -579 -197 -2261 717 -1166 -48 527 -1041 338 -1670 66 -1008 296 628 104 342 247
3655 247 1066 719 1569 -312 1389 592 527 925 1228 1966 515 1957 -24 1644 778 222 2082 -306
3673 -306 2356 -222 1266 338 543 543 566 1324 -1233 1345 12 474 153 -295 394 -210 -456 -646 676
3692 676 -1653 696 -1061 100 134 -966 566 -1787 -947 -888 -167 -1091 -596 -793 -1816 93 -1384
3709 -1384 -67 -1118 6 -1478 -1167 354 -1699 472 -863 -107 -728 10 -308 -609 158 -502 136
3726 136 -1235 1348 1087 -195 531 -504 404 67 1255 603 1609 903 285 1379 350 1462 -383
3743 -383 922 -754 1465 583 -52 2777 243 789 -773 2119 414 1178 967 102 1573 -40 818
3760 818 -762 73 -100 14 371 -1413 976 -897 -262 -818 -593 -1712 -860 525 -1414 147 -951
3777 -951 73 -1170 -405 -1492 -889 -62 -1583 648 -1463 -1031 -2067 913 -153 -1039 196 -1879
3793 -1879 790 -1012 1087 499 -358 -264 -1353 363 -1146 1460 785 755 399 -54 256 -340 2440 585
3811 585 2348 1345 540 -705 156 852 -156 -23 -1179 989 -1 91 296 -435 2079 81 1536
3828 1536 -102 1517 211 1192 798 -230 849 -495 1482 -205 -259 -601 563 350 -107 293 -901
3845 -901 485 -1112 -424 -410 -430 319 -1786 220 -2271 10 -1943 -611 -337 -1620 544 -1895 742
3862 742 -1386 98 10 -750 -1106 -482 -358 -996 418 -572 823 453 -233 1159 -1062 520 -852 841
3880 841 -457 921 666 185 1561 -456 1513 -583 1130 278 1436 422 202 1629 -950 1817
3896 1817 245 1436 59 463 850 -1145 1797 237 2540 -102 2115 1441 27 1995 -556 787
3912 787 -313 1124 -813 206 521 -471 560 -1156 302 -943 -14 -718 -614 -1020 -750 317 -748
3929 -748 203 -1288 -599 -1087 -791 -451 -1292 535 -1832 179 -1071 -421 -362 -892 -485 -810 -255 332 91
3948 91 -87 897 -50 199 1122 -869 838 -703 1742 -157 1016 1204 -487 665 986 1156 -229
3965 -229 1769 -525 1059 280 704 488 -828 1342 559 1024 663 1432 1133 -545 1195 -1002 1341
3982 1341 -394 787 577 404 421 -1186 57 -1996 -53 -772 65 -227 -831 92 -996 -224 -867 -395
4000 -395 -345 -1572 490 -1812 -99 -1273 -254 -1115 599 -2189 -567 -255 -1529 -36 -508 81 -1415
4017 -1415 -604 -1149 -210 525 -1136 -31 -874 319 -417 -69 -46 601 484 318 1230 428 1305 -376 -7
4036 -7 509 -1233 1246 163 1074 886 67 -9 1050 1080 158 2936 38 2292 2 654 -286 850
4054 850 908 -692 -142 -210 330 -238 493 591 -383 1877 -1306 831 -930 -337 -713 335 -170 -722 203
4073 203 -1621 566 -936 253 -838 -249 131 -1609 680 -1522 -532 -1128 716 -160 -462 240 -1324
4090 -1324 1033 -2275 1224 146 -185 768 -818 593 -1141 1426 -880 435 -999 -145 891 -886
4106 -886 1287 -154 1201 -568 864 488 1251 572 630 1385 -448 594 345 1258 -91 402 708 -175
4124 -175 837 -614 1402 859 950 590 -757 -52 135 718 -757 620 330 -318 559 -700 185 -545
4142 -545 506 -922 113 -57 -21 -100 -1141 106 -1524 -464 -796 266 -1002 177 28 -1338 210
4159 210 -1438 -348 -1096 -1047 -298 -1627 228 -854 398 -931 1140 -53 -958 30 -625 886 -359
4176 -359 841 523 825 167 1026 767 -132 1729 396 1355 -589 1336 776 291 1884 -197 823
4193 823 389 1262 552 1374 576 410 1798 -1053 1574 -18 900 -179 -96 569 -421 628 -465 378
4211 378 -1013 1036 -116 309 -87 57 648 -668 657 -458 -341 -118 -350 143 -1741 834 -1514
4228 -1514 -502 -801 233 51 -2004 45 -1125 -606 -1069 -149 -148 -452 682 -1351 817 -589 253
4245 253 -895 -36 -152 -49 705 -971 977 -713 1169 373 968 -38 -147 499 89 1163 314 375
4263 375 -57 393 830 220 127 -294 1082 491 1784 1192 -20 429 801 1016 -90 1532 -686 1523
4281 1523 67 851 1722 -1029 1475 -186 459 -810 1246 104 -640 421 -1018 173 -2128 952
4297 952 -114 74 -295 -989 -709 -1064 344 -1420 -272 -581 -567 -110 -981 -546 -1217 1017 -1365 -98
4315 -98 -902 -199 -990 -849 746 -934 1354 -561 680 237 -121 487 476 627 -283 729 -381 691
4333 691 180 44 1570 -9 979 -189 1286 -509 957 923 950 1705 -124 986 199 1150 1406 1303
4351 1303 200 -493 1958 521 1054 789 408 -416 -417 97 -86 847 -754 336 -813 271 1008 -1122
4369 -1122 -339 -547 36 -906 -255 -992 -1186 1395 -946 -935 -465 1050 -1204 -737 -343 24 -1289 -1492
4387 -1492 445 -1185 174 -590 441 108 -1246 541 -1072 915 -791 132 -518 1111 -230 -461
4403 -461 1022 -633 590 -1124 1188 -924 -73 110 515 976 -214 445 -2 326 1657 -11 588
4420 588 -757 675 250 1169 -122 272 650 373 1910 39 716 -123 1174 -842 579 25 -746
4437 -746 428 -62 1190 -1112 213 -438 -661 -397 -1288 -495 -1360 277 -2136 1288 -1385 -600 -278
4454 -278 -1321 -247 -425 -124 -1843 -573 -701 -873 -10 -1578 574 -1153 -7 -485 -285 668 -1636
4471 -1636 12 -1980 436 -1464 -448 -1243 916 540 147 1511 -1650 1499 -778 499 161 374
4487 374 475 -1030 841 916 -180 205 802 52 412 259 217 1895 -576 743 -226 283 127 -129 -211
4506 -211 160 624 -521 833 -827 226 -745 -1056 875 -704 91 -1038 267 -161 198 833 -341
4523 -341 -291 -582 686 -1009 -1415 101 205 -866 -93 -240 -1173 -1316 -819 -70 -685 -458 713 8 439
4542 439 -1635 508 377 -181 -72 -389 -395 -517 895 -733 453 -503 766 -1061 -775 1127 -29 -30
4560 -30 -634 1389 -362 383 98 231 1685 -838 1273 812 641 549 134 514 -659 529 -324 85
4578 85 -560 529 11 -513 -111 -420 317 312 193 187 -571 248 -3 -385 -987 825 379 312 -128 -1026 -107
4599 -107 -937 1294 -1099 -519 -764 -688 -316 -1021 174 -1200 896 -1611 740 -519 -668 -236 -605 -747
4617 -747 -1226 988 -891 713 13 -541 753 -330 8 -241 572 -594 424 36 -123 730 -532
4634 -532 1075 -385 649 -1006 211 979 302 1072 425 1472 -446 1242 900 526 351 -1002 1067
4651 1067 967 1157 -615 1433 47 405 -704 -195 46 -1346 1039 -665 247 -473 -697 32 -614
4668 -614 842 -1662 47 -183 -572 -758 -1776 305 -885 230 -278 296 -1799 -331 -1517 -949 -682
4685 -682 -874 359 -751 234 -594 196 273 -546 717 -450 284 -725 -435 332 -37 1540 -224 917
4703 917 -51 1206 542 411 1000 602 1567 -133 1098 -680 1124 243 1125 53 -58 -12 365 1752
4721 1752 429 1287 717 1695 113 -39 705 -305 1080 506 697 924 -542 397 -906 153 -660
4738 -660 553 -27 516 62 -493 1072 -627 -298 -56 171 -793 -412 -539 -1323 50 -633 983 -1023
4756 -1023 191 -677 -1151 761 -310 -976 -955 -731 -666 606 537 643 -679 -340 704 -442 214 -1612
4774 -1612 175 422 243 -1193 -598 705 86 933 -59 -444 -748 -38 -20 -694 290 378 784 345 -205
4793 -205 346 -285 937 205 928 250 526 839 -921 161 383 369 321 144 538 182 340 259 -346 -681
4813 -681 1425 -378 -1078 -545 105 -1245 -457 1378 -564 -56 312 -8 -734 208 580 -1302 253 -293
4831 -293 -961 -799 -144 429 11 -573 -222 315 -201 837 10 191 -488 -675 7 -918 85 -1477 57
4850 57 -639 -504 544 -440 562 -240 276 364 1138 134 3 275 -351 1354 161 787 48 603 657
4869 657 -183 1445 275 564 -7 1182 -208 -121 499 68 520 -866 788 463 -158 548 851 793 -515
4888 -515 242 -465 510 -273 -450 -22 -317 -508 -287 75 160 -50 -666 358 -173 24 437 166 217 -1046
4908 -1046 -520 -956 -144 -4 -422 530 -964 654 -353 351 401 181 -588 -1479 1327 153 190 -676 753
4927 753 306 -357 819 440 866 223 110 -249 318 285 247 -216 516 1293 -662 145 443 1222 739 449
4947 449 184 378 -54 104 333 1321 278 67 -191 118 -595 876 -61 828 166 131 957 152 246 -460
4967 -460 426 -2041 -1018 -525 -1093 545 -713 52 -528 -614 -504 -290 -1151 -1221 187 -57 654 -764 161
4986 161 -293 -691 460 -877 -1624 -797 -552 199 -641 135 -37 490 -778 191 289 219 -130 98 1320
5005 1320 55 -233 -7 1411 -345 791 1008 688 770 -307 1665 -923 565 227 697 563 1554
5022 1554 980 1387 221 -1001 1386 -683 1194 -136 257 -415 -1002 1130 -141 638 -600 -39 -118
5039 -118 -329 229 -861 583 -745 -291 -562 -74 -280 -646 269 -917 93 -1378 -298 -244 -696 272
5057 272 -524 51 -854 -66 21 566 -827 135 379 -456 183 -295 767 -1007 -615 -607 279 550 375 41
5077 41 -941 568 -101 -387 121 -61 214 136 -47 163 371 617 173 789 1431 992 -174 1223 -241
5096 -241 -38 245 685 120 -728 556 -590 863 -51 635 253 383 577 -970 761 -962 -116 53
5114 53 -63 842 -19 680 -847 743 41 -228 -60 -1173 -800 -227 -237 -1703 650 -1833 -65 -581
5132 -581 -567 456 25 -115 -152 669 9 -287 -454 -554 150 -443 -260 475 438 -1781 491 -18 -239 1204
5152 1204 -893 -140 -938 268 -44 -139 912 803 945 -505 307 -267 100 210 271 723 -578 430
5170 430 -112 1011 -195 718 711 503 431 -274 865 -926 924 -314 -342 485 -806 101 -967 722
5188 722 -679 1074 -525 -310 916 -357 236 -388 1007 -385 415 134 360 -1070 114 755 -1103
5205 -1103 320 -178 -225 -1334 -760 -891 -329 784 -880 116 -1022 -490 108 -258 158 -577 956 398
5223 398 368 238 387 -123 -981 444 436 1240 301 1560 -573 277 -118 -173 764 -454 1467 106 478
5242 478 1166 -432 580 723 1199 -414 710 -56 1228 737 683 1091 -513 848 -450 207 -793
5259 -793 1280 180 -206 450 -998 503 -220 -224 -698 278 40 -316 897 -1051 249 -537 -734 -961
5277 -961 -480 50 -1269 291 -1339 -682 -119 -257 -395 -547 436 -539 473 -719 -187 -239 -7 -300 -862
5296 -862 -90 -750 1237 317 -286 9 598 -533 -818 1090 -135 4 99 622 876 1345 1003 -276 525
5315 525 387 480 21 -189 1045 149 407 -560 532 -72 697 106 1032 1309 -81 252 -726 1124 -9
5334 -9 400 170 755 -875 36 145 -916 -137 -287 570 1 -251 -392 -590 799 -545 -58 -1719 -505
5353 -505 83 -138 -29 -131 475 -1056 290 -849 -232 -253 -303 -534 -598 -283 879 -402 133 -967 -465
5372 -465 265 741 -500 668 -663 -255 359 -1146 -641 -344 572 -468 1291 261 589 451 571 -78
5390 -78 -858 220 771 1813 519 405 760 1007 235 -653 288 155 191 -631 1031 -203 -801 250 -1736
5409 -1736 129 -781 -532 -269 717 982 147 632 -1258 141 -352 -27 -809 31 -428 -1666 1281 -23
5427 -23 -41 -760 -921 355 -1415 196 335 180 -239 -51 -524 -393 694 38 1249 -792 545 -913
5445 -913 1052 683 -7 6 -1571 495 328 1173 -455 -573 213 457 536 1282 -633 -100 180 543 1740
5464 1740 643 446 106 59 1311 181 543 90 1283 2077 499 -395 -363 1405 327 536 -409 175
5482 175 1466 -727 150 147 1214 -264 834 878 -780 1308 -677 -1255 -1360 863 -872 -772 -343 125
5500 125 1552 -845 658 228 103 -533 -779 -286 -381 -215 -572 -727 -32 -396 155 -374 -1542 562 -86
5519 -86 -806 -749 186 337 -795 -438 74 -220 589 484 2041 315 -758 -509 -402 675 223 955 -149
5538 -149 705 -376 -336 33 201 759 530 -27 40 882 656 -1010 835 658 201 162 1142 347 174 79
5558 79 989 959 -401 -570 -97 1008 -143 557 -247 30 686 -347 -48 -533 -569 -540 -301 -633 -375 -315
5578 -315 -1205 988 -750 -22 -1122 688 -572 -493 -1186 578 513 -971 597 -435 -87 833 -1341
5595 -1341 196 -856 545 -192 -392 365 -655 548 497 842 470 656 1775 -380 -717 22 726 1694
5613 1694 1733 -341 -21 402 219 228 1491 355 -471 1519 -976 728 450 1131 -13 -598 701 865
5631 865 1020 -314 -128 347 -312 919 -446 663 -1132 754 -708 -823 -78 177 680 -395 -725
5648 -725 -447 115 -634 67 210 1178 -974 -118 903 -77 287 -559 484 -72 -1291 -448 -473 -111 -207
5667 -207 -236 -225 -233 -127 -278 484 101 -638 928 -249 -500 321 1559 125 899 9 -378 390 1372 1201
5687 1201 647 1426 -658 665 -487 1120 224 -404 307 -73 -131 -288 964 410 654 -34 -316 436
5705 436 -348 -269 -62 825 -286 555 73 657 599 -472 -298 -747 -503 367 148 52 450 356 897 -307
5725 -307 208 -131 -284 -230 126 295 -511 -1098 596 -370 -289 -313 240 -369 -790 -465 -364 645 -639 710
5745 710 908 -666 887 -12 141 -725 329 727 -216 -262 -605 772 430 -151 -214 127 -1167 226 909
5764 909 253 448 -27 -607 41 37 370 361 969 459 416 -18 -37 -419 195 575 -696 -87 -270 151 -507 850
5786 850 566 613 88 34 42 -176 -257 677 -311 182 -214 404 -408 799 494 205 -587 483 -166 -762 -352
5807 -352 -872 8 -409 -639 -165 -101 494 -31 174 -905 -75 -553 92 -6 -594 779 -62 62 -592 58
5827 58 -321 -118 745 497 1390 -387 1294 -1382 59 -155 -132 38 -1178 772 556 -169 -658 205 129
5846 129 180 67 144 -104 -652 518 190 -155 -116 743 -218 461 -362 -110 1198 -332 425 247 -7 129
5866 129 325 1160 -234 286 -1262 1282 396 -363 1136 -1064 493 -267 1299 -551 190 263 122 -52
5884 -52 219 -34 -566 736 321 -516 32 -238 850 -349 376 159 -344 71 -29 -284 -716 1139 -282
5903 -282 576 189 86 1224 393 -525 -430 483 870 1122 490 541 421 -373 1026 -1195 805 -587 453
5922 453 133 227 526 -39 -198 -302 507 222 661 -526 -34 16 164 979 -72 205 153 -1004 108 -589
5942 -589 152 183 251 668 81 -471 -1327 789 -358 365 165 204 -463 -94 -1137 168 690 -129 49 -119
5962 -119 552 -256 -217 -523 -18 605 -1326 -441 1245 -46 -1089 444 33 -421 213 -549 136 -474 507
5981 507 -99 -54 613 228 1234 388 531 546 741 920 419 833 -501 40 -331 532 -493 -83 -318 199
6001 199 -187 636 855 -408 -235 244 412 -332 6 460 -113 -380 -492 62 38 127 -56 -91 -345 -406 -276
6022 -276 130 52 408 -1065 421 -341 749 -1024 253 504 -167 626 -79 -768 -471 -285 -286 470 -107
6041 -107 312 -195 118 -671 -1180 -170 -696 689 -495 -401 463 -993 587 -809 107 -815 -241 -21
6059 -21 -167 174 315 690 -166 531 1268 343 835 -317 742 152 655 361 482 -927 103 459 -260
6078 -260 1118 18 957 -206 5 393 512 -579 371 660 -387 1276 -68 628 260 -324 -696 -90
6096 -90 1269 -284 761 -1006 515 399 437 -632 -755 856 -827 -39 -301 -1058 -718 347 -169 -27
6114 -27 960 -53 -528 -1394 -430 -420 -592 376 -1199 689 512 549 652 288 287 425 -630 -677 201 -97 -340
6135 -340 415 256 -447 282 -660 286 232 -107 702 -33 774 262 406 515 386 -1646 584 670 -130 -181
6155 -181 -162 -429 820 -192 115 -1054 122 298 -715 1069 42 -649 -551 53 412 1181 769 -571
6173 -571 -82 -628 1125 -590 460 -421 -1758 166 -371 120 -103 -334 -326 -1871 -302 -156 61 -144
6191 -144 -479 -442 -592 240 -559 -372 1092 -871 -28 -329 470 465 292 -700 377 -775 820 317 -849
6210 -849 467 71 -272 1750 -43 -283 369 -992 69 499 193 441 -346 639 636 952 1172 76 106
6229 106 291 267 1208 332 -722 -355 111 -162 -402 -254 859 -505 949 -104 1088 -1871 -267 55
6247 55 290 -335 36 268 -392 677 -454 -395 -45 -415 -568 -598 981 -251 -216 -609 -805 952 -717
6266 -717 532 -530 -2 -298 605 268 577 -332 115 668 253 324 408 -564 -779 -555 47 699 805 458
6286 458 1342 -556 -283 183 299 338 -591 728 -135 1523 342 592 947 1182 341 -367 1231 -476
6304 -476 -449 355 -953 622 488 629 528 -192 -620 179 464 -181 812 -1352 73 -1255 1240 661
6322 661 495 164 118 -806 -199 144 78 -447 931 136 795 -1014 593 -885 -39 -581 -975 -188 -380
6341 -380 207 -40 370 -785 380 149 -133 -745 590 549 -610 83 -5 822 -123 -605 -518 -74 1053
6360 1053 459 913 456 697 274 248 -63 -407 18 716 -122 457 -230 -116 224 882 -438 442 -428 -67
6380 -67 -609 -539 557 530 214 -828 244 54 184 344 157 -494 1048 -158 -284 132 -1161 990 -251
6399 -251 -369 -2 -189 49 -180 474 612 -1325 -405 505 -13 -191 -243 416 -724 -789 -178 329 827 -8
6419 -8 -214 -209 -407 412 -377 445 275 416 -749 -139 172 3 -120 -669 -269 697 -790 -661 -229 -42 -330
6440 -330 -173 -418 -787 -94 -12 196 391 -688 1088 -62 60 -101 834 -358 1328 260 108 104 -321
6459 -321 -440 108 -175 -289 789 -1061 -970 440 402 355 -395 465 142 228 775 -139 112 -242 1191 193
6479 193 -498 142 -52 107 -534 -151 -115 72 -639 149 -548 202 -1211 -669 -1084 -1110 -511 -286 135 445
6499 445 -109 -68 306 -421 863 -446 -625 268 386 -440 579 177 941 -929 -710 -221 406 250 519
6518 519 95 -40 971 809 -482 -512 1059 197 146 488 27 431 148 95 467 682 932 720 812 175
6538 175 -418 -492 77 258 207 654 658 -150 489 -828 -473 210 8 -668 -1326 -192 -51 -951 189 251 80
6559 80 332 -386 -568 -48 381 -207 71 73 982 223 251 463 -1023 254 -728 146 -907 -688 576 -712
6579 -712 286 -500 624 -523 207 -42 767 459 -505 780 -279 -330 274 666 120 -564 94 142 715
6598 715 208 512 539 -327 1235 756 384 47 555 195 88 -16 663 -540 362 207 -384 200 -230 543
6618 543 -78 -522 -73 -695 -551 -262 375 -169 -604 -507 -474 367 -1163 -326 -250 485 339 -375 -599 -1365 -379
6639 -379 -371 -649 -301 -143 119 10 -132 -1169 246 119 566 372 643 735 41 -84 344 511 -564 -307
6659 -307 158 333 728 -459 591 -202 343 707 102 718 951 229 -40 610 -1620 347 76 341 -505
6678 -505 514 251 423 130 -830 -135 -41 1362 410 -311 596 -190 -923 -958 327 -625 -361 270 -299 411
6698 411 -57 -825 138 642 405 -464 -298 -371 -1101 -390 550 -964 -485 -162 606 77 -452 403 -353 -303
6718 -303 -573 -479 453 545 576 -262 -124 -251 331 229 -125 147 319 -688 -1040 516 242 331 420 -157 -173
6739 -173 12 96 -185 -410 154 274 621 -303 345 -514 1370 -227 357 -469 -160 606 321 629 156 -244
6759 -244 723 14 -441 213 773 668 1290 834 8 -281 460 202 527 452 123 805 503 -249 -987 1058
6779 1058 -242 98 -561 -501 -317 -284 -678 -84 -167 -280 459 312 -188 -138 -1228 241 -503 171 -436 175
6799 175 60 507 -467 -888 545 -392 -640 44 884 478 -782 894 -558 238 255 -678 -394 -341 304
6818 304 193 277 -301 1286 -418 -573 770 -112 420 -118 -410 -534 -397 77 -1115 57 -707 -164 566
6837 566 690 -93 -913 343 -963 360 -929 438 -174 287 -345 -699 59 -483 194 -10 224 133 -226
6856 -226 119 -586 283 -327 133 47 -377 -575 107 387 -293 355 537 751 -387 211 -517 309 -470 343
6876 343 658 -36 1143 -1149 -99 -366 -56 -26 -190 338 -297 626 257 859 -138 312 -150 319 628
6895 628 129 953 98 437 -449 912 1219 57 -1453 -774 496 -139 -280 -38 -1271 455 -562 -128
6913 -128 -231 -305 519 244 235 362 87 -742 102 1063 -1656 87 865 472 -522 96 99 -3 -1274 -274
6933 -274 337 -1157 -638 -858 504 -971 -416 -731 225 121 -411 -635 -486 111 533 450 124 -335 324
6952 324 163 755 -153 401 296 -334 -292 579 312 -273 888 -637 592 -602 -351 -213 -79 651 -669
6971 -669 201 -288 874 353 815 435 -684 406 -119 4 -516 167 225 -32 -644 -335 776 297 907
6990 907 113 154 -179 84 82 310 639 25 -652 -64 752 -288 -383 544 201 97 -261 112 -671 -409 364
7011 364 -411 941 -527 84 497 -1172 -949 152 -638 -622 299 -110 190 -361 -338 21 -125 691 -137
7030 -137 -195 485 -104 -966 -98 -25 133 -380 529 230 -329 -559 93 681 -635 9 -178 248 -52 4 -4
7051 -4 458 -222 1055 106 -260 309 524 550 1428 37 -545 -442 421 364 -14 -53 13 309 -440 -669 -621 -441
7073 -441 -406 -532 711 -121 -678 1195 651 550 -139 -532 435 -600 -895 165 -375 -844 -7 -889 -687
7092 -687 431 -718 -8 -70 -768 -214 972 278 741 386 204 417 -796 -260 11 -318 100 -887 -1057
7111 -1057 492 -59 -81 -888 -286 798 -122 212 406 -453 442 -885 -406 -397 335 -132 -65 585 -287 103
7131 103 -488 182 811 304 -774 701 -238 869 -877 -579 136 -63 359 -651 -395 685 -728 -1280
7149 -1280 179 -220 -307 809 -238 -405 585 -61 -988 -135 -117 221 902 -761 170 -21 -533 -465 319
7168 319 669 353 -375 394 355 -729 -348 85 -612 -47 -893 -431 -58 252 -907 -36 421 -533 199 -537
7188 -537 -842 -119 -435 -51 145 177 -363 -786 173 -847 712 -69 -941 81 538 51 270 642 10
7207 10 352 540 251 58 747 1057 526 207 177 327 217 -61 -424 -365 -182 -374 499 -493 212 -498 130
7228 130 -1160 128 151 -218 -795 -398 -504 -28 -697 245 417 123 750 -355 91 -377 -7 57 -159 -327
7248 -327 -353 -144 468 86 670 -221 81 492 533 309 -466 1169 -418 844 -177 -822 268 1207 40
7267 40 -163 273 180 449 -598 200 966 230 -35 441 743 393 644 -284 -74 -443 -120 823 141 -107
7287 -107 -122 325 -649 392 -175 -767 -486 -259 290 -173 754 282 235 272 118 970 -395 -336 -322 -894 676
7308 676 357 280 -362 -190 -979 -3 463 -822 200 -460 -225 -243 211 -802 -256 694 -905 -531 -357
7327 -357 -146 63 456 1089 466 720 532 -271 -1158 -654 846 538 957 32 130 0 254 390 -123 -273
7347 -273 -139 121 -681 -750 -485 260 252 105 -914 -762 -197 490 -51 -368 699 478 1004 482 -582 -347
7367 -347 -277 575 44 -266 124 296 -146 453 829 -228 408 67 488 148 -468 -903 -86 165 365 -679
7387 -679 -251 -656 22 -33 -146 194 -139 204 -180 -578 -216 496 272 -486 -62 -78 57 47 -120 4 372
7408 372 -78 -120 -628 -38 -61 518 1526 285 26 750 974 620 446 -654 187 714 -755 397 573
7427 573 535 669 579 185 490 -758 658 962 -258 141 26 171 -235 -209 1445 585 -6 -279 360 490
7447 490 396 -776 -177 -446 604 598 128 97 109 1401 249 -365 212 -454 410 333 -1075 981 188 1061
7467 1061 -700 -626 -1055 548 629 -267 -1732 -124 -740 881 -396 -459 -441 -535 -504 -73 700 -799 399
7486 399 -100 432 -653 18 453 -140 -805 -145 1419 -202 -689 -426 -101 324 401 508 491 -680 952
7505 952 -793 -474 -276 317 442 383 496 -277 656 -8 3 217 155 535 623 727 768 689 -522 -454 -346 -156
7527 -156 -372 189 -57 -92 530 -639 429 -602 232 554 155 126 -205 -564 -496 274 542 -285 -459 100
7547 100 -859 -420 782 -209 -712 -306 387 -367 268 298 -32 585 145 555 -364 20 -207 61 1097 -151
7567 -151 334 -130 327 587 36 813 229 125 -117 -353 677 88 -141 518 320 -35 1173 1187 701 -295
7587 -295 -358 -265 -734 456 -792 510 107 9 -91 -50 777 -725 484 350 486 -70 -26 -277 -971 -941
7607 -941 -764 243 -798 573 -91 -189 520 -135 739 956 626 -300 367 -64 -1006 -513 -790 -1100 -302
7626 -302 -132 -297 -37 1188 -487 52 425 -107 152 -450 -539 -119 441 -40 -91 103 -248 497 -56 -77
7646 -77 -398 -51 -206 -691 950 -751 -864 -132 999 -17 -1239 145 18 668 -313 -958 -22 1057
7664 1057 134 -341 563 45 -149 -331 581 1363 101 -224 -414 -1184 -584 -606 -816 249 15 -491 -677
7683 -677 499 -297 498 -862 628 -217 -239 80 -643 254 -279 -245 -394 538 386 -659 -717 91 120 -515
7703 -515 101 -110 -417 854 -465 109 -236 770 -1231 744 352 22 -395 485 231 282 366 -373 -190
7722 -190 137 -1 83 678 550 -291 1333 355 -294 143 707 183 -562 1643 -387 288 231 -246 722 124
7742 124 -4 7 361 430 419 -183 243 74 -352 -19 -1414 636 -396 -237 -589 465 -404 -269 -27 -796
7762 -796 15 495 721 -57 425 529 -276 318 -553 370 248 -38 -846 495 -442 628 41 42 -8 347
7782 347 -493 -432 6 468 332 267 -227 47 104 -997 76 430 400 -950 -942 -236 398 46 118 -363 -347 1741
7804 1741 11 180 923 1080 -287 203 367 -268 -136 162 192 -212 76 -30 -537 89 139 -599 -276 -793
7824 -793 145 142 316 -71 200 4 395 127 780 -200 80 -300 -162 -695 -760 91 -692 -391 -47 -251 -480
7845 -480 -239 1122 -216 156 -561 275 -422 -56 204 -45 281 -206 355 -753 431 -195 583 1091 -286
7864 -286 137 -12 99 368 -475 -142 -366 1164 276 666 -153 211 1006 233 448 614 -651 -292 224
7883 224 13 -191 390 782 363 504 -14 -636 486 -648 -209 439 -1102 466 -574 -186 -1212 -917
7901 -917 339 712 152 -310 925 948 -505 -323 320 -385 110 591 139 -639 30 -113 419 -334 870
7920 870 -342 411 -956 -832 -1777 -624 295 -265 446 -100 764 10 514 -60 -187 -787 76 274 -840
7939 -840 706 1042 883 -863 841 96 673 458 -682 699 -187 1306 -83 648 110 -60 878 822
7957 822 593 -357 -152 -10 -492 -1121 -661 898 -137 306 669 275 -654 469 -220 -68 -279 273 1031
7976 1031 7 88 -595 42 -407 397 898 -288 -1286 -32 -1621 -63 63 588 -478 850 -880
7993 -880 100 907 842 929 356 -755 -563 912 218 -276 -146 646 380 848 18 -789 135 474 310 -165
8013 -165 -638 1197 -679 65 212 181 53 314 -112 -342 541 585 383 134 289 -164 35 561 -612 661
8033 661 682 -141 656 -188 272 -348 1089 92 422 -281 250 -663 -566 -261 58 306 -1143 -131 -671 -287
8053 -287 -632 -685 -752 -282 1181 -294 -326 590 -508 -487 442 381 -971 -582 788 883 -453 277 103 -244
8073 -244 650 -517 -607 -292 353 170 -319 39 -970 324 606 661 -75 438 -67 -209 -75 234 766 -450
8093 -450 -615 -523 457 864 -54 1438 80 -135 -432 3 686 -229 -228 -232 271 511 486 -812 26 778 396
8114 396 -410 362 -96 -764 661 17 -1000 1066 81 -202 453 -352 -59 -287 -1344 396 -482 -459 282
8133 282 16 593 -498 -738 -28 -679 -347 -122 27 -26 -227 -100 8 358 314 -37 -129 -117 -56 -61 -249 -77
8155 -77 -652 -83 -204 -555 -876 -763 128 8 697 154 -286 181 94 81 -356 893 -425 389 -170 707
8175 707 286 -134 -474 -91 -125 575 734 -91 -721 1514 -295 209 336 -11 233 -79
8191g9
##END NTUPLES=NMR FID
##END=
