##TITLE=1H_SAM_30.235.2 DMSO
 DMSO-d6, 108 sc, 
 24.11.2020
##JCAMPDX= 6.0         $$ Bruker NMR JCAMP-DX V2.0
##DATA TYPE= NMR FID
##DATA CLASS= NTUPLES
##ORIGIN= UXNMR, Bruker Analytische Messtechnik GmbH
##OWNER= root
$$ XWIN-NMR		Version 3.5
$$ Tue Nov 24 13:56:08 2020 Russian Standard Time (UT+4h)  she@DPX200
##.OBSERVE FREQUENCY= 200.1315066352
##.OBSERVE NUCLEUS= ^1H
##.DELAY= (6, 6)
##.ACQUISITION MODE= SIMULTANEOUS
##.ACQUISITION SCHEME= undefined
##.AVERAGES= 108
##.DIGITISER RES= 18
##SPECTROMETER/DATA SYSTEM= spect
##.PULSE SEQUENCE= zg30
##.SOLVENT NAME= DMSO
##.SHIFT REFERENCE= (INTERNAL, DMSO, 0, 15.7039)
##AUDIT TRAIL= $$ (NUMBER, WHEN, WHO, WHERE, WHAT)
$$ ##TITLE= Audit trail, XWIN-NMR		Version 3.5
$$ ##JCAMPDX= 5.01
$$ ##ORIGIN= Bruker BioSpin GmbH
$$ ##OWNER= she
$$ F:/spectra/data/she/nmr/H-F/1/audita.txt
$$ ##AUDIT TRAIL=  $$ (NUMBER, WHEN, WHO, WHERE, WHAT)
(   1,<2020-11-24 13:55:03.26 +0400>,<she>,<DPX200>,
      <continue with go, POWCHK disabled, PULCHK disabled
       configuration hash MD5:
       00 E9 B6 7A A2 85 ED C7 34 08 36 98 17 FE 4E 26
       data hash MD5: 16K
       C3 A1 75 0B 05 AB DE E4 D3 A8 8E 3B 42 6D FF 5A>)
$$ ##END=
$$ 
$$ hash MD5
$$ 62 FE 44 AD C8 EA 4B A6 B2 29 94 3A 5B 06 F8 98
##$RELAX= 
##$RELAX= 
##$RELAX= 
##$RELAX= 
##$RELAX= 
##$RELAX= 
$$ Bruker specific parameters
$$ --------------------------
##$DU= <F:/spectra>
##$EXPNO= 1
##$NAME= <H-F>
##$PROCNO= 1
##$TYPE= <nmr>
##$USER= <she>
##$AMP= (0..31)
100 100 100 100 100 100 100 100 100 100 100 100 100 100 100 100 100 100 
100 100 100 100 100 100 100 100 100 100 100 100 100 100 
##$AQSEQ= 0
##$AQ_mod= 1
##$AUNM= <au_zg>
##$AUTOPOS= <>
##$BF1= 200.13
##$BF2= 200.13
##$BF3= 200.13
##$BF4= 200.13
##$BF5= 200.13
##$BF6= 200.13
##$BF7= 200.13
##$BF8= 200.13
##$BYTORDA= 1
##$CFDGTYP= 0
##$CFRGTYP= 5
##$CHEMSTR= <none>
##$CNST= (0..31)
1 1 145 1 1 1 1 1 1 1 1 1 1 1 1 1 1 1 1 1 1 1 1 1 1 1 1 1 1 1 1 1 
##$CPDPRG= <>
##$CPDPRG1= <>
##$CPDPRG2= <>
##$CPDPRG3= <>
##$CPDPRG4= <mlev>
##$CPDPRG5= <mlev>
##$CPDPRG6= <mlev>
##$CPDPRG7= <mlev>
##$CPDPRG8= <mlev>
##$CPDPRGB= <>
##$CPDPRGT= <>
##$D= (0..31)
0 1.2 0 0 0 0 0 0 0 0.06 0 0.03 0 0 0 0 0.0002 0 0 0 0 0 0 0 0 0 0 0 0 
0 0 0 
##$DATE= 1606211312
##$DBL= (0..7)
120 120 120 120 120 120 120 120 
##$DBP= (0..7)
150 150 150 150 150 150 150 150 
##$DBP07= 0
##$DBPNAM0= <>
##$DBPNAM1= <>
##$DBPNAM2= <>
##$DBPNAM3= <>
##$DBPNAM4= <>
##$DBPNAM5= <>
##$DBPNAM6= <>
##$DBPNAM7= <>
##$DBPOAL= (0..7)
0.5 0.5 0.5 0.5 0.5 0.5 0.5 0.5 
##$DBPOFFS= (0..7)
0 0 0 0 0 0 0 0 
##$DE= 6
##$DECBNUC= <off>
##$DECIM= 32
##$DECNUC= <off>
##$DECSTAT= 4
##$DIGMOD= 1
##$DIGTYP= 9
##$DL= (0..7)
0 120 120 120 120 120 120 120 
##$DP= (0..7)
150 150 150 150 150 150 150 150 
##$DP07= 0
##$DPNAME0= <>
##$DPNAME1= <>
##$DPNAME2= <>
##$DPNAME3= <>
##$DPNAME4= <>
##$DPNAME5= <>
##$DPNAME6= <>
##$DPNAME7= <>
##$DPOAL= (0..7)
0.5 0.5 0.5 0.5 0.5 0.5 0.5 0.5 
##$DPOFFS= (0..7)
0 0 0 0 0 0 0 0 
##$DQDMODE= 0
##$DR= 18
##$DS= 0
$$ [...]
##$SUBNAM2= <"">
##$SUBNAM3= <"">
##$SUBNAM4= <"">
##$SUBNAM5= <"">
##$SUBNAM6= <"">
##$SUBNAM7= <"">
##$SUBNAM8= <"">
##$SUBNAM9= <"">
##$SW= 16.9725356469052
##$SWIBOX= (0..15)
0 0 2 0 0 0 0 0 0 0 0 0 0 0 0 0 
##$SW_h= 3396.73913043478
##$TD= 16384
##$TD0= 1
##$TE= 0
##$TE2= 300
##$TE3= 300
##$TEG= 300
##$TL= (0..7)
0 120 120 120 120 120 120 120 
##$TP= (0..7)
150 150 150 150 150 150 150 150 
##$TP07= 0
##$TPNAME0= <>
##$TPNAME1= <>
##$TPNAME2= <>
##$TPNAME3= <>
##$TPNAME4= <>
##$TPNAME5= <>
##$TPNAME6= <>
##$TPNAME7= <>
##$TPOAL= (0..7)
0.5 0.5 0.5 0.5 0.5 0.5 0.5 0.5 
##$TPOFFS= (0..7)
0 0 0 0 0 0 0 0 
##$TUNHIN= 0
##$TUNHOUT= 0
##$TUNXOUT= 0
##$USERA1= <user>
##$USERA2= <user>
##$USERA3= <user>
##$USERA4= <user>
##$USERA5= <user>
##$V9= 5
##$VALIST= <valist>
##$VCLIST= <CCCCCCCCCCCCCCC>
##$VD= 0
##$VDLIST= <DDDDDDDDDDDDDDD>
##$VPLIST= <PPPPPPPPPPPPPPP>
##$VTLIST= <TTTTTTTTTTTTTTT>
##$WBST= 1024
##$WBSW= 4
##$XGAIN= (0..3)
0 0 0 0 
##$XL= 0
##$YL= 0
##$YMAX_a= 1266299
##$YMIN_a= -1359815
##$ZGOPTNS= <>
##$ZL1= 120
##$ZL2= 120
##$ZL3= 120
##$ZL4= 120
##$ABSF1= 10
##$ABSF2= 0
##$ABSG= 5
##$ABSL= 3
##$ALPHA= 0
##$AQORDER= 0
##$ASSFAC= 0
##$ASSFACI= 0
##$ASSFACX= 0
##$ASSWID= 0
##$AUNMP= <proc_1d>
##$AZFE= 0.1
##$AZFW= 0.1
##$BCFW= 1
##$BC_mod= 2
##$BYTORDP= 1
##$COROFFS= 0
##$CY= 11.3945322036743
##$DATMOD= 1
##$DC= 2
##$DFILT= <>
##$DTYPP= 0
##$F1P= 15.9154993809931
##$F2P= -4.1035820241983
##$FCOR= 0.5
##$FTSIZE= 0
##$FT_mod= 4
##$GAMMA= 1
##$GB= 0.15
##$INTBC= 1
##$INTSCL= 1
##$ISEN= 128
##$LB= 0.24
##$LEV0= 0
##$LPBIN= 0
##$MAXI= 10000
##$MC2= 0
##$MEAN= 0
##$ME_mod= 0
##$MI= 1.114404
##$NCOEF= 0
##$NC_proc= 0
##$NLEV= 6
##$NOISF1= 3.799351
##$NOISF2= 2.8
##$NSP= 1
##$NTH_PI= 0
##$NZP= 0
##$OFFSET= 15.70392
##$PC= 1
##$PHC0= -11054.96
##$PHC1= 14.20089
##$PH_mod= 1
##$PKNL= yes
##$PPARMOD= 0
##$PSCAL= 0
##$PSIGN= 0
##$REVERSE= no
##$SF= 200.130013532006
##$SI= 16384
##$SIGF1= 3
##$SIGF2= 2
##$SINO= 400
##$SIOLD= 16384
##$SREGLST= <1H.CDCl3>
##$SSB= 0
##$STSI= 0
##$STSR= 0
##$SW_p= 3612.71676300578
##$SYMM= 0
##$S_DEV= 0
##$TDeff= 0
##$TDoff= 0
##$TI= <>
##$TILT= no
##$TM1= 0
##$TM2= 0
##$TOPLEV= 0
##$USERP1= <user>
##$USERP2= <user>
##$USERP3= <user>
##$USERP4= <user>
##$USERP5= <user>
##$WDW= 1
##$XDIM= 8192
##$YMAX_p= 0
##$YMIN_p= 0
$$ End of Bruker specific parameters
$$ ---------------------------------
##NTUPLES= NMR FID
##VAR_NAME=  TIME,          FID/REAL,        FID/IMAG
##SYMBOL=    X,             R,               I
##VAR_TYPE=  INDEPENDENT,   DEPENDENT,       DEPENDENT
##VAR_FORM=  AFFN,          ASDF,            ASDF
##VAR_DIM=   8192,          8192,            8192
##UNITS=     SECONDS,       ARBITRARY UNITS, ARBITRARY UNITS
##FACTOR=    0.0002944,     1,               1
##FIRST=     0,             0,               0
##LAST=      2.4114304,     0,               0
##MIN=       0,             -1359815,        0
##MAX=       2.4114304,     1266299,         0
$$ Real data points
##PAGE= N=1
##DATA TABLE= (X++(R..R)), XYDATA
0 0 0 0 0 0 0 0 0 0 0 0 0 0 0 0 0 0 0 -108 108 -108 108 -108 205 -216 216 -256 324 -330 432 -498 540 -648
32 -648 752 -851 959 -1072 1189 -1342 1506 -1682 1872 -2085 2321 -2568 2844 -3148 3477 -3839
48 -3839 4229 -4656 5138 -5658 6232 -6871 7571 -8367 9264 -10277 11442 -12795 14393
61 14393 -16301 18626 -21556 25347 -30481 37796 -49281 70228 -237815 1266299 365443
72 365443 -1235344 -249853 401141 400424 -379316 -488584 128017 391016 171361 -440827
82 -440827 -480572 681270 511101 -829696 -486224 813913 275984 -714384 -183581 411029
92 411029 134960 -122222 -257652 -121357 323918 270419 -477499 -392789 601679 439601
102 439601 -631734 -383836 701284 358139 -699412 -151220 524178 -49866 -157185
111 -157185 -45708 -162622 268405 196450 -363489 -207815 351908 334061 -449784 -346026
121 -346026 583806 140292 -522967 34748 249584 -56655 -15682 -29424 -153093 133404
131 133404 277947 -283277 -343236 419630 283803 -507171 -172032 500922 64284 -395208
141 -395208 35787 256225 -69753 -79242 59095 -101343 22194 251106 -191143 -295251
151 -295251 343720 180827 -388095 -69503 311723 29028 -240502 17378 165965 -97564
161 -97564 -10393 72442 -200532 61913 269208 -221962 -224700 302953 170700 -347300 -112042
172 -112042 354323 -19046 -297427 118710 142414 -118054 24783 64151 -106185 27382
182 27382 166101 -106017 -189101 203751 159392 -278092 -49471 283777 -71310 -174524
192 -174524 133189 36290 -97380 70426 38884 -132018 20776 189139 -118512 -210314
202 -210314 237527 128477 -297953 1082 249831 -86115 -158295 108518 64529 -121526
212 -121526 30707 85826 -139737 13815 185190 -131851 -134168 201807 53765 -207086
222 -207086 9561 179365 -72924 -132088 128105 35279 -133520 88890 64211 -159245
232 -159245 48176 149750 -130605 -104829 167635 57071 -192526 5941 189413 -91967
242 -91967 -120733 143860 7239 -114817 79831 40174 -111390 21080 116571 -85874 -108716
253 -108716 153473 49209 -187688 48925 148493 -111647 -61142 114281 -14148 -87712
263 -87712 64808 48875 -112203 19766 137474 -107199 -90635 170431 6377 -160708
273 -160708 64513 109901 -93659 -57871 106208 1538 -97224 69837 49634 -116509 38379
284 38379 105508 -108002 -48443 127269 -5565 -119042 45343 104472 -85866 -54232 117172
295 117172 -23387 -88064 88012 16153 -98405 47885 74140 -81576 -45227 113026 5770
306 5770 -128254 57816 97255 -108025 -24776 104574 -38839 -59444 68045 10503 -77982
317 -77982 29359 73235 -80005 -43311 118749 -16001 -110490 71182 61718 -91636 -12362
328 -12362 76590 -24709 -54181 58094 23438 -79999 34348 67182 -89400 -21721 98992
339 98992 -31159 -76151 57723 50638 -68843 -21788 75915 -25134 -61446 67555 6800
350 6800 -73314 50488 42510 -73357 -6118 74668 -22894 -70797 50506 52279 -76488 -8540
362 -8540 75277 -39726 -39190 60482 -8896 -51735 39040 32084 -56750 -9714 73344 -22996 -68764
375 -68764 59903 33665 -73843 9853 53379 -33954 -23609 40475 -412 -43820 28508 36841
387 36841 -60726 -2955 71522 -38903 -47266 57388 14658 -51822 5737 40913 -22534 -29983
399 -29983 39581 -375 -47936 36349 22932 -57763 11861 51894 -34219 -32473 43271 18364
411 18364 -47606 2206 46465 -28160 -23072 44696 -12850 -32216 37228 7446 -40384 9463
423 9463 39202 -21818 -34432 43209 20400 -51244 15092 35655 -32801 -5994 27554 -11860
435 -11860 -16964 20316 10957 -34077 3980 41310 -31320 -27820 45971 479 -38155 16183 20511
448 20511 -18919 -8763 19701 -3407 -19183 21398 9533 -35315 14076 30755 -35212 -13094
460 -13094 33307 -2500 -26445 6725 21520 -14707 -12381 25495 -10018 -18423 29279 -4912
472 -4912 -27934 18488 16012 -20898 -13693 23980 6758 -32256 8979 23505 -24640 -1812 18515
485 18515 -11730 -3590 16432 -3333 -15858 11060 20807 -20177 -13683 31196 -1577 -27026 15295
498 15295 11904 -14728 2331 8239 -4394 -2738 10475 -81 -15334 11039 16893 -24941 -3693
511 -3693 24213 -8358 -15038 8261 5356 -6883 -8768 6830 -2551 -10130 13396 -5973 -14942
524 -14942 16722 5566 -18075 -828 14589 1145 -15896 3469 14158 -10721 -3881 9184
536 9184 -5703 329 9052 -8789 -4243 12689 4989 -11947 -1089 17644 -1636 -15152 10057
549 10057 9424 -12112 2089 5235 -5285 2628 859 -5715 -4602 5914 5628 -14658 -3345 16716
563 16716 -6894 -9824 6903 3140 -1339 -2320 1003 2212 -1534 3534 -3117 -5950 10021 2469
577 2469 -10844 3474 8731 -2442 -5724 3145 8104 -2646 -3862 6225 483 -614 6182 -5969
591 -5969 -2338 11197 -2307 -7877 2632 6060 -322 -8938 189 7639 -3216 -3406 814 -1199
605 -1199 3982 -1236 -6101 -34 4156 -797 -6671 518 6963 -4691 -5179 4181 1527 573 -1234
620 -1234 -2284 4316 1091 -2185 464 -1516 5149 3387 -8832 2471 10102 -4885 -2941 1296
634 1296 615 2631 -4678 -3207 6050 231 -1717 -1482 -822 6770 -2076 -6631 4395 2983 -3159 -4110
650 -4110 1679 4107 -1806 -1978 -364 1710 3102 -3965 -3661 4839 608 -1604 -771 -961 6568 -900
666 -900 -5897 3909 4423 -3254 -286 -1979 2191 4831 -5478 -1989 5480 115 92 -1219 -1105 6451
682 6451 -2266 -5095 3069 2077 -737 -2569 -2758 4566 1150 -3260 -940 2661 2580 -4279 -3666 2987
698 2987 1818 -939 -2884 -657 4918 -1167 -5490 2911 1824 1711 -1652 -3596 3886 2515 -6354
713 -6354 -52 2158 524 2015 -4227 -1383 5941 -2817 -4107 2169 120 1369 -3056 -3365 6475
728 6475 1360 -3849 -1060 1252 3276 -1878 -3602 2435 3172 -567 -2156 -1095 4212 48 -3861
743 -3861 1666 2294 1905 -1131 -3291 3147 1862 -1865 -236 739 2339 1056 -3867 1216 4323 -2736
759 -2736 -2075 -684 1513 2422 -3816 -1584 4937 93 -2186 -1030 1560 3218 -1579 -2873 2266 604
775 604 -262 -2316 -2504 3728 853 -4239 1038 1655 1619 -1984 -2527 3062 2963 -3024 -1109 -166 1988 832
793 832 -3574 -399 3234 360 -1946 -1322 3226 2245 -4306 -1351 2722 207 -2378 -1366 -66 2952
809 2952 -1099 -1781 -142 363 1906 -3069 -2320 5558 1505 -3374 -67 1342 2257 -882 -2660 3780
825 3780 857 -921 -221 -1302 3513 2336 -4120 235 4778 119 -2774 -953 3040 1510 -3204
840 -3204 667 1528 74 675 -3017 -835 3466 267 -3631 -224 3330 1759 -3532 -748 3540 -202
856 -202 -1443 347 -5 843 -83 -3394 -99 2066 207 -2461 -1627 4879 1421 -4509 1901 1685 -282
873 -282 -984 -1260 411 1703 -1386 -932 -1704 2752 2206 -5066 -514 4871 -966 -3525 243 2504 -215
890 -215 -2725 1358 1205 -208 1623 -1618 -1445 2740 1337 -4961 5 3231 -205 -3663 601 3497
906 3497 -651 -2396 1903 77 38 1100 -2452 -509 2783 1267 -3821 -28 4629 844 -5193 1630
922 1630 3325 -1416 -903 -589 483 639 -87 -1726 -1146 3213 210 -3778 -288 3983 -1689 -4423
938 -4423 1287 1720 -319 -1035 -970 882 151 647 -1357 -604 2618 1332 -3678 264 3949 -536 -3562
955 -3562 1256 2815 -2086 -1445 1706 618 199 1650 -2767 -1015 3389 119 -4134 740 3167 -1349
971 -1349 -3802 1856 2290 -2688 -815 1542 -275 715 588 -2282 151 2494 -533 -2694 1277 2963
987 2963 -1037 -2345 1323 2675 -1661 -961 884 164 325 -446 -1336 236 2114 -895 -3518 195
1003 195 4178 -1786 -2168 2010 1200 -2721 -1503 1264 30 -548 649 -2718 -743 3129 -663 -3091
1019 -3091 628 2361 -1219 -2822 1103 1648 -903 -459 1164 -450 864 280 -1511 689 2820 -1572
1035 -1572 -3377 2368 1947 -1323 -2122 1760 1673 -1613 -785 1053 -205 476 -624 -1151 350 2170 -852
1052 -852 -2657 748 2718 -2883 -1497 2622 1575 -1319 132 385 378 954 -296 -990 762 2822 -1366
1069 -1366 -1749 2005 2979 -2662 -1128 2005 1155 -1328 265 513 628 -440 470 -1193 603 1945
1085 1945 -1926 -2985 2514 1982 -1832 -1459 1883 604 -1265 -609 47 281 306 -716 -1442 1589 1028
1102 1028 -976 -1187 1995 1066 -1388 -606 1506 556 -1141 -345 -150 -204 591 -330 -1838 1808 1419 -2282
1120 -2282 -1126 3023 1642 -2164 -440 1318 -327 -820 -380 11 1011 47 -93 -750 1206 1377 -1802
1137 -1802 -1135 1970 653 -1488 -1129 1087 1928 -1629 -85 1146 91 -186 -1011 93 -298 1260
1153 1260 -1328 -938 2939 545 -2074 -113 1588 1498 -1737 490 402 -115 -281 44 -335 981 -528
1170 -528 -555 -1124 447 630 -1705 -89 906 -322 -2158 -1192 31 1243 -99 -1574 -113 386 84
1187 84 -1916 -1337 1712 -235 -1095 585 1488 943 24 -1156 1083 586 -314 -361 358 882 309 -361 -600
1206 -600 928 956 -823 -1223 1535 582 -1199 -618 94 540 -1505 -989 -383 1061 -259 -1795 -206
1223 -206 1762 97 -435 -717 1421 956 -1521 -729 79 838 -416 -468 1028 839 511 -1671 -111 1155
1241 1155 351 -418 -379 517 981 -1350 -476 35 689 -861 -1019 495 513 -739 -2005 -79 1039 56
1259 56 -1050 -717 460 1303 -379 -1602 806 603 -277 -802 -106 735 -527 -1043 -691 934 464 8
1277 8 -312 1330 -35 -965 -413 388 -446 -865 -632 544 -208 370 -1260 -1497 1327 896 -1313 -649 948
1296 948 304 -347 -428 865 542 117 -816 351 593 466 -222 -145 1165 -692 -1625 -74 1361 298
1314 298 -703 -727 737 1666 -222 64 215 -354 285 -604 -227 1031 166 -940 -247 -110 -659 -815 119
1333 119 726 251 -113 50 86 1500 -178 -387 -45 514 -123 -1191 457 938 -830 -213 128 -262 -412
1352 -412 -534 -591 900 767 -1115 -1020 395 933 -660 -1763 88 413 -34 -491 84 244 -537 -409 -129
1371 -129 668 569 -823 -1169 354 601 -1821 -714 686 936 -660 -379 772 1184 -186 -418 -468 -330
1389 -330 239 -295 -1095 2136 2086 -655 -777 79 957 -1160 -27 394 1067 -33 587 -628 417 1782
1407 1782 -210 -1310 1027 1335 -1464 -681 893 1328 -1340 -1599 963 -216 256 711 -1310 -211
1423 -211 1431 -582 -725 208 274 -1575 -860 1793 1110 -1923 -101 682 105 -503 607 -812 -708 557
1441 557 -958 -1195 1112 1600 -2646 -833 2521 -658 -2515 708 -17 -517 243 489 -678 -870 1753
1458 1753 276 -2302 1330 1904 -1428 -609 2313 772 -1675 -380 2421 -1038 369 888 -1459 -376
1474 -376 1242 -1911 -1203 2140 2414 -2566 -994 2988 -385 -1785 1312 162 -1036 321 805 -2606
1490 -2606 456 2472 -1625 -2374 2312 2234 -3197 -746 2125 -634 -2233 1244 742 -688 98 559
1506 559 -1820 29 2337 -510 -2423 2039 1003 -2701 -840 3462 -496 -2151 1894 36 -1770
1521 -1770 521 1636 -2261 162 2825 -1375 -2939 1876 916 -3252 -257 2620 -1793 -2220 2132
1536 2132 1141 -2432 1096 1178 -2306 -805 2578 -200 -3157 3003 1412 -3885 -787 3481 -1659 -2294
1552 -2294 2806 -113 -2082 1418 1805 -2225 97 3375 -1789 -3507 2788 653 -4491 1195 2879
1567 2879 -2898 -1741 2512 140 -3490 1247 2344 -2475 -396 3172 -1924 -2561 4177 615 -3529
1582 -3529 970 3484 -2168 -1349 3877 -289 -3015 2312 975 -4098 199 3472 -2697 -3474 4731
1597 4731 409 -4011 1076 4118 -3415 -1967 3604 -284 -2908 2553 2383 -3866 1070 2794 -2843
1612 -2843 -2463 4703 -479 -5307 1567 3992 -3936 -1216 3502 -1508 -2546 3333 983 -4300 1555
1627 1555 3964 -3539 -2873 5799 -332 -5603 1954 3771 -4095 -1841 3994 -1669 -2569 3796 638
1642 638 -4060 1077 4094 -3431 -1105 4212 -1426 -6430 1938 2755 -4990 -959 4005 -1785 -3184
1657 -3184 4025 143 -4834 1701 2953 -4617 -1322 5613 -231 -6171 2695 3588 -4721 -487 3942
1672 3942 -3363 -2878 4538 948 -5124 1848 3552 -5158 -1310 5037 -1519 -5071 3063 2441 -5884
1687 -5884 359 4067 -2427 -2276 5121 -113 -5522 3201 2845 -5352 -1327 5623 -1998 -5142 4008
1702 4008 1777 -4883 896 4379 -3077 -2667 4907 56 -4507 3238 3412 -4954 550 5349 -3446
1717 -3446 -4049 4863 2603 -5792 868 4701 -2963 -2809 5458 -1159 -4607 3617 2807 -6568 -544 5244
1733 5244 -3128 -3376 5056 2018 -5660 2147 4965 -4564 -2434 5146 -1227 -4068 4181 2355 -5961
1748 -5961 650 6008 -3716 -3566 5723 985 -5913 2055 4528 -3836 -2025 5470 -2445 -4491 4556
1763 4556 1109 -5355 790 6065 -2821 -3242 5652 1063 -5829 1944 3771 -4853 -1282 5063 -662
1778 -662 -3558 5001 626 -5841 1278 6160 -4594 -4099 5753 160 -6079 2591 3969 -4988 -1459
1793 -1459 5009 -3103 -3524 5667 750 -6113 2282 4844 -4556 -2528 6672 -1246 -6279 3025 3666
1808 3666 -5419 -1091 5205 -2952 -4170 5364 680 -6418 2779 4828 -4868 -2537 5986 -1383 -4830
1823 -4830 3614 2341 -4993 -100 6010 -2777 -3803 5224 1271 -5831 1991 4243 -5552 -1611 5630
1838 5630 -1477 -4779 4018 2494 -5563 -48 4836 -3535 -2220 5232 121 -5725 3467 4219 -5655
1853 -5655 -906 4398 -1792 -3652 4276 2380 -5104 1825 4442 -4294 -2937 5473 -496 -4967 3684
1868 3684 3528 -6443 -749 5951 -1609 -4312 4993 1067 -5228 1893 3830 -3291 -2134 5563 -1234
1883 -1234 -4963 4743 3739 -6328 297 6338 -1783 -4019 4981 1122 -4979 2389 4370 -4347 -1477
1898 -1477 5369 -1744 -4524 4146 2433 -6066 579 5991 -3074 -4116 4529 1422 -4456 2476 3608
1913 3608 -4241 -760 4827 -1513 -4192 4168 2449 -4859 513 4400 -3116 -3162 4207 860 -5002
1928 -5002 2117 3564 -4174 -641 5603 -2382 -4068 4725 1781 -5481 212 4438 -3105 -2633 5023
1943 5023 -16 -4777 2856 2510 -5162 -611 5037 -1751 -3178 4260 845 -3957 2157 4955 -4607
1958 -4607 -1996 5120 488 -4840 3792 2910 -4707 -381 3846 -1171 -3304 4345 478 -4647 1302
1973 1302 3864 -4110 -2071 4565 -973 -3533 3552 2596 -4811 -53 4456 -3131 -3162 5146 158 -4306
1989 -4306 2322 3014 -3639 -1343 4605 -1119 -2963 2713 1758 -4374 -58 3900 -3056 -1437 4066
2004 4066 547 -4289 2222 2590 -4202 -184 4392 -469 -3097 2523 1574 -3631 1807 3102 -2583
2019 -2583 -1473 4647 -195 -3699 1162 1845 -3778 -755 3377 -1070 -2717 2782 995 -3820 861
2034 861 3566 -2888 -1242 3624 -1120 -4488 2523 2319 -3119 -840 3603 -1815 -1703 3330 276 -3486
2050 -3486 1044 2209 -2970 -511 3630 337 -2939 2664 2431 -3516 115 3955 -1904 -2314 3555
2065 3555 167 -3626 1111 2406 -2906 -829 3269 -301 -2038 2720 1906 -2669 818 3729 -1567
2080 -1567 -1629 2163 -710 -1899 1735 1730 -3197 -546 3011 -1073 -2438 2239 1327 -2945 559 2170
2096 2170 -634 -1801 2114 -281 -2751 1543 1571 -2645 32 2601 -1089 -2819 2938 1124 -2396
2111 -2396 291 1305 -917 -266 2061 -434 -1663 1933 1633 -2376 171 2488 -2133 -1963 2104 229
2127 229 -2326 620 1907 -1320 18 2434 -1060 -2576 2570 817 -2141 458 1509 -1768 -493
2142 -493 1988 68 -1828 1143 2059 -1077 -360 1106 -1380 -495 2759 730 -1955 224 2543 -1881
2158 -1881 -1592 1591 -357 -2276 1046 2253 -1913 -1207 1441 -1291 -2280 1886 -474 -1948 650 1584
2174 1584 -1082 -536 2111 -241 -1544 1110 2063 -1330 -538 1518 -1144 -419 2039 -972 -2256 1082
2190 1082 1642 -642 -502 1065 -101 -1337 98 381 -1371 -1098 1339 -42 -593 2084 182 -1321
2206 -1321 551 1262 -2308 -662 1605 -1097 -1435 1134 335 -864 223 626 -496 -1183 1303 323
2222 323 -1771 604 1025 -576 -167 775 -455 -1215 522 953 -967 -322 1391 -1252 -178 1349 -82
2239 -82 -1194 1835 597 -1264 -1163 1996 929 -904 666 55 -595 -344 1205 -395 92 1053 113
2256 113 -1315 1639 840 -809 543 2042 -272 -1106 769 172 -438 -774 409 -1777 -353 600 -783
2273 -783 -1231 901 690 -521 -247 736 279 -1650 342 -62 -1157 -313 586 -251 -287 997 74 -143
2291 -143 39 1143 -689 -434 84 -869 -194 -450 202 183 15 344 -136 505 -120 86 -617 1120 -334
2310 -334 -416 927 602 -95 -1314 0 368 -274 139 1363 -130 -202 866 261 -72 749 73 -106 16
2329 16 434 -13 -1285 1033 -453 361 -104 1199 -456 77 -525 66 679 908 205 707 -120 632 -36
2348 -36 -329 561 -213 -1003 608 206 112 732 530 -777 508 1213 -23 -1199 -182 505 -269 -408 -329
2367 -329 24 753 573 267 23 -403 680 -681 54 442 632 -226 687 145 -777 -728 598 -591 -349
2386 -349 704 -773 -329 -389 183 -442 431 313 -44 -67 103 -55 -440 -458 295 177 -143 -48 637 -20 -429
2407 -429 -175 -597 -412 -239 687 302 580 -73 -563 234 -699 -830 142 692 763 7 554 28 -201 141
2427 141 1186 -993 -195 356 -579 1228 -1112 -354 -1094 600 -710 669 461 -26 -164 -712 -169 -338
2445 -338 895 -1033 1019 -712 380 316 -33 504 273 -478 -70 -334 -297 318 -333 492 478 454 1131 -278
2465 -278 -503 -218 -695 -272 -444 -1166 578 -85 -82 -412 -98 -191 533 1614 143 120 -578 129 -685 -35
2485 -35 647 750 570 -219 -646 344 352 -564 -311 580 29 -5 -240 240 -55 -281 709 -283 -147 -94 51 346
2507 346 -717 52 290 -112 -142 679 230 -911 -351 623 -318 -120 805 410 449 647 500 -375 322 -66
2527 -66 -685 -20 -85 336 -12 68 95 -282 104 124 23 -559 244 -549 476 253 -1034 429 -423 -209 -207
2548 -207 1 412 -580 -226 -633 31 -314 -108 -281 700 -496 -1247 27 -292 -242 1006 616 -846 262
2567 262 -533 -66 -502 -118 -153 -148 209 60 272 -759 386 121 866 155 -51 -729 802 -670 220 448
2587 448 -881 -20 111 288 340 202 -177 -275 -757 856 -198 -574 -271 -794 228 -480 192 597 -518
2606 -518 -483 -495 256 -855 -295 308 150 839 -504 -412 -208 -671 -136 -97 -217 -122 120 348 149 -149 178
2627 178 -261 90 -282 799 -564 288 -111 387 625 328 660 -321 -420 -1219 637 886 665 -428 327
2646 327 -870 -602 -169 -7 -1114 -120 23 -603 181 281 283 -1082 -195 690 -957 448 824 252 412
2665 412 -236 482 -123 -147 -475 41 1038 233 186 446 -668 -530 -214 -159 226 -147 401 603 727 842 532
2686 532 -615 -588 -26 -316 63 -277 674 301 -59 -410 535 -355 239 722 189 -116 -116 374 -656 171
2706 171 -253 155 172 -396 0 18 -828 -149 -229 735 -129 103 -589 -273 -162 211 313 -166 -460 307 -575
2727 -575 -234 -854 -198 -418 -527 -204 321 -10 813 729 681 526 123 -380 104 -87 -349 522 963 127 484
2748 484 398 -628 718 -422 207 538 -69 -301 260 -200 -153 -454 -273 -646 505 177 -313 7 307
2767 307 336 447 277 1028 141 -393 68 290 170 -386 -160 -192 -611 -184 80 547 150 -874 149 95
2787 95 168 812 -305 440 -6 22 -303 97 75 242 -151 166 21 -471 853 -314 643 -969 60 -478
2807 -478 848 -576 467 51 -508 -108 -547 -175 279 -874 -341 310 -464 -522 258 -266 12 -429 1015
2826 1015 382 261 262 -128 -236 370 840 197 764 -544 -488 -177 29 -1175 33 -10 296 -14 -1031 645
2846 645 264 239 -1076 -651 -177 82 1081 -46 145 550 -283 485 -138 -847 -231 21 -93 -232 -1204 336
2866 336 123 -465 1402 861 -825 -48 245 -83 -508 834 371 935 -604 -618 -769 435 -544 539
2884 539 853 -162 -214 -35 -633 -287 -126 -373 377 1186 650 -410 1053 -179 510 -929 671 135
2902 135 862 -38 -242 -354 94 -310 -326 -412 -237 -721 -921 -79 -38 585 181 1015 -253 -127 -209 802 -195
2923 -195 534 -823 361 880 322 173 -173 629 -378 535 209 -141 -625 -159 975 -604 -194 233
2941 233 317 -790 361 738 287 285 -985 -258 258 -368 67 471 -253 -81 -622 -226 -41 195 -736 -465
2961 -465 934 -305 310 -101 244 -312 223 755 -338 -48 -342 185 -169 50 763 692 -852 47 662
2980 662 -272 540 78 -928 276 -258 -956 -459 590 -371 -818 -481 161 237 -651 -281 -368 195 -691 -298
3000 -298 -31 -460 6 77 628 -573 237 131 250 315 815 -129 -988 361 51 760 371 -560 307 831
3020 831 358 -13 223 155 802 873 -256 247 371 -463 -167 739 557 -1143 -1134 385 -38 570 1251 -85
3040 -85 -24 -591 50 -363 -13 -396 -717 485 286 299 281 -1061 -927 -480 874 718 28 451 1401 924
3060 924 -520 -848 -572 -790 162 -297 -373 -777 -759 -1137 596 461 230 -71 486 -450 15 -492 -437 115
3080 115 150 -861 -316 544 185 -302 742 30 1430 46 159 -597 -811 143 -18 -266 -305 549 -298
3099 -298 -96 199 188 288 1167 311 -560 211 244 -339 -341 -123 260 460 263 -25 -144 492 198 -150 -517
3120 -517 1000 184 73 -629 -405 603 -398 408 -511 -445 170 -235 -632 642 319 -141 577 -432 516
3139 516 -508 200 -1243 -594 412 1172 444 -207 621 154 -400 283 125 104 -65 344 -442 342 -45
3158 -45 -745 -152 -289 -157 -243 -127 234 -247 685 54 602 -651 -569 706 246 -700 -180 812 -167 -912
3178 -912 195 917 831 423 -344 280 -369 564 853 -686 -458 149 -355 -315 -14 51 -556 220 -91 -82 28
3199 28 -101 -592 388 430 -586 922 571 -361 -778 -55 -933 -35 -385 -1162 612 258 -189 -61 869 68
3219 68 -582 306 -422 414 -49 429 -592 -201 350 -47 155 -15 914 222 36 -235 106 220 -381 15
3239 15 1038 -871 572 164 -77 129 137 -655 374 -545 -593 267 -545 243 -140 -744 -730 -229 64 -438
3259 -438 140 341 -203 779 -297 205 -835 17 311 944 -176 756 380 -78 -660 249 799 60 -218
3278 -218 -373 502 252 198 -44 490 -452 702 114 15 -260 251 501 -1222 -230 -250 -63 121 -717 -417
3298 -417 -296 93 702 -371 119 17 -565 -417 -300 84 234 -12 -886 -267 -238 341 -1110 -28 -78 654
3318 654 -193 266 85 -406 169 -253 -567 -570 -929 408 25 841 461 457 -12 430 238 -413 259 -62 438
3339 438 714 -914 -363 228 170 -465 -193 -82 260 -152 105 101 47 291 634 299 166 131 -131 816 433
3360 433 438 -938 -92 795 421 -454 -769 536 -102 -784 433 -60 568 95 -422 -406 435 568 -197 -689
3380 -689 141 -125 -282 122 356 -186 -121 -1081 -90 -525 1287 646 -675 -375 -102 -30 1294 -27 0 -426
3400 -426 394 -405 -306 342 759 -569 305 -275 1 -337 -229 -213 -139 -507 149 -145 236 1361 -663 -694
3420 -694 93 -697 -49 -191 -585 1154 -427 -212 321 325 -877 260 -742 -469 -49 808 -477 318 207
3439 207 67 -201 423 370 478 193 -95 -102 -261 -224 308 -362 -61 -254 -522 475 39 527 -540 -304 540
3460 540 -502 370 70 62 -606 639 -460 -872 -18 -150 -1271 -360 -103 42 142 301 110 251 288 -321
3480 -321 -507 36 279 -202 121 -733 -218 -803 -582 152 -447 6 -8 -222 -323 -126 -162 200 -396 -61 -101
3501 -101 -252 140 323 -396 -119 -415 608 -589 674 394 138 904 838 -385 -524 646 -120 -23 999
3520 999 69 817 217 592 252 343 -900 -87 -174 52 14 -269 66 627 266 -251 -55 826 -539 667
3540 667 -893 370 443 111 -582 -1272 -350 52 -104 -658 -22 -656 -1109 -647 -70 408 345 507 -60 160
3560 160 377 292 -712 194 260 296 671 538 81 -462 1199 -344 -399 -57 431 179 261 418 112 288 382
3581 382 -356 294 -538 -765 -404 -219 257 485 647 -73 167 108 -655 -25 -1027 395 342 493 124 1123
3601 1123 -27 -214 1087 973 -246 -804 568 414 -197 227 826 -252 -1446 -675 -798 627 35
3618 35 -183 8 -312 490 100 322 -200 605 1 -409 -618 124 738 150 -354 33 -306 -403 -329 -1020 927
3639 927 -113 -973 22 -435 -466 -397 -95 -1034 -111 -172 361 -380 537 282 320 359 124 -602 580 391 1279
3660 1279 -269 68 16 64 -215 24 311 -25 797 461 214 209 -596 1015 -39 -312 854 -629 -200
3679 -200 236 1167 107 -155 -466 -775 170 1001 -295 -237 780 285 -378 459 -1056 626 -157 889
3697 889 -707 -301 -639 -771 149 1146 -504 -607 44 997 153 -308 -519 -218 322 43 533 281 20
3716 20 434 1115 126 995 -230 -196 175 613 286 -630 -84 -258 -382 602 31 -298 951 1285 909 229
3736 229 532 243 -794 74 866 -76 217 -625 554 -1162 -167 873 -851 -361 -61 -311 429 140
3754 140 807 -45 642 681 -881 243 -602 461 -565 356 324 -88 640 201 -593 -372 720 92 -101
3773 -101 569 112 257 -618 864 872 592 285 -703 -226 -273 47 -129 -309 734 596 68 -299 -266 685 -1064
3794 -1064 -172 421 -719 1090 -320 -297 108 862 -271 -977 -125 -221 -85 17 220 -70 -915 -666 535
3813 535 184 1096 -64 362 -75 -107 389 461 1172 -97 1020 -2 222 -683 -444 19 -24 -282 953
3832 953 337 -1233 -568 -350 125 585 -55 -548 -366 255 18 -581 844 1144 137 74 509 312 1058
3851 1058 -568 118 311 -124 338 -701 301 191 900 293 210 813 -183 -878 1255 -337 -321 698
3869 698 244 892 35 907 289 -865 328 -626 -176 -574 221 -315 -142 317 -260 -443 -396 -114 710 193
3889 193 69 -526 110 -589 -87 95 250 187 -1093 67 -708 223 468 98 -452 -601 -718 91 -1149
3908 -1149 -14 934 792 -1018 -557 214 -319 150 175 141 -842 -655 -175 -425 491 539 67 -380 233 691
3928 691 -322 831 41 -106 -419 324 296 -365 1047 264 7 -212 306 -17 -923 -516 466 -277 -195 -115
3948 -115 209 -402 -878 -208 178 438 -557 178 473 -772 366 -511 982 224 -78 424 -187 173 -523
3967 -523 224 -1039 -210 -23 167 -497 410 753 -528 37 -654 -272 -415 1082 -165 -232 -34 -77 431
3986 431 -402 225 -837 -1118 145 168 -524 47 -734 -344 -41 959 712 474 -311 -527 314 123 296
4005 296 -671 677 718 196 -277 205 907 -569 -518 -47 -241 -605 315 41 122 -579 -59 -488 -63 58
4025 58 -861 244 335 334 98 -72 -376 -301 583 -201 -169 -510 432 128 1 202 -61 675 369 -19 685 -492
4047 -492 506 718 114 -479 -775 57 612 -76 -146 -237 -882 -170 -263 136 188 81 193 -914 -402 -592 -419
4068 -419 529 480 488 228 239 224 -559 -440 531 -947 196 -925 -488 396 420 -177 176 989 275 229 71
4089 71 -570 899 39 353 -192 413 793 300 26 814 -1067 271 -794 -733 154 -128 -1347 166 -202
4108 -202 813 656 -189 -136 317 577 -425 -332 533 430 498 32 -166 -179 429 -223 0 763 -284 -1145
4128 -1145 354 -520 219 -65 45 786 188 893 388 18 -695 679 -576 -417 444 34 199 -295 125
4147 125 -198 22 -427 94 -147 233 -128 -222 -142 -390 347 843 -620 -163 44 -638 -18 -319 288 474
4167 474 -282 874 523 21 317 -134 -332 638 -580 -3 -599 -443 16 -287 -411 -53 871 1 -489
4186 -489 482 280 -723 -821 -46 -294 -27 -438 -758 1022 120 -77 -61 363 270 214 558 -327 -68 -995 1250
4207 1250 -209 75 -45 92 765 205 31 92 194 395 318 -22 600 -663 607 376 292 498 125 234
4227 234 121 111 179 301 -110 -105 728 179 485 311 82 218 -431 -756 353 7 -615 -636 546 268 -457
4248 -457 471 110 36 -565 -440 -338 -365 -426 560 21 -132 749 717 -39 70 -641 -57 -724 139 -99 -221
4269 -221 3 72 567 71 -751 686 -530 -324 248 -340 783 -783 -111 55 -252 -267 204 -5 -380
4288 -380 -404 163 169 -235 -297 -251 -217 -1033 1043 684 876 243 769 296 -382 -757 -33 719 -324 405 -723
4309 -723 77 -606 -90 -517 455 -54 -772 532 -13 -407 380 -69 380 57 -310 -87 12 298 -971 -180
4329 -180 316 432 72 410 -242 688 570 231 -777 -466 936 -54 542 218 -340 514 124 620 921
4348 921 -24 38 857 -382 -206 -420 208 592 -266 444 -158 574 -494 180 -371 -143 -318 346 -412 -408
4368 -408 -144 -385 89 -121 358 12 -663 1083 380 179 -585 -435 -338 144 -258 650 -243 132 -573 374
4388 374 -266 -767 -873 -77 523 366 -187 -149 -597 -263 -138 -626 388 341 40 -8 255 -488 -320 234 -458
4409 -458 212 -488 122 -142 -12 49 270 666 -512 464 1332 -993 -360 330 102 640 167 45 30 751
4429 751 12 -1266 625 839 -403 -144 -696 -2 191 647 -321 -227 379 -92 -425 -383 -1231 -109 -482
4448 -482 1006 -1073 853 -320 209 672 -479 -219 -321 -33 -755 -1036 1305 55 -181 -195 -663 766
4466 766 58 -228 47 294 -1259 -740 -596 171 1141 -590 -82 1149 52 -182 -107 137 -413 -945 -1499
4485 -1499 567 -687 -237 829 -617 283 48 -726 -303 -563 -411 -52 -227 -385 85 -494 548 302
4503 302 139 165 -642 -1003 1440 497 -404 -117 216 648 -336 -215 -237 -235 -258 892 -75 21 -336 234 -474
4524 -474 216 -54 457 1 -616 508 716 -66 -39 -281 -739 143 -229 682 450 495 832 231 148 449 606
4545 606 -220 159 -458 -273 -803 -358 236 120 363 346 -552 -591 -421 -195 -47 227 189 608 49 294 -618
4566 -618 -394 140 98 -268 -384 -441 -421 -209 -381 308 817 246 765 -428 135 402 -775 -1164 1120 864
4586 864 85 3 -657 141 73 175 612 -692 -590 310 251 361 -199 1112 165 1925 334 -450 -241 195
4606 195 393 281 85 642 664 -186 -214 888 200 797 410 -156 115 337 -543 100 -399 -353 644 678 -57
4627 -57 285 403 1355 -516 1589 535 -69 -68 -93 319 157 211 309 338 65 466 116 -629 -937 102 -151
4648 -151 271 -324 -1011 419 549 209 -194 745 -286 149 36 -429 369 -946 -294 -38 94 -293 -237
4667 -237 -922 -373 1063 -140 -63 918 385 224 693 -794 315 -53 1138 161 -302 -181 171 -145 -211
4686 -211 577 -184 794 185 -154 -53 817 305 -144 775 591 211 249 167 303 -415 -224 43 -1186 13
4706 13 581 -156 357 583 654 -317 227 176 -665 73 -305 393 -448 -101 832 -654 223 -303 17 -568 -312
4727 -312 351 -389 1004 -384 -436 518 339 -447 187 -340 -788 82 679 10 -121 -31 -227 -371 100 401
4747 401 286 -192 842 541 -298 526 -336 -377 -386 347 -70 263 -230 361 107 592 -577 -232 57 -222
4767 -222 341 806 -429 73 -280 -117 341 -5 -245 104 790 1111 19 -101 120 444 -244 528 -98
4786 -98 269 623 -557 493 -531 361 664 409 -744 468 -781 398 -168 397 -70 539 -1029 -1057
4804 -1057 808 -137 64 -96 -834 22 23 29 -189 -272 -457 -231 -274 -51 349 -110 690 220 906 343 -257
4825 -257 -928 283 -83 -198 92 870 -241 -76 -513 -241 -694 -196 280 -981 -669 -564 -611 -292 542
4844 542 -228 130 588 361 -719 -378 776 -111 402 -150 -536 939 448 250 -864 -286 -296 -74 -129
4863 -129 -59 -853 762 8 -600 44 118 259 -455 -458 -164 -310 869 -64 561 -27 -1551 40 -38 -413
4883 -413 -142 10 -798 708 31 -93 -256 -51 173 533 -994 -328 894 307 -610 -379 -364 -323 1436
4902 1436 -1081 349 -135 182 610 -317 -291 77 -22 1032 540 113 -117 -62 276 -91 -219 136 318 -332
4922 -332 -719 248 -219 -548 -129 -146 607 551 -789 -41 161 171 160 -43 -256 328 -389 412 -44 591 -87
4943 -87 278 -23 538 -42 534 -77 482 459 -57 -274 -371 -701 -627 -839 -475 189 -187 -589 1169 480 -58
4964 -58 -326 -1117 -513 -421 478 -886 102 471 383 -559 -126 -486 -341 -190 502 278 -85 340 350 76 85 -29
4986 -29 -166 -315 -497 -76 33 967 77 -310 -249 610 -450 -473 -35 -341 562 292 -329 452 -345 -521 372
5007 372 1336 -357 434 -1146 -66 -385 -424 391 -368 -388 -607 447 524 228 -610 2 503 430 850 -563
5027 -563 581 -196 1029 173 911 772 -589 -97 -452 -537 399 -88 -182 309 257 -548 -267 4 -387 963
5047 963 -334 272 422 538 -447 319 -236 377 -63 -484 149 -994 -549 210 -1191 252 329 821 -466
5066 -466 354 -2 -365 -469 -210 81 -261 -90 -410 276 601 385 295 -239 284 204 -55 590 453 159 9
5087 9 508 -475 -554 566 -64 -33 658 -477 549 313 485 139 614 850 -876 515 -304 -260 -351 -795
5107 -795 144 -522 -688 886 -291 -378 814 599 13 -491 720 -618 552 719 -492 47 -444 -671
5125 -671 899 347 329 -134 -368 -1332 1114 -1021 -59 574 -84 345 97 475 658 -725 -830 406 -512
5144 -512 -277 -32 493 -48 236 357 -247 -550 349 325 345 780 -772 -495 -115 51 -9 40 274 2 260
5165 260 548 289 -420 -347 713 121 392 156 -359 -483 230 -1173 -88 383 194 33 114 -194 -1407
5184 -1407 716 -753 -989 169 -231 -2413 -610 -516 500 -204 -3 157 770 755 -22 -111 588 -260 -244
5203 -244 -374 -518 -233 -295 43 -149 128 354 -529 83 -171 -86 388 -415 159 76 -31 85 -193 280 20
5224 20 -519 -826 42 46 -445 -146 643 131 -122 97 242 694 -95 476 430 -184 -226 128 142 -212 37 266
5246 266 -204 -163 -263 69 1363 -198 199 -60 -680 461 -164 232 -1365 -516 335 -817 -219 417 250
5265 250 -303 220 94 -845 845 167 -310 842 267 40 -325 -112 20 9 -296 274 599 242 982 -309
5285 -309 672 12 600 166 254 -260 297 152 -269 -671 -361 -1150 -1130 231 -569 -445 14 557 459 384 438
5306 438 -90 660 -665 57 158 -610 -985 -721 -97 -741 95 -57 -437 733 -234 -589 374 111 570
5325 570 472 160 38 -127 -677 -237 859 -885 1196 55 -71 -633 502 -368 -1733 -126 200 -247
5343 -247 27 14 -341 93 75 416 -6 354 -595 -59 497 -498 -451 -452 -140 -165 86 185 -913 395 1189 674
5365 674 43 -73 53 526 156 663 -186 -312 168 374 614 -768 -1270 -559 -17 -544 56 -75 183 -659
5385 -659 640 -394 9 89 -76 -646 184 -193 -850 -319 763 396 -207 -581 -536 38 -485 337 -87 310
5405 310 -550 -583 770 -183 245 -219 -565 -150 411 166 -25 -26 -227 -292 639 -150 109 195 -700 -973 38
5426 38 742 132 370 410 -282 586 -154 -650 -471 -168 -53 499 115 -311 140 -154 -111 -135 444 3 -482
5447 -482 295 601 -462 402 -112 473 107 362 526 141 -8 370 174 298 428 -389 1123 -683 -851
5466 -851 238 -121 -155 -543 930 -278 -459 298 -79 -64 337 -738 -688 -404 -313 -356 318 83 -27 -67 397
5487 397 -15 -368 339 -374 -191 108 -655 -228 425 425 -91 92 -128 257 -558 163 -244 515 -447 47 -518
5508 -518 -142 175 -29 -985 -76 329 372 931 -136 -217 387 2 -333 -1 282 16 -295 424 -867 385
5528 385 645 -246 244 -1086 -369 -1056 506 318 393 -271 481 -595 -494 911 -654 -490 580 74
5546 74 -158 -207 -106 -85 -122 -313 -40 276 -302 187 -449 -15 -190 -526 457 68 328 652 322 -536 240
5567 240 -27 14 865 -603 142 479 -769 -28 146 547 538 364 -156 396 1715 -743 766 -201 -199 -815
5587 -815 282 441 2 -290 -502 38 -765 -749 510 -646 -362 521 399 -18 -389 -199 -451 605 -329
5606 -329 -206 269 451 -621 328 -109 -538 -147 769 267 -656 -141 -175 345 -253 -335 -277 -82 690 777 1283
5627 1283 -861 239 -476 -204 467 -506 848 5 262 132 1091 165 221 -23 363 -969 -504 -28 254
5646 254 -836 193 -555 -120 1267 734 15 -43 460 266 427 -142 334 503 -355 -133 160 -73 -395
5665 -395 -763 65 -413 250 -969 -970 -58 246 -733 -1542 -787 -229 68 903 -275 949 492 -1030 -125
5684 -125 -288 -350 350 90 350 277 -493 873 38 -17 309 376 -97 143 -813 -524 328 -363 -205 793 635
5705 635 -160 -21 125 404 -1049 -565 448 -384 -294 217 -227 -270 88 351 327 -561 90 211 538 997
5725 997 -111 191 211 521 -203 550 925 -98 -19 -723 603 -1906 -161 -101 473 -543 1196 545 250
5744 250 700 -695 175 294 344 -561 -115 -728 514 -704 985 369 -105 -110 875 -49 -257 855 -494
5763 -494 -780 -256 -113 78 -92 -650 537 -609 375 353 -2 -34 -363 -312 -245 -346 138 -14 -435 -529 -933
5784 -933 -42 584 -387 218 166 -482 -41 586 100 305 -350 248 1054 -1321 1448 595 496 81 544 338
5804 338 0 147 -186 -271 323 204 324 304 -889 -463 -226 74 -99 -1043 489 700 -73 -346 6 722
5824 722 166 -82 -82 -795 294 320 -158 -744 -350 334 301 464 70 -665 72 616 -368 783 -497 191
5844 191 -51 644 -990 762 591 275 581 522 290 -593 201 -35 239 32 -439 -1171 764 216 170 156
5864 156 -674 -796 214 -229 85 -70 358 -448 -11 181 -68 -268 -463 -185 -778 107 309 242 -157 -33
5884 -33 520 46 885 239 323 -385 258 618 -699 1267 40 1109 -977 -79 -121 -111 -31 199 123 277
5904 277 -352 56 -278 989 -208 259 -671 -703 -633 -312 64 1135 -194 110 1235 910 -472 73 439
5923 439 292 -150 -1375 -835 1019 -297 259 482 -227 321 -905 -410 -2 -66 121 101 903 54 -324
5942 -324 72 -160 118 -377 -155 431 -556 686 357 942 350 -313 1020 770 41 -1008 -693 886 720
5961 720 847 -116 -423 317 960 64 -718 -59 -188 -12 496 -483 30 45 359 100 -204 -270 -292 454 -740
5982 -740 -154 658 -201 705 177 283 -567 14 -156 137 583 135 275 -60 -540 322 -265 -297 24 -15 -371
6003 -371 -161 -705 -904 1133 860 -406 -1264 1218 1141 -192 -338 355 402 11 -96 452 745 129 -645
6022 -645 15 -313 448 -527 391 100 -134 452 -251 -119 231 -245 637 287 -591 -27 -605 685 -547
6041 -547 -401 -65 33 281 -501 560 1465 -720 175 -324 326 634 -80 766 1047 11 -639 457 436
6060 436 1286 18 737 608 203 -165 -97 454 292 -618 -547 -484 241 -413 219 119 -637 131 4 -19 426
6081 426 -656 -1108 -668 -145 -118 -433 -330 -506 -675 -228 194 310 -150 -512 160 -668 -123 -154 370 533
6101 533 152 1424 141 715 -230 -97 487 -733 -548 -134 450 -32 568 -75 -330 84 -487 -556 -85
6120 -85 915 170 343 98 -87 175 -567 -140 -516 -36 -545 -571 541 -233 102 347 -64 -247 798 664
6140 664 225 -540 -309 217 -423 956 -77 -549 -162 520 -298 -179 -356 -605 -124 258 -733 -141 -175 232
6160 232 390 9 976 824 471 -787 -401 173 -635 874 -32 -501 -543 -279 51 -820 727 61 62 411
6180 411 -458 430 849 -594 545 -409 270 -198 -266 -239 -884 95 -609 -227 3 123 800 765 -431 -332
6200 -332 -199 1035 -1013 125 510 -34 765 -526 542 152 240 -559 -889 875 21 -164 550 399
6218 399 -127 -996 103 458 101 -627 113 272 71 656 -732 557 501 -478 383 -345 -580 230 156 -107
6238 -107 -1270 243 1079 -92 -408 -255 601 -1108 -311 -268 -107 -14 274 913 1435 571 570 986 589 106
6258 106 772 16 579 -355 -580 -374 -396 -169 -260 -866 23 158 -754 574 255 -413 -390 309 -318 62 175
6279 175 34 -826 -38 -499 297 -286 929 -80 560 -110 -922 -166 343 766 -111 -564 -723 -230 -51
6298 -51 327 605 -317 -795 -32 -126 272 -759 -691 -904 307 -554 406 -508 159 -256 367 80 -302 -595
6318 -595 183 33 -122 -85 134 13 -527 3 180 -94 297 408 -63 -527 198 -205 708 -282 -1061 -46
6338 -46 55 -234 637 -238 -303 388 -722 504 -297 -436 184 -350 -256 33 -14 -625 -344 -743 137 -400 -845
6359 -845 -590 -776 344 58 112 130 -301 -469 -1028 114 -216 367 -370 193 432 -202 -516 -610 66 103 -116
6380 -116 625 16 -513 -267 -839 -301 -140 -479 -398 -822 1271 -884 227 -239 214 -96 224 292 970 -380
6400 -380 -153 -102 -438 -446 -619 -129 261 -268 -219 -1001 -1092 286 897 -410 -56 -785 428 913 -95 361
6420 361 656 391 745 815 -328 173 62 656 -242 -379 -116 -620 -794 191 -159 246 189 -788 641 193
6440 193 -55 671 -210 233 -1073 57 -56 470 252 335 669 746 556 -374 85 153 502 -113 -1169 -775
6460 -775 -67 -441 -732 -797 62 -737 -86 -48 -674 161 464 176 464 -688 -117 983 -170 990 366
6479 366 212 -440 -266 -27 407 -340 -424 376 265 569 30 -60 421 190 -843 677 188 343 310 472
6499 472 -264 -656 1154 958 -599 -80 427 796 115 544 -43 -714 -89 -406 659 537 509 -451 518
6518 518 566 -619 494 303 -1090 -512 316 -197 891 414 549 -366 -910 -652 515 578 -955 481
6536 481 479 -184 310 304 -589 428 -309 452 222 224 419 100 -351 -432 52 -587 204 -321 -580 -177 9 -222
6558 -222 567 -337 -612 -609 -879 -499 -75 430 -179 -247 241 -453 -1001 -124 -321 -740 424 -198 -146 671 76
6579 76 488 832 254 -495 -213 -448 140 846 -97 963 1252 393 -32 551 266 -317 -427 -229 62 -410
6599 -410 -713 368 126 62 179 125 -838 -594 -43 -547 78 -339 475 -358 -159 -277 -424 282 -625 956
6619 956 -142 101 935 317 58 150 -141 580 49 984 273 -833 -566 -215 31 193 -209 -56 168 -320
6639 -320 179 211 -455 -1002 601 -603 276 636 -301 -64 58 -635 314 100 135 -8 94 -67 -536 250
6659 250 -539 149 -845 -857 161 1087 -522 -324 330 26 279 588 441 785 733 -1262 -556 43 -4 -152
6679 -152 -492 -59 -1106 -379 -1135 759 177 -238 400 189 -712 330 870 -392 -432 -104 -340 73 77 380
6699 380 629 174 -396 -174 837 -201 88 -460 -18 -409 -634 -324 -154 234 -215 -124 87 133 -111 1256
6719 1256 184 -18 235 104 -303 -113 886 -209 220 -422 79 -357 81 -274 -522 260 -420 169 -288
6738 -288 631 -573 616 -309 122 -485 758 862 1093 2 -895 524 -11 378 164 -146 1259 244
6756 244 572 81 -170 351 -262 341 -18 -412 -252 141 253 -852 -114 -345 18 186 508 -433 -1104 384
6776 384 20 -642 -493 -751 -397 321 423 567 -660 135 834 104 270 -290 376 -307 202 -213 -101 221
6796 221 -509 236 -70 22 -167 -938 254 745 139 -300 -782 -226 -579 -237 402 -659 -42 373 -562 -340
6816 -340 -562 -219 -519 868 661 -281 -750 200 -761 -16 -39 -318 269 -88 -83 111 654 320 -602 742
6836 742 321 227 -492 450 174 91 365 582 5 -661 947 -713 -166 -123 881 -737 506 686 -796
6855 -796 376 316 504 -174 -675 292 -872 -60 -82 277 -527 -522 517 329 -362 -237 -752 975 1014 -948
6875 -948 317 -334 410 -24 702 -687 261 -132 431 1143 795 -762 54 760 -916 -166 248 473 305
6894 305 34 -293 -124 264 241 -267 123 -229 104 638 -94 -481 -306 -759 388 367 -489 48 677 199
6914 199 272 -152 1218 -668 -915 220 -17 -623 -496 66 -663 -76 -851 -694 503 496 348 -179 -19 49
6934 49 -496 -539 200 -875 -24 1398 250 119 691 65 -296 951 138 563 -894 175 -31 -402 718
6953 718 286 -510 272 831 47 -751 1052 645 348 -564 137 272 -545 578 348 666 723 -60 -262 -559
6973 -559 633 -208 603 545 -73 795 -455 -352 157 516 -1 -169 42 -90 308 293 145 -319 648 426
6993 426 326 -340 -144 -442 239 -320 229 149 196 108 -445 536 -94 369 980 76 -256 637 -64 454 -495
7014 -495 -151 317 -225 -17 -100 -559 347 -962 375 -22 -167 -259 217 281 -465 23 263 317 412 167 719
7035 719 48 -32 861 -101 -462 244 -399 -372 381 -6 -23 251 -647 524 -251 -1195 -361 66 -294 -881 -395
7056 -395 -636 674 131 -421 -793 -646 837 -304 698 -812 692 979 365 851 553 234 314 -72
7074 -72 280 511 598 631 -254 91 906 660 245 -377 564 117 988 360 -281 575 -36 214 -127 70 204
7095 204 1075 113 245 516 974 -382 -63 227 -119 116 -633 254 -729 674 29 1310 1203 -202 137
7114 137 -723 -280 534 708 -411 469 35 -289 -779 453 71 265 -411 122 124 -402 -511 -253 321 -789
7134 -789 1016 207 125 -363 152 -397 55 126 399 452 -5 109 -119 -777 -265 -328 668 478 187 106 -718
7155 -718 -116 -349 580 423 48 -65 -721 -287 113 -741 494 498 130 377 287 561 431 -235 1108 248
7175 248 308 -11 328 -265 623 180 -556 139 521 812 -170 285 -448 467 -29 -41 -679 102 -123 707 607
7196 607 -1090 -844 -362 237 -306 89 782 198 283 -830 -15 136 -188 -940 -83 1053 1023 -102 -462
7215 -462 204 -334 36 -83 -163 5 198 92 1052 439 429 44 362 -465 199 -538 -707 -749 866 56 -1026
7236 -1026 506 -152 -124 -259 352 155 -330 733 -495 38 -551 23 -425 -534 429 287 -161 -256 375
7255 375 20 475 241 -875 809 -1000 -145 -983 905 -185 127 961 -52 238 -66 -249 -1428 291
7273 291 -565 -21 -878 -172 1040 -648 334 251 1412 109 -90 -644 -779 267 -616 -117 -1405 252
7291 252 -407 -633 -309 175 -161 17 -186 -1582 -480 -370 -246 -429 317 -525 35 347 174 -170 533
7310 533 129 90 585 419 -559 -766 130 208 1210 -12 -1044 978 241 -87 140 121 -135 -652 -364 397
7330 397 -379 -594 -664 -857 -365 968 -468 522 -656 -610 -165 631 506 -435 1108 559 159 170 289 69
7350 69 -112 -83 384 -159 259 -985 706 493 373 251 211 250 512 471 -166 -174 380 -12 275 -781 -339
7371 -339 -2 109 544 372 188 -587 145 48 -224 80 348 137 654 355 -656 -37 298 88 -1105 796
7391 796 225 45 532 525 297 187 -378 24 98 189 102 687 -54 671 -482 -1159 -645 -923 95 -349 103
7412 103 252 5 -175 -79 268 -64 -125 -462 -101 -566 523 187 -170 -76 957 -571 -588 -86 -992 64
7432 64 505 332 -251 515 365 -591 92 -214 541 209 -857 -368 919 -129 197 -5 -339 -509 -116
7451 -116 113 -172 -906 407 79 -540 -850 -522 -542 161 429 -274 -142 -733 -18 186 165 688 529 104
7471 104 -535 -133 194 -413 153 -533 497 14 98 635 -312 486 -237 -372 -458 -458 59 -36 179 -303 -921
7492 -921 -389 116 483 -625 -259 622 505 -129 -407 -745 849 -423 -567 -98 -25 298 -165 101 548
7511 548 -121 -73 195 11 113 -169 -937 -615 334 546 -210 -195 -190 -270 -262 -129 317 -1017 499 -931 -90
7532 -90 706 -576 -999 243 -454 12 92 843 416 216 946 -384 698 -153 -877 1190 -28 100 -272
7551 -272 -254 784 12 -433 -1017 1022 -482 343 -33 -463 248 -43 308 -160 264 717 -84 -480 -598
7570 -598 477 450 -534 96 -1076 -193 273 -173 -882 689 -447 -697 320 -504 501 150 38 -1076
7588 -1076 -616 -48 -782 46 -815 461 -144 -877 740 -222 166 568 -183 178 963 -147 47 1019 -16
7607 -16 -368 -444 7 -64 -346 -106 -347 -1263 -471 -305 754 -395 285 -836 -104 646 -78 495 666 -28
7627 -28 -182 808 743 432 -1468 37 -533 217 237 156 846 -144 362 15 90 -494 -114 -879 -28 288 709
7648 709 -51 -510 -365 -84 607 74 531 -1319 143 145 -896 270 -256 81 -603 -246 301 -1114 196
7667 196 -349 -76 375 975 196 425 -46 50 -648 -335 -215 -218 -175 -379 -1081 -137 -449 245 -656 376 129
7688 129 590 -13 223 -669 301 -915 -12 468 -203 -62 -109 -378 -114 -216 351 357 -877 92 -210 372
7708 372 370 -895 333 -411 19 -573 252 -231 -315 702 709 127 -503 768 -682 303 -525 126 306 -99
7728 -99 313 33 -803 -482 -573 321 -962 235 -879 1057 -141 -242 456 -580 447 -446 308 -279
7746 -279 366 -510 195 2 397 -94 -327 389 194 -442 -639 374 -411 486 -79 602 121 116 -395 -461 -334
7767 -334 268 -900 -1616 124 478 -399 -301 -206 -127 48 534 299 -898 -9 183 -410 -535 88 -43 -56
7787 -56 631 -491 104 142 -296 -521 -212 91 147 -572 -105 872 -542 167 -994 -1183 -112 395 -540 -455
7807 -455 380 608 -140 270 445 661 514 204 -373 505 178 -604 -230 156 -559 -32 -659 -462 -241 -171
7827 -171 478 574 -227 -48 114 -502 -214 257 541 -151 -703 450 -649 140 -479 -138 -499 -722 -399 52
7847 52 748 843 -927 -343 -315 417 -233 -704 -962 570 -1096 108 577 616 250 670 492 188 137 -363
7867 -363 -329 -283 -300 -273 -256 960 -291 -325 123 211 -250 374 -941 -181 -261 540 405 168 465 -750 772
7888 772 854 -292 -777 -331 -597 623 -174 -482 123 1412 104 240 349 -463 -465 -380 203 144 1044 -462
7908 -462 -199 -46 10 -587 -224 401 -158 347 865 227 -362 -192 -624 -479 348 -320 -772 51 119 -118 -379
7929 -379 977 -487 265 -1120 807 131 -821 -40 -709 296 281 61 -169 423 -499 -38 665 -885
7947 -885 -731 107 416 -950 339 -19 623 31 100 159 163 -415 -195 18 -38 313 222 -445 210 -563 -104
7968 -104 -667 -367 761 -579 -1124 -394 346 -529 -441 -174 154 -1088 -187 -139 -95 177 -549 342 1269 -79
7988 -79 -41 1070 -288 642 73 510 909 142 -698 99 -336 99 164 -1147 856 -243 -600 -261 -300 -382
8008 -382 540 -66 745 208 -744 278 1077 -42 -683 -149 -207 784 752 -391 -122 -893 -46 166 -617 -143
8028 -143 95 73 522 28 -631 696 -7 316 426 442 -762 -94 -13 70 -251 -176 322 346 285 574 -7 591
8050 591 612 -706 120 -295 971 280 -826 315 -557 334 259 -41 -144 43 494 149 -198 -570 -531 410
8070 410 856 -267 517 -290 35 772 -268 -1081 337 330 -763 65 -410 -303 231 -121 -220 -183 83 226
8090 226 -604 -466 -167 79 -264 293 321 -406 547 -127 -602 465 124 -510 52 -527 317 -96 816 310
8110 310 -271 975 219 -581 -26 -242 515 1519 301 132 176 7 126 -590 810 2 198 -797 -95
8129 -95 -184 -597 -716 904 -191 -21 -344 -389 -507 -97 -692 45 -91 -663 -552 -615 -319 -117 -459 1112
8149 1112 262 -59 -412 307 -679 -269 320 170 57 -527 710 -254 440 166 -205 -257 322 -123 -255 -224
8169 -224 -565 -373 196 -599 -11 388 -435 -203 -351 -24 -420 -670 125 -540 277 -876 111 39 -477 384
8189 384 487 -906
8191i06
$$ Imaginary data points
##PAGE= N=2
##DATA TABLE= (X++(I..I)), XYDATA
0 0 0 0 0 0 0 0 0 0 0 0 0 0 0 108 -108 108 -108 108 -216 216 -216 324 -324 432 -433 540 -648 756 -864
29 -864 973 -1085 1292 -1416 1621 -1837 2057 -2322 2596 -2908 3236 -3601 4004 -4436 4910 -5429
45 -5429 5994 -6615 7289 -8032 8848 -9746 10738 -11841 13070 -14436 16002 -17763
57 -17763 19809 -22180 24987 -28371 32534 -37789 44706 -54188 68070 -90355 131886 -235224
69 -235224 1054347 1025093 -1359815 -52382 738307 369945 -417213 -463847 230892 462751
79 462751 -5830 -341069 -348171 600473 522078 -746726 -518349 849134 374184 -778689
89 -778689 -231967 582183 130499 -256697 -206525 -19417 262938 178824 -430983 -369437 512366
100 512366 403982 -644586 -419637 661904 392563 -700680 -252491 662758 45142
109 45142 -346676 41911 -43562 146461 186599 -360975 -205103 341789 258683 -381261 -366658
120 -366658 534408 263275 -585311 -37526 391081 -72221 -130543 10865 -78791 73107
130 73107 218075 -204619 -323926 354712 321890 -480896 -240146 502977 103595 -467071
140 -467071 -14185 330043 -53953 -158120 83413 914 -19405 191013 -95784 -294941
150 -294941 273801 246261 -385831 -115027 358786 47828 -264931 -6699 213979 -55571
160 -55571 -99451 102632 -105000 -18746 253523 -151441 -254570 271999 195411 -326737 -147802
171 -147802 355968 49217 -342527 72634 219523 -139049 -59257 90529 -75602 -20177
181 -20177 140489 -62031 -178113 158471 186394 -247303 -114930 289829 -18971 -243029
191 -243029 111848 103908 -120294 29038 73234 -98969 -8486 161567 -66161 -212369 177815
202 177815 180338 -281392 -61756 287602 -49798 -202340 102059 111571 -118346 -23095 106876
213 106876 -92629 -48123 170990 -76924 -170404 176928 93923 -209196 -18305 195275
223 195275 -42231 -162573 100333 87940 -142936 26509 107244 -132185 -6523 165298
233 165298 -92695 -125993 154542 81520 -181169 -30214 195809 -48903 -164086 126868
243 126868 67578 -136554 46882 81415 -99649 -6381 114817 -52916 -118267 119432 86917
254 86917 -178450 -345 179902 -87007 -106262 120953 20831 -101155 41254 68664
264 68664 -89782 -20468 129179 -64232 -122110 146584 51041 -171781 34920 138841 -83810
275 -83810 -84940 98413 29196 -106941 32706 79556 -97923 -7027 118952 -77210 -79485
286 -79485 122683 19195 -125968 23366 111053 -66615 -85147 106601 17374 -111504 61885
297 61885 55355 -101044 19100 87551 -68532 -61640 94801 26804 -125033 24587 120407
308 120407 -85804 -63115 113918 -10676 -84926 58622 33820 -75657 8563 78832 -52924
319 -52924 -62143 105661 18041 -120238 47149 87943 -87258 -34562 85945 -8340 -65622
330 -65622 41172 41362 -71404 4208 79755 -64635 -46133 100197 -6074 -88915 48652
341 48652 62626 -62805 -36750 73854 1267 -72540 50281 38028 -75537 26125 61309
352 61309 -67316 -22543 75077 -9554 -73204 36243 65569 -64859 -32111 80712 -18880
363 -18880 -61374 52303 12507 -58936 25393 41356 -48703 -22401 64988 -5670 -74829 43487
375 43487 53882 -71178 -11329 65549 -26198 -38196 37584 11426 -43215 12169 42215 -46137
387 -46137 -23367 70544 -19479 -62312 51915 30236 -55274 -2367 47329 -12820 -36843 30915
399 30915 16507 -47760 18892 37317 -51494 -5531 57107 -26418 -42894 39512 24494 -45854
411 -45854 -9648 48338 -14035 -37371 39849 6543 -41188 26774 20056 -39606 2292 39705
423 39705 -15395 -37630 33239 30673 -49706 -2655 47781 -25207 -18762 33627 -3565 -19485
435 -19485 17219 14082 -27990 -4954 39350 -17685 -38605 41859 15146 -43691 10214 29849
447 29849 -18550 -14518 19250 3190 -19551 12408 17438 -30072 3294 37425 -26333 -22347 36568
460 36568 4181 -30460 5232 21875 -9953 -19343 20368 3540 -23907 21172 7755 -29935
472 -29935 13188 21171 -19979 -12987 20313 10637 -29932 -368 31109 -19928 -15117 21429 -10057
485 -10057 -12062 14082 -3491 -15990 6399 19040 -13839 -17834 27944 7949 -31654 10124
497 10124 21258 -15789 -4930 11856 -5029 -4571 7693 1977 -12669 6160 19736 -17830 -8901
510 -8901 28128 -3436 -19176 11336 10958 -6048 -7391 7844 3800 -10744 7470 2235 -17996
523 -17996 10406 9225 -20126 -3012 14261 677 -16093 94 15137 -7953 -10198 10285
535 10285 -3379 -5453 8072 -5867 -7756 10430 4311 -12015 -2666 15521 874 -16754 6053
548 6053 14119 -10350 -1583 9474 -3186 2096 5402 -2755 -2578 5851 5606 -10289 -4720 16337
562 16337 -3072 -14613 7192 4552 -5627 -2791 444 2819 -2228 -256 -1758 -8180 6670 3833
576 3833 -13041 698 9782 -4705 -7187 1924 6310 -2473 -6269 3787 1578 -2571 3218 -2026
590 -2026 -3118 10542 891 -10122 4590 7263 -302 -6959 1076 9560 -2458 -5287 3399 313
604 313 1735 74 -5183 1729 4142 -671 -5458 -750 6878 -2747 -7414 4611 1442 -3250 -955
619 -955 -2424 2508 2423 -5302 -183 -127 2555 3306 -7683 -94 10661 -3823 -5798 4642 1763 1574
635 1574 -2698 -4429 7175 1591 -4459 330 896 4492 908 -7037 3858 6720 -3558 -2865 1398
650 1398 4052 -1699 -3355 587 1273 1528 -2627 -4333 4726 1845 -4539 -1442 -364 3116 704 -7805
666 -7805 3174 6358 -3883 -2241 -372 858 4173 -4053 -3785 6665 -216 -2010 313 -1103 5298
681 5298 -133 -7092 3382 3279 -2831 -1165 -1441 2595 1563 -5063 -1034 2946 1922 -3000 -2932 3813
697 3813 2037 -3191 -2591 971 4604 -1262 -6214 2647 3231 -594 -1513 -2836 3916 3192 -5269 -2086
713 -2086 4432 -896 -7 -2208 -1992 6143 -1689 -5118 3390 2351 156 -1316 -3024 3350 1859 -5548
729 -5548 -193 2856 1730 -1803 -3586 3136 3713 -3495 -1770 -64 4196 1104 -4333 547 1511 -51
745 -51 -468 -3116 2279 2669 -4019 -1204 2225 1374 521 -3209 182 3832 -1491 -2466 2090 1183 1350
762 1350 -1657 -1782 4014 1453 -2656 -339 785 2418 -950 -3904 2639 1533 -1638 -1542 -2576 2813
778 2813 1306 -4007 -23 3167 -203 -1737 -2032 2523 3584 -3117 -727 1105 1223 1326 -3235 115
794 115 4183 365 -2118 -233 3220 2304 -3360 -2388 4126 499 -1420 -1233 597 2326 -117 -2189
810 -2189 622 1688 387 -1447 -2787 4868 2088 -5472 -715 2698 361 -1211 -2788 2355 2319 -1849
826 -1849 168 -833 1816 1948 -4243 -642 4835 -262 -3251 -771 3028 2448 -2622 -1125 2202 421
842 421 -161 -1650 -1212 1991 129 -4102 -402 3349 619 -3637 -2379 4965 -221 -3594 1322 1521
858 1521 813 608 -1961 311 2729 -89 -2573 -2268 2812 847 -5838 632 3279 -1559 -1533 -282
874 -282 304 1401 -1622 -1022 -386 1881 952 -4696 -1626 4679 -128 -3413 1063 2632 -770 -3240
890 -3240 -10 1538 -596 -338 132 -1318 2260 1701 -3730 -404 3851 655 -3697 746 2805 -1170
906 -1170 -3103 1460 1281 -1305 1057 -1118 -1529 2269 -199 -2395 -228 4390 516 -4845 728 4252
922 4252 -1818 -1190 1064 645 618 -591 -763 -170 2250 1371 -2425 -1428 4569 -235 -3452 1658 2121
939 2121 -2181 -2356 495 182 396 352 -878 -561 1033 944 -3936 -593 4418 -1926 -3524 2128 3106
956 3106 -455 -2206 1282 993 -983 810 -1420 -1012 2095 -229 -4070 533 3914 -444 -5073 1107
972 1107 3842 -3023 -1494 1095 -1047 -375 267 -1414 -173 2803 -837 -2141 1192 3423 -771 -3661
988 -3661 1167 2609 -1866 -1810 308 -492 -297 -142 -1265 -461 1394 420 -1447 -105 2870 -1253 -3439
1005 -3439 1999 2101 -1887 -2304 1774 66 -793 1014 -233 -1437 2280 -100 -2958 954 2704 -1579
1021 -1579 -3294 2430 2644 -1383 -1343 1370 640 -342 662 -1008 -406 2795 -1091 -2913 2465 1316
1037 1316 -1913 -2580 2143 1857 -2312 -1340 1891 -706 34 701 -1681 220 1465 -728 -2180 991
1053 991 3303 -1819 -2222 1714 718 -2177 -2309 900 90 -79 -43 189 164 2572 616 -2453 1361 2246
1071 2246 -2231 -1655 2289 -202 -1784 -359 1628 792 -571 121 -184 -155 1578 -817 -2776 2026
1087 2026 2403 -1365 -2000 1500 1729 -1556 -13 1422 188 0 317 -1002 1956 -256 -1238 -1658 1235
1104 1235 2094 -2534 -1870 1398 402 -1263 -65 209 478 143 671 -91 617 1687 -951 -1543 1343
1121 1343 2124 -2231 -493 1928 1029 -724 -643 780 416 -794 -811 -87 807 786 -697 -2418 1279 1123
1139 1123 -865 235 1351 136 -1688 -52 1233 1304 -760 -82 231 1178 531 -1455 -972 2114 964
1156 964 -2035 -660 1851 186 -1416 -1137 811 1327 -204 -407 -897 1060 526 -2199 -203 1153
1172 1153 96 -1853 -498 1164 135 -703 -16 570 1010 49 -197 105 1540 -51 -2140 -542 994
1189 994 888 -1639 -446 1346 563 -482 -649 790 857 -564 -1567 455 1057 425 -399 -444 2018 502
1207 502 -1555 -647 1191 -271 -1689 -167 155 -247 -435 -52 -768 1681 -419 -776 268 679 646 -1581
1225 -1581 -947 1619 1013 -1381 -1138 643 1472 -375 -614 146 764 -1015 -1529 22 550 514 -1609 -1015
1243 -1015 697 375 -816 -1473 -126 1101 -391 -1193 1175 951 -1161 -832 -322 1192 -336 -535 -125
1260 -125 1193 911 -1551 -1106 656 689 -394 -674 1057 1466 181 96 -449 1350 -496 -697 -67 1278
1278 1278 974 -968 -357 809 785 -356 138 621 325 -54 -740 -870 1292 -926 -2037 -461 1559
1295 1559 -293 -840 -807 1196 883 -1132 -614 733 729 -580 82 278 1438 -295 -1492 79 839 162
1313 162 252 326 -223 570 -728 -1425 -90 717 -531 -1467 195 262 486 -702 133 356 -1020 -913 -857
1332 -857 650 386 -901 -767 -400 332 -1078 -1455 459 1295 232 -166 505 1230 -1123 -1233 128 964
1350 964 -219 117 77 -137 826 -536 -834 780 950 -1199 -453 1433 312 70 -704 261 927 -165
1368 -165 -825 -1351 -83 432 -329 -287 499 1178 0 -1665 748 937 -1256 -82 587 -128 -156 -766 104
1387 104 98 488 310 26 66 942 -928 -1776 378 351 -751 -608 674 -430 -233 735 -14 -346 891
1406 891 -1657 -1684 484 1242 -307 -1116 1243 62 -2400 -305 1007 -363 -1259 815 306 538 1476
1423 1476 -201 -1069 127 1613 -1798 -1500 1536 988 -1772 -355 1772 -1272 -209 903 95 -78
1439 -78 720 -166 -1711 472 2700 -597 -1009 2066 -461 -2502 -55 1469 -511 270 111 171 -283
1456 -283 1447 -592 -2386 1166 1891 -1102 -399 1554 -41 -1629 -351 1189 -1535 -1063 2 584
1472 584 178 1261 -524 -2195 1730 1902 -1688 -436 2572 147 -2705 36 1556 -1467 115 479
1488 479 -1621 -418 2105 -90 -2339 1985 1452 -2686 -1193 4152 -579 -2012 1046 350 -2044 530
1504 530 1201 -1421 -196 2175 -1357 -2595 1533 2353 -3576 -1752 1720 375 -2957 2223 2218 -1246
1520 -1246 -284 2767 -1839 -935 3278 -116 -2211 2444 2625 -3710 -489 3334 -1131 -2263 1333 1952
1536 1952 -2555 1119 1299 -2166 322 2863 -1008 -3432 2450 2216 -3178 -761 2957 -1049 -2882
1551 -2882 2762 723 -2952 599 2306 -1494 555 3427 -655 -2500 3219 2268 -3744 304 3445
1566 3445 -1797 -2167 2866 686 -2027 1084 2406 -2018 -1333 3548 -2075 -1969 3419 2593 -2906 820
1582 820 3284 -2002 -2727 3701 457 -3657 1080 1778 -3353 -442 4300 -2486 -4056 3334 1473 -4090
1598 -4090 375 3820 -1583 -3129 2753 1302 -3871 1588 3182 -2570 108 3536 -1772 -3014 4939
1613 4939 578 -4307 1185 4279 -2687 -2291 3334 516 -3744 1970 2363 -3269 -793 5657 -1650
1628 -1650 -2740 4902 1558 -4484 694 3939 -3616 -2812 3500 -582 -4016 1897 2735 -3405 -76
1643 -76 3771 -2490 -2317 4565 605 -5416 2492 4358 -3647 -2101 4296 -626 -3942 2677 2065 -4271
1659 -4271 -98 5103 -4582 -2478 4226 517 -5902 2871 3044 -4250 -2432 4577 -1516 -4278 3378
1674 3378 1800 -3840 1310 4501 -3249 -2571 5692 336 -5484 2950 2814 -4662 -1289 4865 -1581
1689 -1581 -4066 3850 1986 -5307 1263 4075 -4115 -1850 5776 -245 -5016 2719 3759 -4615 -811
1704 -811 4569 -2707 -2984 3309 2242 -5361 1683 4168 -4411 -2246 5389 -1796 -5694 3459 4152 -5025
1720 -5025 -1209 6084 -1862 -4248 4234 918 -5220 2033 4606 -4320 -1623 5768 -2144 -5320 3614
1735 3614 2117 -5571 -159 4568 -2843 -3116 6607 492 -5889 1951 3302 -4469 -834 5282 -1684
1750 -1684 -3756 4505 2103 -6264 299 4849 -3657 -2863 5619 613 -4982 4050 3276 -5364 -813
1765 -813 5388 -2072 -4828 4971 1917 -5806 1414 5026 -3076 -2703 5583 198 -5259 2599 3139 -5122
1781 -5122 -935 6291 -3027 -3561 5627 2158 -6385 974 4856 -3389 -2485 5365 -1388 -4801 3031
1796 3031 2956 -5764 335 5567 -3168 -3726 5937 1285 -5955 2534 4395 -5065 -2135 6750 -1397 -4575
1812 -4575 4739 3263 -5687 1746 5123 -3362 -4384 5384 695 -5598 2705 5000 -4546 -911 6266
1827 6266 -1942 -4156 4864 2401 -6184 1602 5189 -3742 -3231 5052 67 -5191 3250 4280 -4771
1842 -4771 -914 5928 -1540 -4997 5076 1269 -6429 2911 6239 -4235 -2678 7181 220 -5218
1856 -5218 2989 3706 -5731 -763 5372 -2712 -2906 4853 1134 -4835 2663 3864 -5336 -3157 5924
1871 5924 -1217 -5228 4393 3253 -5452 -366 4742 -3463 -3598 4270 947 -6130 2662 4881 -5258
1886 -5258 -1623 5690 -834 -4515 3806 3542 -5570 852 4784 -3333 -3229 6066 117 -5624 3475
1901 3475 3597 -5393 -568 6832 -2269 -4772 3671 1919 -5439 536 4134 -3553 -1078 4895 -288
1916 -288 -4400 3496 4162 -5389 -1219 5733 -1136 -4457 3879 1539 -4884 951 4149 -2873 -1379
1931 -1379 4847 -287 -4889 2816 2898 -5278 190 5601 -2081 -4456 4372 1532 -4863 880 4529
1946 4529 -3016 -2111 4865 -1882 -4675 2924 3277 -3889 780 4364 -2531 -2777 4955 1219 -3875 1376
1962 1376 3314 -3888 -1180 5238 -2044 -4074 4105 2658 -5217 527 5332 -2732 -3416 5024 1188
1977 1188 -4240 2261 3155 -4017 -1094 3625 -1346 -3499 4456 2337 -3643 477 3716 -2933 -2832
1992 -2832 3678 887 -3978 1745 3249 -2789 -833 4349 -2266 -3083 3980 1377 -4253 1068 4538
2007 4538 -3233 -2515 3540 -80 -4446 1142 2397 -2907 191 3845 -2234 -3566 4667 1044 -4539
2022 -4539 1064 3700 -3148 -1624 4499 -996 -3035 2854 2106 -2175 -384 2937 -2663 -2689 3600 199
2038 199 -3842 1523 4028 -2928 -708 3729 -327 -2537 2776 1601 -2738 -303 3389 -2556 -2281
2053 -2281 3912 -560 -3361 1733 2946 -3729 -1606 2686 -1004 -2507 1896 1082 -3303 18 1991
2068 1991 -1157 -1053 3291 600 -2724 2138 2273 -3538 -1038 3200 -851 -2610 2649 856 -1650
2083 -1650 1187 2365 -2726 -1307 3248 -1262 -3711 2214 2099 -3193 -1003 2900 -1585 -2194 2447
2098 2447 538 -2031 585 2407 -2900 -857 2711 -717 -1859 2337 1147 -2705 -414 2395 -426
2113 -426 -2179 2443 1462 -2220 879 2046 -2602 -1047 3626 77 -2616 1546 450 -1888 353
2128 353 1602 -1166 -1547 1420 494 -1715 1438 922 -1815 -161 2098 -314 -1531 2317 467 -2033
2144 -2033 -350 2648 -1206 -1748 2271 75 -2266 2253 2040 -2190 284 2307 -1284 -1598 1907 998
2160 998 -1227 -220 1578 -1389 -976 2169 -199 -2483 769 962 -1608 -871 1456 -1230 -1616 1498
2176 1498 370 -1704 306 1494 -1491 -1527 2509 -28 -2251 905 632 -2150 -573 2396 -1138 -182
2192 -182 1851 993 -1430 -140 1165 -1857 486 1628 -668 -573 1616 -20 -1925 370 1776 -556
2208 -556 -268 1856 715 -1366 572 2414 -679 -1084 1201 -142 -1596 1321 110 -1897 -517 1322
2224 1322 -1597 -982 1236 420 -1867 1028 1708 -898 -230 556 93 -423 1256 -711 -862 1441 124
2241 124 -596 -653 1752 62 -1144 921 1512 -624 -449 372 54 -181 897 521 -1197 150 1024 -305
2259 -305 360 904 -450 -519 373 -66 -323 293 359 -266 -565 898 258 -607 1155 -8 -819 -82 874
2278 874 -875 -1078 991 285 -763 -28 914 -555 -933 971 -609 -613 296 355 -1404 1239 1595 100
2296 100 -275 454 624 -780 501 1392 -638 -340 827 312 -27 -281 819 -971 -394 238 -878 -726
2314 -726 -184 883 -387 -415 331 84 612 814 -918 -621 605 686 -691 -288 568 -399 -461 -886 -411
2333 -411 -959 295 512 -519 -222 672 -755 -176 408 -277 -1798 -705 966 647 -852 297 607
2350 607 -316 189 -415 -563 90 -105 -618 390 -18 -154 -481 568 346 -473 56 289 656 99 -227
2369 -227 67 -27 173 17 -20 259 650 353 99 100 599 -511 -143 321 478 639 655 -1276 765 637 -550
2390 -550 -163 373 261 -901 -556 393 -521 -710 -497 299 -730 -182 469 -676 -222 407 -351 -1210 707
2409 707 -219 218 -347 -440 -337 5 -178 539 83 -571 -664 -430 -716 141 -565 -66 521 -1013 199 -329
2429 -329 -346 -749 481 -130 157 823 198 -200 -483 -304 702 -212 -1005 724 649 -79 173 1043 -213
2448 -213 -528 -405 -864 -163 1112 192 316 607 645 -362 -393 -564 -374 747 185 73 -77 -10 -114 -37
2468 -37 -576 -256 207 -781 132 -73 104 -665 -446 -485 366 -326 -10 -499 -113 -620 -572 594 439 -16 -303
2489 -303 105 -99 -853 773 394 173 -50 -79 530 374 -20 -101 460 293 -393 -1130 -844 127 -431 -1829
2509 -1829 -426 33 587 621 -239 -108 227 190 -451 346 -163 316 101 99 816 -716 565 -14 370 -432
2529 -432 -835 -206 866 753 186 572 198 34 -430 -888 476 372 -654 -126 -298 -853 -345 299 -882
2548 -882 329 -179 828 144 -102 -295 -52 -719 -489 84 -118 -25 -1123 1096 282 -602 -796 1020 -584
2567 -584 -90 251 292 953 1278 138 -12 93 568 -354 -21 603 -215 446 -477 -554 157 -586 -64 415
2587 415 413 618 168 697 542 714 -534 857 546 519 -79 68 -13 217 -269 80 -65 -165 488 364 334
2608 334 -236 -326 254 74 378 -608 -368 39 539 233 72 231 59 1062 291 -64 -200 883 654 -3
2628 -3 -255 184 132 -107 -175 583 -479 492 55 1022 -371 -710 815 233 215 237 420 -192 -997 -584 -57
2649 -57 242 546 515 -219 -960 1489 600 -1331 37 -914 -847 426 -170 -173 80 -431 -357 -292 251 26 -204
2670 -204 590 1055 -568 -259 61 -112 551 45 11 -774 1212 -95 404 -193 29 -392 -753 -490 -605
2689 -605 -132 -105 757 499 104 181 431 154 -144 342 -522 532 174 99 317 109 664 363 215 889 -26
2710 -26 316 341 -233 32 -67 -166 -570 2 -143 -41 -870 -654 561 83 220 -305 -682 346 464 229 -646
2731 -646 -1150 754 98 -1174 -106 -1231 591 580 -732 -654 37 238 32 623 -936 -550 -369 1185
2749 1185 77 486 -344 126 286 150 -255 127 -16 918 -257 49 -504 26 383 -337 429 -419 -136
2768 -136 -670 -335 573 298 -536 -308 -326 495 -858 460 504 -616 593 439 226 433 -129 275 359 714
2788 714 1514 -412 -556 359 -147 -37 120 646 150 -828 -491 -62 -646 -438 -163 -195 152 -938 748
2807 748 -760 814 242 364 -1001 738 785 239 423 -189 244 298 1014 695 -241 176 -571 -625 -228 -247
2827 -247 -273 359 -276 37 -145 106 11 243 -431 -587 129 -127 128 -808 739 -552 210 -90 168 -309
2847 -309 -463 -1133 -37 -197 -256 950 330 -89 631 105 531 173 -540 460 407 -244 390 -850 513
2866 513 553 410 245 -181 104 764 562 9 -235 -414 -340 -197 484 1148 -23 160 418 -38 -126 77 939
2887 939 -518 -893 39 -1019 -479 -101 -211 -553 -455 -126 422 219 765 -50 -289 441 -478 -274 435 -945
2907 -945 -599 379 -334 -375 -295 362 732 -312 -851 619 308 -5 -680 -236 -657 657 -304 -1098 120
2926 120 562 115 187 -511 -348 -1295 136 1517 391 -464 -171 327 -542 387 404 413 367 -820 -666 -264
2946 -264 511 23 -643 77 -160 731 444 -331 -283 -15 -548 -423 132 284 -654 -995 -652 -513 -1218 -240
2966 -240 383 -60 37 -212 -500 -59 11 361 385 -402 408 -893 -188 -268 -362 -575 -746 -400 477 266 -188
2987 -188 297 404 559 41 -293 -791 -125 216 296 -215 733 314 770 -431 -595 -241 -597 -481 -249 -473
3007 -473 186 478 -17 -708 89 -713 -736 -968 -610 -760 -395 538 -809 -483 -205 -321 -417 245 386 -386
3027 -386 -506 -133 368 -342 -72 99 415 -117 721 120 -19 -195 201 960 393 612 -1245 -87 488
3046 488 -303 -211 402 -697 575 57 -262 894 709 -153 -323 -104 560 -149 -318 -20 -296 -115 -336
3065 -336 363 308 192 1081 641 998 159 -260 788 -468 -36 42 364 15 490 -1023 -487 -1054 -330 -477
3085 -477 -388 53 -362 652 -784 989 -11 1213 345 -696 340 -457 162 699 819 11 -336 1024
3103 1024 -381 -900 251 192 218 695 -1581 391 -480 -106 211 -236 -254 -1 111 213 363 -271 949
3122 949 746 402 194 252 -781 -32 -540 -398 -548 326 -717 -170 -861 -463 -130 -691 51 24 -711 685
3142 685 600 642 -682 374 37 -787 -296 -745 -796 -162 -1061 -802 -72 286 -661 -48 -36 267 -436 565
3162 565 71 3 124 6 -450 -350 -231 538 244 -775 685 237 502 622 294 265 362 215 34 -346
3182 -346 -369 344 -184 100 -172 35 -700 -252 -927 95 -466 -126 -484 -318 453 -529 597 1015 114 -461
3202 -461 432 191 -384 -863 276 439 -319 106 -620 -804 -1032 84 -367 -238 -147 -371 137 510 -85 179
3222 179 -21 42 4 115 263 436 449 -816 -609 -58 59 262 768 -291 426 859 -590 -118 -410 -516
3242 -516 -660 465 392 -801 632 -389 -1738 163 -548 -223 -1051 37 -167 -343 -285 321 339 552 -154
3261 -154 1421 150 117 431 216 -62 677 -72 129 621 163 -505 16 -324 -79 -151 -98 253 -445 571
3281 571 721 -166 94 467 -104 94 173 42 -311 -294 744 -360 -866 125 23 464 -1049 -8 993
3300 993 1471 -75 -218 635 550 298 -545 -344 -398 51 399 10 282 556 511 660 -442 -109 714 -499
3320 -499 -165 -415 258 -392 582 368 -95 -358 16 -348 719 -450 -317 257 -119 148 433 357 -638 211
3340 211 -453 -705 187 -209 -349 777 264 -298 -453 82 -163 28 -118 -53 -557 -569 -230 0 -344 -428 471
3361 471 115 238 912 -330 -819 882 -190 -544 1074 480 300 262 490 -66 -397 -1398 318 377 202
3380 202 -94 -366 -389 -377 -206 43 427 427 -884 783 246 -478 -1224 273 -121 -138 791 215 252 -87 1108
3401 1108 -381 157 276 37 382 -266 9 -585 -54 -390 -353 993 832 383 -731 1356 501 -1169
3419 -1169 -439 758 368 699 391 568 -40 421 -68 -617 -708 -83 -445 -400 426 -607 195 -531 692
3438 692 -109 886 528 861 -243 251 148 -737 683 -393 339 45 -21 -87 -166 220 131 -872 -536 459
3458 459 -54 -559 -837 722 406 -369 141 -490 121 87 75 -262 -456 957 62 -631 62 157 -1057 -126
3478 -126 876 -380 -995 951 806 -1071 -414 -128 -469 -101 476 231 -993 296 508 -1180 93
3495 93 746 -275 -224 314 435 -895 -391 95 -277 567 1228 568 -1044 -293 -127 -1144 1030 542 -312
3514 -312 71 202 340 579 746 378 -555 -872 124 190 -263 -123 419 -267 -1106 549 362 -163 745 200
3534 200 -997 499 251 357 75 -139 331 1017 623 -167 -115 67 898 -251 -691 -533 -248 22 -835
3553 -835 -197 -840 -713 431 -267 -979 895 -205 -105 61 -282 25 -15 326 535 -1046 89 -98 -364
3572 -364 -787 328 -659 -151 836 -553 -2 -282 377 -291 -429 112 837 -236 267 -318 -1223 33 350
3591 350 433 -735 909 -373 -520 511 -377 -893 -701 -498 93 172 -236 341 -286 560 -268 -597 -396
3610 -396 344 -630 -506 459 -65 82 679 413 -233 130 818 775 437 -28 -1116 -143 -720 -181 -2 -1774
3630 -1774 -165 -355 81 200 880 483 406 994 -6 -328 -651 -119 -165 349 270 347 -480 41 -308 -908
3650 -908 543 -230 47 27 383 -34 -372 433 1239 -22 104 -338 238 -493 518 -115 -1301 -228 -280
3669 -280 -216 -450 -43 164 88 163 -277 928 -52 793 -355 -13 543 -420 -843 387 507 111 -110 -969
3689 -969 474 -141 -159 -118 -306 -348 35 654 -166 -289 -308 -208 522 -54 -50 217 361 -446 -41 165 96 -501
3711 -501 200 -188 428 -262 -261 -436 -330 696 -376 -123 -250 609 -117 72 619 52 -398 -303 -1 989
3731 989 252 677 -157 127 480 714 -113 503 794 208 -103 86 318 384 355 -442 69 -63 234 429 -649
3752 -649 896 88 213 130 548 -491 -1063 540 -164 193 524 464 -270 251 1605 -636 -109 495 420
3771 420 379 -279 504 550 64 -19 496 -874 292 510 -647 -295 190 -495 -545 788 -113 -591 -59 310
3791 310 254 -107 224 -35 -701 1201 180 -1213 -602 823 -541 -648 199 1519 -115 -489 1016 -1347
3809 -1347 98 621 269 -717 -268 -176 -337 829 -451 -97 -970 363 941 343 815 -41 -13 432 250
3828 250 -302 -321 -44 245 -1034 741 178 233 -522 86 282 -443 464 1021 -616 -804 629 792 481
3847 481 752 3 -290 360 140 545 -525 63 665 161 -234 -114 522 -134 -319 209 -1161 65 -24
3866 -24 -868 579 -600 -1212 -29 525 1113 -543 57 -218 296 -281 1329 277 966 -40 -623 -362
3884 -362 -634 -42 554 512 -751 -174 -1194 880 235 98 -90 1571 54 777 -489 289 361 106 233
3903 233 -125 78 907 630 -271 436 634 -138 -732 -9 -792 269 -4 -819 20 461 -30 -205 108 -1307
3923 -1307 -636 242 478 1161 127 -515 -317 -110 335 -206 547 176 -7 -447 -365 34 267 23 -713 -484
3943 -484 935 -554 863 -159 383 284 61 194 1034 505 952 -124 128 -250 -215 -459 -215 -75 -23
3962 -23 231 -685 -254 244 344 -80 -14 76 118 -774 144 1325 351 479 161 89 -905 413 132 -256 72
3983 72 -141 355 -64 -628 -158 701 598 1219 304 479 -361 548 -980 -361 -564 -537 731 8 -430 -503
4003 -503 246 -50 -352 -43 -434 -518 -796 730 -227 365 146 698 -213 -3 471 134 615 264 556 -923
4023 -923 -518 -333 22 -176 -81 -445 169 47 -525 -64 943 -454 -154 203 167 174 -46 -227 -758 -212 -353
4044 -353 305 -617 44 249 -250 -51 85 -41 202 -214 648 21 428 -137 -81 -5 -276 -125 -581 -405 -819
4065 -819 732 -407 622 -275 -189 -44 -256 -784 43 627 -331 110 130 179 2 746 -121 111 282 754
4085 754 -309 27 -374 -754 943 -536 -660 -37 -200 1423 -207 96 -287 -53 -288 6 250 114
4103 114 143 163 370 504 -107 99 256 383 953 -223 -361 -1199 -474 -198 -473 828 -313 237 67 639
4123 639 -49 1203 -252 5 547 653 -266 -139 -293 249 1342 -23 -208 -95 878 -158 288 662
4141 662 169 321 79 108 -390 881 74 -484 -25 664 662 9 15 485 939 90 959 -773 -73 -50 266
4162 266 -267 945 572 437 -665 746 69 -9 744 -588 388 454 206 -404 -136 372 -406 -148 2
4181 2 424 480 -510 497 187 556 1155 730 -355 99 -493 327 -936 -917 376 283 41 -423 50 -997
4201 -997 -423 -98 -367 -305 443 218 -65 932 405 349 -588 -766 601 886 -434 -499 -467 711 -482 777
4221 777 -391 -262 -143 661 -264 -155 222 -170 -472 18 -571 295 -217 665 -374 -161 986 -99 328
4240 328 -924 192 3 -722 201 717 501 -150 592 -36 69 332 -709 -976 708 244 350 -611 161
4259 161 189 -428 117 115 -552 334 -528 -442 188 -161 330 -694 846 -81 277 -793 -783 -352 379 -155 -905
4280 -905 38 186 -399 -950 -89 -152 584 -161 -176 -419 197 735 751 -50 187 -526 197 -9 828 270 75
4301 75 1039 -353 -457 -271 -771 280 97 -787 426 -361 232 -426 -484 -177 -1238 736 123 -156 769
4320 769 588 298 -601 417 -297 -635 -494 -204 174 -170 -71 -566 -275 -431 -66 22 -488 67 250 165 13
4341 13 496 41 1128 151 -32 -645 -5 98 46 -119 282 310 -360 323 -189 408 321 32 256 -486 48
4362 48 120 587 544 -583 276 -81 -469 -115 -66 -61 921 703 -520 741 -489 -139 -271 32 -401 -283 -694
4383 -694 -293 946 -352 346 374 -275 7 -238 52 660 299 -164 11 12 -325 -495 -135 -297 -454 677
4403 677 159 -936 485 -550 -198 63 -266 -136 -833 -326 -97 -564 355 -56 -8 -733 -124 719 -87
4422 -87 -1004 328 514 -349 -315 -29 592 -210 -804 559 137 -161 496 -405 -502 -322 209 183 161 242 481
4443 481 -408 87 1739 -73 -551 -635 31 137 156 -518 -333 149 1168 474 -535 -446 129 6 161 71
4463 71 -1537 -672 268 -328 1898 -522 -347 124 -324 728 -13 184 572 433 79 335 -786 850
4481 850 597 233 -766 450 -405 434 -122 831 -427 250 665 -590 631 -656 484 -418 104 -292
4499 -292 -222 -319 221 507 187 58 -56 129 -154 -619 -427 -119 -10 108 214 158 -60 418 614 73 -608
4520 -608 -126 -901 -659 -376 124 1229 -106 -229 902 451 -221 -454 436 -1043 248 584 135 3
4538 3 -426 -277 517 -132 -98 -170 -1131 642 735 -621 -72 352 251 46 95 1145 -261 546 -1398 705
4558 705 -215 -43 683 -93 -35 143 147 -653 1551 272 -140 137 -230 719 -311 -302 96 199 -5 137 -127
4579 -127 800 -15 -589 -25 -112 64 135 1 665 -144 242 702 -179 108 -155 573 192 -844 -471 -230
4599 -230 -36 -649 724 -195 421 1 -267 -636 -339 67 -226 -882 -315 702 312 -1119 179 322 13
4618 13 187 808 1089 220 -438 229 -92 -197 45 566 465 163 1065 281 468 626 682 344 786 -592
4638 -592 706 -430 198 -276 27 193 123 -285 -43 -13 581 79 -821 -152 686 -313 -277 -191 326 -304 -45
4659 -45 -911 -258 176 314 -555 4 323 807 398 -67 777 -43 1133 -254 35 574 924 154 920 348
4679 348 657 550 154 -358 -175 -516 356 132 -63 336 -40 475 662 -60 -105 -75 -457 -63 118 -247 785
4700 785 -161 613 191 538 156 -110 1016 -505 534 -86 530 -380 -254 -60 361 -150 151 521 -1035
4719 -1035 354 732 307 -456 170 -300 386 -684 -685 97 -161 -306 578 -872 -89 719 -52 280 12
4738 12 774 -318 440 215 649 277 -4 605 -175 22 638 1060 514 81 586 337 363 -8 -713 45
4758 45 108 -294 190 -255 -115 -95 -595 -17 -197 -503 432 607 163 870 80 -486 -1126 -522 581 -62 115
4779 115 -4 718 -476 -621 -85 722 -409 -420 476 -360 406 -296 -443 252 -626 -205 -467 632 594 -443
4799 -443 -203 22 546 -22 -14 -124 -550 16 325 -3 346 -237 743 510 335 -640 -724 268 719 -410 456
4820 456 -385 -325 -19 231 645 241 -337 102 165 -34 58 -91 11 523 -79 -357 -407 473 -87 40 -323
4841 -323 -958 -169 270 -766 565 693 34 -1240 489 232 1247 -231 -154 361 -208 205 26 400
4859 400 589 -16 -330 458 -1204 -178 731 -128 -194 886 -31 550 89 994 -117 -73 821 211 936
4878 936 -41 -67 -1246 -767 -358 358 450 841 204 -32 -211 -229 464 -142 -197 326 298 371 339 -355 1133 596
4900 596 -268 75 -105 998 -187 205 211 -98 349 282 -369 -53 -873 -856 -920 -401 -162 455 150 610 336
4921 336 221 -190 352 1076 66 -660 -11 -211 -583 39 -23 -142 313 -153 625 133 200 -453 256 -381
4941 -381 -103 -57 62 -456 -248 176 331 -292 -172 -214 198 561 -586 248 499 -439 -424 940 -78 -468
4961 -468 -268 167 760 15 862 -590 402 517 437 430 439 -178 515 424 -39 732 420 161 -194 281 -757
4982 -757 740 81 212 95 50 -446 -745 418 -15 -473 154 -591 666 597 79 417 -17 252 -856
5001 -856 468 1081 -901 -33 179 -195 -254 945 -75 -915 121 49 51 -104 744 264 208 484 -817 587
5021 587 -98 -381 160 -607 213 132 996 485 308 -1176 201 583 1172 -341 -155 24 624 -106 -384
5040 -384 272 502 -319 -124 77 227 -186 -224 188 353 57 7 485 -181 374 212 -49 -116 300 629 515
5061 515 -311 -594 114 -160 877 282 489 467 -1110 127 -747 269 -182 -514 911 780 170 -80 13
5080 13 -1083 -116 583 -539 -906 232 536 169 332 444 1111 708 99 538 373 258 -232 -270 370 -196
5100 -196 258 -599 49 -369 -389 -104 792 249 536 690 68 1055 -201 543 105 171 114 -821 -640 -1092 682
5121 682 509 -8 308 251 -592 452 74 -414 -203 -429 324 -178 1101 -296 283 321 246 604 -635 872
5141 872 -124 -43 -80 65 -411 845 -154 784 127 -62 -353 -940 -401 -314 492 338 -1015 -530 1033 605
5161 605 -844 528 502 516 190 -141 -1021 -63 224 -300 -41 -552 -743 -331 145 447 -407 -468 -76 -772
5181 -772 -318 130 -990 201 714 -312 11 296 -1273 -25 284 221 957 152 130 -1025 -834 659
5199 659 -1809 -36 284 -208 -659 -375 -455 -573 -320 -295 -383 533 -285 737 -368 -848 706 614 193 -760
5219 -760 162 -1121 255 -133 -449 314 117 -515 269 -460 -728 -265 -45 65 230 -494 48 133 -416 -833
5239 -833 -1003 121 -337 313 626 258 -566 168 -494 -156 104 -438 -130 632 -7 -565 106 651 845 355
5259 355 -174 -75 111 13 412 -452 -125 -360 -213 -153 949 -459 -182 -278 203 -207 568 -111 -642 -438 -414
5280 -414 -96 30 -332 283 414 -74 986 -178 -51 218 -13 486 338 -520 682 -529 -64 -150 -269
5299 -269 147 -722 1151 297 -54 -507 -304 -221 -175 652 155 -219 -408 62 -327 640 -113 192 -374 142
5319 142 -804 -686 -634 1112 551 -286 299 34 216 167 286 222 -11 -242 519 587 559 -177 609 -365 387
5340 387 327 -207 34 229 -185 74 -482 -627 45 -283 67 545 214 245 315 1122 866 202 480 -486 1009
5361 1009 -695 -1292 524 -139 -276 -41 -472 -1193 -338 -247 -856 -373 -73 -58 32 -977 247 -514 -697
5380 -697 -85 531 194 371 519 492 466 -356 1003 151 -462 145 -159 65 325 501 -258 -853 -1 -933
5400 -933 259 167 -452 -479 -353 11 -380 -323 553 -988 1136 318 72 -349 -520 -83 -448 514 544 566 -791
5421 -791 225 -770 -629 -1150 -56 -423 -386 -234 -16 -619 16 -591 561 682 401 699 415 -352 493
5440 493 -95 -293 62 -325 -413 243 41 557 239 352 946 298 -657 1036 372 69 66 -200 -345 38 355
5461 355 10 -857 -109 -473 760 856 -527 -306 -90 154 -94 -238 -424 -852 61 651 135 77 -247 419
5481 419 185 74 264 -61 -373 346 -368 -188 48 288 124 -777 -338 502 92 134 155 78 -517 258 355
5502 355 -98 76 704 184 -399 -1365 -31 725 84 -919 -179 -137 -962 581 -239 315 15 1417 -725
5521 -725 306 -26 754 323 300 187 -846 503 409 152 -680 396 928 881 825 -42 125 -850 -567 -112
5541 -112 414 153 599 402 -300 -656 -729 -255 -582 177 -253 -858 -279 254 451 -223 301 327 507 -67 -334
5562 -334 -264 -1206 61 1048 1183 354 572 17 -60 -392 -185 636 4 -47 121 10 -332 842 145 -132
5582 -132 35 -199 -90 12 502 -351 -979 412 -560 -12 -362 -320 -94 93 -32 -128 229 1126 596 -143
5602 -143 -546 -600 -295 -440 302 -528 65 96 167 -321 -125 -658 887 -85 -57 332 -64 -7 38 1080 -68
5623 -68 -35 -55 -92 -392 307 53 1231 -459 149 846 275 -108 908 85 -346 -248 -191 -135 388 -103 -284
5644 -284 148 1001 -306 -6 168 -147 -280 -21 -770 14 -52 145 55 501 294 338 -155 91 68 289 -403
5665 -403 686 765 -372 -349 268 484 -449 -50 -158 -715 237 -417 -290 -248 79 376 -335 -420 -284 -226 -131
5686 -131 9 155 802 -346 -802 859 60 87 162 -120 -744 70 91 382 965 -387 304 226 27 -160
5706 -160 -96 480 8 -176 781 278 435 -343 477 100 116 42 -75 48 126 -826 284 -188 -171 -186 -554 39
5728 39 481 480 -228 -420 -542 -868 21 392 -333 318 -484 733 177 9 1205 -102 -325 90 -298 140
5748 140 967 -327 1081 -918 -191 396 823 1074 -163 386 -365 -257 -925 -797 -196 928 -603 863
5766 863 235 -204 -483 -206 -101 102 815 117 -860 145 43 -108 -48 -270 115 -258 -186 -613 -545 -1061 -59
5787 -59 381 67 -323 -823 -572 -812 -152 -28 240 306 87 -443 -502 373 -745 37 449 -263 192 -674 -86
5808 -86 239 -130 -871 -755 374 99 -555 162 -516 -689 460 -208 -241 -25 -850 -408 128 526 105 -166
5828 -166 -759 -377 -712 -437 994 907 -629 359 488 440 589 -371 131 170 66 481 -379 -67 -279 -188 332
5849 332 150 207 -925 157 -683 173 -597 107 217 -675 158 513 -233 -1065 -357 -175 252 355 77 -108
5869 -108 -173 264 357 -183 -15 -265 392 -304 432 -970 -606 -269 -180 481 -277 -230 -529 493 -340 -165 226
5890 226 15 -427 283 -148 -750 551 -686 -220 -593 102 71 457 594 33 44 560 242 -65 -191 -133
5910 -133 19 908 -505 -288 -29 321 -137 197 225 165 -101 -79 469 678 401 -68 -56 -214 -482 493 114
5931 114 -343 755 -163 559 -1230 -921 -238 433 133 -953 -431 30 -314 167 -930 14 210 -1 -767
5950 -767 360 -176 -751 189 471 673 206 106 372 197 -1099 -67 -451 195 248 -390 -650 527 -34
5969 -34 790 493 1064 198 -548 268 494 158 388 -23 -430 -988 277 -172 -141 323 -124 642 265 64
5989 64 629 133 120 384 5 -733 328 -282 -173 -61 56 -870 757 8 147 -674 173 -72 240 1275
6009 1275 194 38 -663 -379 399 -202 180 -545 -402 193 331 -547 -138 195 -4 501 279 68 739
6028 739 105 -228 326 470 135 186 853 -625 -465 -531 -522 -433 1252 -81 -159 139 310 340 -51 459 297
6049 297 -239 532 207 295 362 413 -156 -157 587 -751 1704 407 384 434 379 -554 319 -257 -813 -287 834
6070 834 -428 489 -437 -239 665 318 -420 681 -216 -502 -187 -426 -96 -336 629 345 140 431 -1005
6089 -1005 -582 92 -358 35 47 505 187 381 -377 -401 -500 -589 -110 812 16 -202 -43 854 483 705 -662
6110 -662 -1218 228 -286 478 505 -10 167 -3 1020 -281 565 563 -149 410 -198 346 -196 -217 -601 556
6130 556 -813 -46 -93 -163 -218 48 -124 -472 509 -484 -760 -624 -368 -250 255 -285 -290 130 -468 488 441 131
6152 131 509 -435 604 8 -160 321 455 154 -14 616 -482 363 224 -312 876 653 160 21 405
6171 405 342 874 85 -176 -628 -465 808 -323 -592 53 834 679 -208 972 -197 279 238 -13 185
6190 185 -728 75 -919 -232 -99 -413 159 -455 -118 -42 671 -756 490 1034 247 -737 65 740 689 -306
6210 -306 -173 1513 -231 1309 12 -501 43 292 298 -171 419 -450 -241 -864 499 -372 182 711 240
6229 240 379 -221 484 423 -10 -267 132 396 463 -336 88 -552 -521 612 -191 -805 -696 -673 337 681 -61
6250 -61 -661 568 185 -338 -317 9 -138 58 821 71 202 -59 603 -507 60 -33 -730 -543 505 218
6270 218 265 -396 524 -285 -390 -703 -129 338 -789 664 38 -648 -869 -443 -589 -508 -374 -380 262 -454 -118
6291 -118 -800 448 -931 731 -233 -219 -62 -234 -102 285 -22 72 -458 -246 244 245 732 670 199 -230 466
6312 466 277 793 14 -352 1034 -399 109 -1067 65 -154 -444 187 -315 -368 -190 -51 67 -487 192
6331 192 319 -701 4 -672 301 -62 -1232 -457 551 -441 389 -279 373 418 -48 262 659 -82 -511
6350 -511 -762 202 741 -504 169 -214 -483 -751 16 289 -112 -623 -762 452 540 116 -198 36 353 204
6370 204 -285 270 103 289 193 656 337 -257 -439 906 -301 -439 59 -413 -34 906 -3 387 -679
6389 -679 226 272 540 -371 -622 488 89 -945 -701 1260 -162 52 121 151 -756 -290 -226 627 -474 787
6409 787 52 -127 68 1200 -655 153 -1224 350 310 -59 1265 -422 -553 -100 13 -18 977 -417
6427 -417 -350 -247 -11 213 148 992 -101 -619 -1185 -275 -45 332 87 -729 377 -616 315 -148 12 503
6447 503 505 76 711 -176 246 -715 -117 367 86 256 241 -692 -283 924 -323 706 38 -126 -568 433
6467 433 211 713 -266 439 228 33 -842 -679 488 347 343 -650 823 -462 -29 184 -447 839 -328
6486 -328 -702 255 -320 348 1125 -376 316 252 -86 290 685 292 177 -10 777 -614 517 120 -565
6505 -565 -336 104 -743 -738 -115 -31 1046 -171 -857 600 -200 567 623 451 -216 -420 -93 31 96 -453 -136
6526 -136 -510 702 -49 353 -49 259 979 348 -121 -635 -421 297 -545 631 565 -528 81 462 -581
6545 -581 -976 363 399 -535 -970 427 367 53 -343 519 -170 381 -218 -296 114 431 -179 -251 -244 -1059 -585
6566 -585 -773 -391 -280 442 -91 10 -438 -234 218 -653 593 392 -254 756 217 -833 -383 -472 686
6585 686 -349 -299 141 -578 -566 -947 -329 -271 -24 566 -648 60 403 -142 -342 -52 157 237 -433 115 -217
6606 -217 158 -135 831 102 -7 -260 225 -302 -719 -644 301 -102 725 888 -408 -44 749 238 143 174 -413
6627 -413 10 -31 -411 749 -322 344 230 672 1469 -1046 -177 -55 -22 1527 268 543 579 321 874
6646 874 -199 -267 616 -928 -39 -710 9 853 -22 -916 -92 98 526 219 -324 219 -62 135 -335 575
6666 575 222 23 -912 -301 334 -313 -227 -347 -153 512 736 883 9 9 29 -95 -219 -245 -24 -16 161 182 1259
6689 1259 -633 162 -83 677 436 -905 861 243 656 50 -144 -301 239 694 -1151 592 1079 346
6707 346 33 -433 294 728 109 328 288 869 517 -302 1507 547 -920 216 -103 142 315 495 28
6726 28 -114 -404 399 -221 -364 -517 -519 514 -389 -772 -399 577 244 402 303 -288 209 -438 344 -409 -274
6747 -274 87 -720 539 403 193 -434 625 -105 -55 321 -170 304 -103 277 -553 -635 -497 -132 -294 -429
6767 -429 -392 446 471 -67 -569 -467 699 524 -465 -520 -479 111 46 739 -595 135 99 472 518 -1064 -514
6788 -514 -403 -649 -157 198 305 -635 1003 -223 -8 350 -578 -728 583 -804 -32 476 -64 -558 964
6807 964 -864 639 810 -406 -637 49 103 479 631 616 95 188 -58 -240 469 763 127 -604 283 -348
6827 -348 -495 411 255 -307 -351 -1037 661 175 -551 231 887 145 908 33 66 504 391 -208 290 166
6847 166 -14 -512 -774 970 21 250 473 68 -27 166 665 -54 222 658 -614 -223 -198 -130 132 -349
6867 -349 -26 -257 155 1206 1290 495 7 45 -833 680 -124 425 280 283 -18 645 -700 -382 -230 60
6887 60 110 -264 186 -141 218 -446 101 538 -98 772 483 -106 204 301 -60 -244 57 -715 698 -592
6907 -592 352 67 848 -234 140 -4 -160 251 -327 415 -224 -971 -553 849 529 854 -459 355 578
6926 578 -249 721 -395 -148 1193 -416 214 536 209 -116 632 -229 -46 -7 52 -145 381 -282 101 226
6946 226 -390 -62 182 -143 -873 -68 -477 -656 262 736 187 389 -489 -42 -252 114 144 235 541 168 -883
6967 -883 476 550 115 200 -295 438 -114 -261 318 -917 -19 -411 1 -697 -951 1218 -75 -404 -495 83
6987 83 120 961 -16 -1326 256 206 679 -21 -893 -706 -55 167 605 -354 -210 -880 371 383 419 -1086
7007 -1086 -285 538 558 -562 -954 -25 -192 -780 -39 243 -1 -1066 -467 635 64 -111 -36 -135 -189 465
7027 465 -94 -776 -49 159 -289 -460 91 939 323 -303 -425 234 -453 -219 518 111 -342 441 190 824
7047 824 283 288 1484 -235 -302 779 -652 434 803 -614 98 213 -118 -306 -131 -40 128 251 -304
7066 -304 -312 990 -322 38 413 477 -488 -104 181 459 -684 682 -492 276 -110 -534 -434 992 -1
7085 -1 -563 -105 -83 1257 -56 -824 -210 -255 577 -492 -373 -821 -807 -268 475 -259 -227 -115 -64 68 -233
7106 -233 -241 -403 157 515 144 655 -652 -970 680 -1012 -436 -564 162 -791 -97 268 723 -318 559
7125 559 -471 199 528 -434 -71 -647 317 -179 -523 -672 -911 -672 309 -144 465 -630 771 357 -730
7144 -730 -178 -388 -33 -157 -459 -265 -547 124 445 80 -273 581 -675 -907 -116 841 89 119 -275 316
7164 316 56 330 446 16 792 225 1317 94 292 1230 140 -211 -558 457 724 -280 -128 576
7182 576 -261 254 729 370 -509 859 992 -133 57 -687 250 -119 -496 -611 424 220 -19 127 591
7201 591 -982 214 -277 451 -70 451 607 -226 524 489 447 29 357 -45 -150 149 652 -201 -48 247
7221 247 -555 -322 -171 981 -479 -565 612 -901 741 177 -142 -230 -930 -573 103 -396 282 349 1087
7240 1087 -221 286 -293 -437 895 -541 412 378 382 -141 -691 -218 1047 -152 -867 92 491 -330 -1111
7259 -1111 564 -89 328 212 70 285 -107 494 -419 -1418 97 -402 -189 218 429 -285 -146 -89 -707
7278 -707 -323 291 182 -254 177 -356 744 -90 -440 495 -262 134 1263 -157 -533 132 403 701 -102
7297 -102 -292 170 -108 1 -604 341 622 522 -527 -1658 -203 -773 857 39 -209 234 567 -307 -379
7316 -379 -70 -179 238 335 -62 166 19 -706 798 194 -528 -854 -199 -447 -68 1031 -199 677 1055
7335 1055 -430 879 485 560 -143 -621 -39 677 -118 -1105 -182 -648 -731 -160 559 596 280 163 193 -73
7355 -73 -281 -1016 -1143 -446 -15 879 469 1052 311 482 -83 197 125 -432 -294 55 385 -999 335 283
7375 283 895 207 -450 165 -229 -431 -165 829 44 444 -133 -297 -581 533 -444 633 144 205 888 -295
7395 -295 -258 736 1142 115 23 -2 349 -280 -308 -604 27 -157 808 -42 126 -125 -579 171 -233 -312 -128
7416 -128 -292 608 -199 -233 599 307 164 -207 -45 -1047 -394 -655 -521 -191 -316 -288 649 -134 -380 44
7436 44 372 -20 -350 820 553 -199 -802 -139 379 -43 315 778 175 -983 132 -506 691 449 720
7455 720 792 -518 14 -559 60 -516 143 -238 -23 74 754 -192 129 -379 441 379 -544 -496 513 95 136
7476 136 56 562 -554 3 171 -480 -532 -316 -85 54 641 -205 -467 387 367 639 52 -375 -311 278 370
7497 370 -988 1352 319 -51 207 -291 -277 25 59 129 -502 -415 612 -336 273 -30 -818 192 64 -639
7517 -639 33 -114 -433 -78 -516 -123 -221 -317 -440 -45 664 561 -85 -316 -46 -176 -874 -130 138 -51 -302
7538 -302 266 -331 -818 39 -2 -248 196 -499 1056 -92 -56 670 332 718 154 464 -857 248 98
7557 98 -642 -646 -507 -673 960 -286 -131 602 5 -103 242 -208 -1123 -538 708 570 -458 263 -70 766
7577 766 -880 -57 50 30 -142 968 186 -326 693 129 -70 -891 91 -7 560 -374 350 414 308 -121
7597 -121 -633 53 69 602 167 943 -612 225 526 546 594 120 303 -217 576 -486 177 -564 -164 489
7617 489 -372 812 862 -476 -246 184 -445 534 -589 -292 337 333 57 996 1429 576 101 -126 538 456
7637 456 -212 -69 719 905 -960 -907 480 -20 135 128 -340 135 -159 146 -292 -1159 321 140 744 -91
7657 -91 -170 710 207 -132 -342 -136 -309 1108 -421 707 769 -52 419 207 418 570 -922 146 237 1039
7677 1039 -513 511 426 329 50 309 -430 -394 773 -1041 -179 -1158 -597 -43 148 555 -642 340 -827
7696 -827 560 124 -207 648 -84 -592 -91 -421 -472 -326 -52 503 665 111 526 -389 -938 -439 -319 542
7716 542 428 51 -149 -213 1261 165 1034 216 -360 -291 383 730 188 -456 256 -393 366 215 -130 185
7736 185 161 300 -278 196 237 459 723 671 -156 114 -115 -561 168 -279 704 -141 735 515 -101 -577 -137
7757 -137 -600 915 -192 -1473 32 -1 -27 -76 251 382 79 172 79 347 -468 787 -514 345 30 777
7777 777 1273 126 735 192 -374 -415 1132 245 77 12 -2 709 -1287 252 829 176 73 227 421 69
7797 69 -517 -220 -630 103 692 537 171 -882 367 -307 16 -76 582 -171 202 -663 412 -44 -68 384
7817 384 449 633 -480 1022 315 -309 86 -268 -571 -586 -174 -331 28 600 325 899 -309 -468 113 612
7837 612 -219 -510 1133 -748 -230 -289 -200 -95 -499 320 665 439 540 163 -641 -239 -190 -387 -292 610 219
7858 219 686 -191 731 -312 182 -60 -168 372 177 -428 -259 452 -580 191 -32 568 826 -41 935
7877 935 267 -866 678 17 448 -92 -444 471 -799 943 146 -277 -367 171 -116 -325 16 -457 -162
7896 -162 43 9 1422 419 868 238 -762 1091 -42 280 961 -450 -99 -82 958 -463 -756 289
7914 289 23 -63 339 230 20 673 291 0 -132 280 122 -439 15 468 550 736 -614 120 534 35
7934 35 20 -929 -524 55 -447 -414 334 -42 761 258 -149 254 -302 711 66 -201 107 -521 -153 -623 -202
7955 -202 135 -458 281 -675 834 -312 715 371 602 243 -350 159 285 137 857 726 116 -98 -932
7974 -932 -123 -539 -446 -151 -83 -533 259 140 -259 736 477 246 1030 422 323 120 595 -107 -446 -43 -259
7995 -259 149 -605 -247 -377 292 247 397 -304 487 -295 -68 -465 -918 315 839 -543 -18 273 -551 -55
8015 -55 1298 -90 -441 225 -1081 361 -51 912 799 626 384 -69 174 464 260 84 525 282 193
8034 193 345 -306 1022 62 12 185 264 433 425 731 923 -422 -27 398 1211 243 -267 417 -430 790
8054 790 -318 -212 536 -749 685 561 -162 -58 549 83 -82 505 710 -322 -491 -747 -346 -243 643
8073 643 64 -985 -292 -240 235 -518 -36 -991 164 -269 -381 -285 -774 -729 228 89 -328 152 -1285 229
8093 229 471 418 234 289 -681 241 536 646 15 67 -60 28 -207 4 628 278 -261 586 -249 -40 969
8114 969 14 783 -218 -244 -292 443 575 -436 -120 738 -181 -378 287 671 285 184 -156 735 -1295 202
8134 202 -185 -390 -247 -411 -216 579 1123 -398 884 123 680 -56 231 -280 115 364 -987 -692 750
8153 750 -463 204 -552 -478 -269 -363 -7 -864 -27 336 -183 -612 -32 -108 109 487 -178 620 94 -275 -337
8174 -337 7 318 373 287 -630 350 -447 -180 -399 -723 952 294 309 -335 -664 -298 416
8191D16
##END NTUPLES=NMR FID
##END=
