##TITLE=1H_SAM_30.235.1
 CDCl3, 48 sc, 
 23.11.2020
##JCAMPDX= 6.0         $$ Bruker NMR JCAMP-DX V2.0
##DATA TYPE= NMR FID
##DATA CLASS= NTUPLES
##ORIGIN= UXNMR, Bruker Analytische Messtechnik GmbH
##OWNER= root
$$ XWIN-NMR		Version 3.5
$$ Mon Nov 23 13:19:13 2020 Russian Standard Time (UT+4h)  she@DPX200
##.OBSERVE FREQUENCY= 200.1315066352
##.OBSERVE NUCLEUS= ^1H
##.DELAY= (6, 6)
##.ACQUISITION MODE= SIMULTANEOUS
##.ACQUISITION SCHEME= undefined
##.AVERAGES= 48
##.DIGITISER RES= 18
##SPECTROMETER/DATA SYSTEM= spect
##.PULSE SEQUENCE= zg30
##.SOLVENT NAME= CDCl3
##.SHIFT REFERENCE= (INTERNAL, CDCl3, 0, 15.7039)
##AUDIT TRAIL= $$ (NUMBER, WHEN, WHO, WHERE, WHAT)
$$ ##TITLE= Audit trail, XWIN-NMR		Version 3.5
$$ ##JCAMPDX= 5.01
$$ ##ORIGIN= Bruker BioSpin GmbH
$$ ##OWNER= she
$$ F:/spectra/data/she/nmr/H-F/1/audita.txt
$$ ##AUDIT TRAIL=  $$ (NUMBER, WHEN, WHO, WHERE, WHAT)
(   1,<2020-11-23 13:17:59.15 +0400>,<she>,<DPX200>,
      <continue with go, POWCHK disabled, PULCHK disabled
       terminated by command 'halt'
       configuration hash MD5:
       00 E9 B6 7A A2 85 ED C7 34 08 36 98 17 FE 4E 26
       data hash MD5: 16K
       CD 20 8A 88 87 36 8C 63 DB CA 4E 60 47 8E DC A6>)
$$ ##END=
$$ 
$$ hash MD5
$$ 02 69 46 DC D1 E4 7B 6B 7F 04 93 72 6F 74 48 7A
##$RELAX= 
##$RELAX= 
##$RELAX= 
##$RELAX= 
##$RELAX= 
##$RELAX= 
$$ Bruker specific parameters
$$ --------------------------
##$DU= <F:/spectra>
##$EXPNO= 1
##$NAME= <H-F>
##$PROCNO= 1
##$TYPE= <nmr>
##$USER= <she>
##$AMP= (0..31)
100 100 100 100 100 100 100 100 100 100 100 100 100 100 100 100 100 100 
100 100 100 100 100 100 100 100 100 100 100 100 100 100 
##$AQSEQ= 0
##$AQ_mod= 1
##$AUNM= <au_zg>
##$AUTOPOS= <>
##$BF1= 200.13
##$BF2= 200.13
##$BF3= 200.13
##$BF4= 200.13
##$BF5= 200.13
##$BF6= 200.13
##$BF7= 200.13
##$BF8= 200.13
##$BYTORDA= 1
##$CFDGTYP= 0
##$CFRGTYP= 5
##$CHEMSTR= <none>
##$CNST= (0..31)
1 1 145 1 1 1 1 1 1 1 1 1 1 1 1 1 1 1 1 1 1 1 1 1 1 1 1 1 1 1 1 1 
##$CPDPRG= <>
##$CPDPRG1= <>
##$CPDPRG2= <>
##$CPDPRG3= <>
##$CPDPRG4= <mlev>
##$CPDPRG5= <mlev>
##$CPDPRG6= <mlev>
##$CPDPRG7= <mlev>
##$CPDPRG8= <mlev>
##$CPDPRGB= <>
##$CPDPRGT= <>
##$D= (0..31)
0 1.2 0 0 0 0 0 0 0 0.06 0 0.03 0 0 0 0 0.0002 0 0 0 0 0 0 0 0 0 0 0 0 
0 0 0 
##$DATE= 1606122872
##$DBL= (0..7)
120 120 120 120 120 120 120 120 
##$DBP= (0..7)
150 150 150 150 150 150 150 150 
##$DBP07= 0
##$DBPNAM0= <>
##$DBPNAM1= <>
##$DBPNAM2= <>
##$DBPNAM3= <>
##$DBPNAM4= <>
##$DBPNAM5= <>
##$DBPNAM6= <>
##$DBPNAM7= <>
##$DBPOAL= (0..7)
0.5 0.5 0.5 0.5 0.5 0.5 0.5 0.5 
##$DBPOFFS= (0..7)
0 0 0 0 0 0 0 0 
##$DE= 6
##$DECBNUC= <off>
##$DECIM= 32
##$DECNUC= <off>
##$DECSTAT= 4
##$DIGMOD= 1
##$DIGTYP= 9
##$DL= (0..7)
0 120 120 120 120 120 120 120 
##$DP= (0..7)
150 150 150 150 150 150 150 150 
##$DP07= 0
##$DPNAME0= <>
##$DPNAME1= <>
##$DPNAME2= <>
##$DPNAME3= <>
##$DPNAME4= <>
##$DPNAME5= <>
##$DPNAME6= <>
##$DPNAME7= <>
##$DPOAL= (0..7)
0.5 0.5 0.5 0.5 0.5 0.5 0.5 0.5 
##$DPOFFS= (0..7)
0 0 0 0 0 0 0 0 
##$DQDMODE= 0
$$ [...]
##$SUBNAM2= <"">
##$SUBNAM3= <"">
##$SUBNAM4= <"">
##$SUBNAM5= <"">
##$SUBNAM6= <"">
##$SUBNAM7= <"">
##$SUBNAM8= <"">
##$SUBNAM9= <"">
##$SW= 16.9725356469052
##$SWIBOX= (0..15)
0 0 2 0 0 0 0 0 0 0 0 0 0 0 0 0 
##$SW_h= 3396.73913043478
##$TD= 16384
##$TD0= 1
##$TE= 0
##$TE2= 300
##$TE3= 300
##$TEG= 300
##$TL= (0..7)
0 120 120 120 120 120 120 120 
##$TP= (0..7)
150 150 150 150 150 150 150 150 
##$TP07= 0
##$TPNAME0= <>
##$TPNAME1= <>
##$TPNAME2= <>
##$TPNAME3= <>
##$TPNAME4= <>
##$TPNAME5= <>
##$TPNAME6= <>
##$TPNAME7= <>
##$TPOAL= (0..7)
0.5 0.5 0.5 0.5 0.5 0.5 0.5 0.5 
##$TPOFFS= (0..7)
0 0 0 0 0 0 0 0 
##$TUNHIN= 0
##$TUNHOUT= 0
##$TUNXOUT= 0
##$USERA1= <user>
##$USERA2= <user>
##$USERA3= <user>
##$USERA4= <user>
##$USERA5= <user>
##$V9= 5
##$VALIST= <valist>
##$VCLIST= <CCCCCCCCCCCCCCC>
##$VD= 0
##$VDLIST= <DDDDDDDDDDDDDDD>
##$VPLIST= <PPPPPPPPPPPPPPP>
##$VTLIST= <TTTTTTTTTTTTTTT>
##$WBST= 1024
##$WBSW= 4
##$XGAIN= (0..3)
0 0 0 0 
##$XL= 0
##$YL= 0
##$YMAX_a= 398617
##$YMIN_a= -157748
##$ZGOPTNS= <>
##$ZL1= 120
##$ZL2= 120
##$ZL3= 120
##$ZL4= 120
##$ABSF1= 10
##$ABSF2= 0
##$ABSG= 5
##$ABSL= 3
##$ALPHA= 0
##$AQORDER= 0
##$ASSFAC= 0
##$ASSFACI= 0
##$ASSFACX= 0
##$ASSWID= 0
##$AUNMP= <proc_1d>
##$AZFE= 0.1
##$AZFW= 0.1
##$BCFW= 1
##$BC_mod= 2
##$BYTORDP= 1
##$COROFFS= 0
##$CY= 11.3945322036743
##$DATMOD= 1
##$DC= 2
##$DFILT= <>
##$DTYPP= 0
##$F1P= 15.9154993809931
##$F2P= -4.1035820241983
##$FCOR= 0.5
##$FTSIZE= 0
##$FT_mod= 4
##$GAMMA= 1
##$GB= 0.15
##$INTBC= 1
##$INTSCL= 1
##$ISEN= 128
##$LB= 0.24
##$LEV0= 0
##$LPBIN= 0
##$MAXI= 10000
##$MC2= 0
##$MEAN= 0
##$ME_mod= 0
##$MI= 1.114404
##$NCOEF= 0
##$NC_proc= 0
##$NLEV= 6
##$NOISF1= 3.799351
##$NOISF2= 2.8
##$NSP= 1
##$NTH_PI= 0
##$NZP= 0
##$OFFSET= 15.70392
##$PC= 1
##$PHC0= -11051.96
##$PHC1= 16.80089
##$PH_mod= 1
##$PKNL= yes
##$PPARMOD= 0
##$PSCAL= 0
##$PSIGN= 0
##$REVERSE= no
##$SF= 200.130013532006
##$SI= 16384
##$SIGF1= 3
##$SIGF2= 2
##$SINO= 400
##$SIOLD= 16384
##$SREGLST= <1H.CDCl3>
##$SSB= 0
##$STSI= 0
##$STSR= 0
##$SW_p= 3612.71676300578
##$SYMM= 0
##$S_DEV= 0
##$TDeff= 0
##$TDoff= 0
##$TI= <>
##$TILT= no
##$TM1= 0
##$TM2= 0
##$TOPLEV= 0
##$USERP1= <user>
##$USERP2= <user>
##$USERP3= <user>
##$USERP4= <user>
##$USERP5= <user>
##$WDW= 1
##$XDIM= 8192
##$YMAX_p= 0
##$YMIN_p= 0
$$ End of Bruker specific parameters
$$ ---------------------------------
##NTUPLES= NMR FID
##VAR_NAME=  TIME,          FID/REAL,        FID/IMAG
##SYMBOL=    X,             R,               I
##VAR_TYPE=  INDEPENDENT,   DEPENDENT,       DEPENDENT
##VAR_FORM=  AFFN,          ASDF,            ASDF
##VAR_DIM=   8192,          8192,            8192
##UNITS=     SECONDS,       ARBITRARY UNITS, ARBITRARY UNITS
##FACTOR=    0.0002944,     1,               1
##FIRST=     0,             0,               0
##LAST=      2.4114304,     0,               0
##MIN=       0,             -157748,         0
##MAX=       2.4114304,     398617,          0
$$ Real data points
##PAGE= N=1
##DATA TABLE= (X++(R..R)), XYDATA
0@%%%%%%%%%%%%%%%%%%M8r6R6r6R6r6J44j92J92k38K86l08L56m19M69n30O22p01
36c67P80q77R91j112J234j377J532j697J884k089K318k561K817l102L423l775
52a978M157m579N047n567O149o807P556q412R406j0583J1995j3724J5901j8751
66a0190K2660k8470L8647j13922L15030l81503R0999K73554l59498L39516j9585
77A67238k45366K48192p7616q8930J61813k34845J30369L1993j32490J11005m5624
88B5739k834O6237n7329k3584R1483r0532j0712N4260j22422R2115m9530q0487
100a07596R6772l6220m9932Q9265q2870L7367R9642j57553J30115k0367l7567
111c8944J16176j35804P8624L6475q6863P6808l8201m3313J23103j13866Q448
$$ plain form
0 0 0 0 0 0 0 0 0 0 0 0 0 0 0 0 0 0 0 0 48 -48 48 -48 48 -48 96 -96 96 -142 144 -164 192 -227 242 -288 334 -367
36 -367 413 -464 527 -585 649 -728 804 -893 991 -1098 1220 -1341 1476 -1626 1797 -1978
52 -1978 2179 -2400 2647 -2920 3229 -3578 3978 -4434 4972 -5611 6384 -7340 8561 -10190
66 -10190 12470 -16000 22647 -91275 223755 -157748 -66749 206805 -152693 186823 167238
77 167238 -78128 170064 92448 3518 165331 -69514 60855 92848 -39642 71363 25739
88 25739 22905 89142 31813 8229 99712 9180 -1532 52728 -69694 22421 -27109 -107596
100 -107596 -10824 -47044 -96976 -7711 -90581 -53214 46428 -111125 18990 -1377 -38944
111 -38944 77232 -58572 20052 56527 -30336 46472 8271 -35042 88061 -25805 -17357
122a7357Q8082j29390J23143n7732m7745J07809q5671J2671L0821n2794K1190
133f973K4594p8763O6637j6876l9162O1282o3008L9183Q169l6519K0081J9266
145b089l2142L0637n870l9849R3766p9490K5371L8031o7992P5878k8530l6699
157b8978O4264k7726k6728P2559q4938M9383L2529r8273J06452n7248q291N9175
169E2180o9298K8893L0282n8913L3508J6145o4642Q3907n9820r731O3380p4796
181b8905M1310n055l0446L3922r59m2608N4485k6602j7367O0781p9844N3992k227
194A0477m4182N1287l0581r083L6975l5344n022N3388p0876N0145j050m7598P4657
207C3193o1469J6056K5559m0265K3790J0310m1424M1968n483m1608O9737n9842
$$ plain form
122 -17357 70725 -58665 64478 6746 -40999 66810 -18861 -6190 24631 -28163 -6973
133 -6973 17621 -61142 5495 -11381 -50543 10739 -52269 -13086 -4917 -41436 -21355 -2089
145 -2089 -34231 -3594 -9464 -49313 44453 -35037 -9666 28365 -39627 36251 7721 -28978
157 -28978 35286 7560 -19168 53391 -31547 17836 50365 -47908 58544 1296 -6995 52180
169 52180 -17118 11775 42057 -16856 16652 32797 -31845 52062 -7758 -17489 45891 -28905
181 -28905 12405 7350 -23096 10826 9867 -32741 21744 -4858 -22225 38556 -41288 12704 10477
194 10477 -33705 17582 -12999 -22082 14893 -20451 -25473 27915 -42961 7184 6134 -41464 33193
207 33193 -28276 -12220 13339 -26926 -3136 7174 -34250 7718 2235 -39373 30364 -29478
219b9478K4352K4632n1652M8196j3268j7009K8641q894k2550M9424m6077J1886
231a797L4068o1891N9437k8342j1983L8687l1887K474K7801l3713J1810K6786
243C1450n8808O1666l1160j6686N0104n6003L2651M074l0295K5574M311l5421
255a8543M3720k4347j4128N0932o3980M1171l186l0199L9378k4498o503K4789
267A4606j9987r731L7438m9396L3309p34l7919N2784l9665P248J7250k2990Q078
280i709J6537l2593K2304R113m0463N3932m2558J0364K7365m2014L0397k857j6761
293a6943K0703j088k7476M7161l5552L848L3363n2375M8827j8704j4415L1468
305A8817k0357j022K1453k5738P134K7143m9137M5367j8488j4563L9442m1715
$$ plain form
219 -29478 -5126 19506 -32146 16050 2782 -14227 14414 5520 -17030 32394 -13683 -1797
231 -1797 32271 -29620 29817 1475 -10508 28179 -3708 -1234 26567 -7146 4664 31450
243 31450 -27358 34308 3148 -13538 36566 -19437 13214 17288 -13007 12567 16878 -18543
255 -18543 25177 830 -13298 37634 -26346 14825 11639 -18560 20818 -3680 -10183 14606
267 14606 -5381 -15112 22326 -27070 6239 5505 -32414 20370 -19295 -12047 5203 -17787 -9709
280 -9709 6828 -25765 -3461 5652 -34811 19121 -23437 -13073 14292 -27722 2675 -182 -16943
293 -16943 3760 2672 -24804 22357 -13195 -9347 24016 -28359 20468 1764 -12651 18817
305 18817 -1540 -2562 18891 -6847 287 27430 -21707 23660 5172 -9391 30051 -11664
317a1664K0168Q557j9970J0100J0051k8105L1998j3389k1116M4475m5925K6282
329A1462J870k5999K8075j0651j3086J9167q658j5092L6394m2995K2130J0009
341A2626l6803M1209k8321K210J7743j9696N87J8963k6611J5280Q951l6362M6962
354A6738l2777L759K2021l2870K4831l091j5050J3736M881k4397L4373k4370j208
367a3424K9546m1275L2086q062j1108J9738j0356o815K1091j3812o062K8685l9004
380a8772L2866p388k0337L5777k7909R179J0324j6455O379J5445k9464K5763m488
393A0920k1356L9940m0495J9860P242k3619K1514p580r204J5283o269j5829L1354
406B1761l1799J4860Q117k9050L2551k0231K66J0024r176m157J6596j9939N305
$$ plain form
317 -11664 8504 17061 -2909 7191 17242 -10863 21135 7746 -13370 31105 -14820 11462
329 11462 13332 -12667 15408 4757 -8329 10838 2180 -12912 23482 -19513 2617 12626
341 12626 -24177 17032 -11289 -9079 8664 -11032 -10445 8518 -18093 -2813 6138 -30224 16738
354 16738 -16039 -12280 9741 -23129 1702 -1389 -16439 -2703 2178 -22219 12154 -12216 -13424
367 -13424 16122 -25153 6933 -1129 -12237 7501 -2855 -9670 11421 -2391 -8453 20232 -18772
380 -18772 14094 6706 -13631 22146 -5763 3416 13740 -2715 3664 19109 -10355 15408 10920
393 10920 -10436 29504 -10991 8869 16111 -7508 14006 6426 -2778 12505 6236 -9593 21761
406 21761 -10038 4822 12939 -16111 16440 -3791 -3525 6499 -2677 -6834 9762 -10177 -4872
419d872J5946l3352L3508k0333k232K0603k3986J0761M219j2481O588R884k6869
432b2616L1327j7218p845K9355l5402K5560n246j2963J8449o718q496J7370j2543
445f986l879K6193l4503K6965o021j3775K7276k3056Q182P065q868J68J3879k0093
459g453J7022P2j9835L2066k6973J0999O573j5340J1548M70j0130Q752L169j8330
473g390K7861k5149P978J2676k6706K4977j2510k472R252o219o901J6543j6857
486d917K629J4354k8956K9530j7858j595J5286j9452R989J845r557L538J0144
499D980k2703K3265j1239q701K3613k6717J7536k421q976J0420j054j0131J4371
512B243o879q832K5618l0620K0629j456j5529K3200j5986L871O493o122j378J4432
$$ plain form
419 -4872 11074 -22278 11230 -9103 -11335 9268 -14718 -3957 262 -12219 -5631 4253 -22616
432 -22616 8711 -8507 -16352 13003 -22399 3161 -2085 -15048 3401 -3317 -11813 5557 -6986
445 -6986 -10865 15328 -19175 7790 1769 -12006 15270 -7786 396 7461 -1407 -1239 12640 -7453
459 -7453 9569 9641 -10194 21872 -5101 5898 12471 -2869 8679 9149 -981 7771 10940 -7390
473 -7390 20471 -4678 3300 15976 -10730 14247 1737 -735 8517 2298 -4603 11940 -4917
486 -4917 -2288 12066 -16890 12640 -5218 -6813 8473 -10979 -990 855 -8702 -5164 4980
499 4980 -17723 5542 -5697 -14398 9215 -17502 34 -2387 -11363 -943 -1997 -12128 2243
512 2243 -4636 -13468 12150 -18470 2159 703 -14826 8374 -7612 -3741 2752 -3370 -4748 9684
526I684j9100J4256J272j7761K7725k3180J0596M467j1066R511M68o411M667M355
540I483j5871K3249j8395M360J1547k0116J7916p969m098O450N07j0992J6806
553A2877j2918j670J7348k8203K5052j2473o381J7518j6792N113N858j1087K577
566c181J0790k2633K1876j0207o893K1114k6487J7638m806o232Q762l417o089
579i765J0123l772q446J9237k1790J4364j026j0548J3919q816K715K595o80o866
593h756J4966j5213P115Q382k0713K4164j4529J846Q777j0314M431O836j0037
606c045N137P308j8474K5292j8651K828J3920k1919J9039p239l951P385j917p158
620a445J3594j1617m41J3866k1057K0655j2242k239R723j0289L808R88j984l797
$$ plain form
526 9684 -9416 4840 6112 -11649 16076 -7104 3492 7959 -3107 6404 6872 461 5128 9483
540 9483 -6388 16861 -1534 2826 14373 -5743 12173 4204 106 6556 7063 -3929 12877
553 12877 -41 -1711 15637 -12566 12486 13 -6368 11150 -5642 -529 5329 -5758 -3181
566 -3181 7609 -15024 6852 -3355 -10248 10866 -15621 2017 -2789 -9021 -259 -3676 -9765
579 -9765 358 -3414 -11860 7377 -14413 -49 -1075 -11623 2296 -6520 -3805 -1210 -1890 -8756
593 -8756 6210 -9003 -1888 6494 -14219 9945 -4584 -2738 6039 -4275 156 6992 -3045
606 -3045 2092 9400 -9074 16218 -2433 395 14315 -7604 11435 4196 245 7630 5713 -1445
620 -1445 12149 532 91 13957 -7100 13555 1313 -926 8797 -1492 2316 3304 1320 -2477
634b477J1746j7182J3075l820q923J6063j5792P755k55m676J604N286j0536O834
648a298J825j3900K1207j9806R289L960j3750J4771q281p75N388j370o950J4448
662D758j5363P991N173j6167K0428j4688N233M377o801M015K546m950K503O366
676E421j3396J7157j1524R05J0065j3557J1114m130j003K003M173r422J0491n091
690C206n426J5876j9474J5606m513o158R287o772M22M626l763n098J3789j7657
704f049J3732m094r427J6693j6949R443r24m268K212K438p925O255J57j0188J6026
719G132j5718P698J466q962R585n433P31J091J473q249J2714j1873L406P654j5134
734a2419J5924r701J506M417m718Q40M376m755Q5R010j4653J6262r750n33J0670
$$ plain form
634 -2477 9269 -7913 5162 1342 -7581 8482 -7310 445 190 -4486 -2882 2404 -8132 -1298
648 -1298 527 -13373 7834 -11972 -2683 1277 -12473 2298 -5983 -6758 -1370 -2740 -9690 4758
662 4758 -10605 -2614 2559 -13608 6820 -7868 -2635 1742 -5059 -1044 1502 -3448 -945 5421
676 5421 -7975 9182 -2342 -1437 8628 -4929 6185 2055 1052 3055 7228 -2194 8297 3206
690 3206 -2220 13656 -5818 9788 5275 -883 8404 1632 2054 6680 2917 -2181 11608 -6049
704 -6049 7683 3589 -5838 10855 -6094 3349 2425 -1843 369 2807 -5118 1137 1294 -8894 7132
719 7132 -8586 -888 578 -8384 1201 -4232 -3501 -2410 -937 -9186 3528 -8345 -4939 2715 -12419
734 -12419 3505 -6196 -4690 -273 -4991 -4151 225 -4530 -4445 4565 -10088 6174 -3576 -4109 6561
749F561j4534J1920k492k586K522L123q034R823m780l842J3729j6519J3164n558
763B497k196P089n605J051K953j191n796J1832j3465R481l51r210J2559j1442
777a794N871l51k626q19N514p825M007L000j2366J6301j4723N896L225r624Q555
792B241m821L2O67J776q256J1825r884K142O521j3191J4367r431K341K362l483
807d792M97K973k913j094Q513j3020J2653o655j678Q189r639P933k380K40r03
822b076M774p512P445j340o225J3652j4388J0029k358l385N523l221J42J823M92
837C375n296J2049j3487R028o3q257J2667j1243O229r94j400o94L701m837J400
852B178M763j0979J3322j1822M016K470o902O391l131j0q77L806r188J0401p704
$$ plain form
749 6561 -7973 3947 1455 -1131 1391 4514 -3520 6303 1523 -2319 11410 -5109 8055 2497
763 2497 301 7390 1785 2836 5789 4598 -1198 10634 -2831 6650 6299 -2911 9648 -1794
777 -1794 4077 3726 1100 281 5795 -2030 1977 4977 -7389 8912 -5811 85 3310 -6314 2241
792 2241 -2580 -2548 -1881 -105 -8361 3464 -6420 -4278 2243 -10948 3419 -6012 -3671 -1309 -4792
807 -4792 -4295 -1322 -4235 -5329 3184 -9836 2817 -3838 -5516 2673 -6966 967 -1413 -1173 -2076
822 -2076 2698 -4814 2631 1291 -4934 8718 -5670 4359 2001 -1384 4139 918 1060 2883 3375
837 3375 -1921 10128 -3359 5669 5606 -2651 10016 -1227 5002 4008 2608 1914 5615 778 2178
852 2178 6941 -4038 9284 -2538 1478 3948 -2954 3437 306 296 -581 3225 -5963 4438 -3266
867c266K37O841j1945J1216o624N89K258k089k059M078k651l567J0614j4006J2871
882B497o574k398R292r987O482j895m36k46M352o900O595j846m882J1416j2349
897f879R539l439j470M926l100R44L15K118o408J0557j0167O702O39o376R464
912G365p796L641o97N18k305N647n675P96O309j1763J2985r196J934L775p060
927a522N392k197j174O82L905r537J0298p444r1P130j2182J1137p319J886J874
942H38k531r13J912j090k784P230j1068R807m886j431O075p517N050j925J544
957a689k960N720p271L994K026p115J0864j0061O353j313j703K855J2j730J724
972b94K653p326J0984j0104N462J847p324R985p458L613J006r31j505M754n189
$$ plain form
867 -3266 -3029 3812 -8133 3083 -3541 -2952 -694 -2783 -4842 -764 -3415 -6982 3632 -10374 2497
882 2497 -4077 -6475 2817 -7170 -688 -2583 -3019 -3265 1087 -5813 782 -1064 -5946 5470 -6879
897 -6879 2660 -779 -2249 2677 -423 521 836 2954 -3454 7103 -3064 3638 4277 -2099 7365
912 7365 -431 3210 2513 3031 726 6373 698 1494 7803 -3960 9025 -171 1763 5538 -1522
927 -1522 3870 1673 499 1181 5086 -4451 5847 -1597 -1688 5442 -6740 4397 -2922 -1036 838
942 838 -1693 -2606 -694 -1784 -4568 2662 -8406 1401 -3485 -4916 1159 -6358 -1308 -3233 -1689
957 -1689 -4649 1071 -6200 -2206 -180 -7295 3569 -6492 -139 -1452 -3155 -300 -288 -2018 -294
972 -294 2359 -4967 6017 -4087 1375 3222 -4102 5883 -1575 2038 3044 2113 608 5362 173
987A73J768M435r412J1401q724L774J531m883M036k337J122j965M602p800P494
1002E215m397j192N967q469P491m792J034o1N57l162K797j31n221R472j1906Q958
1018B160l348k695O088o658K881j53N5k971N433p391O172l79o821J1233j1280
1033g674P284j828j663K537q77J40m29K803n667Q109p281M295J542n559O867n002
1049b403L467j380J758l489N469l249j161O707j0118J0568o522J176K921m175
1063d31L838m10K2k255N702q189P934m785j268O715j0029R116m919K47J303r80
1079A611j020J602j070l315O461q497P647l330k318M573m616K530k087K063l837
1094c603N457n850K684J477o744R058q483N423j282j603J413K28j061J25L500
$$ plain form
987 173 1941 6376 -3036 8365 -359 3415 4946 63 4099 1762 2884 919 5521 -2279 5215
1002 5215 818 -374 5593 -2876 4615 -177 857 796 1353 -1809 988 857 -4364 5108 -6798 2160
1018 2160 -1188 -3883 2205 -4453 -1572 -1725 -1670 -4641 792 -6599 -427 -806 -7627 3606 -7674
1033 -7674 -390 -2218 -3881 -1344 -2221 -2081 -2510 293 -5374 2735 -4546 -251 1291 -4268 2599 -2403
1049 -2403 1064 -316 1442 -2047 3422 173 -988 5719 -4399 6169 -353 823 3744 -431
1063 -431 3407 2997 3019 764 6466 -1723 6211 1426 158 6873 -3156 5960 1041 1288 2591 1611
1079 1611 591 2193 1123 -2192 4269 -4228 3419 89 -2229 2344 -2272 258 -1829 234 -3603
1094 -3603 1854 -3996 -1312 165 -6579 2479 -6004 -581 -1863 -3466 -2053 -1825 -2886 -2761 739
1109G39p276R438q182L417K691o481P231m480K371r28J343k771L987k582pM868
1125C378q536R460n675J693K657l622K904j414J309k616N678p795O875k042k497
1140b43N907p009N648k732Q92m03J112k619K371L20n307Q197r320P217k492l049
1156a510N324m560J841j005J045l668N350n869M062l67n416Q354q032M479j055
1171a027j738J485p82k6j042L723n997P116o476K863J904m788N382l734K241j846
1187b742K353m198N681l317j397O817q880P826l937L35J919j494Q57N32L67k502
1203a780O014o720O102l355q84N798p173N835k790P14M21P28j598J659M95l957
1219d91O391p759O247j846k013L417l675J468o01J943m283N141m581J420J941
$$ plain form
1109 739 -6537 2901 -5281 -1864 827 -5654 1577 -2903 -532 -1460 -117 -2888 1099 -1483 -1490 3378
1125 3378 -5158 4302 -1373 320 2977 -645 2259 845 2154 -462 5216 -2579 4296 2254 -243
1140 -243 5664 -1345 4303 1571 2463 2060 3172 553 2924 3244 -2063 6134 -3186 4031 1539 -1510
1156 -1510 3814 -746 1095 90 1135 -2533 2817 -3052 1010 643 -4773 3581 -4451 28 -1027
1171 -1027 -2765 -1280 -2062 -2088 -3130 593 -5404 1712 -4764 -1901 3 -4785 597 -3137 -896 -2742
1187 -2742 -389 -4587 1094 -2223 -3620 3197 -5683 2143 -1794 -1459 460 -1034 -177 355 722 -1780
1203 -1780 4234 -2486 3616 261 -623 5175 -1998 3837 1047 1761 2182 2910 1312 2971 3466 -491
1219 -491 5900 -1859 4388 2542 529 3946 271 1739 1138 3081 -1202 3939 -642 778 2719
1234B719o244P880o729L138j310n19J37J194j692q60L512o586P322o204K237K696
1250F91n628N710m199J808r10J884k711L245k039r23M790p524P884m541P08J607
1266a48j824J105m32J323k634N066n328M560j902j844N217n432M749k518J366
1281A324j307K347k231J835J157m921Q161q086M618p76k395M370l272J892j514
1296A202K125l577N433n782K185J551m988N865n464L628j346k6m74L96o98o74
1312f44K745n860N602l604Q13J633m130M161l096J297r02J718l396L611j849k151
1328d052N524o507N840l829R41J406p25j35M13O57l527N298n508M806q73k378
1344b649M406m350L955k779J154K79P43j571J132J099k681N379p203N675n08q75
$$ plain form
1234 2719 -3525 4355 -2374 764 -546 -1065 -928 266 -1426 -2286 1226 -5360 1962 -4242 -2005 691
1250 691 -4937 773 -3426 -1618 -2528 -644 -3355 -110 -2149 -3072 1718 -5806 2078 -2463 -1755 -148
1266 -148 -1972 -867 -1299 24 -2610 2456 -2872 1688 -214 -2058 3159 -2273 2476 -42 1324
1281 1324 17 2364 133 1968 3125 -1796 6365 -1721 2897 2121 -274 4096 824 2716 1202
1296 1202 3327 -250 5183 -599 1586 3137 -1851 4014 -1450 2178 832 806 332 728 30 -644
1312 -644 2101 -3759 1843 -1761 -948 685 -3445 716 -2380 -1083 -1985 -267 -3663 -52 -1901 -4052
1328 -4052 1472 -5035 805 -3024 -2083 -677 -1402 -1537 -1124 -467 -3994 1304 -4204 602 -271 -2649
1344 -2649 1757 -2593 1362 -1417 -263 16 759 -812 320 1419 -1262 4117 -3086 2589 2081 1206
1360A206J141k886K984j416J546k219L593k473M03J732m931N901m093K244p47
1375A985l6j269J524j377j151M422o772O158m348M39K007l012K725k309O78j146
1391a482K205l559L804k781j447M854o669O082l299L13P38q10Q09l17P09k472
1407c322M227n144M017j402j579M772m720K655j505J982k040K302j916J271J601
1422A199m537O191m811K956J50k105K950j994Q39o35K085l064M526l808R16K799
1438C657m878N374l317J652r02j12k0J073j278o91L418n739N840m084R75J089
1454B057k692K968k599J580j951K221k861K074k97k755M391n515N077k948N96
1469f54K28q12k29P7P99l116N417n580K890k71k347M382l925K486r67L50m93J595
$$ plain form
1360 1206 2347 -539 2445 1029 2575 356 3949 1476 1879 3611 -1320 4581 488 2732 1985
1375 1985 1949 680 2204 827 -324 4098 -2674 3484 -864 -425 1582 -1430 1295 -1014 -336 -1482
1391 -1482 723 -2836 968 -1813 -3260 1594 -5075 1007 -2292 -1979 -1241 -2051 -1242 -1559 -850 -3322
1407 -3322 905 -4239 -222 -1624 -3203 1569 -3151 -496 -2001 -19 -2059 243 -1673 -402 1199
1422 1199 -3338 2853 -1958 998 1148 -957 1993 -1 838 203 2288 -776 3750 -58 858 3657
1438 3657 -1221 4153 836 2488 1586 1474 1454 2527 1249 558 3976 -1763 4077 -7 968 2057
1454 2057 -635 2333 -266 1314 -637 1584 -1277 797 500 -2255 2136 -3379 1698 -1250 -654
1469 -654 -426 -1238 -1467 -1390 -591 -3707 1710 -3870 -980 -1251 -3598 784 -3141 -655 -1622 -1272 -1765 -170
1487a70j848K32K771m711O029n033L043l53j160J266k51O98j201K486l166L683
1503B315k600O44J597k989M533l381J666o36J220j558J521j064j121M123n245
1518i75M570l071J87J569k790L455k234J059k023K708m200L575j869j372L499
1533B088n074N441k910P07J04r36j10r7J115k568L556m477K801n41k282L345l264
1550c102K706j170R37j785K228k227Q97J845m459N846m784J966L68j242K019j186
1566a143O9p09K247l479M872k846P13K112l362M233l443J218o8Q29q52R94k60
1583A125j178L102l670L607k498O23J832k093R17n63J301k229K649l253K117l52
1599A437k111L932m249L133j005l71o5J22n45K73N04l347L986l891K690n04k144
$$ plain form
1487 -170 -2018 -1786 985 -3726 2303 -2730 313 -40 -1200 66 -185 513 -688 1798 -1368 2315
1503 2315 -285 359 1956 -1033 3500 119 1785 1149 2369 811 2332 1268 147 4270 -975
1518 -975 3595 524 711 2280 -510 2945 711 1770 -253 2455 -1745 1830 -39 -1411 2088
1533 2088 -2986 2455 -455 252 356 -580 -690 -787 328 -2240 1316 -3161 -360 -901 -3183 162 -3102
1550 -3102 -396 -1566 -629 -2414 -186 -2413 -1516 329 -4130 1716 -3068 -1102 -734 -1976 43 -1143
1566 -1143 -1074 -1783 464 -3015 1857 -989 -276 1836 -1526 2707 -736 482 414 1243 391 1385 1125
1583 1125 -53 3049 -621 2986 488 1111 2943 850 1767 1204 2505 276 2925 -328 1789 1437
1599 1437 -674 3258 -991 2142 1137 766 701 823 278 551 1055 -2292 1694 -2197 493 -11 -2155
1616b155L143k632J706j392J437k391K539k256Q42P44l641N377m754K665m03p83
1632a954Q48j24Q03j923K411j993K884k736OK565l611L962k864J349k91J016j131
1649g83J319m17j252L592m425M332j526j258L184k425J328j352J687k149L004
1664B859l549K514j57j468L332m283L617k366Q16n90N37m75M02J268k986K826
1680B297l298K072l91j654K301k734J976j271O94r94J787j762R7J983m581M857
1696A379l951J691l49m01J79K96P2q60K342l423K253j015K75K098l294L183k126
1713a651M78L39J036j597Q55j51l03K832m018L282k057Q74J543j998J706r26J293
1730A537j665K032k719J633Q02k169L559l098J971j426N90n14N58l05J58J304
$$ plain form
1616 -2155 988 -1644 62 -1330 107 -2284 255 -2001 -1159 -415 -4056 1321 -3433 -768 -1171 -1954
1632 -1954 -1106 -1230 -427 -2350 61 -1932 952 -1784 -1778 787 -2824 1138 -1726 -377 -668 348 -783
1649 -783 536 119 -1133 2459 -1966 2366 840 -418 2766 341 1669 317 2004 -145 2859
1664 2859 -690 1824 1667 199 3531 -752 2865 499 1315 725 1262 787 1189 2457 -529 2297
1680 2297 -1001 1071 680 -974 1327 -1407 569 -702 -8 -1002 785 -977 -880 1103 -3478 1379
1696 1379 -2572 -881 -1230 -1631 -1452 -1156 -1084 -1944 398 -3025 -772 -1787 -1512 586 -2708 475 -1651
1713 -1651 -1173 -834 202 -1395 -540 -691 -994 1838 -2180 1102 -955 -81 1462 -536 1170 244 1537
1730 1537 -128 1904 -815 818 1620 -549 3010 -88 1883 457 1047 533 1091 786 944 2248
1746B248l397M020l185J912M29k658K735k858J657j416J974k359K147j585M14
1761G8J113l333L792l122J295j66j118P37P6L77j795L383l777L039k086r29K903
1778D67l379K670j636J217r44J203j234J391K14k286M189m521L471j866L30J394
1794F80j377J030j206J426j665K874l137K711l15k157M093l556K279j146P91l71
1810I54N82r97p21K314k472K962l046K056j06j685K525j920J484j698J853k339
1826b54K177j818m13K287k885L301l722J293M09q55O15l19o3j036K763m132L080
1843D28j762l12K324l167K757k037N32K5O22p57J23R56k196K942l439K922j368
1860a407j91J285j745J729j130J460k212L124k198J285R10k643L653l224K020
$$ plain form
1746 2248 -1149 2871 -314 1598 2027 -631 2104 -754 903 -513 1461 -898 1249 -336 78
1761 78 1191 -2142 1650 -1472 -177 -343 -1461 -724 -648 -271 -2066 1317 -2460 579 -1507 -2436 467
1778 467 -2912 -242 -1878 -661 -1605 -402 -1636 -245 -31 -2317 1872 -2649 822 -1044 -714 680
1794 680 -697 333 -873 553 -1112 1762 -1375 1336 1021 -1136 2957 -599 1680 534 1325 954
1810 954 1536 539 -182 2132 -340 2622 -424 1632 1526 -159 2366 446 1930 232 2085 -254
1826 -254 1923 105 -308 1979 -906 2395 -1327 -34 375 -480 135 -184 -247 -1283 1480 -2652 428
1843 428 -1334 -1646 678 -2489 268 -1769 -1237 -1212 -590 -1347 -1224 -268 -2464 478 -2961 -39 -1407
1860 -1407 -1598 -313 -2058 -329 -1459 1 -2211 913 -1285 0 910 -1733 1920 -1304 716
1875G16m17K48n45R07n8q00K228l848M209k523J496O11k378K017j361P20q29J549
1893A942j708J632j309K69K068l538K913k246J108n31K55O52j280N64j763K837
1909A865l552L143j463j154J810k411K473j787J115j828J894j757N54Q69k508
1924b737L432l148J630o84M8J127j563J160q9M90j684K744l521K144K14j449L190
1941A304l751K865p13N70j30O73q28l79K203l169L657l155K071p65n62K320k317
1958a06J748j068J757k180J769j479P8J880l027K923k551Q78K60l2q7l68J315
1975A710j647J810k848K731p65j131J786k866K693j462j27m90J607k005N02N47
1991D5j778K113k543K208r49k46Q64q33K77p40J547k573K593j811R09J21j100
$$ plain form
1875 716 299 547 2 909 851 51 2279 -1569 2640 117 1613 2224 -154 1863 502 1222 393 1942
1893 1942 234 1866 557 826 2894 -644 2269 23 1131 600 855 1507 227 791 -972 1865
1909 1865 -1687 1456 -7 -1161 649 -1762 711 -1076 39 -1789 105 -1652 -1098 -229 -2737
1924 -2737 695 -2453 -823 -1507 -1459 -332 -1895 -735 -824 -334 -2018 726 -2795 -651 -437 -1886 1304
1941 1304 -2447 418 -295 275 145 818 -10 -389 1814 -1355 2302 -853 1218 453 -109 2211 -106
1958 -106 1642 574 2331 151 1920 441 519 2399 -628 2295 -256 622 882 850 763 395 1710
1975 1710 63 1873 -975 1756 991 -140 1646 -1220 1473 11 -116 -606 1001 -1004 -502 45
1991 45 -1733 380 -2163 45 -904 -1150 -286 -1119 -842 -1582 -35 -2608 -15 -1826 -917 -796 -1896
2008a896K359k358K401j357L00k79J049o74p80K412l506L603j987J010Q63k011
2024h51K119j867J315r35J827k042J747J09k166L155k795K568k024J608n68j74
2040A026J61o3K09j121K848l712K121Q1j420J790k719K477j782J143j100R25j294
2057d30M52J287k949L404l237K338r28p71R36j593J242p73J323k348K598k553
2073b002J570K08k407K828k598K824j838L39M93K34n16p06J549k769L816k029
2089a004O51M20j008R81o49J263k493K895j964J978r28n76K652k894K358j608
2105G4J012o15j72j35N92R72k226K734k779K516j340j268L014k502J149r2N64
2122A498j445R74j168R08O25j801K141k912K207p74k0p2k51N95j548K392k796
$$ plain form
2008 -1896 463 -1895 506 -851 -551 -830 219 -455 -1235 1177 -2329 1274 -713 297 1160 -851
2024 -851 1268 -599 716 -219 1608 -434 1313 1422 -744 2411 -384 2184 160 1768 1200 1026
2040 1026 1187 1124 1333 212 3060 -652 1469 1550 130 1920 -799 1678 -104 1039 -61 864 -430
2057 -430 22 1309 -1640 1764 -1473 865 -63 -834 102 -1491 -249 -1022 301 -2047 551 -2002
2073 -2002 -432 -224 -2631 197 -2401 423 -1415 -1076 -583 -349 -865 -1571 -22 -2791 1025 -1004
2089 -1004 -353 67 -941 40 -609 654 -1839 1056 -908 1070 142 -434 2218 -676 1682 74
2105 74 1086 471 299 164 756 1728 -498 2236 -543 1973 633 -635 2379 -123 1026 934 1498
2122 1498 53 1027 -141 767 1392 -409 1732 -1180 1027 253 233 161 -90 505 -1043 1349 -1447
2139a447K141j468K89M66j834K796k281J024j164R51p12L98M15j336K359l626
2155c029L705j715k6J429j574R37j116J296j364J574j281P72k36j16K251l717
2171b210L532j796J435j184K22P8l41J465k017K885k430J681p48L26M34j026J812
2188B118j780J106j035J791j753J51O37j066K063k586J961q75N16o48N07o28q24
2205c45K042l094K793k266M60J149j344J729k702K090r28O23j018K85K48j386
2221a664K282k249J815j468N56M47q25O34j024J439j361J327j973J743m2j512
2237a875K963l032K461j617J225q76J060n24k76J430k425K967k792K535j291L16
2253B49Q23j510J495j165J542j726J757j012p0J028j726K823k642J503p99J78
$$ plain form
2139 -1447 694 -774 -485 -19 -1853 943 -1338 -314 -1478 -527 -1239 -841 -426 -1762 597 -3029
2155 -3029 676 -1039 -1065 364 -1210 -273 -1389 -93 -1457 117 -1164 -392 -628 -744 1507 -2210
2171 -2210 1322 -474 961 -223 -1 77 -264 1201 -816 2069 -361 1320 572 898 1332 306 2118
2188 2118 338 1444 409 2200 447 598 1235 169 2232 -354 1607 732 1248 600 1107 479 -345
2205 -345 1697 -1397 1396 -870 -410 739 -605 1124 -1578 512 -416 207 -811 -526 -278 -1664
2221 -1664 618 -1631 184 -1284 -728 -281 -1106 -472 -1496 -57 -1418 -91 -2064 -321 -363 -1875
2237 -1875 1088 -1944 517 -1100 125 -751 309 -215 -491 939 -1486 1481 -1311 1224 -67 249
2253 249 1072 -438 1057 -108 1434 -292 1465 453 383 1411 -315 2508 -134 1369 570 748
2269G48J064j516J180j370J604k209K096j603l34J390j429J462k167J949j566
2284g01J023p99N04K28j261J768l531L042j348N57M21j514J288o42P05j041J857
2301E56j871N82M48j158J720k014J889j471R42k50ll19L42R72j866K268j870J216
2319A13l87k25J303j037N69o11P85j397K044j246M11J451k794L186k732K016n59
2336H90j11K96m71P45j425J852j990J842j297r1J128j275J687j843N99p56R71
2353G51r71L27J27n45J884k354K413k163O76m8j322J682j053M90j307J228j091
2370a276J399l72j269J815j806J867j963R77l08M59N3j134J069j472K757k604
2386a808J571m61R4M17o68J067q71J302j266J933j114k44J208k651L107j547Q89
$$ plain form
2269 748 1812 296 1476 106 1710 -499 1597 -6 -340 1050 -379 1083 -1084 865 -701
2284 -701 322 -477 27 255 -1006 762 -2769 273 -1075 -518 -97 -1611 -323 -965 -260 -1301 556
2301 556 -1315 -733 -285 -1443 277 -1737 152 -1319 -377 -627 -630 -949 -607 365 -1501 767 -1103 113
2319 113 -274 -499 804 -233 336 -275 510 -887 1157 -89 322 1773 -1021 2165 -567 1449 890
2336 890 779 1075 604 1349 -76 1776 -214 1628 331 240 1368 93 1780 -63 536 -220 751
2353 751 -220 107 234 -311 1573 -781 1632 -531 145 97 -1225 457 -596 -106 -1413 -185 -1276
2370 -1276 123 -249 -1518 297 -1509 358 -1605 -628 -936 -477 -424 -1558 -489 -1961 796 -1808
2386 -1808 -237 -698 -604 -187 -855 212 -659 643 -623 1310 196 -48 1160 -1491 1616 69 958
2403I58j402N78O99m12O96o70O22j642K134q23k90R37j838J886j299J441j837
2420b62J809j678J079L81j387J347j796J910j453K90J92l53K58n86Q79j447J754
2437I37j796N41M36m72J146k124J293r52N80j174R02n7m39J328k033K181k005
2454a708J005J96m33O13q36J388j127N01m29J145p39r42J760k027J946j303J580
2471E90p68J3M50k08L71j057K271k270J538l50l41J485j674R03j303J711j424
2488f3J051o52J27J25o27J782j645J187j307N04J048j756J153j233J760j706J308
2505A056j152J87N96j217R28j257J192p45O82m10J66Mr76J056j824J915q56J07
2523e48j2j67O44n84O50j125J188j504Q71m39N29M75j080J670k104J725k56l20
$$ plain form
2403 958 -444 134 833 421 1117 447 1069 -573 1561 738 448 1385 -453 1433 134 1575 -262
2420 -262 1547 -131 948 1329 -58 1289 -507 1403 -50 240 432 79 337 -249 630 -817 937
2437 937 -859 -318 118 -354 792 -1332 -39 -991 -411 -1585 -683 -740 -1179 149 -1884 297 -1708
2454 -1708 -703 -507 -940 -327 -1163 225 -902 -401 -830 315 -424 -1366 394 -1633 313 -990 590
2471 590 -178 -165 285 77 448 -609 1662 -608 930 580 239 1724 50 953 -350 1361 -63
2488 -63 988 336 463 588 -39 1743 98 1285 -22 482 1530 -226 927 -306 1454 -252 1056
2505 1056 -96 91 687 -530 398 -859 333 -412 270 -140 26 30 -946 110 -1714 201 -655 -548
2523 -548 -560 -727 -83 -667 -17 -1142 46 -1458 -587 -1026 -497 -22 -1102 568 -1536 189 -67 -387
2541c87N75n20M26j773K975k496J698m94K40N92q85J098k023K279j370J192r74
2558A53L19O61j079P18j254J556n08J59M67j94K48j066J140j412J714j633M44
2575D33m14R7R47j507J826j749P98j43o93Q45q57J052j332J335j999J614j250
2592i97R66O75k231J359j184J122q46Q65o20N6J293j989J748j361O82j81l77N42
2610d78p08R47j292J803j950K355j515L31P64j297J057j47K95j048J933r54P85
2627H81j34j197J600j734J383J47q68K29j59Q86j201J283q34J031m13M14k00j375
2645b61J477j635J763j262K88l28P54n40r3Q75j639K169k262O38J70m69O34k07
2663G2L83j329J107j309J341r71J35M77j110J888j655Q32n07K00q9k54J077j352
$$ plain form
2541 -387 188 -332 94 -1679 1296 -1200 498 4 244 836 -49 1049 -974 1305 -65 1127 153
2558 153 472 1133 54 772 -482 1074 566 725 1192 998 1246 180 1320 -92 1622 -11 433
2575 433 19 116 1063 -444 1382 -367 431 288 -405 440 -417 635 -697 638 -1361 253 -997
2592 -997 -31 644 -1587 -228 -1412 -290 -1136 -271 -891 -835 458 -1531 217 -1144 -462 -643 -1020 -478
2610 -478 -1186 -239 -1531 272 -1678 677 -838 -507 257 -1040 17 -130 165 -883 1050 96 881
2627 881 747 -450 1150 -584 799 946 78 307 148 1034 -167 1116 282 1313 900 1314 1114 -261
2645 -261 1216 -419 1344 82 370 42 796 256 163 1038 -601 1568 -694 -56 114 -355 279 72
2663 72 455 -874 233 -1076 265 -706 -571 -94 -1204 684 -971 -139 -646 -446 -535 -789 288 -1064
2681a064R43j903K084r48K02R79j053J057j238O15m16J239r72L51O08j429J929
2698I84j792J033j20j35J79N77k37l83J187j318L99k92M59J01o91J113j468J403
2716I99m91J99O9j47j85p76J603j803J365j306J561p84l46J013j354J069j788
2733a102J972j354M44k34jQr5J051j802P34n02O35M50p59l1n23J410j439J16N
2753a017K86P46q77L53m81P19j102J430l87N49m43n32J768k521J723p25R0Q13
2771C92q34L45M66L93j415J236j130R85mn74J492q83L81q31J67L35K90p03J10
2790B18J131j590J880j619M11j16k59J353j443J036j466J138r31J782j516j40
2806a31Q41j430J528j192N76j061Q61O37q42M45j417J291j460J765r52K17P44
$$ plain form
2681 -1064 -121 -2024 60 -888 -686 293 -760 297 -941 -326 -742 497 -475 -124 484 -945 984
2698 984 -808 225 105 -30 149 726 489 106 1293 -25 374 82 541 642 -49 1064 -404 999
2716 999 508 707 776 629 444 -332 1271 -532 833 -473 1088 304 -42 971 -383 686 -1102
2733 -1102 870 -484 -40 -274 -275 -267 -362 689 -1113 -379 -881 -246 204 -555 -586 -1109 301 -1138 -1022 -1017
2753 -1017 -731 15 -862 -509 -990 -271 -1373 57 -330 219 -224 -756 1012 -1509 214 -511 -421 392
2771 392 -442 -97 369 762 -653 583 -547 438 434 -140 1352 469 850 19 186 521 811 108 218
2790 218 1349 -241 1639 20 431 315 56 1409 -34 1002 -464 674 -257 1525 9 -131
2806 -131 710 -720 808 -384 192 -869 -8 629 -213 232 -1185 106 -1354 411 -541 -324 420
2823D20j429J270j659J227j279J317r14o9P92J23N38k134K120j023J142p92m73
2840h23R45k95O51j440J937j603N82Q31o11N52m97M83r28N38o4M66k29Q8J88j107
2860c36J499k92J92j106P75k86Q86q76P2J067k067P17M70q19L92l3Q00j401N36
2879A90j21J53J74p81L16l13J878k478J859k130N11P04O0M52j193k60K36M77j019
2898a285M64R8r67K226j497K16L65M60l05j78Q0j455K084j355J282r38M71K96
2916F2o63Q90j379J568j081R43o72N88l90l65K393k249J074j216R23M67p12O20
2934H01p19K80n38J336j007Q40l30o48J167j278O75l45Q76j235P94Q9o24J88n47
2953b25J629j235L32l08M52K01r63O97j739J474q41P16n86K93L38j540J719j646
$$ plain form
2823 420 -1009 261 -1398 -171 -1450 -133 -1047 -1116 -324 -201 337 -1797 323 -700 442 -350 -823
2840 -823 122 -173 478 -962 975 -628 -46 785 174 726 229 712 -216 322 258 724 495 583 771 -336
2860 -336 1163 871 1063 -43 732 446 1332 456 528 1595 -472 245 715 -104 288 255 1055 -346 190
2879 190 69 222 396 -385 -69 -382 1496 -982 877 -1253 -742 -38 22 474 -719 -979 -743 -266 -1285
2898 -1285 -821 -723 -1690 536 -961 -745 -380 80 -225 -403 -323 -1778 306 -1049 233 -705 -234 62
2916 62 -601 289 -1090 478 -603 340 -332 256 -134 -499 1894 -355 719 -497 426 893 181 801
2934 801 82 362 -176 1160 153 993 663 15 1182 -96 579 234 1110 -125 669 758 134 322 -225
2953 -225 1404 169 501 193 645 846 -117 580 -1159 315 -526 190 -396 -103 235 -1305 414 -1232
2971a232O08N70o03R3nK54j37O37j570J701j202N54L27j620K369j476P74j253
2989a211J100r31J331j73n11R24j049R52n87K49k02K78O13p37J001k283K069j380
3007e47J096M34r63M86m95J064j016O35q26R32j068L81J42l81R01r48R45n48N73
3026G97J9j347J057p22O24n59J73k45J35M18j416J200j192J602p27k50K47N67
3044C81l87q63J285j334P44k56J81M41j243J186p88R10j466J171o38R00m0j004
3062h20J327j344P75o48L66Q9L87K15q77J145j180J439n37N5L23j127P62p23R95
3081F22o54P29m80N16p96J67J252j841J855r35O20k29m52L22q76J688j508Q95
3099H95j195J004m81n89J350j918J781j395J306j082J01P53p53L22o59J082j027
$$ plain form
2971 -1232 -624 -54 -657 -564 -569 -315 -452 185 -1385 316 -886 -332 -5 -1625 744 -732 42 -1211
2989 -1211 -111 -1042 289 116 -395 529 -520 432 -155 94 -108 170 783 46 1047 -1236 833 -547
3007 -547 549 983 20 506 11 1075 59 694 -132 800 -268 113 255 -126 775 -173 772 224 797
3026 797 816 -531 526 -196 428 -131 42 -203 -68 350 -1066 134 -1058 544 -183 -433 -186 381
3044 381 -6 -869 416 -918 -174 -430 -249 192 -1051 135 -653 257 -1209 -38 -676 224 184 -820
3062 -820 507 -837 -62 -710 -344 -255 132 347 -530 615 -565 874 337 392 715 -412 350 -373 622
3081 622 -32 697 217 733 -63 104 1356 -485 1370 435 1055 826 374 696 -180 1508 0 895
3099 895 -300 704 223 -366 984 -934 847 -548 758 -324 -223 530 -223 99 -560 522 -505
3116e05P75q28P8J32n31P06n98J54j78O36n22K04R86j556J613j477N39K52L12
3135A92j97K16K99j317Q48n31J392j319P40k46m86R31l43N09n82N63o71J05q5
3154A8n01J510j693J959j895J407n17n35Q54n85L04o2K99o94J180p17J39L11j657
3173h75J865j717J249k69l54K94k2o3l61J183j854J417n09J41R4o58P50r26J036
3192D21j442J756j210N33q7j054J644j570R95o48J52j40Q17j35m89Om0O41n13
3211c63M62p17l75J156j139J163o31P53m14k58j01N35L15m44Q36j224J010l9k20
3230C05O72j008P44o87O54r64Q50j66m55J088j009K46m6M41q42J013l58r15R58
3249E21o16P67j207P14L19p93P65q59P49p17O49m74K57o20L8J026q36J098j441
$$ plain form
3116 -505 270 -558 -480 -348 -879 -173 -771 -617 -795 -159 -681 -477 509 -1047 566 -911 -372 -120 192
3135 192 -5 211 510 -807 41 -490 902 -417 323 77 -409 522 179 688 106 669 -2 103 18
3154 18 -483 1027 -666 1293 -602 805 288 -247 607 22 326 264 563 -131 1049 332 471 782 -875
3173 -875 990 -727 522 253 -101 193 171 108 -253 930 -924 493 -16 125 219 -439 311 -615 421
3192 421 -1021 735 -475 58 -29 -1083 561 -1009 -14 -662 -510 -650 167 32 -457 -451 -491 150 -363
3211 -363 99 -618 -993 163 -976 187 -444 309 -105 -363 -464 71 386 -58 778 -446 564 525 305
3230 305 977 -31 713 26 680 -284 566 400 -55 1033 24 270 224 665 -177 836 478 -437 521
3249 521 -95 672 -535 179 498 -295 470 -389 360 -357 292 -182 75 -545 -507 519 -317 781 -660
3268f60N04m72L16l35M03k82n33J576j335J362r78k2K58n53M39n88J323r42M14
3287a05l52L85n87N74J47q59J223j245R85J91m75J78N6k4N7O44p22R92k61j79
3307F23k91k32Q48j430R37q26P91N49j196J088o75N22n74J71J57n17O53o63L23
3326B58q71J383r59J97k87L66J69l12Q16j089J100p29o6p08L78O65o73J009j929
3345a282J346q98K68R9k59R54j258Q59k50O97l84J76l86m46J009j021R34j146
3363i88J286p47j30P25N48m90p96P67L6q2p97O59O98q94N15j76j46N77k29l63
3383b7L07L43o78J566j676O96p75M50J14k84R74n48k38j39K72N8j13M36j303R99
3403D34p95L74l24M1M67p18J053m68M92o67J019j252N86p34q7J24nN11k7n38j71
$$ plain form
3268 -660 -156 -628 -312 -647 -244 -526 -1059 517 -818 544 -434 -456 -198 -751 -312 -900 423 -519 -105
3287 -105 -457 -72 -659 -85 62 -797 426 -819 166 357 -118 60 116 92 149 793 71 1063 802 623
3307 623 332 100 948 -482 455 -371 420 969 -227 861 186 708 134 305 462 -55 598 -65 258
3326 258 -613 770 -189 8 -279 87 256 -56 760 -329 771 42 -24 -732 -354 311 -362 647 -1282
3345 -1282 64 -834 -566 -467 -726 228 -1030 -171 -421 276 -108 68 -318 -764 245 -776 158 -988
3363 -988 298 -449 -579 146 694 204 -592 175 211 129 -668 -9 689 -205 310 134 -12 565 336 -27
3383 -27 280 623 -55 1511 -165 531 -244 206 320 36 1010 462 224 85 357 415 302 738 -565 434
3403 434 -361 13 -311 -270 197 -521 532 64 556 -111 908 -344 242 -492 -579 -455 -460 51 24 -514 -685
3424f85O92k2j68L5N8l84q64Q68Q1K18J92j085J492n93J55o4N18p27PJ046j467
3445f97J250o32J99o4L35l44l89P20l39O65q95R69q48L43J01r39J189k99N81j054
3465a48J024n36l07Q1J21K71j32K55m55M55k93q12Q19r75J539j153Q61q72j47
3484d04K90n53O33R5k46m05Q36o32N97l76L15p7q26J055r20L78k75j64Q99j346
3504a126J082o24J501j229K53o9o48J123n62R33j170N48JK88J33n58J79m81O71
3523B45n84J351q36j40l6o53J112m28Q96o08M60q33K43O78m92K62l53J039j040
3542B83L88r99P57J24m96P52j132J137q71N50k94p09J172p10p6n85J419j146M48
3561A2k25k86O97o89O57l52O5l74J99L93n63J58l47N32l84M91n66J66L18n45J125
$$ plain form
3424 -685 7 -15 -183 -148 -90 -474 -1338 -470 -389 -171 21 -1064 428 -165 -10 -74 444 -283 -276 770 -697
3445 -697 553 -79 120 56 391 47 -342 378 39 704 -191 778 -70 273 374 -565 624 325 906 -148
3465 -148 876 340 33 114 235 506 374 629 174 629 336 -476 343 -632 907 -246 615 -257 -404
3484 -404 -114 -667 -34 61 -185 -590 246 -386 211 -165 150 73 -753 302 -618 -240 -515 -679 220 -1126
3504 -1126 -44 -668 833 -396 -143 -212 -860 263 -299 634 -536 12 13 301 434 -124 55 -426 245
3523 245 -339 1012 176 36 0 -653 459 31 927 319 779 -54 189 867 375 637 284 1323 283
3542 283 671 -328 429 553 57 809 -323 814 -57 493 199 -510 662 -48 -124 -709 710 -436 12
3561 12 -213 -499 198 -491 166 -186 -121 -495 -296 97 -466 -308 -655 -123 -507 -16 -582 -416 -98 -643 482
3582D82n11Ql35j6M76J4q10J4P31p27K67O16q27P80l66O51p16L40n13O79m94M8
3604b09L9N33Q19j578Q71N7J35j018Q62j11m45R23r85Q12O0n94M21j079R99l83
3624A29j3l47J056r04K21L19o28M82j010J015m44j02K48n07P3Q3L65n87O05m32
3644c78m68Q12l7L08m64J68n88P34k43j41K59o32O92r93Q07p12O28l95L86R71
3664G14j027M87l33K68k75P42k63M5p01j37M30j83M88J85j58Q0l56Q53r73L40
3684B26l20M41l72k77L89K13J15n18O99k51R0m26J77K56j276J448j533J432o85
3703a72O01o83J39l7J81n5j65R75j259Q3K48n17P98p10Q55n68J48J46m40N1p33
3724a114O33n2J67O4k21K84k28P03q66R52j658Q86k5K48k49N1M79l7R6l09L49
$$ plain form
3582 482 -29 -21 -356 -372 104 118 -692 -678 53 -674 -407 209 -618 162 -204 447 -269 71 -442 237 -257 -209
3604 -209 -170 363 1182 -396 475 532 667 -351 511 400 -45 878 -107 705 765 171 592 -487 512 129
3624 129 116 -231 825 -79 142 461 -167 315 -695 320 -124 -226 22 -485 -412 -329 36 -551 54 -378
3644 -378 -846 -34 -71 237 -227 -59 -647 87 -156 -297 -38 -670 22 -971 -164 -876 -248 -643 -257 714
3664 714 -313 174 -159 109 -166 576 313 358 -343 -480 -50 -233 255 440 282 362 6 859 -114 226
3684 226 -94 347 -25 -302 87 300 415 -103 596 345 435 9 186 442 -834 614 -919 513 -172
3703 -172 429 -254 -115 -152 29 -26 -191 784 -475 -392 -144 -661 137 -573 282 -286 -138 8 -432 -381 -1114
3724 -1114 -481 -533 -366 -302 -523 -239 -467 236 -630 322 -1336 -450 -475 -227 -476 -425 54 17 113 -196 153
3745A53n27O82l25N77J7l50R88r99m8L98q65L77K51K32o45P05o69L60k96L82J03
3766E01r51Q05m11O40m75m73L73p4N70m84O31k3K84j293Q09m88N13O58j342J07
3786a23l07M46p14R05P3q44N66j022J145j125J551j299L75M02o92N63m60N23q41
3805h78Q13l00K32j85O2M50q25Q48n10L17l7k33o4n79J294j100J033k71O0J37
3825B64p62O67j77M50q71Q32o94N78P40j384J179j226J179r49P18j30k45J04o55
3844c82J242q01N7J34o7N25q98L64l55N34q43J245j209L96P37o99j22N8P08j321
3864f97R81m07J03J07j00J85n36K88l83L36j69p23J189j074O52o03P48o49K68
3883d84J75l60R79j186Q81m35L11k68J72Q55q27R1k21Q61q05K63p7k70M08P3l6
$$ plain form
3745 153 -374 308 -17 560 577 227 1215 216 168 566 -299 78 329 561 -84 621 -48 312 16 398 501
3766 501 -450 355 -56 584 109 -364 9 -65 505 21 652 629 913 -380 429 -59 454 1112 -230 -123
3786 -123 -430 16 -698 207 280 -564 2 -1020 125 -1000 551 -748 -373 29 -663 -100 -560 -37 -878
3805 -878 -65 -365 -133 -318 -256 194 -631 217 -293 24 -13 -246 -310 -889 405 -695 338 67 127 264
3825 264 -498 169 -8 442 -429 403 -291 287 1027 -357 822 -404 775 -174 544 414 169 273 -382
3844 -382 860 59 116 250 183 708 -190 174 -181 353 -490 755 -454 -58 679 -20 -142 -84 624 -697
3864 -697 284 -123 -20 87 -13 172 -364 -76 -459 -123 -292 -1015 174 -900 -248 -851 -103 -752 -484
3883 -484 -309 -669 310 -876 5 -430 -119 -387 -215 640 -187 -96 -317 544 -261 2 -75 -345 63 136 100
3904A00J28R1o18L62o52O97J69K4L58j143J215m12n23L55j0P47p29j8j57K75M84
3925G43n75q7q7J016j134N78n78J3K8Q0K40l54L42m70R69j242M74l34M74J31j425
3946a198J348k14K25q30P96J33k7o64j35R10j387O52L40N3n73P69J63j031J251
3965E81j171J114m12O76r53n85P78L92K63j467J585r66K34N9L79L23j352L99m95
3984f18P62J04kQ8n14R77p20N23o46K30K19p74M28K11k30j02J56m4M83m14n1j89
4006a23j10R59r95K33k48j44Q65n62J62q8P8k95L01m65j07M26m94N45n74P18n63
4027d81K69j98M70l56m55R36n60M77m40P64l3j152J721j389L25j24M09J06q15
4046e26P74l19j79k88Q17k72j09O01n40Q63l27L2L8m14mj99M16j90K86q67J148
$$ plain form
3904 100 228 319 -299 63 -589 108 277 301 659 -484 731 319 -204 151 141 888 159 141 -16 259 743
3925 743 168 81 -6 1010 -124 454 -124 -111 -83 -3 237 -117 225 -245 724 -518 -44 -378 96 227 -1198
3946 -1198 150 -64 161 -669 127 260 233 -431 -566 344 -1043 -391 -51 2 -571 198 361 -670 581
3965 581 -590 524 112 788 -165 -750 28 420 683 -784 801 -165 69 128 507 830 -522 -123 -618
3984 -618 144 248 246 334 -180 797 77 600 -46 184 403 -371 57 268 38 -64 92 48 531 117 66 -123
4006 -123 -233 726 -269 -36 -284 -428 437 -125 37 -51 27 -268 33 -432 -539 -113 -607 -62 -636 82 -481
4027 -481 -212 -410 60 -296 -751 185 -375 102 -338 426 393 -759 962 -427 -102 -226 183 289 -526
4046 -526 248 -71 -250 -538 279 7 -102 499 -41 822 495 527 565 151 147 -52 364 174 460 -407 741
4067G41l39k90M45k70L7o84P81o73O86p36Q56o56q3L19m91N23j79o49O15O11o76
4088a12j286J492k98P73r92Q90o42j72n3N5O59j85k96n53R10o39L1J93p3J35k48
4109d11N24j62l88K72J1m00L72N59n25K85j18ON63j88o8m20j8O09k41j32K10l57
4131a7K13o3m27Q66p26J02J96L42n8p22P21l55L79o84Q60n78q4P57j074N83l60
4152a29L77n5J3P22l22m13o49J244j015J97l99M74K42j79O3l86N20m04J18j75
4172a56M0P57p94mj86O64l69lJm49M86n22P17j068R17l95O09L02r98M67l04J28
4194a60k41L1M49j58ML5K22K03J19l67o13K48M58K77o38N80k50N28m41p0M37r03
4216b50J122q32N52n01O60l77k69L62p12R99q90N45o92M89K96p61L85L80m71J23
$$ plain form
4067 741 402 112 557 287 324 -360 421 -252 434 -302 554 -102 -185 134 -357 166 -13 -662 -47 564 -112
4088 -112 -1398 94 -204 569 -423 467 -175 -347 -400 -345 314 129 -167 -720 190 -449 -418 -225 -298 -163 -411
4109 -411 113 -49 -437 -165 -154 -554 -182 377 -148 137 19 25 588 400 332 -88 -106 503 262 130 340 -17
4131 -17 196 133 -294 572 -154 -52 144 486 428 -294 427 72 451 -233 627 49 -35 722 -352 231 -129
4152 -129 248 193 206 928 606 193 -456 788 -227 -30 -429 45 287 108 171 -215 305 -99 19 -156
4172 -156 -116 641 -153 -157 -343 321 -48 -51 -50 -499 -13 -535 182 -886 31 -364 245 547 -451 16 -288 -160
4194 -160 -401 -370 79 -79 -75 -40 182 385 504 137 -476 -228 230 507 -131 449 199 727 286 216 653 -250
4216 -250 872 40 592 91 751 374 105 467 -245 754 -136 409 -283 206 502 -259 126 506 35 158
4236A58m42R5J04j56K48O4j63M60n88L58L2J42j95k71J4k88N61m06J1K19j30n4
4258b27k88R70q85L92l46J42J60k21J87j09L59o74O32j12o13L38j29N91j218J530
4278D79p90L07n6j79M15K4L92p04R2J06J27J39l5m01o9N99l64J95k95J37m57K60
4300g8j08J76P08o69K44l73m91N05J89k57j92M79Lm00L42O77j460O87J41n25J32
4321b70k17J136k93l37Rn68N89n57O71l62k35L66N39R9p35N53n97K47l17O87m81
4342g3M3J26j71J91k14O73o23o5k67M18M94k94K27k70L01m18N7k74M44r6N76j41
4364F44p75r9J08k29N42k31L37l59J31m91M43K17j03J65J3K47Q5n19m66L97k80
4385b23K4N80o86O91o82M11Q6m28M35p37O6J41J06P21o66j77J54j59K17L97o50
$$ plain form
4236 158 -284 -189 -85 -241 7 71 -92 368 -220 138 170 312 117 -154 -140 -428 133 -273 -262 -43 -173 -227
4258 -227 -515 455 -430 -38 -384 -242 -82 -303 -116 -225 134 -540 92 -20 -633 -295 -424 167 -1051 479
4278 479 -311 -4 -60 -239 176 200 592 -112 -20 86 213 352 317 -84 -153 446 82 277 -18 119 -338 -78
4300 -78 -186 -10 698 29 273 -100 -591 -86 103 -154 -346 133 136 -264 78 755 -705 -18 123 -402 -270
4321 -270 -487 649 356 19 28 -540 49 -508 163 -199 -434 -68 471 570 -165 388 -209 38 -279 408 -73
4342 -73 -30 96 -75 116 -98 575 -48 -113 -380 38 532 238 465 195 496 78 135 -139 305 209 785 644
4364 644 -131 -230 -122 -351 191 -40 297 -62 69 -422 21 238 135 300 313 560 645 126 -340 57 -223
4385 -223 -199 381 -305 386 -296 115 201 -227 208 -529 -463 -322 -216 505 -161 -338 -184 -343 -126 271 -379
4406c79N23p8j4m39J55M65k41k52P4N35m03L57K72r50J099o40J82o69P69K2J19
4427E07j099J53L38m60J080j071R53j20l09K73m48L17qj65M09m30J09l45J030
4446G14o96N50q86%M53l16M72m84Q20r56j78K89M57J92p17P24o40L97p7j50M60
4467D28m6k55m53L71J00j71k75p3R8j40L33m39R58n84O72j254O05j18k02N63n71
4488d53L92n27J212j012L49R94j065J56j035J028n39J024o30L04l99n7L78J3o72
4507e39M11L49j91M73k54K65l33j22L9L03k91qJ94j00l9R2k1K33p90P21j40k79
4529b7L86l61J191j339J63K96k93k53L16R9m26O50o14K01K36j65k8k20J49o06
4549f45J211r54P13k83n19N72l16N3m85N77n14M18k34J40l90l31N89K25K96k89
$$ plain form
4406 -379 144 66 52 -387 -232 233 -8 -260 -186 349 -54 303 575 -375 724 84 266 -403 366 388 507
4427 507 -592 -439 -101 -561 519 -552 401 281 -28 245 -203 114 106 -59 350 -80 29 -316 714
4446 714 18 568 -318 -318 135 -181 291 -193 627 -329 -507 -218 239 431 -286 438 -202 195 118 -32 428
4467 428 382 127 -326 45 145 -26 -301 -374 -276 -416 -83 -522 436 -148 524 -730 -125 -243 -445 118 -453
4488 -453 -61 -588 624 -388 -39 955 -110 46 -989 39 -500 524 -106 198 -201 -258 120 133 -539
4507 -539 -128 221 30 503 249 514 181 59 98 401 110 102 296 196 157 249 228 461 -329 392 252 -27
4529 -27 359 -2 1189 -150 13 309 16 -237 79 178 -248 402 -212 -11 225 60 32 -188 -39 -645
4549 -645 566 -388 325 42 -477 95 -221 -168 -653 -76 -590 -172 -406 -266 -656 -987 -398 -173 123 -166
4569a66J26M69n06L26p82K33M88J48o25M4N0l10R16r16N22k60P9J69k15O8m6R6
4591i2o68J038k47k9J08m7k22M89k70n56O36k33K00J86L5k17m17P25o57J20j10
4612b28M97N11n92K78o78M74k19K65n82L49J36r75M29m96P50N50n82K94K04P1
4632D56r02J000j135j81M61J41M57p18K42l3L45l25N51p05k99R97k00L13n84K14
4652I5m97P03p76P73l3l86O4M92o0n12M30l92LJ42l65L05j32L95k94J07j35L2
4674d1M03n50J13r0J03k9L96n89K14K01m37N11j83K80m95K78j28m48R09m71J91
4695A38Q1p6o22M84j18r05J657j444L71K65j2L80J59k17L93l62l91J74k98j84
4715e27L63QL00l02k2L55l49j89P47k29m64R07k07m26K46k24k02j9N28k70k40
$$ plain form
4569 -166 -40 429 -77 249 -533 -300 188 336 -289 -245 -195 -505 411 -505 17 -243 -164 5 -210 -142 -188 -92
4591 -92 -760 278 31 2 110 63 -159 330 60 -496 140 -93 107 293 328 111 -306 419 -238 -118 -228
4612 -228 269 780 188 466 -212 262 43 308 -274 75 211 -764 -335 -831 -81 469 -113 181 385 456
4632 456 -446 554 -581 -762 -301 -160 297 -421 -179 -212 133 -192 359 -346 -645 352 152 465 -119 95
4652 95 -402 301 -475 298 265 -121 -57 435 375 -137 293 -99 -96 46 -319 -14 -146 249 -45 62 -73 -41
4674 -41 362 -188 -75 -165 -62 -91 305 -284 -70 131 -306 205 22 302 -193 85 -43 -491 418 -53 138
4695 138 219 143 -479 5 -113 -1018 639 -805 -434 -169 -181 199 358 141 534 172 -219 -45 -343 -527
4715 -527 -164 -156 144 -158 -180 175 -174 -363 384 155 -309 598 391 -35 211 -13 -215 -234 294 24 -216
4736b16l56K63N85q51J262o53o3J8O00p32P9j53L31l6p39Q33l95L53k1M2q44R70
4758B77k5J15K26o66M96n91N06m37j62L48j34k79l04P72k02l19Q41o87M72k73
4778b6n3j04m53P22n44M13k78L98N6k75k49Q35o02k72Q28l77k85M03L17q34O71
4799B91k01l76L32k05Q0J71l06j7L11O11r88O45r04Q27j028J377k40r02J175j34
4819E19m30n36R72m38k32P0P5M67k01j4p31N93K85l97K21m78O26k41L10j037P28
4840A31m28L72r9m91M12l41N95p65P24m77K29l07M30J87k97l0M4j39Q1L82J43
4861C56o82k19O01m83K80J0N2L04J66q65O79r58P93R6k71k54M90L47k88k24n03
4882e73N46L62j40o01J74O04O5k61o06J038j227P02J90L54m44l84P62q01K37O99
$$ plain form
4736 -216 -572 -309 276 -575 687 34 -29 -11 589 -143 -64 -217 114 78 -661 172 -223 130 109 151 -693 277
4758 277 252 367 593 -73 423 -168 338 -99 -261 87 -47 -326 -630 142 -60 -379 462 -225 247 -26
4778 -26 -79 -183 -636 86 -458 -45 -323 75 131 -144 -393 442 -160 -432 396 19 -266 137 454 -380 291
4799 291 90 -286 46 -159 -79 92 -214 -231 80 691 -297 348 -556 271 -757 620 380 -522 653 519
4819 519 89 -447 525 87 -145 -75 0 467 266 252 -479 114 399 2 223 -255 371 130 440 -597 131
4840 131 -297 75 -24 -515 -103 -444 151 -614 110 -367 -138 -445 -15 172 -125 -155 -111 -250 -169 213 356
4861 356 -326 -545 56 -427 -147 -137 -85 219 385 -480 199 -759 34 130 -141 -395 95 442 154 -70 -573
4882 -573 -27 335 195 -406 -232 372 437 176 -430 608 -619 83 273 627 183 -201 561 -240 -3 696
4902F96l43n3J71j74p51N66l15N67l20k34P49k88M62o64j16L61m79l6j17K97l33
4923c54P2M30j62K33m37J85j34o56J41M92rr9Q07j428R09j92k48M34m9k39K55
4944d9j44J92j46J28p8R0O0k72O93n41l38L98p76R29l19N34k17p7j74n5Q29j017
4966c50L9O60J86l51m91P64m99K66l93R25L29o67r7l7L36j062K1l5N65m43M47
4987A13j48J35j79J82j1K08k73J79l28M05l65m37j4M31m01O96q84N11L55Q0l64
5008a09p8M7k04M1K62k30M4N71k36n35P43o18L97Q7k03N95l49o2r0M67p72L34
5030A02K79j02P6n19J46J20j28L29l43M2p5N84m49J90P3K66r50R55K00p21O80
5051G55n44n42K83J01L05j60j61Q66q21q9M82q01J088j243L4J189j024L57M12
$$ plain form
4902 696 353 300 471 297 -454 112 -203 364 44 -190 559 271 733 69 -47 314 -165 -201 -318 -21 -354
4923 -354 -282 148 -14 219 -218 -33 -167 -823 -682 -190 -199 -298 509 -919 -10 -202 -450 -16 -65 -304 -49
4944 -49 -193 -1 -147 -19 -97 -7 53 -219 474 -67 -405 -7 -783 146 -173 361 144 67 -107 -162 667 -350
4966 -350 -311 349 535 184 -307 457 -42 224 -169 756 1085 418 321 284 620 -442 -421 -456 109 -334 113
4987 113 -35 100 -79 103 92 300 27 206 -122 283 -82 -519 -533 -102 -503 193 -691 -180 175 255 -109
5008 -109 -187 -140 -344 -303 -41 -271 -227 344 108 -427 316 -302 95 182 -21 574 225 163 73 540 -232 102
5030 102 381 279 355 -164 -18 102 -26 303 -40 2 -73 511 62 252 325 591 -359 596 796 75 755
5051 755 211 -331 -48 53 358 198 37 903 82 -7 475 -326 762 -481 -447 742 -282 75 487
5070D87j204Q52m23K00m4n8Q8L7J55J46K73o95P6m38M43j06M54j219J483j029
5090e22J33J98J18N2l34J63K92p3J26j72k39j46L66k56M10m54J9M68k73k07l0
5111c61R19q02M82k27J07j16m00R34n45j9j61K11j73o42J339k83K72n22k28P94
5131E79q68J81J82k19m88Q20m66R12o46q7L74l67M32p69M41l94M83J04j33J27
5151A98n56o3K84N1j32O15r05M85L19p57M00J31J69m86J43m25l1O91J31J12p64
5172c90K88K0J51L83j191J080j106R18K95j97j27l20L12K31L24l86m53J01qO6
5192ik0N23j125M86M25m00Q1N69o83j14L98j89K10l62N13n64J09O06j266J455
5212F43r15p0N1J75O78q29M36l61L36j86L0L29r44k5JL77J68L06l50l90L84L15
$$ plain form
5070 487 -717 135 -288 -88 -132 -190 -102 -65 90 236 509 -186 -110 -548 -105 -211 243 -976 507 -522
5090 -522 -389 -191 -73 -21 -355 -192 100 27 153 -19 -258 -404 -38 -294 116 -338 -319 149 -124 -331 -361
5111 -361 558 -244 238 11 118 2 -398 536 -9 -28 -189 22 -151 -793 546 263 535 13 -215 579
5131 579 -289 -108 74 -145 -633 187 -279 633 -13 -100 274 -93 339 -430 11 -383 100 204 71 198
5151 198 -358 -421 -137 -86 -218 397 -508 -23 296 -461 -61 70 239 -247 -104 -529 -560 131 262 374 -390
5172 -390 -102 -82 69 452 -739 341 -765 153 448 251 124 -196 116 347 671 285 -168 -67 -75 -9
5192 -9 -29 494 -631 -145 280 -120 -39 530 -153 -267 131 -58 152 -210 303 -261 -152 454 -812 643
5212 643 -272 -342 -291 -116 562 -267 169 -192 144 -42 -12 317 -627 -652 -651 -274 -106 200 -150 -540 -156 159
5234A59m50K44M15n59J011j111j84K29n7J15k95J14N15K22o93jR70o61J95p2l01
5255a95L29j65l9k78J15J8P39j97K33l77K41p42L22K20J21l7n84L80O4o74J194
5276F88r36J80M01l2k54l33M22n4J37o48J039j129K31M31K90l62K98l53K25k05
5296C6l12M94J03m64K44n31N29L17l25j71Q5n23N76K2n35O20l45N96l7k21K91
5317D49j062J41J32L54k41J11k99k20Q57j98j83J96J87j106P30o2J29P4k81N33
5337B41L99o08n49R04j02J47L25j174O20jK70n58L00J62o8n43O3J030l59m73M94
5358E20j28m79PM95m95N87p65K28K3q8L2k71K60m61K7P53J21l59K90n28K39l00
5380b92N14q02M47MN1Q6M57r02N76k79NO1o07J76P55J32j218Q33R4n8K87k05j43
$$ plain form
5234 159 -291 -47 368 -191 820 -291 -475 -246 -303 -188 -483 -369 146 368 -325 -326 644 -17 178 106 -195
5255 -195 134 -31 -70 -348 -233 -215 524 327 560 183 424 -318 4 224 345 308 -276 104 168 -506 688
5276 688 -248 -68 333 301 47 -286 136 82 219 -429 610 -519 -288 143 433 71 369 16 241 36
5296 36 -276 218 321 -143 101 -430 99 416 91 -80 5 -518 58 80 -455 165 -180 416 379 158 449
5317 449 -613 -472 -340 14 -227 -116 -415 -635 222 24 -159 37 224 -882 -152 -214 -85 -11 -292 241
5337 241 640 32 -517 387 285 432 757 -417 203 202 472 -86 214 376 308 -235 -172 858 499 26 520
5358 520 392 -87 -80 415 -80 507 -258 -30 -7 -95 -63 -334 -74 -535 -508 245 366 7 297 -231 8 -292
5380 -292 222 -580 -133 -129 -78 8 465 -437 139 -140 -135 -74 -681 -505 250 382 -836 -3 91 33 320 115 -28
5403b8j88M52m73O30j11n32K88l14O74l7j35q65R48l53Q00n38o93P35L7m67J53
5424a7Q85o04k50j1J26L90p22J37O89j316R17P6j99K8p9nm34P08m09j54j74M93
5446G5o2j14J89Mr13P71k91j3M46m46N31l94k77L31K31J79p41k40L20L52L3Q59
5468H30q64K48k62K6K52k56n7j39N96n52O16k3n00M64o82L68M46n02L86o14Q11
5489E92n80M07k09K48n53J7K87j03k50J64j94MK2L43j29P78j139J059l66Q2j80
5510C00r40J316k56m26L61k49q8N8m49N14l66L82J84l23L25p3n48N48K0N3m92
5531a49J66k01k14P7Oj80N54K4m76L81m81J004r07Q98l33J68k95k21M24L41p41
5552a55k3l26J64M64m83N80L40k49r99L98K13P28p95L36n57K84l09O87j51n90
$$ plain form
5403 -28 -216 236 -237 393 282 -250 38 -276 398 361 226 -639 309 -44 756 218 -475 260 297 -170 -17
5424 -17 868 264 14 3 129 519 -203 -66 623 -693 224 300 101 129 50 45 -389 319 -90 -244 -418 75
5446 75 13 -101 88 92 -821 -50 -341 -354 92 -354 177 -217 -494 -163 68 247 -494 -734 -414 -62 -29 830
5468 830 -34 214 -48 -22 230 -26 -83 -222 374 -178 438 415 -85 379 -303 65 511 9 395 -219 592
5489 592 12 419 210 458 -95 -78 209 106 -144 20 -174 -170 -148 195 66 844 -295 764 398 480 300
5510 300 -640 676 420 -6 355 106 18 76 -373 141 -225 157 341 18 343 270 -278 270 290 343 -149
5531 -149 17 -184 -398 -321 -315 -495 59 83 -393 -12 -493 511 -396 502 169 337 42 -179 245 586 -155
5552 -155 -178 -504 -340 124 -359 221 561 312 -687 -289 -76 652 -143 193 -364 -80 -389 298 147 -443
5572d43n0k3M17k05Q58o99L74K3r5k32L72J58q48L82k85J91o3l47L00l54N29J24
5594H4m5M76k32k72j25J59O8q9j81K45l17j98J77J12L28J47o87j34L46L34k67
5615g1n83K70O11m89M21j96K37n93L27m7L8N00m5p42n0N65j41j73K30l79K93O6
5637D9L51N4p83j56J5Q00l20L84m59K44j06j13K35o80N59k43l8K02K98j46k23
5658g6l73J35L75J21m35L05l96L39o6k14K0L32l86O11l04O01j246Q30j68K3k2
5679Fo54O76k65q7L95L8Ko44P78k26r5n63N09p29J6K61J38J83o2J42k87Q05n01
5702a64m44L16N20o32R98q04N58k69J65n81J235m03J12r01M63L6R8L75o87J58
5722A49k91J267j317L37L49o27L29kJ04J0K49j44r0K17r51Q86o11L28J02l21M8
$$ plain form
5572 -443 -493 -516 -99 -304 554 -145 229 252 157 -75 297 455 -393 -11 -296 -105 -168 -515 -215 -569 -40 84
5594 84 39 515 283 11 -114 45 113 24 -157 88 -229 -427 -250 -138 190 337 -350 -484 -138 196 -71
5615 -71 -654 -384 227 -262 159 -37 200 -393 -66 -113 -75 425 380 -362 -412 153 12 -161 69 -310 -17 49
5637 49 400 454 -329 -485 -470 330 10 394 -65 179 73 -40 195 -485 74 -169 -207 -5 293 147 -76
5658 -76 -449 -314 61 182 -253 52 -344 -5 -71 -285 -265 67 -319 292 -12 589 -657 173 5 28 6
5679 6 -648 28 -237 -324 71 109 111 -533 245 19 -76 -639 -130 -859 -843 -582 -444 -261 -323 -181 -468 337 -164
5702 -164 -608 -292 228 -404 594 -210 348 79 244 -337 898 495 607 -294 169 205 303 678 -9 149
5722 149 -142 1125 -192 145 494 -133 196 194 298 308 557 413 323 540 -411 475 -136 192 294 -27 21
5743B1j66J05l68J066q73K76l37p2M77k61K7k30j43Q16L3p91j58N21k79Q25p00
5764b11j42O07j055Q58J49K5J6j97k95j72J59j73J72l2K40Q8k76p05J680r27K44
5785E3N26o11J95j54R2m61O24l58O88l77j4K72p13P94J24k55m38K92J78m49O36
5806F44j159O08K99k73J33K20r7l07K27p67R88j79k98K44q35Q99j60k75M08j18
5826B02n48K84J91j47M38o35L94n80P49Ok23qo15Q98j083Q02k24L23m47n11P12
5847b2m69M15O0N06j100Q85l21j62N41n83K3K08J26L88r95J001j203P08K3j7k13
5868b01K53N93r29M03l22N30o34L41L48j96j71L07k40Q3K86j024P69L97n83k02
5888a92J38N25p18M34j89n08J013j77l29k30K91k17j8q3M53o29Q57m16o26L38
$$ plain form
5743 21 -145 -40 -408 658 -215 61 -276 -348 129 -132 -105 -335 -478 338 371 -420 -578 -57 -336 489 -211
5764 -211 -353 254 -801 57 206 231 247 50 -245 -417 -258 -431 -259 -291 -51 37 -239 -944 736 -191 53
5785 53 579 -32 163 9 101 -360 264 -94 594 217 203 475 -238 556 680 425 -13 279 457 8 644
5806 644 -515 93 392 119 252 472 375 68 295 -472 516 337 39 283 -552 347 187 -88 320 202
5826 202 -346 -62 129 -18 420 -215 179 -401 348 354 131 123 -492 406 -677 125 -99 224 -223 -734 -22
5847 -22 -491 -76 -16 490 -610 275 -46 -208 333 -250 -227 -19 107 495 -500 501 -702 6 29 12 -201
5868 -201 52 645 -284 119 -203 327 -307 34 382 186 15 322 82 165 451 -573 196 593 10 -192
5888 -192 -54 471 -247 187 -2 -510 503 326 -3 -233 58 -159 -177 -260 193 -436 421 5 -621 -283
5908b83j35K74K55n88N02l51k7M56k31k52p3M96n55J010q08M90l48M08l78m46
5928e84P71l44L05n26J49K43l4L9k2M96o95Q42j074R06o14R57q91K14J48J83j12
5949C57j07l98j59j09M04k59L87L7J56m1l1m63L91k68M07J1p52P85n24K8N97m50
5971aK02k06j48P9J78k55L09m96M34k98j89J07k50L60Q0k0mk25M19o1J03o7j16
5994f5p04J156q99O87k18k80L58r91K73Q49k79o4P96Kn15j69L61n63P72j42P6
6015D41L13J27r79O40l64M23p64k77L91J64J82m14O48k34l24r9L43J19k35k92
6035a91m43R14l28L80J13K96n29p3l52n9N72n10j76O37k25j27oK68o23Q20p12
6056c54J9Q60p59M71p42J43M50L62o35M79P5o84L58l51L43K92o78k54R50K4m55
$$ plain form
5908 -283 -418 -144 111 -477 25 -326 -353 103 -128 -380 -453 43 -512 498 -310 180 -168 240 -138 -584
5928 -584 187 -157 148 -378 -229 14 -20 19 -3 493 -202 640 -434 472 -142 815 -76 138 286 469 357
5949 357 250 -148 -307 -416 -12 -271 116 153 309 268 237 -226 165 -103 304 315 -437 348 -176 -148 449 -1
5971 -1 201 -5 -153 -74 104 -151 158 -338 96 -202 -391 -284 -534 -174 -94 -114 -118 -343 76 15 118 51 -65
5994 -65 -769 387 -512 175 -43 -323 35 -956 -683 166 -113 -177 619 621 106 -63 298 -265 507 365 441
6015 441 754 881 -98 542 178 601 -163 -440 -49 115 297 -117 531 297 -27 -126 217 336 101 -191
6035 -191 -634 280 -48 332 445 741 212 139 -213 -272 300 -210 -386 251 26 -101 -107 161 -462 358 -354
6056 -354 -335 525 -234 237 -505 -362 88 450 -185 294 369 -315 43 -308 35 327 -351 -605 345 369 -86
6077h6p7J54o31N81l08L67m11J40k50K44j91M12k32N39j13M1L56m40K17m17j56
6098b61K39k56J64M88L00k28n95J20J83K27o18O96p34O24n01j34N8J55J71j42
6118d4P40j102M05J71l13n0j60O03q71O62N5l46J8M7q3L26J33l01N61j4l03n49
6140d15k37J17K19k16j59M49k2M59j07n33l45M28K37J06j21L6K85nJ68q63N47
6161B8L50q79L81l0L56J3k30M25m85J98j6J78K08r02J84M67l0p28L58N14o08K43
6183eL41K05m97L15o18K48o13N77J32k72O30p9m77o2n6M48j00j53R1L10p04P44
6205D05q83j66R06k93l28k85M50j40K61J57J28K43m53l49M60m49L22q15M16L21
6225i2p85N82J8l1N77j39k19n1N78M7r71k17J141J6j040N20L45K4M45n45l16m7
$$ plain form
6077 -86 -163 -9 -640 -59 -367 0 -411 -271 -521 -277 -468 -56 -288 251 138 179 535 95 312 -105 -261
6098 -261 -22 -278 -114 374 674 446 -149 -29 154 381 -237 459 -275 349 -152 -286 -228 -73 98 -44
6118 -44 696 -406 -1 170 -143 -193 -353 250 -621 41 96 -250 -232 -185 -268 58 191 -110 451 437 134 -415
6140 -415 -652 -535 -316 -532 -691 -242 -264 195 88 -445 -790 -362 -125 -19 -140 -104 181 176 344 -519 28
6161 28 378 -501 -120 -150 206 219 -11 414 -71 127 111 289 497 -405 -221 246 216 -512 -154 360 -248 -5
6183 -5 336 541 44 359 -259 -11 -624 -47 85 -187 443 364 -113 -175 -231 217 117 -36 55 365 -339 405
6205 405 -478 -644 262 -31 -359 -644 -194 -334 -73 84 212 455 2 -347 113 -336 -14 -829 -413 -92
6225 -92 -877 -295 -277 -308 269 130 -89 -140 438 485 -486 -703 438 454 -586 -66 279 303 748 203 -113 -160
6247a60P42q37Q07Q0j093K38l65K86pJ014o11K60m54K44k66J07K98R5o26M94k12
6268C4P3L6J14o51N79r56M69K26k59j8L33l54N57K60r33P86n00k41R59k88j24
6289A02l62j06L6J80J42k88J43J014r07l73L02O14p46J73n23M82J17k6l78L3j32
6310e03L54n44k69J408k51K88k10j15m30O27q3m83J31J88L4J07j08L88j92p04
6330c67N70m11l17L64L43M9J58k65J23k82J70l11K05m00J25R4m38K64L40J32l06
6351a60K35K94m6M70j395J277r36N48P9n41P13m89k42j42J05m84P54J54l7J25
6371B82k17J56k36j15l28L39o25P28J54l23L33p71L10j8L97j112R23M64q75N11
6391b3p0l04N70l64L2j85j3L81K07k54K25r9Q08j289R11R3q42L05l73P88p62L44
$$ plain form
6247 -160 582 -255 552 632 -461 -223 -588 -302 -309 705 94 354 -100 144 -122 -15 283 378 -248 246 34
6268 34 107 143 257 -394 185 -771 -302 -76 -335 -353 -20 -374 183 443 -490 296 -204 -445 514 226 102
6289 102 -260 -366 -330 -150 -8 -296 -153 861 -46 -419 -117 497 -249 -76 -599 -117 0 -26 -404 -371 -503
6310 -503 -149 -693 -962 446 195 483 273 158 -272 355 272 -211 -80 108 142 249 141 529 337 -367
6330 -367 203 -208 -525 -161 182 231 389 124 247 -35 135 -176 29 -371 -246 -152 -590 -326 14 146 -160
6351 -160 75 369 323 793 -602 675 -261 287 366 -175 538 49 -193 -335 -230 -714 40 194 157 282
6371 282 65 221 -15 -130 -458 -119 -744 -16 138 -185 148 -623 -313 -331 66 -1046 -123 341 -534 -23
6391 -23 -93 -397 173 -191 -159 -344 -357 24 231 -23 202 103 911 -378 533 626 -216 89 -284 504 -258 86
6413H6m16L86k75J23O59p54N0K55m76k50N65K00n67N77q75K34J42P2J88o35P08
6434cj29J44j0k19jn84N85j00M15j7j89J63j24N2j26M30Q4j35n08Q32q11k41O57
6457A65r85N60J48M9k46R19m49O8K6l81L37q4q9n36L03j89J16J43k8N47p93L33
6479f6j41M89l8j26J26m78O19l54K88l43R9K26k42K12l29K40j61k29M5j18K82
6500Ak78n2o0Q2PP5L34k12N6n81L63r3r1j03N29k65l3m57R30j68M7N3o8J91l04
6525i7l88J44N5mL35N89j11p44K27M10J01r47L53l7L1K29j45L10k92L03j23k66
6547f7K07Jm61j17O76o1L67o69N24N60j391N50L11k22n34N50O3j64Q6k47L06j19
6569A49K16m49N78r16O26K04q21J041p18k20J50l45K24K89j72R3j46P39m60j032
$$ plain form
6413 86 -330 56 -219 -96 563 -191 -141 114 -362 -612 -47 153 -414 163 -712 -478 -336 -264 -76 -711 -3
6434 -3 -132 12 2 -217 -218 -802 -217 -317 98 81 -108 55 -69 -17 -143 287 371 236 -272 560 -251 -492 165
6457 165 -820 -260 -112 -63 -309 610 161 229 255 -126 211 127 38 -498 -195 -384 -268 -125 -153 394 -399 -66
6479 -66 -207 282 244 118 244 -234 385 31 319 -24 75 301 59 271 -58 182 21 -208 -163 -281 1
6500 1 -277 -329 -389 -307 -300 -225 109 -103 -47 -628 -265 -358 -449 -552 -23 -288 -321 -778 152 -16 31 84 16 207 -97
6525 -97 -485 -341 -286 -290 45 634 523 -221 6 416 517 -430 -77 -114 -83 146 1 311 19 322 199 -67
6547 -67 140 141 -320 -437 239 178 545 -124 400 960 -431 119 430 208 -326 224 287 123 209 -38 268 149
6569 149 365 -84 494 -422 204 408 -413 628 -90 -310 -160 -505 -281 8 -164 -71 -217 522 62 -970
6589i70O12J97j75M00l4P6k12N48n88J77j61m97P58q85N66n53N21o92J028M25
6609E41p20L17n86K60Q2j0m9Q0M30l89L74l95K27j7l1o07p3J123o77K00L48k43
6631A85l83Q06p93J31j59L51oM2l09Q5J65M22n97l61j61M51O27q00M10l86Q99
6652F19p73M13p38K78l28L30K02m5L46j13m48J00J15k43P64m05l93M58q54L84
6672c31L57k47M41j82m94L76m4k13J34k05Q16m73L36l42j27N80j54k62j72P31
6692E25k01o68K96O2M04j27J23l44m8J99o11M80K48j09l01J85L86k39l40l26N28
6713A22m23P04j201R13O2q9K10m07j11L72K71q53O16p4l0l36j57N88l97K54o2
6734b8l17M28L17j101K18O00m07k4P05M47q11m9J65l08n57J042N1l35j39J99K22
$$ plain form
6589 -970 -358 -161 -336 64 30 106 -106 442 -146 31 -130 -627 131 -754 -188 -741 -220 -912 116 541
6609 541 -179 138 -448 -188 -106 -116 -165 -85 345 -44 330 -65 162 145 114 -493 -566 557 -120 80 428 185
6631 185 -198 608 -185 -54 -213 138 132 174 -135 -50 115 537 -60 -421 -582 -131 496 -304 106 -280 619
6652 619 -154 259 -479 -201 -529 -199 3 -42 304 191 -257 -157 -42 -285 479 74 -319 139 -715 -331
6672 -331 26 -221 220 38 -456 -80 -124 -337 -203 -408 408 -65 271 -71 -198 382 228 -34 -206 525
6692 525 324 -344 -48 14 418 291 414 70 22 221 -390 90 338 229 -72 113 499 260 -80 -406 122
6713 122 -301 403 -798 115 177 88 298 -109 -220 152 423 -430 186 112 82 -254 -411 177 -220 34 -28
6734 -28 -345 83 400 -701 -483 117 -290 -314 391 838 27 -22 143 -165 -722 320 371 36 -103 96 318
6755C18n71j11N92j74n41J067p04J037j029K12p09Q98k19J98M4q01O29rJ32K70
6775E29q0p26M37L62j35l64j28l7j59l64R79n37l99oP31J02j2o07O06l8o34M39
6797d1l88K86m96l2P32k72j12N68k25L0L32m38n15R33j40o56J12N50j99ql76Q82
6819E27r81J65N78l38nJ56l50k16J17M84l23K37k11J68Ok72K47L3L49n32M19k54
6841DM98l24j04k8L18l63K07K12K23p16j81O86l0j31J49q00J280j065O17O1m02
6862A11m95J53P53n1o50k33Q36m50k31m3j38J20Q10n72o4M96P7j286N52k50O83
6883A28l77O36m39j45M1l26P86m13j19N8Rn15O40J23K62j97q95J276j034O20j60
6904d1m76J062m08p14M50M3L37l87l01L07M26m19j90J40M66l22L33Q4k48K31K9
$$ plain form
6755 318 -253 -364 228 54 -487 580 -124 913 -116 96 -613 285 66 264 308 -493 136 127 259 529
6775 529 449 -277 160 522 387 23 -105 -142 -301 -665 314 -223 -622 -628 103 205 193 -414 192 154 -480 -41
6797 -41 -429 -143 -639 -671 61 -211 -323 245 20 50 382 -56 -571 362 222 -434 -322 228 29 21 -355 527
6819 527 -454 -289 289 -49 -54 102 -248 -464 -347 137 -186 51 -160 8 14 -258 -11 22 371 -161 258 4
6841 4 502 178 74 46 364 1 208 420 643 -73 -254 432 402 271 420 -380 900 -165 452 513 111
6862 111 -384 -231 522 471 -179 -412 424 -26 -257 -300 -438 -318 492 -80 -144 352 429 -857 -305 -555 128
6883 128 -249 387 -52 -197 -156 -482 304 -109 -228 -170 -161 -676 -36 87 349 152 -743 533 -501 119 -41
6904 -41 -517 545 137 -577 -127 -84 253 -134 -435 -128 298 -121 -311 -171 295 -27 306 390 142 373 402
6925D02l04l32M72k55o7K84p65M52K69K03n57R85j448L95K15K38m9l61L23K74
6945C74j65k24m05R44K21m91K12m74j47L35N8l73j38K59j21K58l88j51M63l35
6965b88P1M7k16J96L51k07m85M03J35l29O2L28J07p44J243o53Q2r4o6j40J82L58
6987C43m21K40j40M16j95j13n29J9K13M49l42N20k19M61q87M6O5J04o07P89K60
7008D72m74O11p80L1J48L17l93K76J03o10N96M95j516Q75Kj27lj07m79J201q62
7029b24N53l22l38L34q2K10l99J069m97J93j37l48l4n66L97l32P46p59N79Q2k62
7050a37p0o4M30n43K06K66K40n21N89K06q82k76O60L21j35l23J10l22J74k26M54
7071A57j6nK70k76p3l97K25O00n87l54N23m86K85N52j90m27N17K98r40M84m70
$$ plain form
6925 402 98 -234 238 -17 -84 200 -565 -113 156 359 -198 787 -661 -266 -51 187 138 -223 100 374
6945 374 209 -15 -420 524 745 254 466 -8 -155 180 238 -135 -273 -14 -135 123 -265 -416 47 -288
6965 -288 -217 -170 -386 -190 161 -46 -531 -128 7 -322 -260 68 175 -569 674 21 103 9 -57 -197 -15 343
6987 343 -78 162 22 438 243 130 -399 -380 -167 282 -60 460 241 702 -185 -139 -74 30 -577 212 472
7008 472 -2 609 -171 -140 8 325 -68 208 311 -299 297 792 -724 151 153 26 23 -84 -563 638 -224
7029 -224 329 7 -331 3 -79 131 -268 801 304 497 360 12 -22 -588 -191 -523 223 -536 43 125 -137
7050 -137 -207 -271 159 -384 -178 88 328 -193 396 602 -280 -556 104 425 290 -33 77 -245 -71 -297 157
7071 157 141 136 406 130 57 -340 -115 485 -102 -456 67 -419 -134 418 228 -199 318 616 -324 160 -310
7092c10L44K43k85P4n60L67M28p6k76J39Q7K51m26j81L08l45M50o73Q57K11o95
7113f8k51l4K06l55P45j97n89O49j39J96n68n8K21L05O15j392Q33j79O77r24J11
7134a96J98l28L02k37P26n76N19k45N99j569Q85l48J64L76k36l28L36L73j50O6
7154C31m77K55o2O3n4J41Q2l67k34N01j93j24L17J67N14r72j20m99Q49l23N62
7175C57j75n69M73K35K47j021O98m42l56P19l81j06j11M61J69o44L4P76M4l61
7195D7o3m94nN77K13N3n32J85k49l64O35j8l27J65M75m53j58J023L8j305Q48j98
7217I3K98r93O22l74K54N04o32O78k07n59j25N04j04n03P93o15R84k49m53n97
7237f81M93M18k6L00q92N30J19p6p94L25L70l88N49J36l07J1j13j70p7N53k90
$$ plain form
7092 -310 34 277 -8 66 -494 -127 301 225 -51 88 175 426 0 -181 127 -218 232 -441 416 627 -68
7113 -68 -319 -353 -147 -502 243 46 -543 106 -33 163 -405 -463 -242 63 678 -714 119 -60 617 -307 -196
7134 -196 2 -326 -24 -261 465 -111 408 163 762 -807 78 -270 -106 270 34 -294 42 415 265 331
7154 331 -146 109 47 110 56 197 279 -88 -322 179 -14 -138 179 346 860 -112 -232 -731 118 -205 357
7175 357 182 -387 86 321 568 -453 245 -197 -553 166 -215 -321 -432 29 198 -446 -412 364 408 47
7195 47 -16 -510 -515 62 275 328 -204 -19 -268 -632 3 -15 -342 -177 298 -155 -313 710 748 -557 291 93
7217 93 391 -602 20 -354 -100 404 -228 450 243 -316 -441 63 -41 -544 249 -366 618 369 -84 -681
7237 -681 -188 230 204 504 -388 142 261 185 -609 -284 86 -302 247 383 76 87 -26 -196 -273 280 -10
7258a0L3j06N1K72K34m96n59J011j9n00J8J69m72K08J97m07J76j82N27k5p9J19
7280A60l29M10m06P0O30k85J94m79m25L83K18L47n2n59L06L4l86O65p63L05k16
7301a78j44R69j94o96J006o9r46K69R7m62K01j12P80l23m91K19O4j36m77P60j43
7322fK03k31J21m52L2Q6P16p53J50J38m76qJ00N16p03M35J60j05K18k83J49L44
7344C51r42K0K1R29o77N56m87J30p79J463o34j61n3K50J85l14P32q70J25K28R4
7365A67m79M81K64n66l39R31q60L62k30m1N64m28N5L73K24m37M26qj086K56j05
7386d76J52K27k67K35N39m60M12m36Q3k24O36p12J89L73m35K9J16o3j8k13M55
7407A42m98K68j22Q17j591P88K90J83o48j19Q6O84n39K75M10K53k55l80M90r67
$$ plain form
7258 -10 23 -83 -32 240 474 -22 -581 430 411 -89 -71 98 -374 -166 31 -376 -200 -382 145 120 41 160
7280 160 -169 241 -165 -95 535 250 444 -35 -460 -77 141 488 436 -123 183 217 -169 496 -267 38 -178
7301 -178 -322 647 453 -243 763 694 -252 17 114 -348 -147 -259 521 198 -293 -74 -10 -146 -623 137 -6
7322 -6 197 -34 87 -365 -333 -247 469 -284 -134 4 -472 -480 -380 136 -567 -132 28 -77 141 -142 7 351
7344 351 -591 -571 -550 379 -298 258 -229 -99 -878 585 -49 -210 -263 -13 172 -142 590 -280 -155 73 167
7365 167 -312 169 433 -133 -472 459 -401 -39 -269 -310 254 -174 -119 254 478 41 467 459 -627 -371 -476
7386 -476 -324 -97 -364 -129 410 -50 362 -74 9 -215 421 -291 -102 271 -164 -135 -19 -82 -100 -313 142
7407 142 -356 -88 -210 607 -984 -196 94 277 -371 -490 -404 280 -259 16 426 679 424 44 534 -433
7427d33N60L28n68j29J67p51J422q38O8P0m76N54J70n2K88n45M7N64n43K70m79
7448c06Q09j66m59R4K42j57P3l39K13L59J76p82M62m61P82r30O23O94q67L40j120
7469g20R51j62R6n47L82k40l2Q1J52L06q86R15K30l36n83K16P78j329M24l55N
7490f54L01L48N68j188J85k23L26l26R25j01K03L20r02k13M32K33q41Q80l72M27
7510C28p28K72rqP18k19j173J228k81l33k16K24k24P87k22J55o25J61P79p64J03
7531d7O03j124J231m55m82P37k80J47k41L10j46j56M71q97N49o10J19M58j82J60
7551A65n4n48O82m30L18J71m74j35L57L23n10j03K58k38P85J73o14l81j33n3M49
7572Hl33N32j16k36K92K81p39N67m33M44M81o27Q11q61l90P93l49K43l14k22J38
$$ plain form
7427 -433 127 455 -113 -242 -75 -826 596 -242 -174 -104 -580 -26 144 92 380 -165 -118 446 -97 173 -306
7448 -306 503 337 -122 -28 214 57 130 -209 4 363 539 -243 219 -242 540 -390 233 927 60 400 -720
7469 -720 231 69 165 -382 0 -240 -272 -191 -39 267 -619 296 526 190 -393 -177 601 -728 -304 -659 -654
7490 -654 -353 -5 563 -625 -440 -663 -337 -663 262 161 364 684 -218 -431 1 234 -607 273 -99 328
7510 328 -400 -128 -137 -145 573 354 -819 409 128 -205 -421 -197 -421 366 144 299 -326 -165 614 -150 -47
7531 -47 556 -568 663 208 -274 463 183 330 89 399 253 97 568 -329 220 -390 -271 187 5 165
7551 165 111 -437 245 -185 133 304 -170 -305 52 375 -135 -238 20 -218 567 740 126 -255 -388 -441 8
7572 8 -325 207 91 -145 147 428 -311 256 -177 267 748 121 932 71 -319 474 125 368 54 -168 -30
7593c0J67K81n54nL42k33P4k2J76k97M77J27q07K44P6j77m14Q6J79N34k11j04
7615i1P0R9l25L60m0J18l44M62j70j46M7n4k70j54O43J44m56k0l73K3N18l48k57
7638e64k3J224q35J40j68l00K92M08j81K14N21j365N57K54l58J82n53J008k3p59
7658c29J19K3N19o32K00k75Q30l19m27N8j1K08J52K2l36L67k53K71l3l47K31J66
7680B04K16m75P4m03N19l01O62R6o50K82m41K66J21l58J51M98k92Q49p41p89K73
7701b39M86m46N8m20Q97k61j61m87R9L50p2M44j97o4m75N54m4k65m26M27n40Q40
7723E8m92J079o89n21M80K57j23O3l30L32k18N35n44K98K78p0k32m72K22J68k34
7744a55j33J12L04M66n07n3j62N62n17l5j91K53l98Q98m61L83n44M45k58l52L
$$ plain form
7593 -30 137 418 -136 -141 201 -32 42 20 196 -101 376 503 -304 -60 16 -161 -575 -489 -310 224 13 -91
7615 -91 -21 78 -247 113 73 191 -153 309 139 -7 40 -14 -284 -438 205 349 -107 -127 -500 -477 41 -307 -564
7638 -564 -587 637 -198 -58 -226 -526 -234 174 -7 207 728 -637 -80 174 -184 -2 -555 453 430 -329
7658 -329 -210 -187 332 -300 -100 -375 455 136 -291 -233 -244 -36 116 138 -198 169 -84 187 154 -193 38 204
7680 204 420 -55 19 -384 135 -166 496 592 -58 224 -217 49 170 -188 -37 461 169 1018 277 -512 -239
7701 -239 247 -199 -141 -561 336 75 -86 -573 -474 -124 -196 248 51 -13 -488 66 22 -243 -669 -242 -782 58
7723 58 -434 645 -44 -565 -85 172 49 112 -218 114 -104 431 -113 185 463 393 161 -311 -89 79 -155
7744 -155 -288 -176 128 594 87 34 -128 434 -83 -118 -309 -56 -454 444 -17 366 -178 267 9 -343 -340
7765c40J74L20k91K86M20n89o03J265j021j27J069j349Q27l75P37m03j68J05K76
7784B13m19j67J81K34m50O98j69M63j039P28n52q5J033j076P49r03k1K26J82n80
7804g54J135o86K96N18n20l95m06L39L70O02m51k82N12O4J43j92J86j93j11J98
7824C73L3j63j16l19J70N62o35j73J29O32l91j09J54J20l2l35O98p61l60N53L60
7845C90j80j56o24N51j92N95L0j32l92q5K16M55l20q4k13J89k33M55ml47m80R29
7867C68m09p1j33K21m11K98M31l39l93Q49J32q70N52m30N09p64J61N45K94j46
7887C94k62M30j149Q58J02o26M45K01R1m10M49m26k11k52N68P70j237K4J54l0
7907a17K16k66M6p37J193M25n69K99j445P81j46L45Nl2K14R2l74J88m3N64q55
$$ plain form
7765 -340 -166 154 -137 149 569 -20 -623 642 -379 -506 563 -786 41 -334 403 0 -168 -63 213
7784 213 -206 -373 -192 42 -408 290 121 584 -455 273 -279 -364 669 -407 342 -561 -582 -356 -174 -754
7804 -754 381 -305 -9 509 -11 -406 -812 -473 -103 499 48 -234 278 342 485 293 479 286 175 373
7824 373 406 243 127 -192 -22 540 -95 -268 -139 493 102 -7 147 267 235 -100 598 -163 -523 30 390
7845 390 210 54 -570 -19 -211 384 414 282 -110 -195 21 476 156 72 -141 48 -185 270 266 -81 -561 368
7867 368 -41 -112 -245 -24 -435 -137 294 -45 -438 411 543 -327 225 -205 304 -460 -299 246 540 394
7887 394 132 562 -587 271 373 -253 192 393 484 74 523 97 -114 -366 202 972 -265 -241 -87 -117
7907 -117 99 -167 -121 -858 335 760 191 490 -955 -174 -320 25 30 -2 212 304 -70 118 75 639 -216
7928b16M35J44r4j98N3J09p84L53J6J39K5k94K8L46l27M78N1j98k28k80K7P73
7950C58l2l89K09j98J13K15J05l93N9J81m0j7p8L08r25N80J1L75m62R1L06k29
7972A48l14r9O26n90L24j19J96L14j90k1j03l09L03o9r1O01l81k62k8j64q0N87
7994B79n36O28o50Q0N16j51n03N59m24J06N83j181J078n06J91j18k76O79k15m50
8014c11j47O99Jl16N68J5q08N99j88q22N53n80J200K09j50p30k30M38K78j12k75
8035a09M49r20lO50p4L76q28P10r6r1P8n6L92n30J91j45j49J009l3q28k17j80
8057d04l11M70N34m85q1j8K44o6K13o7J04j71N46j71j060L08L88J69n06O72p88
8078d80Q15l45l44M94l21K47K05m97j69N07p4l28O66n17m62O13K67n14J16L09
$$ plain form
7928 -216 219 363 269 71 124 233 -551 -198 -182 -43 -18 -312 -284 62 -265 213 264 66 -162 -442 -415 358
7950 358 326 -63 146 -52 61 276 381 -12 47 228 188 171 93 401 -524 56 67 442 -20 71 377 148
7972 148 -166 -265 361 -229 95 -24 172 486 296 275 172 -137 166 97 6 607 226 -36 -64 -228 -308 279
7994 279 -257 371 -279 -199 317 166 -337 222 -202 -96 487 -694 384 -122 69 -49 -325 354 139 -311
8014 -311 -458 241 242 -74 494 509 -299 300 112 -710 -157 -737 463 672 522 -208 -438 0 278 166 -109
8035 -109 340 -580 -583 67 -7 369 -459 251 155 64 142 86 478 -52 139 -6 -155 854 821 -7 -224 -404
8057 -404 -715 -245 289 -196 -277 -295 -51 -117 96 29 133 -38 508 337 -723 -415 -27 142 -364 308 -480
8078 -480 335 -10 -354 140 -181 66 271 -226 -395 112 38 -290 376 -141 -603 10 277 -237 -121 188
8098A88o50j68J78N26J6N2k11n47O23k0K75n50J45l77O90r1J35M21p13M95L41
8119G58j198M02M73n31L22l07j10M52m05O62r24L5L58o85J640k55r20j03P98n40
8139g8J4O7K49j55j76l3L29N5o70J080m04k22j6p82M83M12k08K86n00J76j4K78
8161A71j86N6P3p80K44O04m69L79O18q55M01m08P5J20JP5p35Q93p87M19L88q96
8183e99J160q7l16Rj84m20O60j22
$$ plain form
8098 188 -462 -630 -452 74 90 142 -69 -616 7 -13 262 -288 -143 -520 170 79 214 635 -78 417 758
8119 758 -440 -38 435 -96 226 -81 -191 261 -144 518 -406 -371 -13 -698 942 687 -233 -336 462 -78
8139 -78 -64 3 252 97 -79 -112 217 272 -398 682 278 56 40 -742 -259 153 -55 231 -269 -93 -107 171
8161 171 -15 41 114 -666 -422 182 -287 92 710 -145 256 -152 -77 43 44 119 -616 277 -510 -91 297 -599
8183 -599 561 474 158 167 -17 -437 223 101
8191A01
$$ Imaginary data points
##PAGE= N=2
##DATA TABLE= (X++(I..I)), XYDATA
0@%%%%%%%%%%%%%%oN4r6R6r6R6j44J92j92K40k88L36l84M32n26N99o70P65q78
33d70R96j109J251j412J581j770J969k191K434k697K989l316L665m039M450m899
49b568N397n947O551p219P961q793R727j0783J1999j3405J5055j7023J9409k2388
63a2027K6222l1355L8614m9724O8961j11341L67744o6658l37037N05218l97673
74I44J06165J52368l49822J44325R4490k51385J91304j33331j8720J66638j85812
85h2836P3775L3061p4453P5507m5672m5819O8290k7601q6064J07191r3224K9016
97f8829M9952j08553J00837K7382p4381Q6139O43m3505J37240j21966K1397R9326
109A05682j37525J16160q3820k3372J08276j15473L4095K7852p9921R3800l2118
$$ plain form
0 0 0 0 0 0 0 0 0 0 0 0 0 0 0 0 -6 48 -48 48 -48 48 -96 96 -96 144 -144 192 -192 240 -286 313 -357 408 -470
33 -470 526 -583 668 -744 837 -933 1036 -1155 1279 -1418 1571 -1745 1920 -2119 2331 -2568
49 -2568 2829 -3118 3433 -3786 4175 -4618 5109 -5674 6325 -7080 7975 -9048 10361 -12027
63 -12027 14195 -17160 21454 -28270 40691 -70650 297094 230436 -106601 398617 944
74 944 107109 259477 -90345 53980 148470 -102915 88389 -44942 -63662 102976 -82836
85 -82836 -9061 24000 -50453 25054 -20618 -66437 1853 -25748 -111812 -4621 -97845 -68829
97 -68829 -18877 -127430 -26593 789 -73592 12547 13190 -30315 106925 -15041 6356 105682
109 105682 -31843 84317 497 -22875 85401 -30072 4023 31875 -48046 45754 13636
120A3636q9205J42560j09301K6106N4150j28512J23686m4217m3853O7427m1291
131b8814m229M8444n8311J8102N0660p9650O8734k3829q606M9905m8756J9416
143C066K6431k0504k919L2323n7844O7413k1010n2521Q9383p6235L6376J9147
155D3106o8162N6037M563n8762O0749l0797l1963R0350j09776N5846K3355q0547
167d6001Q7829n3027j0494N4207n0920n111N1701o8545M0971R884p1887R2188
179C0795n6510j043M1526m7217K8090J3085m1805K6224K0075n6420O7410m7077
191b2867l872N6070p3720M7366l006k9487L7604j1227k8465N6485l8597q215N8271
204C6340p6488O2370j5372l6770N9988m3075O194K6237l3738J1818L3154n8902
$$ plain form
120 13636 -75569 66991 -42310 -16204 37946 -90566 33120 -11097 -54950 12477 -28814
131 -28814 -33043 15401 -42910 -24808 25852 -53798 14936 -8893 -17499 32406 -16350 3066
143 3066 29497 8993 6074 38397 -19447 47966 26956 -25565 63818 -12417 23959 43106
155 43106 -25056 30981 35544 -23218 37531 6734 -25229 65121 -44655 11191 34546 -46001
167 -46001 41828 -11199 -21693 32514 -18406 -23517 28184 -40361 610 10494 -61393 30795
179 30795 -25715 -26758 14768 -32449 -4359 8726 -33079 -6855 13220 -43200 24210 -22867
191 -22867 -26739 29331 -44389 2977 -29 -29516 8088 -3139 -31604 24881 -13716 -21931 36340
204 36340 -40148 22222 6850 -29920 30068 -13007 -6813 19424 -14314 -2496 30658 -28244
216b8244N2179r396l4991O6010o0413K6736J5592l6866K4715L929l0447L1450
228B0254o607l5402O3561n8309K1870K0996n0520M9097k1552j5311K9470j5099
240B448j8937M5472m8536J8966K5685o3675O5409l5806p024L6677m1209J6110
252d420J7177l2684J7583J5032m6984N7296l8319n343M3647n6029L7028o515k1335
265b3866K6079n744k3500L6655k2686q983M2616n7113M4211o957k7226L9890k4081
278a0705J319J9779j8295m070L5628m5604L2689R50l4657N5183m2385J0787J9655
291B0274k6071J3999J0100k8021K5929K835l7088N3584m4582J5447K0218m3945
303a7321L8277j1767j4243K1769j0149j6589L8193l8226R089K5966m8599M7109
$$ plain form
216 -28244 23935 14539 -20452 45558 -14855 11881 27473 -9393 15322 19251 -11196 20254
228 20254 13647 -21755 41806 -16503 5367 26363 -24157 24940 3388 -11923 17547 2448
240 2448 -16489 28983 -19553 -587 25098 -38577 26832 -8974 -15998 20679 -20530 -4420
252 -4420 12757 -19927 -2344 12688 -34296 23000 -15319 -20662 22985 -33044 3984 -2531 -23866
265 -23866 2213 -3531 -27031 9624 -13062 -22045 20571 -36542 7669 712 -26514 13376 -10705
278 -10705 -9386 10393 -7902 -11972 23656 -21948 10741 11691 -22966 32217 -10168 619 20274
291 20274 -5797 8202 18302 -9719 16210 19045 -18043 35541 -9041 6406 26624 -17321
303 -17321 20956 9189 -5054 16715 6566 -10023 28170 -10056 -967 24999 -23600 23509
315B3509k6734p654K9515k6961M575J3346k0268P396J8791m3909M3253k0042j3355
328a8538L5286m0509K3845K522k0327J3759N914k3642K7739j3727j6173M3184
340A9333m7267K8775J219k4767L2656j8343n668J9813j1733q757L0946l8823K7058
353D442L941l2290M3132k9943Q885J3493k0119Q986J3364k2856J5079P048l0149
366a6987M3088l2501O216K0306k9736K3793n965j0615J3873J478k2439L1335k3106
379a260k35K6570m2582L5531j1769j2616K2574j6794j635J6855j9036J80K3377
392A9160l8706L4713j5366j4480L3253l3899J5249L811j5355J0937N101k2703
404a8285K3093p205j6686L3603l6562K1732J509j9580K0277q760m606J0681l892
$$ plain form
315 23509 -3225 -10879 18636 -8325 -3750 9596 -10672 -3276 15515 -28394 14859 -5183 -18538
328 -18538 16748 -23761 84 2606 -17721 -3962 1952 -21690 6049 -7678 -23851 19333
340 19333 -27934 841 2060 -22707 9949 -8394 -14062 5751 -5982 -14739 16207 -22616 4442
353 4442 8383 -23907 19225 -10718 -1833 11660 -8459 527 13891 -8965 6114 13162 -16987
366 -16987 26101 -6400 -184 20122 -9614 14179 8214 -2401 11472 12950 -9489 21846 -1260
379 -1260 -1495 25075 -17507 18024 6255 -6361 16213 -581 -2216 14639 -4397 -4217 19160
392 19160 -19546 15167 -199 -14679 18574 -15325 -76 3735 -11620 -683 4418 -18285
404 -18285 4808 -2397 -19083 14520 -22042 -310 1199 -18381 1896 -6864 -11470 -789 -4681
417d681j3433K9245k8047J2564J0845k7838L2197j9782O59J3602j1140o98J5691
430I184j9688J0420J2700l2347L8106k3565J603K0040k7790J9933p57j1221J0394
443G012L085j8571K7597j9617j362K3776l3590K8196j1391p647J6726j1024k312
456H78J1476j0473l955K0838l1066K4762o928j4429K4517k2818R026M062r579
469c689O12J2246k0475J5265j846j9174L2036k8828J2086N058j7386J5844n359
482c610p066J0433j774j4027K5105k4687J1274Q677k4467K7165j6633J695R904
495A989r388l18J1848j4272N132J2934k6056K9524j7446m22J6789j9219J1687
508B782J342p718O058O879k0374K4485j2230o013K3128k9559K2808n176q792J3019
$$ plain form
417 -4681 -18114 11131 -16916 -4352 6493 -21345 10852 -8930 -8271 5331 -5809 -6507 9184
430 9184 -10504 -84 12616 -19731 18375 -5190 -3587 16453 -11337 8596 7839 -3382 7012
443 7012 10097 -8474 19123 -494 -1856 21920 -11670 16526 5135 -2512 14214 3190 878
456 878 12354 1881 -2074 18764 -12302 12460 5532 -8897 15620 -7198 1828 5890 -3689
469 -3689 -3077 9169 -11306 3959 2113 -17061 14975 -13853 -1767 3291 -14095 1749 -3610
482 -3610 -10676 -243 -2017 -16044 9061 -15626 -4352 4325 -20142 7023 -9610 -7915 1989
495 1989 -7399 -7717 4131 -10141 -5009 7925 -18131 11393 -6053 -6475 10314 -8905 2782
508 2782 4124 -3594 2464 9343 -11031 13454 1224 -4789 18339 -11220 11588 6412 -2380 10639
522A0639o851l475J1528q231n385J9805k6728K1342n600j2818K1247j8340P902
535E035J632o306l47R119j4572J0352J275j7255K5148k1902Q394M672j3418R441
549A268n51p766N107L878j6994K5097k1245M676J3000k4582K3018j1040l126J0571
563A311p664l447J4005j4758L850J3392k5049K6597j6493N35J4329j7984J2524
576A148j135m715L394O811j5328J6701p901m608J7662k0944J6665m809l770O130
590E301j093m875P683q57j0394K0212k1446J2054L212j5399J8536j1505R27O062
604H418m894m635J4174j7875J0662M155j9787K5477k1315P165N802j3819R977
617C505p02o729N582J085j2788J9330j6837M627P729j7180J7499j0673J583K363
$$ plain form
522 10639 3788 313 11841 3610 -1775 18030 -8698 12644 7044 -5774 15473 -2867 5035
535 5035 6667 361 14 9133 -5439 4913 6188 -11067 14081 -7821 573 5245 -8173 1268
549 1268 717 -7049 -1942 1936 -15058 10039 -11206 -6530 6470 -18112 4906 -6134 -9260 1311
563 1311 -6353 -9800 4205 -10553 -6703 6689 -18360 8237 -8256 -7721 6608 -11376 1148
576 1148 13 -4702 -1308 5503 -9825 6876 -1025 -5633 12029 -8915 7750 2941 -829 5301
590 5301 4208 -667 7016 6159 -4235 15977 -5469 6585 9797 -5602 12934 1429 2356 8418
604 8418 3524 -1111 13063 -4812 5850 10005 -9782 15695 -5620 1545 7347 -6472 3505
617 3505 2803 -3926 1656 2741 -10047 9283 -7554 -2927 4802 -12378 5121 -5552 -3969 -1606
631a606o67n261Q565p150k053J3130j9284J6751p591l475J0014q605L837K436
645i59k995l561J2805j6677J5091l897j0375K0776k0599J2678k66p148Q140o74
659B339o206R256k924p406J8353k0376J3308M5j0712J5264j1595M418J172q30
673D106m054R650j0850N384M787j3905J7734j4326M806L213o219K914J357m789
687a92P58P865j6799J7417j2014Q83J0603j7388J3123n562k054L561K4p357J0434
702C302p543k917J2634j9023J7479q852k555R988j0233M371J369k516k272Q249
716A481j2740J1767l349o035J4055j4831R955k081k919L269K227n175M341K317
730B282r974J6724j5420Q727L052j0063J1447o264j24K825P35n955J1360j1147
$$ plain form
631 -1606 -2273 -7534 1031 -6119 -8172 4958 -14326 2425 -5166 -8641 1373 -7232 -3395 -959
645 -959 -3954 -7515 5290 -11387 3704 -193 -10568 10208 -10391 2287 2021 -5127 3013 2339
659 2339 -3867 5389 2465 -4941 13412 -6964 6344 6389 -4323 10941 -654 3764 4936 4106
673 4106 52 9702 -1148 4236 9023 -4882 12852 -1474 3332 6545 326 3240 4597 -192
687 -192 566 8431 -8368 9049 -2965 -2082 8521 -8867 4256 -1306 -3360 201 225 -7132 3302
702 3302 -4241 -7158 5476 -13547 3932 -4920 -7475 2513 -7720 -3349 -1980 -4496 -6768 1481
716 1481 -11259 508 -2841 -8876 5179 -9652 303 -1778 -4697 -1428 799 -4376 -35 2282
730 2282 -7692 9032 -6388 2339 5391 -4672 6775 511 387 3212 3947 -2008 9352 -1795
744a795M808O673j6202J9186j3442L603M704o888K978J971l680R17N399j3373
758e141J5142j0594Q88Q070j3553J1794o786L99R28J663o039O774m836m508J2868
773G069j6287J2620n703k863O485o034J524P55J7n482J0666j2912R990j641q829
788a0625J4783j3103P613l39k950R61L084n233M312K226j0281J6429j5096P893
802c26K073q173J0864o604J753J179J559n450R382p304J837O359j2203J3523q483
817a4K313K510k963J046K078k065j686P798j2942J3423p860j428Q732j0968Q166
832F140l727q96J008K669p624P295k797n507J1425j4966J1850n140l359O848n569
847b350J427j62m82m025R409j1644P355J51p681J1453j0897N859r72j022l94K849
$$ plain form
744 -1795 3013 9686 -6516 12670 -772 2831 7535 647 3625 5596 1916 2833 8232 -5141
758 -5141 10001 -593 295 8365 -5188 6606 -180 219 1147 2810 -3229 3545 -1291 -5799 7069
773 7069 -9218 3402 -2301 -5164 1321 -4713 -3189 -2434 -2417 -7899 2767 -10145 -155 -1796 -10625
788 -10625 4158 -8945 -1332 -1671 -4621 -3660 -576 -5809 -1497 729 -9552 6877 -8219 -326
802 -326 1747 -6426 4438 -2166 -413 766 2325 -3125 6257 -1047 790 7149 -5054 8469 -14
817 -14 2299 4809 1846 2892 4970 2905 1219 9017 -3925 9498 1638 210 8942 -2026 6140
832 6140 2413 1517 2525 5194 -2430 4865 2068 -3439 7986 -6980 4870 -270 -3629 3219 -2350
847 -2350 -923 -1085 -1567 -5592 3817 -7827 -472 -321 -8002 3451 -7446 -1587 -2559 -3581 -3975 -1126
863a126l779J990M146j0699J3540j1377N141K743o909O967l729L42N12L776p456
878e918J0255p474K085O241j1856J3268q468K305L102l465J393K371k771r16O756
893F908j0910J2675p670o82P548j0348Q137k927J37k54K204n401M979j029n434
908b067J0629j2577R085l401k280L365k596K53Q16P79o393R690j0714O168P50
923A507q256J1741j0332M048p9j004q76L517n390K830L438j0859J3129j0890N019
938b457K168o823P855m162O45m96K654n017P614o045J379N321r716J0997o904
953b987K625J346j459K10J256K23l661Q581j0822R210k900l022P433p873N749
968C909j314q8j434M730o871N727m58o312J1121j1968Q928k860l087M426l554
$$ plain form
863 -1126 -4905 -2915 1231 -9468 4072 -7305 -2164 579 -6330 637 -3092 -2750 -2238 1538 -5918
878 -5918 4337 -3137 -1052 5189 -6667 6601 -1867 438 3540 75 1468 3839 1068 152 6908
893 6908 -4002 8673 1003 321 7869 -2479 5658 2731 2868 2614 4818 -583 4396 3367 -2067
908 -2067 8562 -4015 5070 1669 -611 2754 158 411 1227 2006 -4387 5303 -5411 757 1507
923 1507 -6749 4992 -5340 -1292 -1371 -2375 -3251 266 -5124 -2294 1144 -9715 3414 -7476 -2457
938 -2457 -289 -7112 743 -3419 -2774 -3270 -616 -5633 1981 -4064 -2685 2636 -7080 3917 -2987
953 -2987 -362 984 -475 -265 991 1214 -2447 6134 -4688 4522 1622 -1400 6033 -1840 3909
968 3909 2595 2507 1073 5803 -1068 4659 4201 -2111 9010 -2958 5970 3110 23 4449 895
983H95J170k52J165n250Q958j0152N869K24o967Q870q212N173k252l03r26K253
999B63l011Q20L675q651J0287q111K579J732m827M307k187J39n77M377p565Q435
1015A685n187j148P273j0065R172m762L22K928j509j439L151j105k029P679j1598
1030f632J0414l922j695O607p472N660k074J241j904M874o011M064P67n445R458
1045G930r855N947j578j656K366j246l2r9L203p267R207p905K594L469p996Q947
1061F029o650K754l74l38k431L940m289Q55L961r269J0585r278L733J433m581
1076c920M048k391Q37j485L007n446O258m042r23N725q718Q518n079J293N2j28
1092b394k89J564k00m065Q143q495P487k824k469O168n471L736j222J213k781
$$ plain form
983 895 2065 1813 2978 -2272 6686 -3466 2403 2627 -4340 4530 -3682 1491 -761 -1064 -1990 263
999 263 -2748 -1928 1747 -6904 3383 -4728 -2149 -417 -5244 -937 -3124 -2985 -3562 815 -6750 1685
1015 1685 -3502 -4650 2623 -7442 1730 -3032 -2710 218 -1291 -2730 421 -684 -2713 4966 -6632
1030 -6632 3782 -140 -1835 4772 -2700 2960 886 2127 223 5097 -914 3150 3917 -1528 7930
1045 7930 -1925 4022 2444 788 3154 1908 1876 1777 4980 -2287 6920 -985 1609 5078 -2918 6029
1061 6029 -621 2133 1759 1421 -1010 2930 -1359 -504 3457 -5812 4773 -4505 -772 661 -3920
1076 -3920 128 -2263 -1426 -2911 96 -5350 908 -3134 -4057 1668 -7050 1468 -3611 -2318 -2266 -2394
1092 -2394 -2683 -1119 -1319 -5384 2759 -5736 1751 -1073 -3542 2626 -2845 891 -331 882 -1899
1107a899N243n485M007L40n146R816r364N948j477j965L211j365L9K94K193n856
1123a466Q481p739L311J807o264P815o278L147j998J897k282L156k811j016M452
1138D212p941P973o461K191J793m277L315j114M95k746M781p162O235k551k386
1153c643O191r074P838m835P29J051l77j382K225l26k876O218q149P006k698j703
1169c805M716n536N018l299K839k833M133l461J357K012m657P165o366M493j140
1184F36p34J192l4M14q93L543o001P751o212K195K524o256O347l801J474p9J160
1201C226l435L988k765m46M561p938Q871o763J809J324l443K391j606Q35j621
1216a012L613n391M989l733n32M827p156O460l785O82l06Q35j423K3J385m122
$$ plain form
1107 -1899 3344 -2141 1866 2206 -2940 6876 -2488 3460 1983 18 3229 1864 1903 2197 4390 -1466
1123 -1466 7015 -724 2587 4394 -1870 5945 -333 2814 816 2713 431 3587 776 -240 4212
1138 4212 -3729 4244 -2217 -26 1767 -2510 805 -309 186 -2560 2221 -4941 1294 -1257 -3643
1153 -3643 2548 -6526 1312 -3523 -2794 -1743 -2120 -3502 -1277 -1603 -4479 1739 -6410 596 -2102 -3805
1169 -3805 911 -4625 393 -2906 -67 -2900 1233 -2228 -871 1141 -3516 3649 -2717 1776 636
1184 636 -98 1094 1060 1474 581 4124 -1877 5874 -338 1857 4381 -1875 4472 671 2145 2066 3226
1201 3226 -209 3779 1014 568 5129 -2809 6062 -701 1108 2432 -1011 1380 -226 609 -1012
1216 -1012 2601 -2790 2199 -1534 -2066 2761 -4395 2065 -1720 -1038 -1344 -509 -1932 -1909 -524 -4646
1232d646O400p359N131o89k424L502k769J734j676J528j960M814n739L279J492
1247F18n712P961o857L914k10o13J230j83m87L08K804m996O348o015L028J095
1263B233m159N846m588K932r65Q89j681K629j099j576M319o718O954m108O74J011
1279B593k506K371j554J200k962M590n697N280k406k242N516p221M747j904N69
1294C74m14k75j650K251L06m563O735o878M425k294j466M172m399L028k054J702
1310a000k184L657m258J756K145n138O358n080L466j335q6O81K51j09j256L830
1326A698n607O428l968J165K719m269L280j463O59q97L413m322L870j287j742
1341c23M950o494O278m224J341R97k545K536j235K61n34K605m805M773k530n51
$$ plain form
1232 -4646 1754 -5605 -474 -1163 -3587 -85 -2854 -1120 -2796 -1268 -3228 1586 -4153 -874 618
1247 618 -5094 2867 -3990 -76 -286 -899 331 148 -339 -31 2773 -2223 4125 -1890 1138 2233
1263 2233 -1926 3920 -668 2264 1299 2188 507 3136 2037 461 4780 -1938 5016 908 1582 2593
1279 2593 87 2458 904 2104 -858 3732 -1965 3315 909 -1333 4183 -3038 1709 -195 374
1294 374 -40 -315 -1965 286 592 -3971 2764 -4114 311 -1983 -3449 723 -3676 -648 -2702 -1000
1310 -1000 -3184 473 -3785 -2029 116 -5022 1336 -3744 -278 -1613 -1699 -1018 -767 -876 -2132 1698
1326 1698 -3909 2519 -1449 -284 2435 -1834 1446 -17 642 -255 3158 -1164 2706 1419 -323
1341 -323 4627 -1867 4411 187 1528 2525 -20 2516 1281 1542 1008 3613 -1192 3581 1051 500
1357E00L694o044N153l126R10j29M43j324K00Q81m906O690o066L639r25r47K143
1374G86j852L3p09J230l523N302m791J561K493m620N008m723K199P47j303M37
1390a725O12q30k27K884n489O496m212J005K468m573M984k704J754j502J925j644
1406g78J556j246l63M192n029M529l117R38J057q74Q59m62Q37k495M368m644L178
1423B506k76k689M511m388K967j457k66o5J790k743J209J294m788O543n996L684
1439A836q84k264L123l065J413p60J173l230L793l278J549P17l224M608m959K920
1455e32j024K51m58N38L66k014L853m939M628l297J052J889l928L926k199J696
1471a92j166J844k834L446j649j250M481n445M880l041O50J782j619M75K37J118
$$ plain form
1357 500 4194 -1850 3303 177 1087 958 1401 77 277 1158 -3748 2942 -3124 515 -410 -1357 786
1374 786 -1066 -1033 -1742 -512 -4035 1267 -3524 -1963 530 -4090 918 -3805 -1606 -859 -2162 -1725
1390 -1725 -1113 -1943 -2170 714 -4775 1721 -2491 -1486 982 -3591 1393 -1311 443 -1059 866 -778
1406 -778 778 -468 -831 3361 -1668 2861 -256 682 1739 865 1724 1262 2099 -396 3972 -672 2506
1423 2506 2230 -459 4052 -336 2631 1174 908 843 2633 -110 1099 2393 -2395 4148 -1848 1836
1439 1836 952 -1312 1811 -1254 159 -601 572 -2658 1135 -2143 -594 123 -3101 1507 -3452 -532
1455 -532 -1556 -1305 -1763 -1225 -859 -2873 980 -3959 669 -2628 -1576 313 -3615 311 -1888 -192
1471 -192 -1358 486 -2348 1098 -551 -1801 2680 -2765 2115 -926 -276 1506 -113 362 599 1717
1487A717k561M223l968K879r65j207L221l303K437j431N59r38J952j958O44J072
1503B373l710N056n146L496q16j497K109j777P25o45J786l675M358l374M4K381
1519A688m249M679m742J981M11p47r3K31m08j308L579n529N816l492P12J945l770
1536c296L631k555J459j669J744k242K569n08k128L807m303M463k166L7Q93q84
1552a148J324p73J546l026M372l671L191m54k048L609l569K362n25k3l56O88j241
1569B58J258J449m051N596n348K614k22j420K541j551R24j310J631k493J933k194
1585c85Q19K376l843K807k706J117M21m60j073J108l19k199M024n377L758k048
1601a980M14K033k794J700j776J200j225K078k524K358k96k116M160n409L787
$$ plain form
1487 1717 -844 3379 -589 2290 1325 118 3339 36 2473 1042 1601 663 2615 657 1301 2373
1503 2373 -1337 3719 -1427 2069 1253 -244 1865 88 813 168 1954 -1721 2637 -737 -693 1688
1519 1688 -2561 2118 -2624 -643 -232 -979 -1072 -841 -1249 -2557 1022 -4507 1309 -2183 -1471 474 -3296
1536 -3296 335 -2220 -761 -2430 -686 -2928 -359 -867 -2995 812 -3491 972 -1194 -1157 -264 -1148
1552 -1148 176 -597 949 -2077 2295 -1376 1815 1361 -687 2922 -647 1715 1190 1167 811 1499 258
1569 258 1516 2965 -1086 4510 -838 1776 1554 134 2675 1124 2048 738 2369 -124 1809 -385
1585 -385 434 2810 -1033 1774 -932 185 606 146 -927 181 -138 -2337 1687 -3690 68 -1980
1601 -1980 -1566 467 -2327 -627 -2403 -1203 -2428 -350 -2874 -516 -812 -2928 1232 -4177 -390
1616c90j657R67M05j067Q76JJ129l146L848l066K637q60j598M354l857L011j810
1633b23J751j427O04j237R43J916m131N115l518J752K12r49J524j350R09j419
1649D72K068k888K950k213Q75J725m015M108l361J918j307L38n50Q22m09j147
1665f14K359l111L488l021j44J834k408J755j486J328k088K119k229J587%k455
1681c086L832l733K925k034R0Q38m88R1M49J050l182M638m426K596K43k026L731
1698A508l364K183j107R04j746K552j343O79J502l660M473l062J464L64j460J589
1714A476j449J459j039J881k731K691j480Q2J687l232L785k504J125r75M56o50
1730E82O86M67k058L069l531K669j696p74J787k250J523n21L26j152J901k767
$$ plain form
1616 -390 -2047 -1080 -675 -1742 -866 -865 264 -2882 966 -2100 537 -323 -1921 2433 -1424 1587 -223
1633 -223 1528 101 705 -532 411 2327 -1804 3311 -207 1545 1757 808 2332 982 1891 472
1649 472 2540 -348 2602 389 1264 2989 -1026 3082 -279 1639 332 670 120 942 533 -614
1665 -614 1745 -1366 2122 -899 -1043 791 -1617 138 -1348 -20 -2108 11 -2218 -631 -631 -3086
1681 -3086 746 -2987 -62 -2096 -2006 -1168 -1656 -1565 -1116 -66 -3248 1390 -3036 -440 -197 -2223 1508
1698 1508 -1856 327 -780 124 -1622 930 -413 266 1768 -1892 2581 -481 983 1347 -113 1476
1714 1476 27 1486 447 2328 -403 2288 808 890 2577 -655 3130 626 1751 776 1232 582
1730 582 1268 1735 -323 2746 -785 1884 188 -586 1201 -1049 474 -47 279 -873 1028 -1739
1746a739J792L14k666L334l966L621j421r13L09j29l20K43J436k900M049l927
1762b883J910j6j452K962k781J894j570J589j649J958o25nJ267l438L882k793
1778a750K711r10p82J472n57J147j689K427k923K866j421j043L080l765M064k296
1794F31J216j426J196n49N32j08j734L520m390L473j941L68J094k038J310j455
1810c01J920k257K666k738R89O86k289L043l387K122r97k81N7Q7L11j341K300
1827E90l058L495l374J693j85j538L339l349K349j712J183j504J853p22p23J940
1843B77l290L764k863J469K07q01J234l47O34j167K834l160K497o73r78K688k935
1860f10K677k246J149MJ017j783M75Q09k221L304l364L274k366Q02J162j060J124
$$ plain form
1746 -1739 53 367 -2299 1035 -2931 690 -731 -1644 -1335 -1464 -1784 -1541 -105 -3005 1044 -2883
1762 -2883 -973 -989 -2441 521 -2260 -366 -1936 -347 -1996 -38 -663 -668 599 -2839 1043 -1750
1778 -1750 961 51 -731 741 184 1331 -358 2069 -854 2012 591 -452 2628 -1137 2927 631
1794 631 1847 421 1617 1068 1600 1492 -242 3278 -1112 2361 420 788 1882 -156 1154 -301
1810 -301 1619 -638 2028 -710 279 965 -1324 1719 -1668 454 -543 -824 -767 -680 -369 -1710 590
1827 590 -2468 1027 -2347 -654 -839 -2377 962 -2387 -38 -1750 -567 -2071 -218 -940 -1663 277
1843 277 -3013 751 -2112 -643 -436 -1237 -3 -350 284 -883 1951 -1209 1288 615 -363 2325 -610
1860 -610 2067 -179 970 974 1991 208 683 1492 -729 2575 -789 2485 119 921 2083 1023 2147
1877B147k688K136j936K164k458J646O2j794L176l199J863j132J143r56J54k77
1893E1j366K027k660K761k698J733n21j541K641k004J457k030J220j216J371r22
1909a697l16K055k879L478l183K581r48l39L59m7Q73j752L163l383K186m84m59
1926g92J425k103K709j372M32k55J004p38J61R05j936L157l080K638j475kJ122
1943A800j825J808j426O35p27J965k162J203L5j453K286k581K892j832k10L52
1959G60l77L19j128K060k834L217l210J773J50k016K004k559J908j641K232j820
1975a162J545j365n59K183l253L912l217O30P86j377J406j180J377j690K429l072
1991b607K652j181n52K532k545K466k254J386n77O72l59O57m2j119L282l752K673
$$ plain form
1877 2147 -541 1595 -341 1823 -635 1011 1073 -721 2455 -744 1119 -13 1130 174 328 51
1893 51 -1315 712 -1948 813 -1885 -152 -673 -2214 427 -1577 -120 -2150 -930 -2146 -775 -1697
1909 -1697 -2013 42 -2837 641 -2542 39 -909 -1248 -889 -936 -63 -1815 1348 -2035 151 -333 -792
1926 -792 633 -1470 1239 -133 299 44 1048 310 471 1376 -560 2597 -483 2155 680 678 1800
1943 1800 -25 1783 357 992 265 2230 68 1271 1306 -147 2139 -442 2450 618 408 760
1959 760 383 702 -426 1634 -1200 2017 -1193 580 730 -1286 718 -1841 67 -1574 658 -1162
1975 -1162 383 -982 -1541 642 -2611 1301 -1916 -1286 -500 -1877 -471 -1651 -274 -1964 465 -2607
1991 -2607 45 -1136 -1688 844 -1701 765 -1489 -103 -680 -8 -367 290 248 -871 2411 -1341 1332
2008A332o19q55J407o95Q58j845K396k560K522j755N46J064k325L122k392J604
2024A805j235O74o90Q16L0j009J735l027L068k362P84m42j360K296j227P80j225
$$ plain form
2008 1332 713 -142 1265 570 1428 -417 1979 -581 1941 186 732 1796 -529 2593 201 1805
2024 1805 570 1244 554 1370 1400 391 2126 -901 2167 -195 589 147 -1213 1083 -144 636 -589
$$ [...]
8191A97
##END NTUPLES=NMR FID
##END=
