##TITLE=1H_SAM_30.235
 DMSO-d6, 108 sc, 
 24.11.2020
##JCAMPDX= 6.0         $$ Bruker NMR JCAMP-DX V2.0
##DATA TYPE= NMR FID
##DATA CLASS= NTUPLES
##ORIGIN= UXNMR, Bruker Analytische Messtechnik GmbH
##OWNER= root
$$ XWIN-NMR		Version 3.5
$$ Tue Nov 24 12:30:28 2020 Russian Standard Time (UT+4h)  she@DPX200
##.OBSERVE FREQUENCY= 200.1315066352
##.OBSERVE NUCLEUS= ^1H
##.DELAY= (6, 6)
##.ACQUISITION MODE= SIMULTANEOUS
##.ACQUISITION SCHEME= undefined
##.AVERAGES= 108
##.DIGITISER RES= 18
##SPECTROMETER/DATA SYSTEM= spect
##.PULSE SEQUENCE= zg30
##.SOLVENT NAME= DMSO
##.SHIFT REFERENCE= (INTERNAL, DMSO, 0, 15.7039)
##AUDIT TRAIL= $$ (NUMBER, WHEN, WHO, WHERE, WHAT)
$$ ##TITLE= Audit trail, XWIN-NMR		Version 3.5
$$ ##JCAMPDX= 5.01
$$ ##ORIGIN= Bruker BioSpin GmbH
$$ ##OWNER= she
$$ F:/spectra/data/she/nmr/H-F/1/audita.txt
$$ ##AUDIT TRAIL=  $$ (NUMBER, WHEN, WHO, WHERE, WHAT)
(   1,<2020-11-24 12:20:35.76 +0400>,<she>,<DPX200>,
      <continue with go, POWCHK disabled, PULCHK disabled
       configuration hash MD5:
       00 E9 B6 7A A2 85 ED C7 34 08 36 98 17 FE 4E 26
       data hash MD5: 16K
       F6 65 B7 21 44 2C 0E A6 B3 53 6B FD 51 1D D8 8C>)
$$ ##END=
$$ 
$$ hash MD5
$$ 95 4B A2 01 55 B9 B9 CA DC 55 8B 30 A7 37 16 93
##$RELAX= 
##$RELAX= 
##$RELAX= 
##$RELAX= 
##$RELAX= 
##$RELAX= 
$$ Bruker specific parameters
$$ --------------------------
##$DU= <F:/spectra>
##$EXPNO= 1
##$NAME= <H-F>
##$PROCNO= 1
##$TYPE= <nmr>
##$USER= <she>
##$AMP= (0..31)
100 100 100 100 100 100 100 100 100 100 100 100 100 100 100 100 100 100 
100 100 100 100 100 100 100 100 100 100 100 100 100 100 
##$AQSEQ= 0
##$AQ_mod= 1
##$AUNM= <au_zg>
##$AUTOPOS= <>
##$BF1= 200.13
##$BF2= 200.13
##$BF3= 200.13
##$BF4= 200.13
##$BF5= 200.13
##$BF6= 200.13
##$BF7= 200.13
##$BF8= 200.13
##$BYTORDA= 1
##$CFDGTYP= 0
##$CFRGTYP= 5
##$CHEMSTR= <none>
##$CNST= (0..31)
1 1 145 1 1 1 1 1 1 1 1 1 1 1 1 1 1 1 1 1 1 1 1 1 1 1 1 1 1 1 1 1 
##$CPDPRG= <>
##$CPDPRG1= <>
##$CPDPRG2= <>
##$CPDPRG3= <>
##$CPDPRG4= <mlev>
##$CPDPRG5= <mlev>
##$CPDPRG6= <mlev>
##$CPDPRG7= <mlev>
##$CPDPRG8= <mlev>
##$CPDPRGB= <>
##$CPDPRGT= <>
##$D= (0..31)
0 1.2 0 0 0 0 0 0 0 0.06 0 0.03 0 0 0 0 0.0002 0 0 0 0 0 0 0 0 0 0 0 0 
0 0 0 
##$DATE= 1606205618
##$DBL= (0..7)
120 120 120 120 120 120 120 120 
##$DBP= (0..7)
150 150 150 150 150 150 150 150 
##$DBP07= 0
##$DBPNAM0= <>
##$DBPNAM1= <>
##$DBPNAM2= <>
##$DBPNAM3= <>
##$DBPNAM4= <>
##$DBPNAM5= <>
##$DBPNAM6= <>
##$DBPNAM7= <>
##$DBPOAL= (0..7)
0.5 0.5 0.5 0.5 0.5 0.5 0.5 0.5 
##$DBPOFFS= (0..7)
0 0 0 0 0 0 0 0 
##$DE= 6
##$DECBNUC= <off>
##$DECIM= 32
##$DECNUC= <off>
##$DECSTAT= 4
##$DIGMOD= 1
##$DIGTYP= 9
##$DL= (0..7)
0 120 120 120 120 120 120 120 
##$DP= (0..7)
150 150 150 150 150 150 150 150 
##$DP07= 0
##$DPNAME0= <>
##$DPNAME1= <>
##$DPNAME2= <>
##$DPNAME3= <>
##$DPNAME4= <>
##$DPNAME5= <>
##$DPNAME6= <>
##$DPNAME7= <>
##$DPOAL= (0..7)
0.5 0.5 0.5 0.5 0.5 0.5 0.5 0.5 
##$DPOFFS= (0..7)
0 0 0 0 0 0 0 0 
##$DQDMODE= 0
##$DR= 18
##$DS= 0
$$ [...]
##$SUBNAM2= <"">
##$SUBNAM3= <"">
##$SUBNAM4= <"">
##$SUBNAM5= <"">
##$SUBNAM6= <"">
##$SUBNAM7= <"">
##$SUBNAM8= <"">
##$SUBNAM9= <"">
##$SW= 16.9725356469052
##$SWIBOX= (0..15)
0 0 2 0 0 0 0 0 0 0 0 0 0 0 0 0 
##$SW_h= 3396.73913043478
##$TD= 16384
##$TD0= 1
##$TE= 0
##$TE2= 300
##$TE3= 300
##$TEG= 300
##$TL= (0..7)
0 120 120 120 120 120 120 120 
##$TP= (0..7)
150 150 150 150 150 150 150 150 
##$TP07= 0
##$TPNAME0= <>
##$TPNAME1= <>
##$TPNAME2= <>
##$TPNAME3= <>
##$TPNAME4= <>
##$TPNAME5= <>
##$TPNAME6= <>
##$TPNAME7= <>
##$TPOAL= (0..7)
0.5 0.5 0.5 0.5 0.5 0.5 0.5 0.5 
##$TPOFFS= (0..7)
0 0 0 0 0 0 0 0 
##$TUNHIN= 0
##$TUNHOUT= 0
##$TUNXOUT= 0
##$USERA1= <user>
##$USERA2= <user>
##$USERA3= <user>
##$USERA4= <user>
##$USERA5= <user>
##$V9= 5
##$VALIST= <valist>
##$VCLIST= <CCCCCCCCCCCCCCC>
##$VD= 0
##$VDLIST= <DDDDDDDDDDDDDDD>
##$VPLIST= <PPPPPPPPPPPPPPP>
##$VTLIST= <TTTTTTTTTTTTTTT>
##$WBST= 1024
##$WBSW= 4
##$XGAIN= (0..3)
0 0 0 0 
##$XL= 0
##$YL= 0
##$YMAX_a= 1275496
##$YMIN_a= -1360472
##$ZGOPTNS= <>
##$ZL1= 120
##$ZL2= 120
##$ZL3= 120
##$ZL4= 120
##$ABSF1= 10
##$ABSF2= 0
##$ABSG= 5
##$ABSL= 3
##$ALPHA= 0
##$AQORDER= 0
##$ASSFAC= 0
##$ASSFACI= 0
##$ASSFACX= 0
##$ASSWID= 0
##$AUNMP= <proc_1d>
##$AZFE= 0.1
##$AZFW= 0.1
##$BCFW= 1
##$BC_mod= 2
##$BYTORDP= 1
##$COROFFS= 0
##$CY= 11.3945322036743
##$DATMOD= 1
##$DC= 2
##$DFILT= <>
##$DTYPP= 0
##$F1P= 15.9154993809931
##$F2P= -4.1035820241983
##$FCOR= 0.5
##$FTSIZE= 0
##$FT_mod= 4
##$GAMMA= 1
##$GB= 0.15
##$INTBC= 1
##$INTSCL= 1
##$ISEN= 128
##$LB= 0.24
##$LEV0= 0
##$LPBIN= 0
##$MAXI= 10000
##$MC2= 0
##$MEAN= 0
##$ME_mod= 0
##$MI= 1.114404
##$NCOEF= 0
##$NC_proc= 0
##$NLEV= 6
##$NOISF1= 3.799351
##$NOISF2= 2.8
##$NSP= 1
##$NTH_PI= 0
##$NZP= 0
##$OFFSET= 15.70392
##$PC= 1
##$PHC0= -11048.47
##$PHC1= 5.80089
##$PH_mod= 1
##$PKNL= yes
##$PPARMOD= 0
##$PSCAL= 0
##$PSIGN= 0
##$REVERSE= no
##$SF= 200.130013532006
##$SI= 16384
##$SIGF1= 3
##$SIGF2= 2
##$SINO= 400
##$SIOLD= 16384
##$SREGLST= <1H.CDCl3>
##$SSB= 0
##$STSI= 0
##$STSR= 0
##$SW_p= 3612.71676300578
##$SYMM= 0
##$S_DEV= 0
##$TDeff= 0
##$TDoff= 0
##$TI= <>
##$TILT= no
##$TM1= 0
##$TM2= 0
##$TOPLEV= 0
##$USERP1= <user>
##$USERP2= <user>
##$USERP3= <user>
##$USERP4= <user>
##$USERP5= <user>
##$WDW= 1
##$XDIM= 8192
##$YMAX_p= 0
##$YMIN_p= 0
$$ End of Bruker specific parameters
$$ ---------------------------------
##NTUPLES= NMR FID
##VAR_NAME=  TIME,          FID/REAL,        FID/IMAG
##SYMBOL=    X,             R,               I
##VAR_TYPE=  INDEPENDENT,   DEPENDENT,       DEPENDENT
##VAR_FORM=  AFFN,          ASDF,            ASDF
##VAR_DIM=   8192,          8192,            8192
##UNITS=     SECONDS,       ARBITRARY UNITS, ARBITRARY UNITS
##FACTOR=    0.0002944,     1,               1
##FIRST=     0,             0,               0
##LAST=      2.4114304,     0,               0
##MIN=       0,             -1360472,        0
##MAX=       2.4114304,     1275496,         0
$$ Real data points
##PAGE= N=1
##DATA TABLE= (X++(R..R)), XYDATA
0@%%%%%%%%%%%%%%%%%k4J32k16K16k16K16l24M32m32N07o15O63p71R25j038J193
33F48j391J572j764J989k239K489k776L105l456L854m281M738n241N795o400P059
49C701p778Q571r445J0403j1458J2635j3950J5419j7084J8982k1161K3713k6741
62a4193L0393l4904M0621m8160N8554p3834R8686k41808J460141r08573j489227
73a122304R86436P60138k17402j038683L05111Q21821k20119m10181l12930L63802
83h4311R36387q86885r74542J207438Q35767j348301o68877J373473N21909j355313
93d43255l13469J198494J26483r12630m776M16108K17592o4604o49748O9566R05851
104E45612j71337r76401J28272J214361k76201j406985P36136J120391r26225
$$ plain form
0 0 0 0 0 0 0 0 0 0 0 0 0 0 0 0 0 0 0 -24 108 -108 108 -108 108 -216 216 -216 291 -324 339 -432 493 -545 648
33 648 -743 829 -935 1054 -1185 1304 -1472 1633 -1823 2031 -2250 2488 -2753 3042 -3358 3701
49 3701 -4077 4494 -4951 5452 -6006 6629 -7321 8098 -8986 9996 -11165 12548 -14193
62 -14193 16200 -18704 21917 -26243 32311 -41523 57163 -184645 1275496 366923 -1122304
73 -1122304 -135868 624270 406868 -631815 -326704 495117 274998 -135183 -448113 -84311
83 -84311 852076 -34809 -1009351 198087 1033854 -314447 -983324 390149 912058 -443255
93 -443255 -756724 441770 568253 -344377 -349153 66955 284547 219943 -429805 -360239 545612
104 545612 374275 -602126 -473854 740507 464306 -942679 -206543 913848 -12377
113a2377o26124O43038M84241m09453m92898L61825K81313p2003j70902m42049
123d55389N22908O36687r80392m21367J112101K20373j072189j58338J100123
132E04517J0154j055770K10241P82868k78515m06198P2020J66224K70563j59663
142A16441n36246K73578O69313l60122p83490M60744R06637p05965q28908R26804
152A38786N02201q35229k55722N51461K54702l73213k67926K32881K18376O1063
162B27380l58217l24125P29693K61653r80907k6247R61812p8478r16316J33335
172c70417R01955k76536p38979L64134M18531k01521j90483j15499J89267L52504
182C32956k84676m75285L57873N79628m55010o63977O37997O09157q03549l77316
$$ plain form
113 -12377 -638501 4537 488778 79325 -413573 -51748 229565 157562 -13340 -455389
123 -455389 67519 704206 -276186 -697553 414548 634921 -437268 -595606 504517
132 504517 514671 -541099 -330858 452010 173495 -232703 -160683 5541 276104 116441
142 116441 -419805 -146227 523086 162964 -620526 -159782 746855 40890 -788018 138786
152 138786 640987 -194242 -449964 101497 356199 -17014 -284940 -52059 166317 227380
162 227380 -130837 -454962 274731 536384 -444523 -470770 491042 412564 -503752 -370417
172 -370417 531538 255002 -483977 -119843 298688 97167 -93316 -208815 -19548 332956
182 332956 48280 -427005 -69132 510496 55486 -608491 29506 638663 -164886 -542202
192e42202P69713J50636n45661j11370L45357J64250k27540j75873N7321K47555
202A32186J49156m93194j77348P53390j3912p95261J80398O99783k17465o44246
212d26513K67219N64846l46625l54020K85818J30710l6674q8659k10227K07302
222f823L13975l12530l58476L84133M13031n11860l92135O59065K23968o72409
232b60061j8453N01575m4434l08895j8051K07784O9568j12617j25141k2900K92610
243A60985O4392n13100P1511N98772k52068n17900L11938M37487l15872l92527
253c46382L57060K73219l40788r9898J67462L8724O0495j47781j71584K80703
263G1230J85265l53076k06598M35093K12420n57801j03280N98621o5051m81423
$$ plain form
192 -542202 227511 378147 -167514 -278884 66473 230723 3183 -172690 -115369 132186
202 132186 281342 -211852 -389200 364190 350278 -444983 -264585 435198 217733 -426513
212 -426513 -159294 405552 58927 -295093 -9275 121435 84761 -3898 -214125 -6823
222 -6823 307152 -5378 -363854 20279 433310 -78550 -470685 188380 412348 -260061
232 -260061 -278514 223061 178627 -130268 -148319 59465 129033 16416 -108725 -131625 160985
243 160985 225377 -287723 -216212 382560 130492 -387408 -75470 362017 46145 -346382
253 -346382 10678 283897 -56891 -156789 10673 49397 109892 -37889 -209473 71230
263 71230 256495 -96581 -303179 131914 344334 -213467 -316747 281874 216823 -264600
273b64600J36275L08294p4729k08875o333J55037O4697p1729j82525K5888L59850
284B41250j10683m66799K68646M22334l47358l29941L32633K88400l28700k31172
294b61390L21598J14181k09963m3130J8138J14668J06677k48877j15177L23219
304A19944J07218l64738j19568M43471O6498m96112O1957M21640j38685k69878
314a68253R4798J65996m588j32994n0530Q7914J22874m3423k51183Q6855L50226
325B57692k09542l34369K99225K43080k91690j84968K59038J56484k48558q8885
335a42493J88650K0976n0491n1598o7346J64808Q3044k50636m5442K70815M0634
346A60921l05176k1165L53370o5373l24752J46347K10395j30368j11840M5825
$$ plain form
273 -264600 -128325 179969 105240 -103635 -109968 45069 109766 38037 -144488 -118600 241250
284 241250 130567 -336232 -67586 354748 7390 -322551 10082 298482 -30218 -261390
294 -261390 60208 174389 -35574 -78704 -60566 54102 160779 -88098 -203275 119944
304 119944 227162 -137576 -257144 186327 252825 -243287 -181330 240310 101625 -168253
314 -168253 -73455 92541 87953 -45041 -95571 -7657 115217 71794 -179389 -92534 257692
325 257692 48150 -286219 13006 256086 -35604 -220572 38466 194950 -53608 -142493
335 -142493 46157 67133 16642 -34956 -102302 62506 145550 -105086 -150528 120287 160921
346 160921 -144255 -165420 187950 122577 -202175 -55828 154567 24199 -87641 -41816
356d1816R0752J4381q6201n3125O1363J30546p7625k17946J69263K27157k60804
367d4055j54712K72611Q8655k32290p5026K13377N2690j90152m144J03355J0160
378D0469J193j01752k9389J96706j3157k24907L9837K30375l8325k68381Q1274
389h6057K73461j48663j99807J52188J11536p8643q7552P207J07939K2630j05838
400c1599o3862J03282J33726j56703j66212K36209J22100k60221o0737K20054
410G6037M8377j82432n8610J71923L7887j27952k4825M1476Q3450K675j70813
421a02807K6161K05319o3722j92805N7119K04840o0228k27302J07256J87212j25212
432A5831j10583P0830P9227j608r9043k7958J11478M2439j01105q6634J22497
$$ plain form
356 -41816 48936 63317 -22884 -76009 -14646 115900 38275 -179671 -10408 216749 -44055
367 -44055 -198767 73844 162499 -69791 -144817 68560 121250 -68902 -73046 30309 40469
378 40469 41662 -60090 -89479 107227 94070 -130837 -91000 139375 101050 -167331 -86057
389 -86057 187404 38741 -161066 -8878 102658 24015 -63537 -56330 51609 74239 -31599
400 -31599 -95461 7821 141547 -15156 -181368 54841 176941 -83280 -144017 76037
410 76037 124414 -58018 -116628 55295 93182 -34770 -59595 -18119 65331 68006 -102807
421 -102807 -76646 128673 64951 -127854 -70735 134105 73877 -153425 -46169 141043 15831
432 15831 -94752 -23922 55305 53697 -45346 -73304 38174 80613 -20492 -107126 15371
443A5371J23100j81560r9558K09446M6890j79107k5162J36243L9266j19233m3959
454g8263J05334L0071n5232n2939Q705J19027k3040j59061O7288J44539p5037
465C1392j28789N5863J50365p6488j45359J07455R1196q2312n4505K1617P3123
476D3558O620r8609m319R1828K5797r3771o1717J36211N5353j70699j3714J56707
488G3245q656j23795l234J09745J7199j08284j3199Q5307K1096m8160o7707M7439
500a9004J12975q3574j15325J06185R3831r0754r9400Q2267J17597j05419r6102
511i6723J04944N8958n5565o8615J7430J07456k1743j16504K5416J02496N336
522F2886j19064k5858J56252L943j57967J7099J27555k316j13000j9307J17244
$$ plain form
443 15371 138471 -43089 -142647 66799 113689 -65418 -90580 45663 84929 -34304 -78263
454 -78263 27071 57142 1910 -51029 -42324 76703 53663 -105398 -38110 106429 31392
465 31392 -97397 -41534 108831 32343 -113016 -5561 85635 3323 -51182 -29565 43558
476 43558 50178 -48431 -52750 39078 64875 -28896 -90613 45598 100951 -69748 -83462 73245
488 73245 64589 -59206 -62440 47305 64504 -43780 -56979 28328 49424 1264 -66443 -19004
500 -19004 93971 10397 -104928 1257 95088 4334 -95066 -12799 104798 -621 -96723
511 -96723 8221 67179 11614 -57001 -39571 67885 46142 -70362 -44946 57550 62886
522 62886 -56178 -82036 74216 78159 -79808 -62709 64846 62530 -50470 -69777 47467
533D7467K3097j10798k2663Q3646M6773o7726q5789Q4461J00308j04243q8382
544i3849R8345Q2483q0518r8589Q4426J00851r3751p3699O5850O6591k4504r5179
556f1543J7504J15312l1315j02201J6773R7725J0020j23072l708J33361j8416
567E0440j08318J1220Q8098J3913r3027k3242J00600J5302q4679k2745O7124N0504
579F5190p4794o5880R1233N6989r0151m8435P4871N8285o8773p1999P9667O1636
591F7839p6843m4385M7213N7871l1903q2133M4029Q2519m8535o9694K6919Q3563
603E6460k0190j02422L7310R4743m3636p4665K0715P9122m827r3996J0299R0766
615D9679j1443p7011p643P7454K7047r5874k2497R9828J4746q5398k6344P8740
$$ plain form
533 47467 70564 -40234 -62897 20749 67522 -204 -85993 -1532 98776 -5467 -93849
544 -93849 4496 86979 6461 -92128 -7702 93149 -602 -74301 -8451 58140 33636 -61543
556 -61543 -44039 71273 39958 -62243 -45470 52255 62275 -60797 -64505 68856 50440
567 50440 -57878 -46658 41440 55353 -37674 -60916 39684 54986 -29693 -52438 14686 65190
579 65190 -9604 -75484 15749 72738 -17413 -65848 9023 67308 -1465 -73464 6203 67839
591 67839 -9004 -53389 -6176 51695 19792 -62341 -18312 64207 15672 -54022 -27103 56460
603 56460 36270 -66152 -28842 65901 22265 -52400 -31685 47437 42610 -51386 -41087 49679
615 49679 38236 -38775 -46418 31036 58083 -37791 -60288 39540 54286 -31112 -57456 21284
627B1284M4206q8144m7588R5966L5893p7917m1496N9946O4737o4431p4726P3385
639A115O3721n9621o5239M0269Q7287m4498r7182N7736P9455m1696p5146J9751
651c4048R0418j7148r8864K3323Q7393j1209q0466j0722R3003J4619j01760o347
663e1808R0403J1503p6856l1014Q0793L9626q7255l5945Q2536L1828o2900m7787
675e6876N9783O3039p1392n4271O4438M7791m6290o0681L9371P6127m9474o9613
687e8048M9307N5192k7121o6420J9569Q0811k9717p3607K8700O0853j0236o5555
699c6272j240Q0157p582p5813J1157O1767L510o3867j4553P3379J1328p2979p832
712c8840O2810J5935n6893k9967O5180L1251o9545k3796N8011K8142m8572m2274
$$ plain form
627 21284 65490 -22654 -70242 25724 61617 -16300 -57796 2150 66887 2456 -72270 1115
639 1115 64836 5215 -60024 -19755 67532 23034 -74148 -16412 63043 21347 -53799 -34048
651 -34048 56370 39222 -59642 -36319 51074 39865 -40601 -51323 41680 56299 -45461 -51808
663 -51808 38595 50098 -26758 -57772 23021 62647 -24608 -60553 21983 53811 -9089 -56876
675 -56876 2907 65946 -5446 -59717 4721 52512 6222 -54459 -15088 61039 11565 -58048
687 -58048 -8741 46451 19330 -47090 -27521 53290 23573 -50034 -21334 39519 29283 -36272
699 -36272 -37512 42645 35063 -40750 -29593 32174 35684 -28183 -42736 30643 41971 -31008 -38840
712 -38840 23970 39905 -16988 -46955 18225 49476 -20069 -43865 14146 42288 -6284 -48558
724d8558N3833M7292o2455l6990N1171L9086l7885n4910M2888N9915n1096m9860
736d7569M0061N0376k5746o4247K6231P2287l4321o2539K5617N7801q670o9850
748d0569O036P7273j0291p1623P690O2490Q240o7508j5609P5554J0806o9927j4388
761d1826O1068K6157n9990l5937O7346L2011o3833k8785M9238M1461m5992n2265
773e1347N0664N1392n0161m2405L3797N1462k7052o6158L5654O1384l4964n0480
785c8214J8333N6968j0295o7348J5226O3129j4814n2391J835N2654R479o2716
797b8154o046O1536L930n2322j1943M9146K2282n4977k2045N6928J4456m6467
809a3676j8148L7805L0911m2619l2714M6354K4077l5015k7912K8107L9173l0303
$$ plain form
724 -48558 5275 52567 -9888 -46878 4293 43379 5494 -49416 -6528 53387 2291 -47569
736 -47569 -7508 42868 17122 -47125 -20894 51393 17072 -45467 -19850 37951 29281 -40569
748 -40569 -34533 42740 32449 -39174 -31484 31006 39246 -28262 -43871 31683 42489 -27438 -41826
761 -41826 19242 45399 -14591 -50528 16818 48829 -15004 -43789 5449 46910 918 -51347
773 -51347 -683 50709 548 -41857 -8060 43402 16350 -49808 -14154 47230 12266 -38214
785 -38214 -19881 37087 26792 -40556 -25330 37799 22985 -29406 -27571 25083 34562 -28154
797 -28154 -34200 27336 31266 -21056 -32999 16147 38429 -16548 -38593 18335 32791 -13676
809 -13676 -31824 5981 36892 -5727 -38441 7913 31990 -3025 -30937 -2830 36343 6040
821F040m4445L8642L4821l2311l3666K1158M3264k3594m5290K8632L6362k0331
833I282l6103J0248M2711o540n0223J2723M6101r813m2980J338M8909N98n3211
846b6960L944M9634m337m0983o410M1430J3973m7927j1451M5112J1721l7738k2322
859c2314L8385L1689m6644k8436M7135K2846l6681k9785L3059L7461l6935l4298
871c4518L4020L0277k1839l7065J5150M6376j8028m7897J9856M3241j1016m7482
883b8925O881N2364q122n0496R177M2813l084l8058p894M1603J1129m3395r015
896b5022L6967J5875l5535k3880L9209K6216m3988j9872L7822J8656k8656k6289
908b8497L0270K6448l0869k0265K0956K2059j0432l3395J2135L8627j8293l3381
$$ plain form
821 6040 -38405 237 35058 2747 -30919 -9761 33503 9909 -35381 -6749 29613 9282
833 9282 -26821 -16573 26138 19598 -30625 -17902 28199 18386 -24594 -23256 25653 26251 -26960
846 -26960 -23016 26618 22281 -18702 -25112 16318 30291 -17636 -29087 16025 27746 -9992 -32314
859 -32314 6071 37760 -8884 -37320 9815 32661 -4020 -33805 -746 36715 -220 -34518
871 -34518 -498 29779 7940 -29125 -13975 32401 14373 -33524 -13668 29573 18557 -28925
883 -28925 -22044 30320 22198 -28298 -19121 23692 20608 -17450 -25344 16259 27388 -16007 -25022
896 -25022 11945 27820 -7715 -31595 7614 33830 -10158 -30030 7792 26448 -2208 -28497
908 -28497 1773 28221 -2648 -22913 -1957 20102 9670 -23725 -11590 27037 8744 -24637
920b4637J4603L2147q819l8390J2811L6247j4593k9176J0054K5071k032k6900
932a3614l352L1550K080l0375k024K6385Q719k9985j0928L4914P348l4238l641
945a7161K6791P875k6080j2457L1471Q165k6033q217J8548J4906j5842k4203K2378
958A41K3598k4907k0275J8460K6623j9412l0041K5131K3612k3612j8728J5003
970d407K1929r626k6387Q398K7643o218k7524K338L0248Q85l5841J6L8850m579
984A5725l4031K579K8804M915l0041o828L0932L565k3714r445J9482K0151k3734
997a640k4150K8873J9423k4358k0553J9842K7146k3390k5090K3905J9637j7195
1009B450j9608J0384K2684o619k6136P162K4130k433k5530k868L0473K212l2276
$$ plain form
920 -24637 -10034 22113 13294 -25096 -12285 23962 9369 -19807 -9753 15318 13286 -13614
932 -13614 -16966 14584 16664 -13711 -15735 10650 19369 -10616 -21544 13370 20718 -13520 -17161
945 -17161 9630 17505 -8575 -21032 10439 18604 -7429 -15646 2902 17808 1966 -22237 141
958 141 23739 -1168 -21443 -2983 23640 4228 -25813 -682 22930 -682 -19410 -4407
970 -4407 17522 7896 -18491 -10093 17550 11332 -16192 -13854 16394 17279 -18562 -18546 20304 15725
984 15725 -18306 -15727 13077 17992 -12049 -18877 12055 15620 -8094 -17539 1943 22094 -1640
997 -1640 -25790 3083 22506 -1852 -22405 -2563 24583 1193 -23897 8 19645 2450
1009 2450 -17158 -6774 15910 9291 -16845 -9683 14447 12014 -13516 -16384 14089 16301 -15975
1022a5975J527K9326k171k4797l73K1061O627k3857m486J9194O121j5104j1510
1035a4417J5149J7270j9767j6695K1903J3301j7957j4650J4824J8234j9325j2195
1047a4325J6536Q013q722j2734P023J7217q453j7096P746J5154k212k0085L759
1060h179K2283p655k1951R757J8544o724j6690M026J7710l441j7701L258J3974
1073G211K005j4133p200J8473P127k3211l412K0995M019j7564r050K0895Q915
1086A5070k2305m472J6035O463j1430j3419J3438J6058j5177j3699J1761J5119
1098A3442p746k1406J1483K0323j2465j9073J1795J7401p843j8072M762K0661
1110A3262n958j7485J689J7071K521j9370n714K3048O020k4035m135J9740O568
$$ plain form
1022 -15975 -14448 14878 12707 -12090 -12463 8598 15225 -8632 -13118 6076 12197 -2907 -14417
1035 -14417 732 18002 -1765 -18460 3443 16744 -1213 -15863 -1039 17195 -2130 -14325
1047 -14325 2211 10224 1502 -11232 -4209 13008 4555 -12541 -4795 10359 8147 -11938 -8179
1060 -8179 14104 6449 -15502 -5745 12799 6075 -10615 -6589 11121 7680 -10021 -6763 7211
1073 7211 9216 -4917 -12117 6356 13483 -9728 -13140 7855 11874 -5690 -14740 6155 15070
1086 15070 -7235 -11707 4328 10791 -639 -14058 -620 15438 261 -13438 -1677 13442
1098 13442 5696 -15710 -4227 16096 3631 -15442 -3647 13754 5911 -12161 -7399 13262
1110 13262 7304 -10181 -8492 8579 11100 -8270 -13984 9064 15084 -8951 -13086 6654 13222
1123A3222j9561r099K1478O397j7629n371J0864J1504j0014j5951J2731J4872
1135A3443j3327j1856P717J6501p489j9060R651J7246r625j4283O839J3264k079
1148F942j6458K633J4920k090j3134j147J2778N540j6075l191J5467K841j4333
1161e307k567J1560N717j3475n823J6146J300j0158m337Q130P942r607q605J1544
1175B460N928q697q926R105R347q656j0786J1518O917q264q178O893J0602o897
1189B366j1394P534R887p523r092M875J1353l513j5470P125J3154n262j2409K311
1203f058J3544m29j6023K491J5226k561j2057k808J3794N353j6150l996J5077
1216E403L341j1122q531J2922J0662j5748p826J3159P611r695j0972R305J2878
$$ plain form
1123 13222 -6339 -15438 6040 12437 -5192 -10563 301 11805 1791 -14160 -1429 13443
1135 13443 116 -11740 -4023 12478 4989 -14071 -4420 12826 3201 -11082 -4243 9021 6942
1148 6942 -9516 -6883 8037 5947 -7187 -8334 4444 9984 -6091 -9282 6185 9026 -5307
1161 -5307 -7874 3686 9403 -4072 -9895 6251 7551 -2607 -6944 1186 9128 -479 -9084 2460
1175 2460 8388 -309 -9235 -130 9217 561 -10225 1293 8210 -54 -8232 -1339 9263 2366
1189 2366 -9028 -1494 8393 870 -8222 -3347 8006 4493 -10977 -3852 9302 4040 -8369 -6058
1203 -6058 7486 7057 -8966 -6475 8751 6190 -5867 -8675 5119 10472 -5678 -9674 5403
1216 5403 8744 -2378 -10909 2013 12675 -3073 -10899 2260 9871 176 -10796 -1491 11387
1229A1387j0305j2652Q624J3300o985j2685L817J6222n928j4052L621J3800k099
1242F065j4630N90J5469L37j5257Q65J2014K798j2260o047J3974N712j3984m241
1256h595J1758N127r420q223J0440P876r618p811Q149P260l755j2370Q089R759
1270H666q902p748N492R329m041j0290L596J0953m547q800L082Q693j234r891
1284e642Q85J0181k074r345K434P966J128r509j273J0294L91j0464J040P911Q11
1299D734p619l936J1050K447j1354l62P727L289q040n039J0210M503r105m558
1313f053P055O073o140r466Q311Q091q739o447P159Q159p406q900O929R326o268
1328A684q763N116Q845k257j2139L683J1013k064j1664J332J1276N98j2181j728
$$ plain form
1229 11387 1082 -11570 -2946 10354 3369 -9316 -5499 10723 4795 -9257 -5636 8164 6065
1242 6065 -8565 -7975 7494 7831 -7426 -6561 5453 8251 -4009 -10056 3918 9630 -4354 -8595
1256 -8595 3163 8290 -1130 -9353 1087 8963 -655 -8466 -317 6943 3188 -9182 -1093 8666
1270 8666 -236 -7984 -2492 6837 2796 -7494 -3898 7055 2508 -6292 -3210 5483 4249 -5642
1284 -5642 -4757 5424 3350 -5995 -3561 4405 5533 -3976 -5249 5045 5436 -5028 -3988 3923 4734
1299 4734 -2885 -6821 4229 6676 -4678 -5040 2687 5976 -2064 -7103 3107 7610 -1495 -6053
1313 -6053 1002 7075 935 -8531 -220 7871 -868 -7315 -156 8003 597 -8303 -1374 7952 1684
1328 1684 -7079 -1963 6882 4625 -7514 -3831 7182 5118 -6546 -5214 6062 6660 -5521 -7249
1342g249J3132n21r695j473R134M313j0027n576J0451N293q591p541R012P791
1356H453q727r088R487P855p578p379O182Q914n344j0140M776Q415k570q195L57
1371d582J0113M2j1689K471R120k91j0367j119J0902J621j1833L85R161M22p126
1386b770j707N580L659o342k802N551L746m559o306O502O714q975l776O744M423
1401E682o738l916M966M390m291m081L118M460k555n511J217Q206j541r576L845
1416b325Q049l994p251L738P289l901p691N228O258m522l496J03N115R08o776
1431c268m32N748L052p080m587R421L640j1871l83R799N77p701r60P298O88o240
1447b299j186L174M091k795o919L753R393n978q460N535J0583o666j0736Q187
$$ plain form
1342 -7249 5883 5362 -4333 -5806 3328 7641 -2386 -7962 2489 7782 -809 -8350 662 8453
1356 8453 -274 -9362 125 7980 402 -6977 -795 8119 2775 -7365 -2589 5826 3256 -4939 -4582
1371 -4582 5531 5573 -6116 -3645 5475 5184 -5183 -6302 4600 6221 -5612 -5227 3934 4356 -2770
1386 -2770 -4477 1103 4762 -1580 -4382 1169 4915 356 -5950 552 7266 -1709 -5485 1259 5682
1401 5682 -1056 -4972 -6 4384 93 -3988 -870 3590 1035 -4476 -3259 4947 3406 -6170 -2325
1416 -2325 5724 1730 -5521 -1783 5506 1605 -6086 -858 5400 878 -2618 -2515 2600 3508 -3268
1431 -3268 -3700 2048 5100 -1980 -6567 2854 6494 -5377 -5760 4039 4616 -3085 -4045 3253 3941 -2299
1447 -2299 -3485 -311 3780 985 -5934 -2181 7212 1234 -7226 -1691 8892 2226 -8510 -323
1461c23P773p317n103M600L161l96m140k033O337K845q268l192Q420N309j1687
1476d014m089J3275J528j2852J365Q544l30o523j77N044n25o97l802p16R048p72
1492D307j0923L623R863m210j0539P715P740p139o377P160L347o849Q90K222j542
1507g12K779j841m234M557M266o987l919R058L795j2132M2J1610l882p768N078
1522b90M836m170k112K423l7j129K231l620j669Q494l156q210O271P062p702o181
1538f959J0032L761j1420P71R353m217n963N489p57j568L735k457m372P129L193
1553E750j1375j57J3799m113j2859P570J0098j0673l712Q414O97n154o9K827j771
1568g28K186Q38p598L469J0327r797q000J2943M794j2806k430J2879r45j1238
$$ plain form
1461 -323 7450 133 -4970 -370 2791 2395 -1745 -3778 2559 5404 -2864 -6056 2364 7673 -4014
1476 -4014 -8103 5172 6700 -6152 -4787 3757 3427 -3096 -3273 1771 1246 549 -3253 -3969 5079 4307
1492 4307 -6616 -2993 6870 2660 -7879 -164 7576 437 -5940 1220 4567 -2282 -1392 830 -712
1507 -712 2067 226 -4008 549 4815 -2172 -6091 2967 6762 -5370 -5328 6282 2400 -5368 -290
1522 -290 4546 376 -1736 687 650 -479 1752 -1868 -3537 4957 1801 -6409 -138 6924 -778 -6959
1538 -6959 3073 6834 -4586 -3815 5538 1321 -4642 847 90 -1478 2257 -200 -4572 2557 5750
1553 5750 -5625 -5782 8017 3904 -8955 -1385 8713 -1960 -5672 2742 3439 -1715 -1784 1043 -728
1568 -728 1458 2296 -5302 -1833 8494 -1303 -9303 3640 8434 -4372 -6802 6077 5132 -6106
1582f106M851N184m706m84K099l788K664N879r653k126J1982J671j4968L160J5024
1597A0683r352j0967J1565L539r528J529O200l602p00M152n059l237J0687k256
1611C654j2239Q235J0379j3378n653J4207J604j3209K539J1628p802m966R430
1624D429l080n761P513p71q095O712N980j1474k085J4385l528j3998R949J0053
1638A0229j3549l249J2818l304r023P777J750p915L847N567p993n97J0082n828
1652F12q818J2696L096j5066L515J3185p733j0724J1430M530j1997K638Q113p151
1666a674j159P489n513n823J2228p10j2087M916J2084j1589q609J5697K728j6540
1680h562M650J1691r312l128Q724l593m476P494L89j1419P663R318j4431m134
$$ plain form
1582 -6106 -1255 3929 -777 -1261 838 -2950 -286 5593 -4060 -6186 5796 7467 -7501 -4341 10683
1597 10683 1331 -9636 1929 5468 -4060 -2531 3669 67 -633 3519 -1540 -4777 5910 3654
1611 3654 -8585 -350 10029 -3349 -9002 5205 6809 -6400 -3861 7767 -35 -5001 4429
1624 4429 1349 -4412 3101 2330 -5765 947 6927 -4547 -6632 7753 4225 -9773 176 10229
1638 10229 -3320 -6569 6249 2945 -6078 1699 3449 -4466 -619 4948 -3045 -3642 6440 612
1652 612 -8206 4490 7586 -7480 -3965 9220 1487 -9237 2193 6723 -5274 -2636 5477 -1674
1666 -1674 -2833 4656 -857 -6680 5548 4838 -7249 -2333 9751 -1838 -10447 5250 7978 -8562
1680 -8562 -3912 7779 -1533 -4661 4063 470 -4006 3488 3877 -7542 121 9439 -4992 -9126
1694i126J7219l220j6501R901J2436j2518o160J3470k615q581P770K189j0077
1707e813O840O156j2458q35J5376o657j4608J3805R409j6879j909J5338m415j0499
1721g149R659K368j0103M033O763r288j25J2038o565j1489J3989M984j7535K274
1735f146J6091r121j0951J3686L109j2235L676R481j0307l164J3063p073r077
1748h968J3581J774j4108M271J3477j1488q147J5951N49j5942O991J1454j2832
1761c437l219J2589l952q405J0012J918j1845M817J0050j2936l766J6741n494
1774C073j3515J1369R783j5372k169J4703m602j1847J0222M584j1989L945R659
1787G844j1300k292J3691o639j0851J2744O284j6097J77J8307r015j3819J3867
$$ plain form
1694 -9126 8093 4873 -11628 -1727 10709 -1809 -7969 5501 2886 -5695 2075 4264 -5813
1707 -5813 1027 7183 -5275 -6110 9266 2609 -11999 1806 11215 -5664 -7573 7765 3350 -7149
1721 -7149 2510 4878 -5225 -1192 5571 -3717 -3842 8196 1631 -9858 4131 9115 -8420 -6146
1735 -6146 9945 824 -10127 3559 6668 -5567 -1891 7590 -2717 -5881 7182 109 -8968
1748 -8968 4613 6387 -7721 -3450 10027 -1461 -9608 6343 6892 -9050 -2059 9395 -3437
1761 -3437 -6656 5933 1981 -6424 3588 5506 -6339 -1522 8528 -4408 -8174 8567 3073
1774 3073 -10442 927 10710 -4662 -6831 7872 3270 -8577 1645 6229 -5760 -1815 7844
1787 7844 -3456 -5748 7943 1304 -9547 3197 9481 -6616 -6439 11868 2853 -10966 2901
1800B901L808j3077L608R612r444k314J2489o592r410J2578L500j7244N192J6801
1814A2408j2566j1470J6718L253j7085N138J1585r261m219J1378m918p906J1238
1827D293J822j4449N317J3738j4148o649J6958k0j6421P517J2554j4541l229J3736
1841F478m404q067Q240J958j1261M983J1187j2183n133J5106l627j3768J1468
1854I77R713j5209k551J5188n833j0836J2222K228j2260M527R530j0835m109J4622
1868G374m896j2724J2598O326j6050J695J5668q553j0450J3116L366j5209M595
1881c144J1616j1300l189J2644m465j0314J0344N805j5623L531J4457j1671p886
1894i195J5403J07j4482N768J1657j1808m741J3286l780r567Q698M956j3367N065
$$ plain form
1800 2901 6709 -6368 -2760 6852 -2592 -4906 7583 991 -8419 4159 7659 -9585 -4393 12408
1814 12408 -158 -11628 5090 8343 -8742 -3604 7981 -1280 -5499 5879 961 -6945 4293
1827 4293 6115 -8334 -3017 10721 -3427 -10076 6882 6862 -9559 -2042 10512 -4029 -7258 6478
1841 6478 2074 -5993 2247 4205 -7056 -2073 9114 -3069 -8202 6904 3277 -10491 977
1854 977 10690 -4519 -7070 8118 2285 -8551 3671 5899 -6361 -1834 7696 -3139 -7248 7374
1868 7374 2478 -10246 2352 8678 -7372 -5677 9991 1438 -9012 4104 7470 -7739 -3144
1881 -3144 8472 -2828 -6017 6627 2162 -8152 2192 7997 -7626 -4095 10362 -1309 -9195
1894 -9195 6208 6315 -8167 -2399 9258 -2550 -7291 5995 2215 -7352 1346 6302 -7065 -2000
1908b000J0549j1506m587J4517j686j5127J0394R488j4400k214J3882m785r861
1921g336R264L300j0326L550Q776j0016l185J2955l681j3234J2078Q128j7240
1934f967O32J4781p007q257Q715M953j1131J916Q258q623j988J0260k673j0920
1948h051J1428N079j5027J716J4336q974q967J2610K162j1944L453R867j0493
1961b805k145J0154m781p526J0427K143j2196M358J0429q185q518J3915J198j3757
1975g289N097R243r500l812J1166l275p917P960K841r908L900R494r888m379J1263
1990D996j033j1146O991P927j2229n96J1396m282q827P832N882j1924K767Q494
2004F248p353m420J0723k490r382P207O620j2081j4J2096n899q679J0189K497
$$ plain form
1908 -2000 8549 -2957 -7544 6973 5287 -9840 554 10042 -4358 -6572 7310 2525 -7336
1921 -7336 1928 5228 -5098 -1548 7228 -2788 -5973 6982 3301 -9933 2145 10273 -6967
1934 -6967 -6335 8446 1439 -6818 1897 6850 -4281 -2365 5893 -2730 -4718 5542 2869 -8051
1948 -8051 3377 8456 -6571 -4855 9481 507 -8460 4150 6312 -5632 -2179 7688 -2805
1961 -2805 -4950 5204 423 -7103 3324 5467 -6729 -2371 8058 -127 -8645 5270 6468 -7289
1975 -7289 -2192 7051 -2449 -6261 4905 1630 -6287 1673 4514 -5394 -1494 8000 -1888 -6267 4996
1990 4996 3963 -7183 -192 7735 -4494 -5090 6306 2024 -6803 1029 6911 -5013 -2246 6248
2004 6248 -1105 -5525 5198 2708 -6674 533 7153 -4928 -4942 7154 1255 -7424 2765 5262
2018E262r557K011Q160p338l553R211k641p561Q510L302j1804K154J0293p329
2032h80o516J1534J753j0876K800Q970p357m803R025j748o482O721L15o335K985
2047h94P049o677n470J0733n26j1602O287Q481r437l277Q265J01p168M465L255
2062C585o828L108N845q104k851J0611k710r920P754N749j0053q67R536k307o904
2077d356O133J327o922L197N870p142j508P956l086o201N346M584q360o67Q687
2092D858m417o297P371K520q813M015N845o108k732O179j841m756N571J829p286
2107d062K212P049n681m717Q255N55p968K883P002p175j942P000j308n388M591
2122A306K592o992J730M899n390j289O589l19q623N506N080p494j147P519k988
$$ plain form
2018 5262 -4295 -2284 5876 -1462 -5015 4196 1555 -6006 2504 5806 -5998 -3844 6449 -880
2032 -880 -7396 4138 5891 -4985 -2185 6785 -572 -5375 3650 1902 -4580 2141 2456 -3879 -894
2047 -894 6155 -522 -5992 4741 4215 -7387 -1100 7381 -2056 -5333 2932 3033 -4135 330 3585
2062 3585 -3243 -135 5710 -2394 -5245 5366 2656 -7264 490 6239 -3814 -4681 4855 2548 -4356
2077 -4356 1777 3104 -3818 -621 5249 -1893 -3401 4555 1469 -4732 614 5198 -3162 -3829 4858
2092 4858 441 -5856 1515 4035 -4778 -763 5082 -1026 -3758 2421 580 -4176 1395 3224 -4062
2107 -4062 -1850 5199 -482 -5199 3056 3611 -4357 -1474 5528 -1647 -3589 3411 2103 -3285 1306
2122 1306 3898 -3094 -1364 3535 -1855 -3144 3445 3126 -5497 9 5089 -2405 -3552 3967 979
2137I79n530N009K297m608J63M365l718p02M032j066n577N481L909q272J113P179
2153E054l400o439N472K643n469M55L382k243n53L117j400m010N081J454o765
2168c621J493P004m325m913O214J655n655J08M946l112j388K286p81k202L263
2183I72Q96m027J665L585m207k761O546l31m592P90M608l212k257M001j52l562
2199b038K670Q77l581J618K548k213k602N157j432m574L115L733m748j405N622
2214B747j837l401K224K837m323Q78L122l012o99L391j611k799L802P18m259L21
2230a901L451j863k042K800K455m378O81K889k064j719L195r86j622K067M68k936
2246a505Q28L277k422l092M296J239o293K572L484j461k703K528r69j591K082
$$ plain form
2137 979 -4551 458 2755 -1853 -1690 2675 -1043 -1745 2287 1221 -4356 1125 5034 -3238 -2125 5054
2153 5054 1654 -4785 687 3330 -2139 -1684 1698 -545 -1098 2019 619 -3391 1690 3144 -3621
2168 -3621 -2128 4876 551 -4362 1852 3507 -2148 -2040 2906 -206 -1594 692 -89 -2291 972
2183 972 1868 -2159 -494 3091 -1116 -3877 2669 2338 -2254 -1464 3144 -68 -2325 1676 1524 -2038
2199 -2038 632 1509 -2072 -454 2094 -119 -2721 2436 1004 -3570 -455 3278 -1470 -2875 2747
2214 2747 910 -2491 -267 2570 -1753 -875 2247 -765 -1464 1927 316 -2483 1319 2037 -2222 -1901
2230 -1901 1550 -313 -2355 445 2900 -1478 -797 2092 28 -1691 1504 518 -1104 963 1431 -1505
2246 -1505 -677 2600 178 -2914 1382 2621 -3672 -1100 2384 923 -1780 748 -221 -1812 270
2261B70J045k131O67J654k098r20M104j442m482L393K040k731j065K586J60k269
2277a219J49K002r84j27P33j502L23K178r13k477K099J353k637j206M242j490
2293E24k600J185K481j828n96J025j048M26J154l80k114K618N27k680q96L199
2309I97M2k402O63K051k617n10K080p7l14N5L33j135J886m01j657R21J576j805
2327c14j342J102R86k149J100J501J05k079J384O75j777k57J559j048P70j0q24
2344f18l79J975J95j265j83J775k756M42J836k51j640J047P64j43j614J493q02
2361a24K89p11P18m17J373j2k086J161J017n51j940J231J194k441O00J882r08
2378B75n63k60M15M59m41j43k69R78N83j128q04J507Q24k479O67J271n21o93m91
$$ plain form
2261 270 1315 -816 -149 1505 -593 -1513 2591 1149 -3333 60 2100 -631 -1696 890 1050 -1219
2277 -1219 -1070 932 -52 -179 554 -948 -625 1553 640 -1837 262 1615 -1022 -2228 2014 524
2293 524 -2076 -891 1590 -238 -834 191 -857 -431 723 343 -1771 847 1374 -1306 -2202 997
2309 997 1039 -1363 -700 1351 -1266 -1776 304 227 -87 -32 301 -834 1052 651 -1006 -85 1491 -314
2327 -314 -1656 -554 432 -1717 -617 884 989 -1090 294 969 -808 -1065 494 -554 216 206 -618
2344 -618 -997 978 1173 -92 -275 1500 -1256 -814 1022 771 -869 178 942 799 -815 678 -124
2361 -124 165 -546 172 -245 1128 1116 -970 191 1208 657 -1283 -52 1142 -1299 -699 1183 275
2378 275 -288 -548 -133 326 -115 -258 -527 451 1034 -94 -898 609 1433 -1046 -379 892 371 -322 -813
2397h13J489k53n35j883J560J254J03j592n47J369K86j091K80N12l8r58P66N99
2415E08J03j024n8l9J087j106k12N67L21n06j116J008J326j843k76J214N31n59
2433g4L9m31J028L42j558J208R8l75K31p68J93N75r63J5Q09R7j285O85L01k73
2453a06r0N22m54j25N98q02M59K22P7M8q03P46n45K11N99M49j846L72J221o22
2473A31q22Q57J044j998N13R7N46q3p57J182r16J765j568P60p13J078j536K4P62
2492C66j82M69j184Q61Nj344r8Q53l94P55k56k40R96j158N60m73J180l56p88k61
2512f89J883j498O15m86J153j485k86M0J158J046j223q56R00R24j311L16n75R75
2530F01p37K44l47L86N0J4K58j05n88Q8l0J004l98q05OO53m59M80j10m99M72J75
$$ plain form
2397 -813 676 423 -112 -1995 -435 819 922 -670 -1217 152 438 -653 -373 139 101 -857 -91 508
2415 508 611 -413 -471 -510 577 -529 -741 -174 147 -359 -1475 -467 859 -984 -1260 -46 485 -74
2433 -74 -35 -466 562 904 -654 554 652 277 508 -260 -67 508 -455 -440 369 466 -819 -134 167 -106
2453 -106 -196 326 -128 -253 345 -457 2 224 301 349 -454 292 -253 -42 557 1006 -840 -468 753 131
2473 131 -691 166 1210 -788 -275 -178 368 285 -472 710 -206 1559 -9 751 38 1116 -420 -396 366
2492 366 184 653 -531 330 335 -1009 -1107 -254 -648 107 -149 -389 607 -551 9 -464 716 360 -428 -689
2512 -689 1194 -304 311 -175 978 -507 -793 -753 405 1451 228 -628 272 1196 -115 201 -374 601
2530 601 -136 108 -239 147 197 211 469 364 -224 -136 -166 838 440 -365 -359 294 -165 315 205 -294 178 353
2552C53m13p77J122N60j692J486r46j01O63n45M04M75q11K74J16q4M2n52J278
2571H52l30l12q40M35K82j93l1N08l83p92J71J053q4m61n08Q66l56m80O87l02
2591b18l45K1K20N13m72m80N76O67q05l68J199k11O84j696P26K79N97j346j50
2610f09R76O1o60l51j02N29j70L23j80N66n81r34J465O84m19m86p09R88n86q95
2630a090R88J175m84o44L89N98q66k26l65K68O20j315J099P72q2k27j130M13l78
2649d85K70l09Q78L06j719R96j55Q77r50p25R58P49j685N41P98KP29j645O95k94
2669a68K39j179R44k74J81O48n85M64J075q43p69Q81k17j366K54J328o56n32P74
2688A99K48p00N26l12L57r20J087j360J046j164O85o28N46M29j46K26N4P61j360
$$ plain form
2552 353 -60 -837 285 845 -847 639 -307 -408 255 -290 114 589 -222 52 168 84 126 -426 852
2571 852 522 210 -630 -195 87 -106 -137 371 -12 -804 -633 420 336 -125 -633 233 -123 -603 84 -218
2591 -218 -563 -542 -322 191 -281 -761 -185 482 -323 -691 508 297 981 -715 11 290 887 -459 -609
2610 -609 367 428 -232 -583 -685 -156 -326 -3 -183 383 -198 -1132 333 1017 598 112 -597 391 -195 -1090
2630 -1090 -102 1073 589 -55 334 932 66 -160 -525 -257 363 -952 147 919 837 610 -520 -107 -485
2649 -485 -215 -524 354 660 -1059 -63 -218 659 -291 -1016 -58 691 -994 -453 345 347 1076 -569 126 -168
2669 -168 71 -1108 -164 -438 -257 391 -194 270 1345 502 -267 614 397 -969 -715 613 -43 -575 199
2688 199 447 -253 273 -39 318 -602 485 -875 171 -993 -308 -936 -390 39 -107 119 173 934 -426
2707d26m61K004l01k32o23J93J63p00J505j416N23m6q29R71m7n5M57r47Q66q88
2727b89N69N63O5K09j607n0K033k031n35Q54L17n37l36N17L51N10n89K78K55J112
2747A659j995k14K39O71o89k32N72j19l50j325J390O10J40o86n5Q5L67p29m3J743
2767A039p60l98J25o37N9Q92j027J585q37j93o95Q30j27r9m16N89O79q66L77o85
2787e65J220o93J26o13Q68K32l87l45P41m9j290J090l49L46l66p71M25j34j31
2806f45J130j132l5J67O82J25j514r6J653m96m84Q68O78p71j23K38m66P75R4p47
2826i9R1M7O90j736R16N48n10L55J57l17M35n45M06l60L26n07k31K56L05o21K54
2847a40J391j350O46j963K884j453k66k10K61J56R7j35l83J444J89j664Q97Q61
$$ plain form
2707 -426 -887 1117 816 584 -39 154 317 -383 1122 -294 229 183 -646 325 278 223 680 -267 599 -289
2727 -289 280 843 908 1117 -490 -540 1493 -538 -1073 -219 98 -439 -775 -258 93 603 14 292 547 1659
2747 1659 -336 -550 -311 360 -329 -561 11 -108 -458 -1783 -393 217 357 -329 -384 -299 68 -661 -704 1039
2767 1039 279 -119 6 -631 -572 320 -707 878 41 -152 -847 -17 -144 -243 -659 -70 609 -257 120 -565
2787 -565 655 -38 88 -525 343 575 188 -157 584 535 -755 335 -14 332 -34 -805 -380 -514 -645
2806 -645 485 -647 -682 -515 167 292 -1222 -1318 335 -161 -645 223 901 130 7 245 -221 554 648 -99
2826 -99 -8 39 729 -1007 -91 457 -53 302 459 142 577 32 438 78 404 -103 -334 -78 227 -394 -140
2847 -140 1251 -99 547 -1416 1468 15 -251 -461 -200 -44 53 -82 -465 979 1168 -496 401 1262
2865A262o58j128R59r60L44k69J326r06Q23j67j555J441M93n42q18l87J375p60
2883a27p34j88K310j196n24l16P82K14L3k59n16L08p20P04J174R2j701P1R14l60
2903c9n25K89K02L98m05m08P01m36M9L69J6k25P39j313P14J42n32Q07n33N46j124
2924e68K77J39k56N17l67j62J73ml99J315j176m86N66L93Q0n66L58Q94p41p09
2944g22Q43k71l52m93P28M22n68J395q55l16M83r17J042n67M39k29j95M36r64
2963f61J469n33l09R94r3k57Q05n70n99K57j172R30K0M01j346M70L62m10R42o95
2983EL83m68M54j25M55l91q52O73J01j020J035q2k80M76l64J215p53j87O2r60
3003f23O5R88p42l94Q37M04j597M13J218m39M22l53q91J177m36j04j98Q60n0j577
$$ plain form
2865 1262 604 -524 435 -525 -181 -450 876 -30 793 626 -929 512 1005 463 -355 -742 633 -127
2883 -127 -861 -1049 1261 65 -459 -775 7 221 254 -5 -521 -213 -933 -229 945 1037 -664 -593 321 -39
2903 -39 -564 -275 -73 325 -80 -488 213 -223 -174 195 211 -14 725 -588 126 268 -264 543 10 556 -568
2924 -568 -291 -152 -408 109 -258 -420 -247 -251 -650 665 -511 -997 -431 -38 42 -524 -166 728 -13 -722
2944 -722 121 -150 -502 -995 -267 155 -413 982 127 -189 294 -623 419 -148 291 62 -133 303 -661
2963 -661 808 275 -34 960 867 610 1415 845 246 503 -669 261 281 682 -664 -194 168 -242 700 5
2983 5 388 -80 374 249 704 313 -539 134 235 -785 250 168 -112 364 0 1215 462 275 337 -623
3003 -623 -558 430 -312 -706 131 535 -1062 -649 569 130 552 199 -692 485 49 -55 -253 607 557 -1020
3023a020K186j309m6m25Q26O96j390P66j35n32L55O19l34p61J457M98j567Q92
3041G76j050K84q0q43J753j362L95m28rO40k48j17M03N11Q8J00j196J08j49m35
3061h59O46l01L13R28p4j422J052l67J74l36M3P23l14m10J97J209p63o25l67N53
3081@n47l92P8J890K21j274M26M55r09r5J23L74K53o62Q8j150R9R66L86p43J443
3102A030j321J22j42R79m02n31j23N76q53N80O38j663Q18L84j43L31L19j008O30
3121B21J91l16N5n12l93Q25k00O82k11j299J672l83o49P0p5N6q9P92j106Q26m94
3142c37Q60RL29j899R46L20n87J157m98j373J668j223R59q02J272Q5m41K52j16
3161E81j439J469j45q00n75Q10M37m27m17J156M72o85l6j235L76p32R48J154J25
$$ plain form
3023 -1020 1166 -143 -189 -614 212 908 -482 284 149 -383 -28 591 257 -504 953 1451 -116 776
3041 776 -274 10 -70 -913 840 -522 -127 -555 -564 76 -172 -289 114 625 713 813 -383 -275 -424 -859
3061 -859 -213 -514 -201 727 653 -769 283 -84 90 -246 -203 520 206 -204 -7 1202 439 -186 -553 0
3081 0 -547 -939 -861 1029 1250 -24 402 857 -52 -147 -24 350 603 -59 29 -1121 -1022 -56 330 -413 1030
3102 1030 -291 -169 -311 668 266 -265 -388 188 -665 -85 553 -1110 -292 92 -51 280 599 -409 221
3121 221 412 96 151 -361 -754 71 -129 553 342 -957 715 332 -317 -247 -322 -266 -355 437 -669 157 -337
3142 -337 523 532 861 -1038 -92 228 -359 798 300 -1073 595 -628 331 -471 801 886 445 697 581
3161 581 -858 611 466 -334 -909 -99 338 -89 -506 650 1122 437 401 -834 -458 -1190 -242 912 1037
3180A037k449R69R05N0n58r20J371m16m75M00N54M5j066M54J67k88l2m33K97J75
3200b13L35m76P54O15n18o08O84N68j098k59J074k158J351m61K64o23J643j017
3218a43o35R35L73o90L81m08M13m90r16J542m89K65K00l09n50N41L2o07M96L51
3238B92k58M10k3j39l73j2J219j244J2P99j053l44J20J61j6j87J251o71j224J287
3258GR69j525J68J191r70j69J395o65m33K02l07J341j889P89k8n19P34j00m11
3277b20J80n19L80n76J099n27l79N34P28o19o39N63J93m41M0m0K15k0P46r97J76
3298a23PM43q54P75J56n43l16M73p0q19J085K01j901J116P82n28k30P05P7J64
3318F00p7j092k97j60Q22n33L62p55J699j491O91r2l79K47Q49j37l51j68J234
$$ plain form
3180 1037 -1412 -443 462 512 -46 -966 405 -11 -486 -86 468 513 -553 -99 68 -220 -252 -685 -388 -213
3200 -213 122 -354 400 1015 497 -111 573 1141 43 -216 858 -1300 51 -410 -146 -769 874 -143
3218 -143 -778 157 530 -160 221 -187 226 -264 -1180 362 -127 138 338 29 -521 20 52 -555 -59 292
3238 292 34 444 421 282 -91 -103 1116 -128 -116 683 -370 -714 -594 -433 -449 -636 615 -56 -1280 7
3258 7 976 -549 -381 810 -160 -329 1066 401 -32 170 -137 1204 -685 104 76 -443 291 191 -220
3277 -220 -40 -559 -179 -755 344 -183 -562 -28 700 81 -558 5 198 -243 -203 -243 -28 -48 698 -299 -123
3298 -123 -116 327 -527 248 404 -139 -455 18 -52 -871 214 415 -1486 -370 412 -116 -346 359 436 600
3318 600 523 -569 -866 -1026 -204 -737 -375 -1130 569 -922 -231 -323 -702 -455 394 257 -94 -262 972
3337I72j254N57R09j490l06R64p46R12j176J404q23m71Q80j275O90J431j585K46
3355a61l30P78O4j157J239Q7j563J073P62j252K63O51q35J8j33J255q19J97O19
3374G56r09l56P89p19n73J371p20M34J348k13k103J46J199j246N53O30Q36j104
3392A19p55J100Q37j118p0N96j148L03J260j096N49q62M22j019Q65p7l42K18P39
3411E21o21o58J370qm41r00J598j219m35R93o10N50L04j11k21j294J089l42L47
3430h8KM62L99o61Kk11j011K565j502j587K077L11n51m51M19Q46j589J64J372
3449I68j266N84Q76j408l26J911j066r4J33l13K17m86j82J150j924J927j56o60
3467a15q7P11j693Q76Q12k54r29J89L08k92J059K71l33k075Q72J003n89r0J028
$$ plain form
3337 972 -282 275 1184 -306 -612 352 -394 518 -658 746 -77 -548 332 -943 -253 1178 -407 -161
3355 -161 -491 287 351 -806 433 520 -1043 30 792 -460 -197 454 -381 -363 -496 759 -60 137 756
3374 756 -153 -509 280 -439 -1012 359 -361 73 1421 1208 -895 -749 450 -796 -243 387 1223 119
3392 119 -636 464 1301 183 113 709 -439 -136 1124 28 577 -285 137 -882 -17 -94 -436 -218 521
3411 521 -100 -758 612 604 163 -737 861 -358 -793 200 -410 140 444 333 112 -1182 -93 -435 -88
3430 -88 -86 376 775 114 116 -95 -1106 1459 -43 -1630 447 758 207 -244 175 1021 -568 -404 968
3449 968 -298 286 1162 -246 -572 1339 273 179 312 -1 216 -270 -452 698 -1226 701 545 -115
3467 -115 -202 509 -1184 -308 504 250 -679 -490 -182 -474 585 856 523 -1552 -680 323 -266 -356 672
3486F72r38j54P67k09j668J397J042r00qK94q19m1J351r36j14Q88m23r02M37J237
3506I73l87j321J410n02p42O59o0k12j29J475r57o02L20J195j971R10Q16j277
3524d02K51J028j29k309J907k45o81J137O4p47o04N07N44j278L14J017l05o49
3542e80J278L1j365N42J383j247k27J287j307q42J371N14q85L5J569j866q42R66
3560a85M76n57n0J524k758J175O87j5q40J327J04k016J741O98j095o40K50L45
3578A71j28l23M50m03K24P51j015n58J107J54k151J877J71p52L24J156o22p65
3596c32J84N09l95m39J213j163Q1Q07m78K64j77J133r73m27O17m60j216J312O57
3615G17j572J201O72j202k42n0N71r99Q08P44j268J38N29K86j655J068J986k226
$$ plain form
3486 672 -266 -420 347 138 -1530 -133 909 9 1 295 -524 -565 786 -150 -264 624 201 -701 -264 973
3506 973 586 -735 675 173 -569 90 30 -182 -311 1164 207 -395 -75 1120 -851 59 875 -402
3524 -402 -151 877 748 -1561 346 101 -580 557 621 -126 -730 -223 321 -957 -643 374 69 -580
3542 -580 698 729 -636 -94 1289 42 -185 1102 -205 -1047 324 838 -47 -12 1557 -309 -1151 -185
3560 -185 291 -266 -316 1208 -1550 -375 312 297 -543 784 888 -1128 613 1311 216 -424 -174 171
3578 171 43 -280 170 -233 -9 742 -273 -831 276 430 -1721 156 327 -425 -101 1055 433 -332
3596 -332 -148 361 -34 -473 740 -423 -342 465 -13 251 74 1207 234 -193 424 -36 -1252 60 717
3615 717 -855 346 1018 -184 -426 -476 95 -904 -96 648 -620 -482 47 333 -1322 -254 1732 -494
3633d94K04R60K35j516J188J81k417J672Q03j315J52J282j381o71K078O7j773
3650g45J41K178j964M80J355q58k707K472m17J84j383J362r33J76J499O30k762
3667a292J467Q07j283M54L1O44j594J347J326k958Q78J578j552p14J945j342j524
3684a782K351K6o48n6J226l76j090N37Q47j410k33J353r36n50L94N41o93L80K46
3703A27o71M11P33j4j298J203L11m79J143n33j428p62J842l44l48l22L88m5M33
3722C47O83j525j110J398N80l07n51M72O08j664J868j008o15L10R31l43R5P27
3740H96j551q2R79K70j498J751J07j212k66J256o03j007J219P4j497J129R18m20
3758D63j352R66k31n98P46K11m38Q9L10m81m21J800l6k309J286M44P38k112J481
$$ plain form
3633 -494 -290 670 905 -611 577 758 -1659 13 816 -499 -347 935 -446 -1117 961 1028 -745
3650 -745 -604 1574 -390 90 1445 587 -2120 352 -65 119 -1264 98 -835 -659 840 1470 -1292
3667 -1292 175 982 -301 153 184 828 -766 581 1907 -1051 -173 1405 -147 -861 1084 -258 -1782
3684 -1782 569 595 -53 -109 1117 741 -349 188 1035 -375 -608 745 -191 -741 -347 194 -499 -119 127
3703 127 -544 -133 600 586 -712 491 802 323 1466 933 -495 -1257 585 241 -107 -429 -41 -86 347
3722 347 1030 -495 -1605 -207 373 66 -485 -13 595 -1069 799 -209 -824 -514 417 74 169 896
3740 896 -655 -737 242 512 -986 765 872 -340 -606 650 47 -960 259 333 -1164 -35 883 463
3758 463 -889 77 -154 -752 -6 205 -233 -144 166 -315 -736 1064 1028 -1281 5 449 1187 -925 556
3777E56L5j209J112J12q81j000O83J122j388P02q4q36R00J021j624o60J529K01
3795B91j610J390K85j65jL15m57r08m03J468J96m57O58j037n35J385o56m44R70
3814B85J327j046j070J014n33l23L31R19m76Q25p72q58l20J567j196n83N64J232
3832H87j333P57o31j097J519L83l3j803O44J409j118J19K07j052J233P88j77o74
3850B8J37J00r44L56K56q8J92M12j51p4p83J433j160m13J805j373l0k22J163j526
3870h82J159J49j005n5O71l65r38L60L90K89r44J969r02j88J64N92J07j298J213
3889D86q05r8JK25o85M34Q10k25j249J136L8M49n04M23j94j576L58J607j526Q81
3909a4N0o56q9J846k487J372O4j43n40O45j5n12O82j58Q44j016J40L63p55J18
$$ plain form
3777 556 591 -618 494 606 -275 -1275 -592 530 -858 -156 -240 -1076 -176 845 -779 -1439 90 291
3795 291 -1319 71 356 191 190 505 48 -860 -1263 205 401 -56 602 -435 -970 415 -241 -685 285
3814 285 1612 566 -504 510 -23 -346 -15 904 428 1253 481 -377 -697 870 -326 -909 -345 887
3832 887 -446 311 -320 -1417 102 485 452 -1351 -707 702 -416 -297 -90 -1142 91 879 702 28
3850 28 165 265 -679 -323 -67 -155 37 449 298 224 -559 874 -286 -699 1106 -267 -297 -519 644 -882
3870 -882 277 426 -579 -634 37 -328 -1266 -906 -516 -227 -1171 798 -104 -292 -128 464 571 -727 486
3889 486 -319 -417 -416 -191 -876 -442 368 143 -1106 30 68 517 13 436 242 -1334 -976 631 -895 -14
3909 -14 36 -620 -709 1137 -1350 22 86 -57 -597 48 33 -479 203 45 889 -127 13 376 -379 -261
3929b61J078M76j350j88L32r51J816o27L41o96M65r74m59J33J565o6k33k80P5
3948A96r11O86qm73P01Q9p59k9J572p11k73j174Q69k2K63J14j35j54PK73j006
3969h85J148J43m65N39L37j594L47J621j290m82J108R9j121N78n6Q40j439J392
3987H20q89k8k23K74k3m72P52o25M74k84M14m24k12Q51p72L70k6k13M31m83J77
4008a11r1p9L9K41NL37K20r53o6Q23o46j59Q76m97o04J504o60N47q96J30m78N60
4030D2N0J5M21j252J003m23p7N69M03r16L9O47K12m85n59j88Q73p23M38J97k83
4051CM8L62O40o4n67j911K074n83j692K109j1o01O9J30M2l21j93K13Q78l11k51
4072F3J162j341L70j10j56M5k92L3P5J396q00q00Q13k07j61l60N33r81N08K62
$$ plain form
3929 -261 817 1293 -57 -245 87 -864 952 325 666 -30 435 -539 -998 -865 700 634 401 121 196
3948 196 -715 -29 -37 -510 191 280 -479 -508 1064 353 80 -1094 -225 -247 16 130 -5 -159 -152 121 -885
3969 -885 263 406 -59 480 817 -777 -430 1191 -99 -581 527 626 -495 83 27 867 -572 820
3987 820 -69 -97 -320 -46 -69 -541 211 -414 60 -224 190 -234 -446 405 -367 3 -23 -236 195 -288 -111
4008 -111 -202 -281 -242 -1 4 341 561 -392 -458 365 -281 -440 436 -61 -665 839 179 726 -170 -40 -518 42
4030 42 92 107 528 -724 279 -144 -221 348 751 -165 -126 521 733 248 -311 -499 374 -349 89 286 3
4051 3 51 413 1053 989 422 -1489 585 2 -1690 419 408 -193 -124 6 48 -273 -466 -253 625 314 63
4072 63 1225 -116 254 144 -12 33 -259 -226 -151 1245 445 -355 458 251 90 -270 263 -718 -210 52
4092E2m45N74K99l93o8O3K15o91O35k54k28K53n2Q4n18l57P03L51l01o90j24O29
4114b63Q44j470J489j642J470J61j791Q70R30j017J15L62m20M02L52l55K02l1
4132B08o80Q4M47J77m5L38m38J51r7R2n27K0k78M94j32K45O7m05nJ81l29M65N74
4155F07j320K56M94j22j70O35q55O43m26m16Q86q0j75M26o39N93om7M30n98J14
4176B30l82j27O33J10J20O08j272m89O41n30N42j353N65J097j035J063o94J216
4194I43p59m33o99J110n92K77n52N04K11Q0p27N47LJ80j120P55l6P27l57N3J089
4215A204q77j96L49m09j85J83j58K83j367K040j563N14N25q63L16L44j618O93
4233g85Q47PP31j013m59K70q2K24o9Q4j34M99o1k19o13J482j429N88J81k8J43
$$ plain form
4092 52 -393 181 480 87 19 82 297 -394 241 -13 -241 12 -40 44 -474 -831 -128 223 -78 -768 -892 -263
4114 -263 581 -889 600 -1042 428 589 -1202 -332 598 -419 -304 58 -362 40 392 37 239 208
4132 208 -472 -388 59 236 191 529 91 242 145 237 -290 -270 -548 -54 -186 59 126 -279 -284 -103 -432 33 607
4155 607 -713 -457 37 -85 -255 380 -475 168 -258 -674 212 132 -43 383 -256 337 331 284 714 116 230
4176 230 -152 -279 354 464 584 1192 -80 -569 72 -458 84 -1269 -704 393 -642 421 -273 943
4194 943 184 -249 -948 162 -430 -153 -705 -201 10 90 -637 -90 -87 93 -1027 -272 -308 419 62 115 1204
4215 1204 327 131 480 71 -114 69 -89 194 -1173 867 -696 -182 343 -520 -204 140 -1478 -785
4233 -785 62 69 800 -213 -672 -402 -484 -260 -329 -245 -379 120 59 -160 -773 709 -720 -132 49 21 164
4254A64n4k68O1j7q54J627M72p34r31L94O85m41j148Q04L68o1J94p01L00o25K06
4275e59M07J42L54K13j82k12p28M69K15P93q80J3p16J452n10n25J50L3O16j672
4295a127J161J101j506J6J259p89N70j698J629n85r5n28M00l80J530p84m9j12
4313A3j42L46O0k51k69j60Q10o46k88R17N12l22K68r76J11J88l46K87k77j98O28
4334B65R0j128M53R45r43L64J49k73j66O06R4j7m33j044Q87N3o5j26Q73k59q66
4355e41J31P07j249P03K74l54l66P99j99o31J377l02L91k6p10j7K88r50r6J269
4375D98l99k26j10O98r28L63O09n94J23J00J042p52K43K27n83M1l79P84n09o08
4395c60L73j192J553L14L98l11j298N18m54M62r6k09O11P0R9o39O54l67k86q29
$$ plain form
4254 164 110 -158 -97 -114 -968 659 1131 397 -534 -140 545 104 -1044 -240 128 67 261 -440 -140 -765 -559
4275 -559 -152 -10 344 557 375 163 -565 -96 119 912 32 45 -671 781 271 -254 -104 -71 545 -1127
4295 -1127 34 1135 -371 -355 904 115 685 -1013 616 31 -64 -592 -192 -572 958 174 125 13
4313 13 -129 217 277 26 -243 -403 407 -239 -527 390 902 580 848 -128 -17 171 -175 112 -165 -363 265
4334 265 355 -773 -320 625 -318 46 195 -78 -244 362 456 439 6 -1038 -151 -98 -163 -289 584 325 -541
4355 -541 -410 297 -952 -249 25 -329 -695 104 -95 -726 651 349 740 714 4 -13 275 -675 -771 498
4375 498 99 -127 -237 461 -467 -104 505 -89 34 134 1176 424 667 894 311 352 -27 757 248 -360
4395 -360 13 -1179 374 688 1086 775 -523 -5 -459 3 -93 -302 309 379 478 -161 493 126 -160 -989
4415i89J450o77N43n58J340q89J87l15q61R33j86j464J136J33r5l4P78Q06k013
4434g75L50r1K78Q6n0PL98m01R77o29o27O03N54p88O86p72K59K68j002P29o3l27
4456c30J280r10O12j323j87J25P41o58J545r11l87m8L32k1k28J97ml99J90R89
4476F05p91J80k19M73O8N02r36K35n5J38j92m81J29Q65o71m98J371L75m56k27
4496D15l16o97P97o07J00N74K35r88L85M75R9n41l49P28q96L16j5J531j816K11
4516c59N73L16r8q20J097p74K37j19J19p20J36L7m27N02P30o79J319n95j183j2
4536g20J450j77m96l27p85J227j07L61o61O24n96j043J312p39J013k01K17K12
4554E64m02P0O68j331k45O35k07k7Q3j17O56j73q19J296p40N49q05O32o89M45
$$ plain form
4415 -989 461 -216 327 -231 1109 220 407 92 -769 164 -22 -1486 -350 -217 -312 -346 432 1238 -775
4434 -775 -425 -516 -238 -152 -202 -195 203 -198 779 150 -477 126 680 -108 578 -194 65 333 -669 60 -3 -330
4456 -330 950 40 652 -671 -858 -733 8 -650 895 -16 -403 -451 -119 -140 -368 -171 -175 -574 -384 605
4476 605 -186 -6 -225 248 316 818 -118 117 62 200 8 -473 -344 521 -150 -648 723 1098 642 415
4496 415 99 -598 199 -408 -308 266 501 -487 -102 373 472 -69 -418 310 -586 -270 -285 1246 -570 -359
4516 -359 214 530 432 -388 709 -65 172 53 172 -548 -412 -375 -802 -300 430 -249 1070 475 -708 -720
4536 -720 730 553 57 -270 -1055 172 65 426 -235 389 -207 -1250 62 -677 336 135 352 564
4554 564 162 232 900 -431 -676 -41 -248 -275 -192 -309 347 174 -645 651 -89 460 -345 287 -402 43
4574D3j39n55Q61O02j110Q40l04k01r80J098K70n74M14P2r53L40N04N64l79r02
4594d89P7J54o6k0Lk4M6o02P31K91n01O96n31M30j89r13J001l22j91N9m53Q96
4616H3k07P7L24p90L00o4R9p17J030o77K99K89m40J604o70n37j12P30r71R05o95
4637a40m15J156p57L89k17O3O41j088p25J821j459O03J35J77m72P46P4r84K46
4656b06N72m67M8j81l6N31l09N7n03n68J672q91m05P15l45J050K23p16J70m23
4676a2J62L0k09K90N96q99N51j118M71P12l30q3M58q41n13R12k92Q80m96K1r91
4697g01Q48L99n78J92J31j386O42N76n69o0P43o87oK3J40K8K97n1N1j52L39n09
4719b90k49M20l26M09m38P31m95Q44k82j074N80K88o54N22m23N96N41j52M48q21
$$ plain form
4574 43 -96 -651 210 812 -298 542 238 37 -943 155 425 -149 265 337 -616 -276 228 792 413 -489
4594 -489 -412 -258 -324 -344 -341 -365 -319 -921 -190 101 -400 296 -235 195 6 -907 94 -228 -419 -360 -813 83
4616 83 -124 -47 277 -513 -213 -277 -178 -895 135 -542 -243 46 -394 1210 540 3 -109 621 -350 555 -140
4637 -140 -555 601 -156 233 16 79 720 -368 -1093 728 -731 -128 7 184 -288 458 532 -452 -206
4656 -206 366 -101 -53 -234 -270 261 -48 9 -494 -1062 610 -281 -686 29 -316 734 957 241 411 -12
4676 -12 150 180 -29 261 857 -42 509 -609 -138 574 244 161 619 -222 -735 177 -115 765 269 290 -701
4697 -701 147 546 -32 160 291 -1095 -453 123 -446 -506 237 -450 -456 -433 -293 -265 32 -19 32 -120 219 -290
4719 -290 -539 -119 -445 -36 -474 257 -238 606 324 -750 -170 118 -536 -14 -437 159 700 548 996 175
4739A75l66L14o27O45j1j015J491l64j51N15m82l57n69R78k20J05p03j17P86L44
4759C71j042Q57J96j156Q64m32P24l21k5kL29o90P61k73j95j2N89m76n75K21n36
4780h23J354o62j99K98q9p32J171k68M67K2M47m47m46n45J58J071q92L2J39r80
4800i24J668r67k45K51J44k00M95p4p62Q8j73Q66M3R87r42m02k2P7M55N86m50
4821D99j031J443j251L93N68n58O09j275K79J68R96p15J69j06M08q62n70J310
4839D74K14J11J13j354J050j155J218j045R27j89n35m36N59L59p57J097j370N99
4857a20Q52n67L10m18K1N74l97k99O48m18P53l90o44n63J485j621P69j038Q82
4876a81P20j147J088j94l76p72J59J124J39j032l92R87j23k41K22M4p52Q26K10
$$ plain form
4739 175 -191 123 -504 141 130 -885 606 242 91 606 124 -233 -802 176 -44 61 -642 -759 27 371
4759 371 -671 186 382 -774 90 -342 382 61 36 34 363 -327 434 161 -34 -46 543 67 -508 -287 -823
4780 -823 531 -131 -330 -32 -121 -853 318 50 517 539 986 539 93 -452 -294 777 -115 -83 56 -924
4800 -924 744 -223 -468 -217 -73 -273 222 148 -614 -526 -699 167 210 1197 255 -147 -169 -92 363 949 499
4821 499 -532 911 -340 53 621 63 672 -603 -324 -156 840 125 294 188 596 -266 -836 474
4839 474 688 799 912 -442 608 -547 671 -374 553 364 -171 -607 -48 311 -446 651 -719 -120
4857 -120 732 165 475 57 78 652 255 -44 604 186 939 549 -95 -658 827 -794 -25 -1063 -181
4876 -181 539 -608 480 286 -90 -862 -703 421 560 -472 -864 123 0 -241 -19 25 -727 99 309
4895C09j53p88O07l93J73N03M67n95j56R2m90L22K11J8k45J23o52j55J316j17
4915C97r70J369l03m63O52p20M11n65M03J24p08J079j05Qo18l81K15N91l43O79
4935G52j294J250q81J5N14m15l94L72L8q3O21M06j033N64j200N66J098j177P34
4954D53r51K76K87n12O42n81K01L10K33n94p1o41J424j404J668j243k10M27k9
4973c15j05Q52n55L41L77j226K48L72l61L73P30m87N36m51n56L5J094r41m44Q67
4993C84O0j227J391J5q24L80O7J64r01R64n83j23n52O10O87k63L29q91L96k53
5013a70M23K82m85l97pOM62K20l70M1n63N13J020p19j41J54k46N73p65O7J012
5034I10n94J40r63R02l3J01n96N89l26l47J2J194j070J12m89j33J494j831J581
$$ plain form
4895 309 156 -632 -25 -418 -245 258 725 130 -26 66 -424 -102 109 127 -118 5 -647 -802 514 397
4915 397 -573 796 493 30 682 -38 373 -192 211 335 -373 706 601 609 -9 -390 -175 416 73 752
4935 752 -542 708 -173 -158 356 -59 -453 -81 -43 -126 495 901 -132 432 -768 -202 896 -281 453
4954 453 -498 -222 65 -447 195 -386 -185 125 358 -236 -307 -948 476 -928 740 -503 -713 -286 -315
4973 -315 -420 432 -123 218 595 -631 -383 -11 -372 1 731 244 780 329 -227 -192 902 -39 -483 384
4993 384 444 -783 608 623 -201 179 246 410 -491 473 -110 -233 -785 -175 512 249 578 -313 83 -170
5013 -170 253 535 50 -347 -354 -348 114 334 -36 5 -558 -45 975 256 115 269 23 596 -169 -102 910
5034 910 316 456 -507 395 362 463 -133 456 130 -217 -205 989 -81 31 -458 -591 903 -928 653
5053F53r44M13L90n17K73k65P76q59J243j415k37J27R22j83j485Q79M18L69k11
5072C47m03O93j442N27M42P5m09J96J101j118M54l83j90q7J254q41M17m7m27n43
5092c84J79Q15p67K55M15j055J054l75k09M36n92O15j130l87J086L13k79O2m20
5111c68p43J087QO06n87M17k52N4o81O25O86j193M06l0O62o53L58M39q52n73P17
5132A33q46J66N18r8M45N98p79J89K71m64o43J135n17o60Q38k24L02J18m28LJ41
5153A98K10l52O7O71m64M78k55k40J75q96P56j17Kl73J22J58k83N2N46r53j78
5174f76P67m62J050r80J34O9P14k37J79M30j099k02n31R84n35J44R61p70o25J505
5194H20q66m75M38Q98j344j0Q4O48l38N66n32L06p38J248o08k50N19o82r3m15
$$ plain form
5053 653 -291 122 512 -5 268 3 779 -80 1163 -252 -489 -362 560 377 -1108 -229 189 558 347
5072 347 -56 637 -805 -278 164 239 -170 26 1127 9 463 80 -110 -197 1057 216 633 586 159 -384
5092 -384 -205 610 -157 98 513 -542 512 137 -72 364 -228 387 -743 -1130 -44 269 -10 52 -368
5111 -368 -1111 -24 -16 590 3 420 168 222 -459 166 852 -341 65 35 697 44 402 841 -11 -584 133
5132 133 -713 -547 -29 -127 318 916 137 326 597 133 -510 625 108 -552 286 62 364 482 54 57 198
5153 198 408 56 123 794 330 808 553 313 488 -408 348 231 233 -140 -18 140 -143 -91 455 -498 -676
5174 -676 91 -371 679 -301 -167 -98 616 379 558 988 -111 -313 -844 140 -395 -251 710 -60 -685 820
5194 820 -46 -521 -83 815 -529 -539 -455 193 -145 421 -111 195 -543 705 97 -153 366 -316 -409 -824
5214h24J164R2n38J022j392Q18P5N65q9o31q90M17o23L19Q89j60Nq2p51L79L17
5235H2j153J391n81O25j120N76k72P96m89K60J11o36M24o43Q94k74l41J67Q98
5254G15k23J88j10l62n43n25j8M09R9K24j47J303j723P87m7L05j228M98J048m05
5274B45L76j363J229l03q34K35J52l63P65J11q70P86j06m68j02R03k10k30l54
5293d01J145p11m75L09M95j219J148k102K015R4j481O89R10o31J180m51n44n5
5311h5j67k59J269k87j04q42O43R0N29l78l18M77p01P33r48O59p60R03j7K4L21
5332G82j042M49m63J04N61m18J53P2m90N72l09l20N07j20j65J086n54j95L2L92
5352F34n69R9j86K88l52q05O77m37N08mN42K46j65M87l71j158J87O78O64j285
$$ plain form
5214 -824 340 432 -106 916 -476 342 417 982 893 262 -628 -211 -834 -515 374 214 219 137 -614 -235 82
5235 82 -1071 320 -261 364 -756 -180 -452 344 -145 115 226 -410 14 -629 265 -9 -350 -183 715
5254 715 492 680 570 208 -335 -860 -878 -469 -370 -146 -293 1010 -713 74 27 332 -896 -398 650 245
5274 245 621 -742 487 184 -650 -415 -263 -626 139 250 -620 166 60 -408 -510 393 183 -47 -401
5293 -401 744 33 -442 -133 362 -857 291 -1811 204 298 -1183 -494 416 -215 965 514 -30 -85
5311 -85 -252 -511 758 471 367 -475 168 258 787 409 91 568 -133 600 -348 311 -449 454 437 461 782
5332 782 -260 189 -274 -170 391 -27 126 198 -292 280 -29 -349 158 38 -127 959 405 210 242 634
5352 634 65 164 -22 266 -86 -891 -214 -651 -143 -147 395 641 476 963 592 -566 -379 299 963 -322
5372c22Q56p77m05Q05k76J51k96j84L85m55J122n69P31m92L9p85k8K69Q6N01k19
5393A37l12R63l92M48q40j39R64r83M48m93q0J29o0j45O98j38q46J35K366j945
5413h5m83J002l78k26o83R21l06m55N25J21p70M05J99N9M09m63j19K84J4K74j16
5434A29m4O77j069L07Q4j33PN29l89k46J96K07L48m56r5r96O87P4l63J173m08
5455B19j46J34r94O93m31M57R93p66l57m9K86L15o20l39J295m46r77K029j008
5474B88K79o61r10N06J252m29j364Q39K2K06J01j52K37n21j28O16O71p40l78L5
5494b31K84K58k23k36J320n27k86j220Q07R63j940J169k71K26k95L54K13p29Q05
5513D41O5o71O07n14J366k034J764j004Q25j231M9N96j087N98Q53j791J727k7
$$ plain form
5372 -322 534 -243 -648 157 -119 32 -264 -448 -63 -518 604 35 766 274 313 -472 -500 -231 -145 356 137
5393 137 -175 788 396 844 4 -135 829 -154 294 -199 -279 -150 -210 -355 343 205 -641 -506 1860 -85
5413 -85 -568 434 56 -170 -853 68 -238 -693 -168 -47 -817 -412 -213 -154 255 -208 -327 -43 -29 245 129
5434 129 85 762 -307 0 84 -49 -42 487 98 -148 48 255 603 147 52 -944 -257 -183 -546 627 219
5455 219 73 207 -787 -94 -525 -68 925 159 -198 -247 39 354 -266 -605 690 244 -733 1296 288
5474 288 567 -94 -1004 -498 754 325 -1039 -200 -178 28 129 -23 214 -307 -435 181 852 112 -266 -231
5494 -231 53 311 88 -148 1172 645 359 -861 -54 909 -1031 138 -133 93 -202 152 365 -364 441
5513 441 506 -165 442 -72 1294 -740 1024 20 845 -386 -337 259 -828 -230 623 -1168 559 532
5531E32l02k59r7m9J18m98P08P19j082K94l71M51m38L39K25j030O89r40J033N4
5551I6m43K63j18j30J73Q54K23j300J234q49j45J54p00R89K32L1k06m38nN7J00
5572G2q33Q36N88m89r47N37q0M46P64j510O01N57N00j164J054j496R82k59o2K28
5592C25K42p82m6kM43M74k63k7j85j84k02L52P64n69o94K81K80r5m33J706j237
5613A48O84j471k6L99K00p31n1k14Q92K43O8J43j46l25Q01j124N47m9k24L65L77
5634E06l77n11j10k03J319j235N43Q90k85j217j029J587n98J151m28k36L72P17
5652H56q12Q44k27q14j96M91J7p27N3J022q85n48R85m13J638j407R97o97l32Q34
5672F79o72J66m47J401k087J064L2Q0J19J16l91K00p61K35P14j456Q80K12k97
$$ plain form
5531 532 230 -29 -126 -175 -57 -555 153 872 -210 84 -287 164 -274 65 290 -740 -51 -991 42 96
5551 96 -347 -84 -202 -332 -159 695 918 -382 852 3 -142 12 -688 301 533 564 358 -80 -85 -28 72
5572 72 -761 75 663 174 -773 -236 -316 130 894 -616 -15 542 1042 -122 932 -564 418 159 97 325
5592 325 567 -215 -261 -263 180 654 391 364 179 -5 -207 145 909 340 -354 -73 207 112 -321 1385 148
5613 148 832 -639 -665 -266 -66 -797 -848 -1062 -170 73 141 284 138 -187 614 -510 37 -12 -236 129 506
5634 506 129 -382 -492 -695 624 -611 -68 822 537 -680 -1709 -122 -720 431 3 -233 139 856
5652 856 44 888 661 -153 -349 142 159 -568 -515 507 -378 -926 59 -354 1284 -123 874 177 -155 679
5672 679 7 173 -274 1127 -960 104 136 216 335 451 60 260 -501 -266 448 -1008 -128 84 -213
5691b13l38M88j87P51n01P93j376J148p71l60J88M53L02j572R29o25P26M6M06
5710B87m2p52p3J642j990J148r49M52R34n6l82n50R48q73L54k94M57l66p02J756
5730I49Qm11o52N16j15q12M94O34p02m38J37N29l11l01k57O16L44O82j261M72
5750A21O5O3k30l57J047q75L5M44j038R17m1j44k54K28k25L37m2k87K70j54p9
5771a99lo97J126J24q26j05L30L53J02P17k191J748n42M85o75L67n40R32k69j46
5791I1n58K69N07l84m13L68L1K75R72j531J1L65J174j894J67J017r13O00j20N41
5811E75p45N50n79m25L51l73O5M87N8j83m67O23l12M91l50M5k61R6K68n35K42
5832c79P49q8l84J31j06j4J96j008N70L46Q7J88J02n53J22R85p14j76j001Q88
$$ plain form
5691 -213 -551 -63 -250 501 0 793 -583 565 -206 -566 -378 75 377 -1195 -266 -891 -165 -119 287
5710 287 245 -507 -580 1062 -928 220 -729 -277 657 601 219 -331 617 -256 98 -196 261 -105 -807 949
5730 949 957 546 -106 410 295 -517 -23 611 -91 -529 -392 137 -174 -475 -732 -116 228 910 -351 121
5750 121 186 249 19 -338 709 -166 -131 313 -725 192 151 7 -247 -19 -244 93 51 -236 34 -120 -199
5771 -199 -202 -899 227 351 -475 -580 -250 103 205 922 -1269 479 -63 422 -253 114 -426 506 237 91
5791 91 -467 -198 309 -75 -488 -120 -89 186 1158 -373 -362 3 1177 -717 -550 467 -446 154 34 575
5811 575 -170 380 -199 -624 -273 -646 -581 -94 -36 -219 -686 -63 -375 116 -234 -189 -450 -354 -86 -621 -379
5832 -379 370 282 -102 29 -77 -91 105 -903 -333 13 100 288 390 -163 -41 944 230 54 -947 -59
5852e9j315J707m21l79n95k5Q43p8Q60q20l43J208r8n93L02k10l69J54k61N44
5872E2k41L14r26J239l77o71K58j1L39k5N17K31r91J47K08q99N88M86j07j069
5892i38Q82L31l96O95p50KO74o13L45l57M44n03p57P99J466k075J64J378j311
5911e20J85N01k28L84m23J69l51K27J14l72K81m22O82r63K95J63K48J05l55R82
5931G02r82N59J35m96r3n01J13J010j67p20K52l65Q34J241j568N2r67O02L50k00
5951b09N55q2m37J008m02l94K10k34j284J364o68J149p28r41P81J24j80K71p6
5970a73P26p10K39l96l0P62J22L07k02K00n49L5k07l23n21J129j80N05j320O32
5990D6J16j18l69Q80l60j82q76M94O00K07o22K12q59J247N11j097K74L75l10n56
$$ plain form
5852 -59 -1374 333 -88 -467 -1062 -1087 -244 -322 538 -282 -625 583 485 -108 194 -16 -385 -231 -492 52
5872 52 -189 125 -801 438 61 -610 -352 -363 -24 -49 468 699 -292 -145 63 -836 -248 238 131 -938
5892 -938 -56 275 -121 574 -176 -174 500 -113 232 -125 319 -184 -941 -142 1324 -751 -587 791 -520
5911 -520 -335 166 -62 322 -101 68 -283 -56 58 -314 -33 -455 227 -736 -441 -278 -30 75 -280 702
5931 702 -280 279 414 -82 -175 -676 -563 447 280 -440 -188 -553 281 1522 -46 6 -961 -359 -9 -209
5951 -209 346 264 -173 835 433 39 249 15 -1269 95 -573 576 -152 -1093 -312 -188 -368 -97 -173
5970 -173 553 -157 82 -314 -344 418 540 847 645 845 296 331 124 -199 -720 409 229 734 -586 46
5990 46 162 44 -325 555 195 13 -863 -369 231 438 -184 28 -831 416 927 -170 104 479 169 -387
6010c87r8L86o3J436j342K59Q88j020L48p54L2M71q3J03N42k12j30M24r43J76
6030C3L61j05n90R38j10p99M67r76L5M03O42p39M81k75M38L8j358J426m40L15
6050A85m87L02J4p64R35K23j85q7P23o81l40P43M69o37m25M2p7m86J030q90J10
6071b83m6K71M61j024J64L84k67j68j24Q71o40k73J421r80L72m28M92n08L88N63
6091F46j267K95m08J812r17K3M20k38o70l15Q88n52J54J75J255j477O07p94L54
6110im10K0O16p98O57J47n49L40k18j66L01L21m53M82l31N94l25l14m00J375p70
6131A10k8J75M43m45k36M27j28j00p61N72L39m18l17L97R7O73r94j39K3L73n09
6152d46M74R0K94o87M87p57L89J092l09l01Pj192M56J231o56M13n00l92P56M5
$$ plain form
6010 -387 -485 -99 -162 1274 -68 191 1079 59 407 -347 -315 156 73 176 718 506 376 800 -143 33
6030 33 394 289 -301 637 527 -272 195 -781 -746 -343 299 -440 41 -234 204 242 -1116 310 -130 185
6050 185 -302 0 14 -750 185 408 223 136 859 178 -162 581 1050 413 -12 30 -47 -533 497 -393 -283
6071 -283 -329 -58 403 -621 -457 -73 -340 -508 -632 239 -401 -674 747 -233 139 -289 203 -305 83 646
6091 646 -621 -326 -734 1078 161 184 604 366 -304 -619 269 -283 -129 46 1301 -176 431 -363 -9
6110 -9 -419 -399 217 -581 76 223 -326 14 -204 -370 -69 252 -201 281 -50 544 219 -95 -495 880 110
6131 110 82 257 700 255 19 446 318 218 -543 29 368 -50 -367 30 127 800 -194 -333 -310 63 -446
6152 -446 28 118 412 -275 212 -545 -156 936 627 326 333 -859 -403 828 172 585 85 -307 449 494
6172D94q43L83K60M07M3r71m8J97J05q21Q26j71O64k79j169J856n24n39M00j412
6192a142J135kj36M31j87P22r94K03M98Q2j152O6L14M68n54O08k42k40K85l52
6212a89pJ21k18K17K5l6R08m57r11N26l34P61J35o28l88J065n20O27k72l08M99
6233F16n73N00o98P00j029M48j37j138N80Q17o99Q85l08J93j026J257J56j26p5
6252C43r53R78j40j39q1K93r80K38N58N78j312J527o68M54j387K62k3Q68j69K71
6272E18R1p62j82P63q80J50O8m88J081n67J993j813O02q8j036N37J5L32jl4L35
6293F34p48J81k72N6k5p95P45m66o4L19J107j454L09N11k91J330j035l89J097
6312G50m79k49m36Q10j13l74j6k95Q29l46j91L28m29M2n98J206p62K51J7L68j21
$$ plain form
6172 494 -349 34 294 701 744 -227 -275 -78 27 -794 32 -139 525 246 -923 933 409 -130 270 -1142
6192 -1142 -7 -9 -145 286 99 821 -173 30 528 610 -542 -476 -162 306 -248 360 118 -122 163 -189
6212 -189 -196 -75 -293 -76 -51 -87 821 364 -547 -21 -355 406 541 -87 -475 590 70 697 425 117 616
6233 616 43 543 -155 545 -484 -36 -173 -1311 -731 86 -613 272 -36 157 -869 388 544 418 343
6252 343 -610 368 228 89 8 301 -679 -441 117 695 -617 910 242 696 -691 -429 -452 416 247 518
6272 518 609 -153 -335 428 -452 -302 -234 -722 359 -208 1785 -28 574 486 -550 -13 2 334 333 299 634
6293 634 -114 67 -205 -149 -174 -969 -224 -690 -754 -435 672 -782 -473 38 -253 1077 42 -347 750
6312 750 271 22 -414 396 283 -91 -107 -402 427 81 -110 218 -211 -169 -767 439 -323 -72 -55 313 192
6333A92r10R54q58N79M50m59N03M96j151J006m00L14l27p2q7J46q48j84L73M55
6353A72r92Q5J159j027j00Q85P0J46m04Q36j96p97N14m81j58J37N86j57o98O17
6373A97K82o56M23m36n77J183r86N60P0o05J09k5P25k09j14N01j73k06O79k72
6393D70Q9r63N65j36q44M31j4O42M84j546J250l59m31P28l17J91l7J12j87Q80
6413A008q20m72j71O40R09j083j41M19j948J017l12m91K593m73p27m12M5P54p3
6432B62j39j73Q72j387M1K24L49l73K71N19K43k40j047P8m26J555j40p34r52R12
6452b85O47q3j361J629n03p25M78M54k82K04n43Q05P61m19j317K63J094j281Q86
6471D22J67p03O32l10p31M6M13J15L9N53q87K59K37o27O32Q6j71N51Q3j332L83
$$ plain form
6333 192 -718 236 -622 -43 407 -52 451 947 -204 802 402 716 389 317 230 376 -472 -656 -283 172
6353 172 -820 -735 424 -603 -703 182 252 398 -6 830 634 -163 351 -130 -288 -151 435 278 -420 197
6373 197 479 -177 246 -190 -767 416 -570 -10 60 -545 -436 -461 264 55 -59 442 269 63 742 470
6393 470 559 -404 161 25 -819 -388 -402 240 724 -822 428 69 -362 366 49 240 203 315 128 1008
6413 1008 188 -284 -455 185 1094 11 -130 289 -1659 -642 -954 -1445 1148 675 -52 -464 -419 335 262
6432 262 123 -50 822 -565 -524 -300 49 -324 -53 466 709 469 -578 -500 -926 629 489 -245 -1197 -285
6452 -285 362 279 -1082 547 44 -681 -203 251 -31 173 -370 435 1196 777 -540 -277 817 -464 422
6471 422 589 -114 518 208 -523 -477 -64 51 90 643 -244 15 252 -375 257 343 172 723 806 -526 -143
6492a43O8K09j089L39J267n88N21n65J04P2L62q11O8O03q36P38j83l09Q35q67
6512b05P05m97O6M78j51m06Q89o55r36J111q93Q84p17J5j36J282j299n26M42R65
6532D16q07R66l4M21o62q96P17j50p0M29J9m85K98O41m90j03r3m20M74k23n30
6553e82N70P0N53j69L74j100O15L99p45j56j79O63n79q2M35J015j157K3k71O8
6573b35P78m95l03J409j121K57j171L31R86p84J88Q58n27m26L4N23n81J168j306
6592d17l22O70m51L75Q5K63M01j156J239l62l27n6K27M36j179N59n45O51N49j190
6612e50P14K7j039J029M50m92k4n0k05j34O49j336J253n10O32l75J39m76L00k41
6632b39N03L40k40j144J060j77L23L08p47o87j4R96q09O37N71m98N79p28l01n34
$$ plain form
6492 -143 -75 134 -955 -616 651 63 584 19 123 195 557 -254 -186 417 -419 319 136 -173 662 -205
6512 -205 500 3 69 547 396 -10 879 224 -712 399 -494 390 -327 -312 -448 834 -465 -991 -549 416
6532 416 -391 575 541 962 300 -596 121 -29 -99 330 349 -136 162 803 313 210 117 -303 171 -52 -582
6553 -582 -12 58 611 442 816 -284 331 730 -15 -171 -350 313 -266 -348 87 1102 -55 -32 -303 -235
6573 -235 543 48 -255 1154 33 290 -881 -550 436 -348 -160 698 171 -255 -221 302 -279 889 -417
6592 -417 -739 -69 -520 -145 -60 203 604 -552 687 325 -2 -58 169 605 -574 -15 -560 91 640 -550
6612 -550 164 191 -848 181 631 139 115 65 -140 -274 375 -961 292 -218 414 39 178 -298 2 -239
6632 -239 264 604 364 -780 280 103 426 734 -13 -700 -714 282 -527 110 681 183 762 34 -267 -801
6652h01J01j62Q34Q2M95j23p38J401j428L65No43J56j81P29M51n44O4q42J010
6672B31k16N79j34j29M6q78N71K90L44j81q00l17J008n83J309j464N54k32J35
6691A33k28P90r30j63j79Q84j695J604n9Q2k09J21m17K51o64J120k07n26k47J25
6711d14M47N0o22M12l10k49P87m60J178j353l91M35j13L35K86k3m71j40P46N00
6731F30l03o35P10n72n06O07q6r7P17K2k31j15K79j60M24j081Q5J3J304r00K38
6752C43k26k98l03L65r5k10K06J7j35P05J21j207J432j026K82o83Q04P89r21P97
6772G57j28n36P91q13j23m10K12P0P31K99r89l23J18O72l49J23m17o90J373O60
6792A028l97J07p44m87k05J143Q55k301K95J54k95J271m59l57M68L11j066R63
$$ plain form
6652 -801 -700 -862 -28 54 549 426 -312 1089 -339 26 31 -612 -456 -637 92 543 -1 63 -779 231
6672 231 15 594 460 331 377 -501 70 360 704 523 -277 -594 414 -169 1140 -324 230 -2 133
6691 133 -95 695 -235 -398 -577 307 -1388 216 157 239 30 151 -266 -15 -679 441 234 -292 -539 -414
6711 -414 33 83 -539 -127 -437 -686 101 -359 819 -534 -925 -490 -603 -268 18 -5 -476 -616 130 630
6731 630 327 -308 402 -170 -676 -69 -155 -252 465 487 256 141 420 260 684 -397 -312 -299 1005 105 343
6752 343 117 -181 -484 -119 -214 -424 -218 -201 -336 369 490 -717 715 -311 -29 -712 92 881 -40 757
6772 757 629 93 884 71 -52 -462 -250 -180 551 850 -139 -462 -344 328 -21 102 -315 -1005 368 1028
6792 1028 631 738 -6 -493 -698 445 1300 -1001 -706 -552 -847 424 -35 -392 76 387 -679 284
6810B84J05o11KJ184j258K14K70j34L10o34L95k6M66r59K02O61p51M88o48N31
6830I1L08P29p29o15l91K87Q73j253J097j086K6P89k34M9n25R36n61K26k76K80
6850B1k05N2M75n10j109J190k86N89q70J213p43n5L72P10j136N72J426j628j35
6869e7j088M4J523q1j361R22N21n24L57q85J81N19M39m14M27o00k56P33k49N51
6889G02q49J47O05o74n7J55l96Q21j108j4L09N36Q3r06Q59k87P07n37l03n2N12
6910B53p89J98j22P47m16N29q94M28p13Q08J173j001J92l40K00m92K56n53J344
6929H08k44n24M79j120R74n20j066O27N29O77M7j409K018j857Q89m82Q94n81l90
6948b51M05o37O70m67K25N7k38J616j815O36N7l30l13J289j403N66J90j340k93
$$ plain form
6810 284 389 -222 -220 964 -294 -80 190 56 366 -268 127 101 567 -392 -190 471 -280 208 -440 91
6830 91 399 1128 399 -216 -607 -320 553 -700 397 -689 -663 126 -108 -59 -584 352 -209 17 -259 21
6850 21 -184 -132 343 -167 -1276 -86 -372 217 -653 560 -183 -238 134 844 -292 280 1706 78 -57
6869 -57 -1145 -1101 422 341 -1020 -98 423 -101 256 -629 -448 71 510 96 523 -77 -333 400 151 702
6889 702 -147 0 605 -69 -126 29 -367 454 -654 -668 -359 177 260 -646 213 -74 633 96 -207 -259 253
6910 253 -536 -338 -460 287 -129 400 -494 -66 -779 29 1202 201 393 53 253 -239 17 -536 808
6929 808 564 40 519 -601 373 -147 -1213 -586 -57 620 667 -742 1276 -581 308 -174 720 139 -251
6948 -251 154 -483 187 -280 -55 2 -236 1380 -435 201 258 -72 -385 904 -499 67 257 -1083 -1376
6967a376K293p19j65l6k75J504j131j008R83l52k48J338n08l87K05O62j491R68
6985B57L06n80n9k34m82J377j456J200j13L88j050l23L95M08N8o44Q87J18q53
7004d00M82o84O65O0Q4l31M70J21o51O3J73J74o29J36J098o58O15j392P63j21
7024C8K78M7p99L15n90R75K26o55m6N8O59K26j362P32N73p01k71K2L74O4m01l75
7046f13L94R48j044K63j80K62J02J19K03q27N04k28n46J419p20j578K124j239
7064f37Q50j05O21o4n48J01l75r05N63J172n64o40N2J089r29p8J053n0j011K35
7084a70K05j398J151K29L13J52q16R97j440J356j087R9Q75j53J72j01k11k34P5
7103A4J014K72k046k67Q06m3M94L26J3j1j36q2l18L39R11j496J53K4j23j39Q33
$$ plain form
6967 -1376 917 198 33 -3 -278 1226 95 -913 70 -282 -530 808 300 -87 118 780 -711 257
6985 257 563 -17 -76 -310 -792 585 -871 329 216 604 -446 -769 -374 34 92 -552 335 453 -400
7004 -400 82 -602 63 123 207 -124 346 467 -184 -121 52 226 -403 -267 831 173 788 -604 159 38
7024 38 316 363 -436 -121 -711 264 490 -165 -211 -153 506 732 -630 102 675 -26 -297 -275 99 163 -238 -613
7046 -613 -219 729 -315 -52 -232 30 132 251 454 -373 131 -97 -643 776 56 -1522 602 -637
7064 -637 213 108 729 665 117 218 -157 -1062 -499 673 109 -531 -479 610 -319 -397 656 606 -405 -170
7084 -170 35 -1363 -212 17 330 482 -334 663 -777 579 -508 -409 466 313 485 384 173 -61 14
7103 14 1028 1300 -746 -1013 -207 -250 244 570 583 572 436 354 36 375 1286 -210 -57 -33 -156 -295 538
7124E38j477M22N43N67o35o26L53K45K93L83j221J70K14k8k70N56j77k08j23L63
7144a18O00k50k25j400J428n5K23r57l52K93J64J076k96l42N47j089k93M33k70
7163h83Q81j388J054M38j118M44J200p84K91K5L13m17O56j103L10K78M51j82J60
7182F26n61N5k37k81j2L86K5O69q31k84N14n24N8q7P53m53J87M1l60l37O72N79
7204E98r80k62P40L75q7n41K04L52n80n30P06k42P76O65r74K18p69O15O59n66
7224C77k30m32j30LJ628j022n94j06J79L49o35J682r50j35o58N07L22k4n63J054
7244F22k01o4j62n18k46K24P96q45P2q28Q89M03l15j36P50j233P36j62p36K96
7264f58J181q23O42k29K40K33k56q73l49r56K648n34j894J525o99P67j113J440
$$ plain form
7124 538 -939 -517 26 593 -42 -668 -315 -70 223 606 -615 -445 -231 -259 -529 27 -150 -358 -481 -118
7144 -118 482 232 7 -1393 35 -20 203 -754 -1106 -813 -649 427 131 -211 336 -753 -1046 -613 -883
7163 -883 -2 -1390 -336 102 -1016 -572 628 -156 135 160 473 56 712 -391 -81 197 648 466 626
7182 626 65 120 -117 -398 -410 -24 1 670 -161 -445 69 -455 -397 -484 269 -184 3 44 -316 -653 19 598
7204 598 -382 -644 96 471 384 -157 47 399 -181 -711 -5 -247 529 1194 220 438 -331 284 943 377
7224 377 147 -285 -415 -412 1216 194 -400 -506 -327 22 -613 1069 119 -16 -674 -167 155 131 -432 622
7244 622 421 357 195 -323 -569 -345 451 -394 -322 -1150 -261 142 -173 -309 441 -792 -56 -218 -954 -658
7264 -658 523 -300 342 113 353 586 330 -543 -892 -1848 800 266 -1628 -103 -802 -35 -1148 292
7282B92m85k28N25P30q05M44j61j74n52O11n55Q48m4n54k19Q56q40q7Q21J062
7302A485j489n95J357k88l84k37J8M89l92p08J065l03Q00q85r12J301n11n29O20
7321i8n2N12k57O7k53n78J034K58j089R93o59K22n65N12m03L45p81J246j09l42
7341CL16j668J458n95j10O55m03P13q91P10q91Q17n23m47J384l68j206N78N89
7360A21l74P2M28p88R57j032N73P66n41R6j49J30l46J216j440J93N08m95r5K01
7380Aj17k68r7p03K132j094j7p06J476j23j35Q5j75k93O32j85Q0n48L37j74k4
7401H4j49p06J038l0p63L00R80p55M33l17M33j1q18O26jj444R46R75j000L48L5
7422B04O35J67q17L55j338L16O83Q62o15p21M00l41N6M98P23j487M89n93L21N32
$$ plain form
7282 292 -193 -421 104 834 29 473 312 138 -414 197 -358 490 446 -108 -327 529 -311 -398 423 1485
7302 1485 -4 -599 758 470 86 -151 -133 356 -36 -744 321 18 818 -67 -979 322 -189 -718 -98
7321 -98 -150 362 105 172 -81 -659 375 633 -456 537 -122 100 -465 47 -356 -11 -792 454 345 3
7341 3 319 -1349 109 -486 -596 59 -344 369 -522 188 -703 114 -409 -856 528 160 -1046 -468 121
7360 121 -253 -181 247 -541 416 -616 -43 723 182 278 129 259 -87 1129 -311 -118 390 -105 -200 1
7380 1 -116 -384 -481 -1184 948 -146 -163 -869 607 484 349 434 259 -34 598 413 493 -55 282 108 84
7401 84 -65 -771 267 237 -526 -226 754 -1 432 115 548 537 -281 345 344 -1100 -154 821 -179 169 204
7422 204 839 1006 189 544 -794 -478 205 1067 452 -269 131 -210 -154 344 1067 -420 69 -524 -203 329
7442C29q28Q65J0j11o52J536q49p59P89k35n08n2N58m36l64J363j294J133m50
7461D5P46o37j45P6Q04j219K99o86N18n0k38M89L03l89K24j72n72J123q62J245
7481I02j130q17Q40M26J06n51m7K49K43n56j06N15M53n07l46J01L43K78j391K80
7501g15J83k4l45K016n79q4o88m2J52j38L83j97k93L84q87P01k7j26r8n73N14
7522d83N02m2o15M77K29n40J016n34N90k59j54M24r31L51J31O81j46p42Q86o13
7542B28j67j44j60O84r26P30M49j91o47p02P22j48K46k70k8M50k85m43l39J166
7562B25J78j009Q06m62kR21l09Q02j485J84J44K78l88Q35p17n1O35q08K12J361
7582A350k129J011k60r25L52K75M06j23L90j81R1j221Q61m87J601o38q05L19M8
$$ plain form
7442 329 -499 366 376 265 -387 1149 300 -459 330 95 -413 -465 93 -343 -707 656 -638 495 45
7461 45 791 154 9 85 889 -330 -31 -717 -199 -249 -487 2 305 -84 140 -32 -604 519 -343 902
7481 902 -228 -1045 -205 221 327 -224 -271 -22 221 -335 -441 74 527 20 -326 -225 118 396 -995 -715
7501 -715 -532 -556 -901 1115 536 452 -236 -278 -126 -264 119 -78 -371 13 -874 -173 -200 -326 -424 -997 -483
7522 -483 19 -23 -638 -161 68 -472 544 10 600 341 187 611 -320 31 162 843 697 -45 841 228
7542 228 61 -83 -243 441 -485 245 694 503 -144 -846 -124 -272 -26 -296 -324 126 -159 -602 -941 225
7562 225 403 -606 200 -262 -264 657 348 1150 -335 -151 -7 271 -117 718 1 -50 585 -223 -11 1350
7582 1350 -779 232 -28 -953 -601 -326 80 -43 347 166 257 -964 -103 -590 1011 373 -432 -113 -65
7601f5m73o11J354O60p53R80j232l16O15J78j104p22J504j60Q93J97p59N5k58
7620a7j49N28J65J6j073P27q85k4J004n54O73o80P70j416J190O5j89n39l49M63
7640b74J35o45LK33O72J164j156k66J010j354J304n88k76m52J028o79J38q62R66
7659A01j4l14P87j9q9Rl2m1Q8l95m72K21J234m73o58l39L55J27l40J110p06l66
7681b26J089n46l47J17M00r62K93j2K82m23O50l2o26J71N96q76k30J015p83k90
7701g40P03M64j085Q92m07k84J055j260J204l04j121M86O1M64l62j43K30l45K56
7720b36K98n8P2j72K99l84m65O17q25J578n47L07m50L10n00L27n01L64l9K56l37
7741h6k31K39m51J080O1k92o32n26N54k61J06M83r5j32J22J17M99r76k54O93l07
$$ plain form
7601 -65 -538 -1149 205 865 112 1092 -140 -456 159 337 -767 -1489 15 -145 748 945 186 241 -17
7620 -17 -166 362 527 543 -530 197 -688 -712 292 -262 411 -269 501 -915 275 340 151 -388 -737 -274
7640 -274 -139 -784 -781 -548 124 1288 132 -134 876 -478 826 238 -38 -490 538 -141 -3 -865 101
7659 101 87 -227 560 541 452 461 429 388 476 81 -391 -170 1064 591 -67 -406 -51 76 -264 846 140 -226
7681 -226 863 317 -30 87 487 -475 -182 -194 88 -335 315 283 -343 -172 424 -452 -682 333 -450 -740
7701 -740 -37 427 -658 234 -173 -457 598 -662 542 238 -883 -397 -336 128 -234 -377 -147 -492 -236
7720 -236 62 4 76 -96 203 -181 -646 -29 -854 724 177 484 34 344 -156 171 -330 34 -5 251 -86
7741 -86 -317 -78 -529 551 612 320 -312 -838 -284 -545 -439 44 -51 -183 -61 56 555 -421 -675 18 -289
7762b89o28J209m52R3K19k63L53R5k79n7N08j057J053j210P27J236k179P47J60
7781a4M15k04J77L25j434K56M77n6lJ98rn8K43O2On7k87j87Q7m07O17O75r58L32
7805A96o4P14j360K5j2P35k73k37J75o84O26O42k44k19J067j087Q21n05m79j28
7825b91J64l06J1J92J71j61Q31r34O04j098R22M44m86k1n71N84P64k21j087J208
7845G19r13R80p14k01L25L23j115J095p8j126R96r00P34N48J49k58q93O97j04
7864B64J66l02n48M86J24K23j582R04R6n63L27J2J2J063n71k41l90O2K88O97k04
7885C23j72q9j62J4L11O22j258j4k71J059m47m02lk0O20J187j737l95J394l12
7905B48p87J405j350O71n26N42k36J6o16J257j152Q17p8m30J22J48K70N7j294
$$ plain form
7762 -289 -917 292 -160 -67 152 -111 242 337 58 1 509 -548 505 -705 22 1258 -921 -174 -14
7781 -14 401 197 374 699 -735 -479 -2 -58 -61 137 128 70 313 375 381 324 37 -150 -63 -470 147 822 -136 196
7805 196 132 846 -514 -489 -501 234 -39 -276 -101 -785 -159 483 239 20 1087 0 821 316 -163 -291
7825 -291 -127 -433 -422 -230 -59 -220 611 -323 281 -817 105 549 63 42 -529 55 819 598 -489 719
7845 719 -194 786 72 -129 196 519 -596 499 421 -705 291 -609 125 673 822 564 -329 368 264
7864 264 430 128 -420 66 190 413 -1169 -265 -169 -732 -405 -393 -381 682 111 -130 -520 -458 -170 527 323
7885 323 151 62 -100 -86 225 847 -411 -425 -696 363 -84 -486 -489 -509 111 1298 -439 -834 560 248
7905 248 -539 866 -484 187 -339 203 -33 -17 -633 624 -528 289 211 -219 -97 51 321 378 -916
7924i16J298L15p08R0r7J69n77j7R77K37r36O77n27J4m95m46J121p53Q86m02L1
7945e9l68L05K16K95p79Q04K9r7j378J122lQ59r66Q31m87o55M78R38j116K35j471
7966a267J593K47L46j252J44m4n22O83m2R14p06k5O12p73k33L55p1O6J36k07J08
7987F2J270j417P8p99N7P73K75q28J238M25q13j029J250q12k76O55l92m10N87
8006a06m40M25m02M14Q63p66m61P27K44r50J441m50q78Q65J48p66M74l0p88L91
8026d5r57R52l35o89J646p36JR02p70m37N76L73o65o14R15m64L57K98p26J43L30
8047E5JP23k51K30n35j058J243q13j18L21O09j360J198L11q85J111p68k1n76J285
8067G02j239P22K99r61N10q37P67l74J101l31q32O62m65K08m22J138j69M4Q15
$$ plain form
7924 -916 382 697 -11 79 -18 151 -426 -443 534 771 -165 512 -15 -1 -496 -942 179 -574 312 -90 -59
7945 -59 -427 -122 94 389 -390 414 443 346 -1032 90 87 946 -20 811 324 -331 147 1085 -31 204 -1267
7966 -1267 326 573 919 -333 -189 -233 -755 -72 -114 800 94 69 681 -92 -325 30 -41 25 161 -46 62
7987 62 1332 -85 -7 -806 -749 24 299 -529 709 1134 321 -708 542 -270 -546 109 -283 -693 -106
8006 -106 -546 -121 -523 -109 754 -12 -473 254 498 -452 989 539 -339 526 674 -92 382 352 -436 -45
8026 -45 -1002 -50 -385 -1074 572 -164 -163 739 -31 -468 108 481 -184 -798 117 -347 10 308 -418 -275 55
8047 55 56 779 528 758 223 -835 408 -405 -523 -202 407 -953 245 556 -329 782 14 -7 -583 702
8067 702 -537 185 484 -477 33 -804 -37 -411 690 359 -473 189 -276 -68 -490 648 479 523 1338
8086A338r63j235O72N01J12q39J101m43l14R32j108o33P01L0N77j265N02J045
8104G11m10p98L63K62r33L16q26J233M22k81J188n86m00P52j138j249J992j11
8122E07j340J087m19m9O63j54kj05M7r6O9j83r9O5Q1j5R9l40o48P54K92O84p57
8145A41n68O54n77n80J060m55N53N85j214j64k56Q37n44m28J108O67j101M94l9
8164A73j54J37K56j066L61J377n72j101P88k32L26l40M04l80R34j776J186O9p27
8183c37k23Q39l18p32r1K47M97k32
$$ plain form
8086 1338 375 -860 -188 313 425 -414 687 244 -70 862 -246 -879 -178 -148 429 -836 -334 711
8104 711 301 -497 -134 128 -805 -489 -1315 -82 340 59 1247 661 261 1013 -125 -1374 618 507
8122 507 -833 254 -165 -214 449 295 293 188 235 139 208 25 -74 -9 72 57 156 -184 -832 -78 214 898 141
8145 141 -427 227 -350 -930 130 -325 228 813 -401 -565 -821 16 -528 -956 152 819 -282 212 173
8164 173 19 156 412 -654 -293 1084 512 -589 199 -33 293 -47 357 -23 911 -865 321 390 -337
8183 -337 -560 279 -39 -771 -862 -615 -118 -350
8191c50
$$ Imaginary data points
##PAGE= N=2
##DATA TABLE= (X++(I..I)), XYDATA
0@%%%%%%%%%%%%%%j08K16k16K16k16L24m32M32n40O48p56R60j068J188j404J620
30H64j839K123k444K762l100L479l917M410m940N505o131O813p563Q382r267J0241
46E378j1314J2470j3736J5135j6677J8371k0240K2326k4664K7295l0270L3678
58A7752l7637M2279m7819N4575o3023P3919q8583J09485j41787J98633l27193
69b09399J143621j41119k153575J319990Q39464m50371r71876K73496R39904k78039
79C12096o51620N5612K55778P04192o35341r84645J059965R22335j314332p30266
89a006226J345944O13290j391332m05887J275363K28478j087934k9013O66584
98B09267P2472k00566m23317K2801Q19669j38024r35778J48751J072080j51560
$$ plain form
0 0 0 0 0 0 0 0 0 0 0 0 0 0 0 0 -108 108 -108 108 -108 216 -216 216 -324 324 -432 528 -540 648 -756 864
30 864 -975 1148 -1296 1466 -1634 1845 -2072 2338 -2602 2903 -3228 3585 -3978 4404 -4863 5378
46 5378 -5936 6534 -7202 7933 -8744 9627 -10613 11713 -12951 14344 -15926 17752
58 17752 -19885 22394 -25425 29150 -33873 40046 -48537 60948 -80839 117794 -209399
69 -209399 934222 793103 -1360472 -40482 798982 348611 -623265 -349769 590135 312096
79 312096 -339524 -283912 -28134 676058 40717 -943928 116037 1038372 -275960 -1006226
89 -1006226 339718 953008 -438324 -844211 431152 659630 -428304 -457317 209267
98 209267 281739 81173 -342144 -319343 500326 362302 -573476 -424725 647355 495795
108D95795j351614M92474J331931q99507q49895Q15506N06082m89236n07115L85860
118f9719M12027k67390j79111j90016K96173O05813p78701n55241J089955K97856
128F61646j089436j86167J080575J02037j102135J04137R47977k75934n94862
137c52162K04749K58252R5257j37745m21697K14276O14123l21599p19020L97545
147a68021Q52995n67811r05527Q41939O79831r26033l45806O95000K33060m41897
157e2270k73694L15737K37117j03932k47760k22585N33237L35740q91161j41791
167e11362R92791m5999r28960R6807R15885j95821q48615L44450N84463l14596
177H9043k77465M6398J66616K50405k35966m22279L23729N25433l98436o29850
$$ plain form
108 495795 -855819 -363345 968586 69079 -780816 34690 540772 51536 -455579 -69719
118 -69719 342308 74918 -104193 -294209 1964 607777 -170924 -726165 363790 661646
128 661646 -427790 -613957 466618 568655 -533480 -429343 518634 242700 -352162
137 -352162 -147413 110839 206096 68351 -353346 -139070 475053 153454 -565566 -168021
147 -168021 684974 117163 -788364 53575 733406 -192627 -538433 156567 389627 -52270
157 -52270 -325964 -10227 226890 122958 -124802 -347387 185850 521590 -369571 -511362
167 -511362 481429 435430 -493530 -396723 519162 323341 -525274 -180824 403639 89043
177 89043 -188422 -142024 24592 274997 39031 -383248 -59519 465914 67478 -562372
187e62372N38829O60375p35940n08100Q19872K47544o69828j07850M32326J37437
197B52293k84202j73984J55099J91475N2673l51208j96585O41337R8195q05418
207d20325J14564P49442k06925o64535K32540O18858l12781m75567L43694K29189
217B08154j75969q1996j01111J40089K77642k67187l34995L47092L87347m39103
227d0037m19137N90820L24032o90513j11856O01922l5858l95067J8038K49877
237I2221M8819j66127q8163M5117J92637O6021m08077j7375N81250j70089n68651
248c92417K96995M68378l10912m17370L35323L45128l65842j83821K72288M6727
258I4477m6409q0150j35562K23100J81236l21768j92208L85374K19838m97289
$$ plain form
187 -562372 -23543 636832 -99108 -607208 212664 460208 -209620 -317470 114856 252293
197 252293 -31909 -205893 -50794 140681 193354 -157854 -354439 286898 385093 -420325
207 -420325 -305761 443681 236756 -427779 -195239 423619 110838 -364729 -21035 208154
217 208154 32185 -49811 -150922 -10833 266809 -378 -335373 11719 399066 -40037
227 -40037 -459174 131646 455678 -234835 -346691 255231 219373 -175694 -157656 92221
237 92221 141040 -25087 -113250 -68133 124504 190525 -217552 -234927 346323 176234 -392417
248 -392417 -95422 372956 62044 -355326 -20003 325125 -40717 -224538 47750 94477
258 94477 48068 -32082 -167644 55456 236692 -85076 -277284 108090 327928 -169361
268a69361j73226N97499J6373n57561J21045L90428j17214k45909K9414J82631
278G4119L3539j15687j11066L6189K69128m9945m31554J90281M60279l23565l72893
289c41175L44709L04586l25070k69401L33430J77051k83763o3038J16418O0368
299E4115O1779j83200j20935K96377J05751l41011j15195M00008J05460m81311
309b18162l455M73510j14719l47050J29861K07420m8176j45608k7524J15823P9425
320A01345o0163j82978N1709L12147j44727l58357K65826K90725l04514k06095
330b35082K71266J73268k53853j29315K30437M7332j26130k0444j9357J04434
340D2556Q8700k17144o4366K64226L9506k82425l8417L32642j4189l53672J14882
$$ plain form
268 -169361 -342587 254912 271285 -286276 -165231 225197 107983 -137926 -108512 74119
278 74119 107658 -8029 -119095 -82906 186222 136277 -295277 -104996 355283 31718 -341175
289 -341175 3534 308120 -16950 -286351 47079 224130 -59633 -122671 -6253 54115
299 54115 115894 -67306 -188241 108136 213887 -127124 -242319 157689 263149 -218162
309 -218162 -221617 251893 137174 -209876 -80015 127405 79229 -66379 -93903 21920 101345
320 101345 41182 -141796 -90087 222060 77333 -281024 -15198 275527 -28987 -235082
330 -235082 36184 209452 -44401 -173716 56721 104053 -22077 -42521 -61878 42556
340 42556 131256 -85888 -150254 113972 153478 -128947 -167364 165278 151089 -202583 -87701
351h7701K72653j51777j51504Q9443R2963r841r2014l1035P3662Q6820n8767j80514
363a47612J15364K36658k22053j95501K77924J15698k53331p9866K19274O9112
373A35667k06942k8068J54521m719m5653m9316k7688J55634J2084k18247L1460
384i1267K25219l7687k47570N2904K80164j17928k44944J62422J51582j21717
394A1178r0710L7949R7511J1260j10605l8482R9010R9099j20949j60884J99813
405C4190J50872k58387q7415K44799M5928j95007n5773J76698N1853j58120k3564
416g3926Q4650M5653r455j27806M822J97202n0745j99716O3870J93757n1136k21775
428a44605Q0284K17962j25277j48757J06158Q6472l2965q6014j9669J09513L2777
$$ plain form
351 -87701 184952 33175 -118329 -28886 64077 54236 -37778 -68813 4849 91669 32902 -147612
363 -147612 -32248 204410 -17643 -213144 64780 180478 -72853 -152719 66555 135667
373 135667 -71275 -99343 55178 50459 4806 -44510 -72198 83436 95520 -122727 -91267
384 -91267 133952 96265 -151305 -98401 181763 63835 -181109 -18687 132895 11178
394 11178 -79532 -41583 55928 67188 -43417 -81899 17111 116210 -4739 -165623 34190
405 34190 185062 -73325 -160740 84059 129987 -65020 -120793 55905 107758 -50362 -73926
416 -73926 10724 56377 46922 -80884 -76062 121140 70395 -129321 -65451 128306 77170 -144605
428 -144605 -64321 153641 28364 -120393 -14235 72237 39272 -46742 -66411 43102 75879
439G5879j05523o2510J06249J12140j52372j20444K03042P3192j99920l0754J55290
450E4269L2810j25524m6719J18129L6254q5768l3367K6522Q4300p927j47105M5423
462d8703J56463p5168j33241O3378J38993o1134j55850R8109J19950j04899o3909
473f6011N1156N8667l38r0022n777R9369Q126q6785m5389J10822O5383j58040
485e8839l5279J69369k181j39355N077J12589J2844j09079j7259J00928J1964
496E0779o4641m0905M2252R3726o3830j19754R9163J03666j01745r1092Q1124
507a1257J11819r2944j11145J11909P3936q3466n7409K9703Q9239j5538j17047
518g2200K7522J08554j1567j05899k0735J39747J6386j62060J0932J43170j3127
$$ plain form
439 75879 -29644 -92154 14095 126235 -26137 -146581 56461 129653 -70267 -101021 54269
450 54269 87079 -38445 -85164 32965 69219 -16549 -49916 -23394 60906 52979 -94126 -48703
462 -48703 107760 32592 -100649 -37271 101722 40588 -115262 -17153 102797 -2102 -66011
473 -66011 -14855 43812 43474 -46548 -52325 47044 55170 -31615 -77004 33818 99201 -58839
485 -58839 -94118 75251 73070 -66285 -61208 51381 64225 -44854 -62113 38815 50779
496 50779 -13862 -54767 -12515 81211 17381 -102373 -3210 100456 -1289 -92381 -11257
507 -11257 100562 7618 -103527 8382 82318 -1148 -58557 -28854 60385 44847 -72200
518 -72200 -44678 63876 52309 -53590 -74325 65422 81808 -80252 -69320 73850 60723
529F0723j17205j0159J14434K3922j16110k1497R8301L0981p2559o8154P5688
540a635R6369r6990r4940J03663Q3342q8040r0033P8936J04506r2128q8275Q4863
552c62O3946m3553p6765J6133J08205k3757j11483K6832R7133l055j08387j0642
564f5755J32335r463j21938J8919R3168L254q8473k2495R9319J9438r4485j6664
576e2840P4600L5453o7524o0255Q2807O2213r3647n0962Q3877N0626o7732o7583
588g0967P4454O7368q0701m9432O2170M6366l4283p2912L7301Q6265n0308p5081
600e9760M0834P0840j9185r3507K6767J03690m6063q2723L3229P3489r574q6584
612d8547M835R5777j3054q3169K889P4110J9821q5761k8430J01509J7310r3938
$$ plain form
529 60723 -56482 -66641 47793 71715 -44395 -65892 32409 63390 -9169 -77323 -1635
540 -1635 94734 -2256 -97196 6467 89809 1769 -88264 -9328 95178 3050 -85225 -362
552 -362 63584 20031 -56734 -40601 67604 43847 -67636 -40804 56329 53274 -55113 -65755
564 -65755 66580 57117 -64821 -45902 47266 50520 -37953 -60448 38871 58309 -36176 -52840
576 -52840 21760 57213 -10311 -70566 12241 74454 -19193 -70155 13722 64348 -3384 -70967
588 -70967 3487 70855 -9846 -59278 2892 49258 14975 -57937 -20636 65629 15321 -59760
600 -59760 -18926 51914 32729 -60778 -34011 69679 23616 -59107 -25878 47611 38037 -48547
612 -48547 -43712 52065 39011 -44158 -41269 32841 52662 -33099 -61529 39980 57290 -36648
624c6648j7647Q0793L4738q1976m8654R4366M1201q9178l5174O5359N3840n8647
636B373p4188P1997O9829o9511o0938M7592P7010m0704r6393N4369Q8335n3580
648A6191p2427K8558Q2234j4736r9575K2199R3592j9431q1498J81Q5648J4949
660E5885r9430j0518R8215N442q2123k0929P7670L6343q4313l7970Q5632L2393
672E6297p1455l9379N8293N8060o4749o1094P0287M9863n6880n0483L9395O9280
684E7435m4038p4843N4200O0002l9299n8358J9784P5152k3422p9946L1290O6155
696D4112j9650o1261K436P3063j540p9251R585O9565m648o1890r369O8006J4241
709D3399p5181q666O9097R180n7852k2610N9213L2661o8977k6711O5155K2588
$$ plain form
624 -36648 -54295 26498 61236 -20740 -69394 24972 66173 -23005 -58179 7180 61020 2373
636 2373 -71815 182 70011 500 -60438 -12846 64164 23460 -72933 -18564 69771 16191
648 16191 -56236 -27678 54556 39820 -59755 -37556 56036 36605 -44893 -44712 40936 55885
660 55885 -43545 -54063 44152 49594 -32529 -53458 24212 60555 -23758 -61728 23904 56297
672 56297 -15158 -54537 3756 61816 -2933 -64027 6260 56123 -757 -51240 -11845 57435
684 57435 13397 -61446 -7246 52756 13457 -44901 -25117 50035 26613 -53333 -22043 44112
696 44112 24462 -36799 -34363 38700 37160 -42091 -32506 37059 32411 -29479 -38848 29158 43399
709 43399 -31782 -40448 28649 37829 -20023 -42633 16580 49241 -19736 -46447 18708 41296
721D1296n1552l5012M9787M8586o0376m2523N8273L4794m2415m6535L7942O0994
733E3259m8478n6077M8299M6149l1511n5213K2968P0384l1638o7208L1140N8750
745D0824j5896o3551O755P3751j0029p3996J2121O3981q47o2105j3158P2421J3259
758D3530p4249r757O4419J8308n7932l3708O3782L6193o7606l0014N7984L3029
770D3979m4259m8894M7980N3224n3819m4540M2498M5168k7506o0237L0385O4391
782D8370l6106n5621K6766N3135j1996o2794J0581O6640j5811n7763J0197N1034
794B6632M562n6674r632O2232N962n7131p880N0292J6394n0074k4371N7843J8817
807C6972n3580j5217M1271K4762l9199l3664M5689K8484m1680k5525L0153L4948
$$ plain form
721 41296 -10256 -45268 4519 53105 -7271 -49794 8479 43273 858 -45677 -7735 53259
733 53259 4781 -51296 -2997 43152 11641 -43572 -20604 49780 18142 -49066 -17926 40824
745 40824 24928 -38623 -31868 41883 31854 -42142 -30021 33960 33113 -28992 -42150 30271 43530
758 43530 -30719 -40476 23943 42251 -15681 -49389 14393 50586 -17020 -47034 10950 43979
770 43979 -280 -49174 -1194 52030 -1789 -46329 -3831 41337 13831 -46406 -16021 48370
782 48370 12264 -43357 -16591 36544 24548 -38246 -27665 38975 23164 -34599 -24402 26632
794 26632 31194 -25480 -35112 27120 33082 -24049 -31929 18363 34757 -15317 -39688 18155 36972
807 36972 -16608 -31825 9446 34208 -4991 -38655 7034 35518 -6162 -31687 -1534 33414
819C3414k7524m4243L5588M0416l6620l2812K5233L7602k0565m4778K5958M1595
831C3264k6022l3973J3565L7807n984m7904J0030M9273j3292m2835O121M5166
843B5216p5n1860J831N2577m780m5934Q65L9357J0883m5722j2530M7957J0660
856B8445m0740j6847L5634K9218m2483l2107M9702K3730m2407k4058L3552L3926
868C5565l5787l6106L7298K9981k7905l1860J7598M2685j6500m8903K0862M3507
880C0435j4514m3752O828N0407o573n2877J0065M5950o281l9925k401L9153R239
893B5754m2608r082M0027J1503l4328k0668L5369K7154m1488k4921M2693J7975
905B7380l2540k2550K9326K7808l1912k3457K7036K0076j5090k8542J1421L7680
$$ plain form
819 33414 5890 -38353 -2765 37651 1031 -31781 -6548 31054 10489 -34289 -8331 33264
831 33264 7242 -26731 -13166 24641 18657 -29247 -19217 30056 16764 -26071 -19950 25216
843 25216 25141 -26719 -24888 27689 22909 -23025 -22160 17197 28080 -17642 -30172 17785 28445
856 28445 -12295 -29142 6492 35710 -6773 -38880 10822 34552 -7855 -31913 1639 35565
868 35565 -222 -36328 970 30951 3046 -28814 -11216 31469 14969 -33934 -13072 30435
880 30435 15921 -27831 -21003 29404 22831 -30046 -19981 25969 19688 -20237 -22638 16515 25754
893 25754 -16854 -25936 14091 25594 -8734 -29402 5967 33121 -8367 -33288 9405 27380
905 27380 -5160 -27710 1616 29424 -2488 -25945 1091 21167 6077 -22465 -11044 26636
917B6636j6983l6109J7717L1970j0519l5575R246L9639j5111l3349J2960K7300
929A7822p387k4587j080K8854L009l0607j686K6389O730k7910j1154L3014J1100
942B2507l6767n355L2374M100k5704j0897K7818J2255k9932o718K1408J0403j5373
955A19k0457J8557K4653k4009k1102K1912K2244j7893k8912K2202K7829k5243
967a00k1831K0038J9053j1192k4057Q880K7842q650k7406N091K8498Ml2699k865
981a9394L8192j721l6254L432L0580R98k8191n872L1423N482k8779o316K0456
994D036J5525k0324k4099K7035K2707k8041j9012K1454K3618k0348k7056K5260
1006G55K1602k2232j7335J2692K0473o609k6464P905K4640m665k4060j208K8921
$$ plain form
917 26636 9653 -26456 -8739 23231 12712 -22863 -13617 26022 10911 -22438 -9478 17822
929 17822 10435 -14152 -15232 13622 16631 -13976 -15662 10727 17457 -10453 -21607 11407 22507
942 22507 -14260 -19615 12759 16859 -8845 -19742 8076 20331 -9601 -16319 5089 15492 119
955 119 -20338 -1781 22872 -1137 -22239 -327 21917 4024 -24888 -2686 25143 -100
967 -100 -21931 -1893 17160 5968 -18089 -9209 18633 9983 -17423 -12332 16166 16170 -16529 -19394
981 -19394 18798 17077 -19177 -15745 14835 15833 -12358 -18230 13193 18675 -10104 -16420 4036
994 4036 19561 -763 -24862 2173 24880 -3161 -22173 -719 22899 2551 -24505 755
1006 755 22357 125 -17210 -4518 15955 9346 -17118 -9213 15427 10762 -13298 -14506 14415
1019A4415K099l2206M91L1124j998k7809J968K1568L412k1937m950K1189M289
1032A1655j5947r022J4698J4694j7597j6557K1214J2815j8374j2370J4781J7210
1044A7200j7905j5895J9540R892j3511j0123P688J4745p756j6311R358J4496n793
1057E625j6014J589K2624n161k3809Q715J9854q680j6213M974J6674l582j7298
1070a0702L591J5575r05j4191l762J6101P563k1469n538K2837L073j9291n466
1083a2584J9199Q076k1883n917J9172M034j2474r907J1703J5140j4054j5379J4349
1096e25J3888j0131j9533J1287K3294j4296j9803J1994J8440j0002j7100N070
1108g417J9730m867j9937N238J6762L17j7727l866J9536O605k3485m020K0651
$$ plain form
1019 14415 16514 -15692 -15201 15923 13925 -13884 -11916 9652 13064 -8873 -13823 7366 11655
1032 11655 -4292 -13314 1384 16078 -1519 -18076 3138 15953 -2421 -14791 -10 17200
1044 17200 -705 -16600 2940 12832 -679 -10802 -3114 11631 3875 -12436 -3078 11418 5625
1057 5625 -10389 -8800 13824 8663 -15146 -6431 13423 4743 -11470 -6496 10178 6596 -10702
1070 -10702 -7111 8464 7559 -6632 -10394 5707 13270 -8199 -13737 9100 12173 -7118 -12584
1083 -12584 6615 14691 -7192 -13109 6063 10097 -2377 -12284 -581 14559 505 -14874 -525
1096 -525 13363 3232 -16301 -5014 18280 3984 -15819 -3825 14615 4613 -12487 -7417
1108 -7417 12313 7446 -12491 -7253 9509 9826 -7901 -11767 7769 14374 -9111 -13131 7520
1121G520O290k0171q261K0582Q204k0748m601J4086Q861j1187j2758R885J6112
1134A3814j3143j4019J1381J4213p832j8234Q742J8538j1058j3526O092J4342
1146I310l720j4510K510J4847k265j3243J1J2091L971j6125k560J5969L211j6007
1160f510j012J2949L580j3452n797J5987K254j1518k340P945O176q769r732J1626
1174A387Q349j1212o094P514R158q256j2087J2651P954j0635o005O428Q046m965
1188B233j1869Q230J0392o874r501L936J0468k668j3636M732J4783n107j3692
1201h573L133J3514j179j5176J061J5840k559j2259q23J2024M351j3513o291J6735
1215F285L002j3298m894J1300Q413j3630r257J3979Q912j2429r005R557J1785
$$ plain form
1121 7520 13810 -6361 -14622 5960 14164 -6584 -11185 2901 11762 575 -12183 -2298 13814
1134 13814 671 -13348 -1967 12246 4414 -13820 -5078 13460 2402 -11124 -5032 9310
1146 9310 5590 -8920 -6410 8437 6172 -7071 -7060 5031 9002 -7123 -9683 6286 9497 -6510
1160 -6510 -7522 5427 9007 -4445 -10242 5745 7999 -3519 -5859 2086 8262 -507 -10239 1387
1174 1387 9736 -1476 -7570 -56 9102 846 -11241 1410 9364 -1271 -7276 -848 7198 2233
1188 2233 -9636 -1406 8986 2112 -7389 -3453 7015 4347 -9289 -4557 10226 5119 -8573
1201 -8573 -5440 8074 6895 -8281 -7220 8620 6061 -6198 -7021 5003 9354 -4159 -10450 6285
1215 6285 9287 -4011 -8905 2395 10808 -2822 -12079 1900 10812 -1617 -10622 -1065 10720
1228A0720q776j2586R743J0678p503j1970M521J4443l412j5168L428J5103l221
1241F000j3030L68J4155M04j5245n32J4745k33j0991m055J2294N380j2839n792
1255i371J2831M910r770p283R993Q560j1792p594J0175N820n545q667O055J0606
1269H928p417r605O086P931l351q615K366J1166m600r641M104Q488j120r350%
1284d630J0393j438r997J262R568r71p361k448R880P19j0504P24R141N45p797
1299b914k214R641K100j0504q64Q194J696o243n948R558L983r367l541Q372M288
1314F237o839p095Q337P900r113o902P100P125n345q518N351R289o484q315N781
1329a491P601k333j0673K682J1396k639j1831L056R971L45j2102l52J3220J77
$$ plain form
1228 10720 1944 -10642 -899 9779 2276 -9694 -5173 9270 5858 -9310 -5882 9221 6000
1241 6000 -7030 -6662 7493 7897 -7348 -7880 6865 6632 -4359 -8414 3880 9260 -3579 -9371
1255 -9371 3460 8370 -1400 -8683 1310 9870 -1922 -9516 659 6479 934 -7733 -1678 8928
1269 8928 1511 -8094 -2008 5923 2572 -6043 -3677 7489 2889 -6752 -2648 5840 4720 -4630 -4630
1284 -4630 5763 4325 -5672 -4410 5158 4187 -3174 -5622 4258 4977 -5527 -4803 4338 4883 -2914
1299 -2914 -5128 4513 6613 -3891 -4755 3439 5135 -1108 -7056 2502 6485 -2882 -6423 1949 6237
1314 6237 -602 -7697 640 8540 -573 -7475 -375 6750 1405 -7113 -1762 7527 1043 -7272 -1491
1329 -1491 6110 3777 -6896 -4214 7182 4543 -7288 -4232 5739 6084 -6018 -6370 6850 7027
$$ [...]
8191G
##END NTUPLES=NMR FID
##END=
