##TITLE=1H_SAM_30.235 DMSO
 DMSO-d6, 108 sc, 
 24.11.2020
##JCAMPDX= 6.0         $$ Bruker NMR JCAMP-DX V2.0
##DATA TYPE= NMR FID
##DATA CLASS= NTUPLES
##ORIGIN= UXNMR, Bruker Analytische Messtechnik GmbH
##OWNER= root
$$ XWIN-NMR		Version 3.5
$$ Tue Nov 24 13:43:10 2020 Russian Standard Time (UT+4h)  she@DPX200
##.OBSERVE FREQUENCY= 200.1315066352
##.OBSERVE NUCLEUS= ^1H
##.DELAY= (6, 6)
##.ACQUISITION MODE= SIMULTANEOUS
##.ACQUISITION SCHEME= undefined
##.AVERAGES= 8
##.DIGITISER RES= 18
##SPECTROMETER/DATA SYSTEM= spect
##.PULSE SEQUENCE= zg30
##.SOLVENT NAME= DMSO
##.SHIFT REFERENCE= (INTERNAL, DMSO, 0, 15.7039)
##AUDIT TRAIL= $$ (NUMBER, WHEN, WHO, WHERE, WHAT)
$$ ##TITLE= Audit trail, XWIN-NMR		Version 3.5
$$ ##JCAMPDX= 5.01
$$ ##ORIGIN= Bruker BioSpin GmbH
$$ ##OWNER= she
$$ F:/spectra/data/she/nmr/H-F/1/audita.txt
$$ ##AUDIT TRAIL=  $$ (NUMBER, WHEN, WHO, WHERE, WHAT)
(   1,<2020-11-24 13:42:09.87 +0400>,<she>,<DPX200>,
      <created by zg, POWCHK disabled, PULCHK disabled
       configuration hash MD5:
       00 E9 B6 7A A2 85 ED C7 34 08 36 98 17 FE 4E 26
       data hash MD5: 16K
       62 1F EC 35 05 D3 A6 77 19 09 B9 7B B6 7C A7 AF>)
$$ ##END=
$$ 
$$ hash MD5
$$ D5 D8 71 61 FB 20 AA BE EE C6 E3 EC B4 56 D9 91
##$RELAX= 
##$RELAX= 
##$RELAX= 
##$RELAX= 
##$RELAX= 
##$RELAX= 
$$ Bruker specific parameters
$$ --------------------------
##$DU= <F:/spectra>
##$EXPNO= 1
##$NAME= <H-F>
##$PROCNO= 1
##$TYPE= <nmr>
##$USER= <she>
##$AMP= (0..31)
100 100 100 100 100 100 100 100 100 100 100 100 100 100 100 100 100 100 
100 100 100 100 100 100 100 100 100 100 100 100 100 100 
##$AQSEQ= 0
##$AQ_mod= 1
##$AUNM= <au_zg>
##$AUTOPOS= <>
##$BF1= 200.13
##$BF2= 200.13
##$BF3= 200.13
##$BF4= 200.13
##$BF5= 200.13
##$BF6= 200.13
##$BF7= 200.13
##$BF8= 200.13
##$BYTORDA= 1
##$CFDGTYP= 0
##$CFRGTYP= 5
##$CHEMSTR= <none>
##$CNST= (0..31)
1 1 145 1 1 1 1 1 1 1 1 1 1 1 1 1 1 1 1 1 1 1 1 1 1 1 1 1 1 1 1 1 
##$CPDPRG= <>
##$CPDPRG1= <>
##$CPDPRG2= <>
##$CPDPRG3= <>
##$CPDPRG4= <mlev>
##$CPDPRG5= <mlev>
##$CPDPRG6= <mlev>
##$CPDPRG7= <mlev>
##$CPDPRG8= <mlev>
##$CPDPRGB= <>
##$CPDPRGT= <>
##$D= (0..31)
0 1.2 0 0 0 0 0 0 0 0.06 0 0.03 0 0 0 0 0.0002 0 0 0 0 0 0 0 0 0 0 0 0 
0 0 0 
##$DATE= 1606210929
##$DBL= (0..7)
120 120 120 120 120 120 120 120 
##$DBP= (0..7)
150 150 150 150 150 150 150 150 
##$DBP07= 0
##$DBPNAM0= <>
##$DBPNAM1= <>
##$DBPNAM2= <>
##$DBPNAM3= <>
##$DBPNAM4= <>
##$DBPNAM5= <>
##$DBPNAM6= <>
##$DBPNAM7= <>
##$DBPOAL= (0..7)
0.5 0.5 0.5 0.5 0.5 0.5 0.5 0.5 
##$DBPOFFS= (0..7)
0 0 0 0 0 0 0 0 
##$DE= 6
##$DECBNUC= <off>
##$DECIM= 32
##$DECNUC= <off>
##$DECSTAT= 4
##$DIGMOD= 1
##$DIGTYP= 9
##$DL= (0..7)
0 120 120 120 120 120 120 120 
##$DP= (0..7)
150 150 150 150 150 150 150 150 
##$DP07= 0
##$DPNAME0= <>
##$DPNAME1= <>
##$DPNAME2= <>
##$DPNAME3= <>
##$DPNAME4= <>
##$DPNAME5= <>
##$DPNAME6= <>
##$DPNAME7= <>
##$DPOAL= (0..7)
0.5 0.5 0.5 0.5 0.5 0.5 0.5 0.5 
##$DPOFFS= (0..7)
0 0 0 0 0 0 0 0 
##$DQDMODE= 0
##$DR= 18
##$DS= 0
$$ [...]
##$SUBNAM2= <"">
##$SUBNAM3= <"">
##$SUBNAM4= <"">
##$SUBNAM5= <"">
##$SUBNAM6= <"">
##$SUBNAM7= <"">
##$SUBNAM8= <"">
##$SUBNAM9= <"">
##$SW= 16.9725356469052
##$SWIBOX= (0..15)
0 0 2 0 0 0 0 0 0 0 0 0 0 0 0 0 
##$SW_h= 3396.73913043478
##$TD= 16384
##$TD0= 1
##$TE= 0
##$TE2= 300
##$TE3= 300
##$TEG= 300
##$TL= (0..7)
0 120 120 120 120 120 120 120 
##$TP= (0..7)
150 150 150 150 150 150 150 150 
##$TP07= 0
##$TPNAME0= <>
##$TPNAME1= <>
##$TPNAME2= <>
##$TPNAME3= <>
##$TPNAME4= <>
##$TPNAME5= <>
##$TPNAME6= <>
##$TPNAME7= <>
##$TPOAL= (0..7)
0.5 0.5 0.5 0.5 0.5 0.5 0.5 0.5 
##$TPOFFS= (0..7)
0 0 0 0 0 0 0 0 
##$TUNHIN= 0
##$TUNHOUT= 0
##$TUNXOUT= 0
##$USERA1= <user>
##$USERA2= <user>
##$USERA3= <user>
##$USERA4= <user>
##$USERA5= <user>
##$V9= 5
##$VALIST= <valist>
##$VCLIST= <CCCCCCCCCCCCCCC>
##$VD= 0
##$VDLIST= <DDDDDDDDDDDDDDD>
##$VPLIST= <PPPPPPPPPPPPPPP>
##$VTLIST= <TTTTTTTTTTTTTTT>
##$WBST= 1024
##$WBSW= 4
##$XGAIN= (0..3)
0 0 0 0 
##$XL= 0
##$YL= 0
##$YMAX_a= 64814
##$YMIN_a= -76221
##$ZGOPTNS= <>
##$ZL1= 120
##$ZL2= 120
##$ZL3= 120
##$ZL4= 120
##$ABSF1= 10
##$ABSF2= 0
##$ABSG= 5
##$ABSL= 3
##$ALPHA= 0
##$AQORDER= 0
##$ASSFAC= 0
##$ASSFACI= 0
##$ASSFACX= 0
##$ASSWID= 0
##$AUNMP= <proc_1d>
##$AZFE= 0.1
##$AZFW= 0.1
##$BCFW= 1
##$BC_mod= 2
##$BYTORDP= 1
##$COROFFS= 0
##$CY= 11.3945322036743
##$DATMOD= 1
##$DC= 2
##$DFILT= <>
##$DTYPP= 0
##$F1P= 15.9154993809931
##$F2P= -4.1035820241983
##$FCOR= 0.5
##$FTSIZE= 0
##$FT_mod= 4
##$GAMMA= 1
##$GB= 0.15
##$INTBC= 1
##$INTSCL= 1
##$ISEN= 128
##$LB= 0.24
##$LEV0= 0
##$LPBIN= 0
##$MAXI= 10000
##$MC2= 0
##$MEAN= 0
##$ME_mod= 0
##$MI= 1.114404
##$NCOEF= 0
##$NC_proc= 0
##$NLEV= 6
##$NOISF1= 3.799351
##$NOISF2= 2.8
##$NSP= 1
##$NTH_PI= 0
##$NZP= 0
##$OFFSET= 15.70392
##$PC= 1
##$PHC0= -11050.72
##$PHC1= 9.600889
##$PH_mod= 1
##$PKNL= yes
##$PPARMOD= 0
##$PSCAL= 0
##$PSIGN= 0
##$REVERSE= no
##$SF= 200.130013532006
##$SI= 16384
##$SIGF1= 3
##$SIGF2= 2
##$SINO= 400
##$SIOLD= 16384
##$SREGLST= <1H.CDCl3>
##$SSB= 0
##$STSI= 0
##$STSR= 0
##$SW_p= 3612.71676300578
##$SYMM= 0
##$S_DEV= 0
##$TDeff= 0
##$TDoff= 0
##$TI= <>
##$TILT= no
##$TM1= 0
##$TM2= 0
##$TOPLEV= 0
##$USERP1= <user>
##$USERP2= <user>
##$USERP3= <user>
##$USERP4= <user>
##$USERP5= <user>
##$WDW= 1
##$XDIM= 8192
##$YMAX_p= 0
##$YMIN_p= 0
$$ End of Bruker specific parameters
$$ ---------------------------------
##NTUPLES= NMR FID
##VAR_NAME=  TIME,          FID/REAL,        FID/IMAG
##SYMBOL=    X,             R,               I
##VAR_TYPE=  INDEPENDENT,   DEPENDENT,       DEPENDENT
##VAR_FORM=  AFFN,          ASDF,            ASDF
##VAR_DIM=   8192,          8192,            8192
##UNITS=     SECONDS,       ARBITRARY UNITS, ARBITRARY UNITS
##FACTOR=    0.0002944,     1,               1
##FIRST=     0,             0,               0
##LAST=      2.4114304,     0,               0
##MIN=       0,             -76221,          0
##MAX=       2.4114304,     64814,           0
$$ Real data points
##PAGE= N=1
##DATA TABLE= (X++(R..R)), XYDATA
$$ [...]
$$ plain form
1809 -476 185 212 -387 -179 418 -244 -626 483 470 -741 24 678 -223 -247 604 392 -640 200 629 -353
1829 -353 -222 697 -95 -680 695 277 -794 119 659 -271 -512 695 -26 -876 195 355 -595 170 499
1848 499 -305 -409 331 138 -301 -242 674 -402 -444 368 86 -582 166 457 -536 72 658 -316 -493 422
1868 422 325 -508 267 831 -631 -210 442 21 -253 445 292 -428 -143 730 -212 -332 614 224 -752 42
1888 42 493 -374 -364 510 -147 -591 618 245 -551 97 633 -318 -658 411 190 -515 202 282 -587 -173
1908 -173 666 -89 -673 284 392 -601 54 670 -210 -380 618 27 -775 25 607 -563 -177 632 30 -255
1928 -255 451 224 -329 -357 465 -368 -388 474 33 -594 501 425 -413 -111 529 25 -234 375 177 -352 272
1949 272 452 -670 -104 621 85 -237 259 218 -261 -164 642 -291 -319 275 -17 -417 250 366 -583 -262 407
$$ packed form
1809d76O61K7n99K08N97o62l82J109j3j211P65O54r01k4Q51k12j032Q40M29r82
1829c53J31R19p92n85J375m18j071R13N40r30k41J207p21q50J071J60r50P65L29
1848D99q04j04P40j93m39N9R16j076m2Q12k82o68P48K91r93O08N86r74j77R15
1868D22r7q33P75N64j462M21O52m21k74O98j53p20K85Q73r42j20R46l90r76P94
1888D2M51q67J0Q74o57m44J209l73p96O48N36r51l40J069k21p05P17Q0q69M14
1908a73Q39p55n84R57J08r93O55O16q80j70R98n91q02Q00N82j170L86Q09o02k85
1928b55P06k27n53k8Q22q33k0Q62m41o27J095p6q38L02O40n04k59O09j98n29O24
1949B72J80j122N66P25n36l22M96m1m79R7Q06r33k8N94k92m00O67J16r49L21O69
$$ plain form
1970 407 -78 -407 368 369 -522 -204 683 -5 -215 434 47 -365 123 701 -334 -58 865 -151 -348 502
1990 502 481 -390 -55 412 -339 -162 620 144 -374 161 339 -497 -57 613 -83 -567 392 262 -583 259
2010 259 200 -353 64 453 -33 -401 219 -9 -303 -5 416 -159 -481 145 248 -282 171 553 -203 -21
2030 -21 126 -132 -351 166 106 -314 -34 313 28 -213 458 -42 -427 -160 490 -397 -178 481 -26 -253 -17
2051 -17 66 -325 -144 420 -156 -19 443 -41 -428 8 371 -386 -365 407 -15 -367 172 -2 -440 23 266
2072 266 -301 -429 389 -197 -409 -54 298 -394 -100 202 -463 -379 87 -11 -437 18 438 -151 -263 205 -251
2093 -251 850 575 227 -565 -62 233 -280 -188 759 332 -198 372 114 -156 -447 456 -4 -300 -63 424
2113 424 -228 -114 116 -260 11 110 246 -185 143 -53 98 -518 572 -698 -547 108 -312 -450 103 86
$$ packed form
1970D07m85l29P75Jq91L18Q87o88k10O49l87m12M88N78j035K76R23j016j97Q50
1990E02k1q71L35M67p51J77P82m76n18N35J78q36M40O70o96m84R59j30q45Q42
2010B59n9n53M17L89m86l68O20k28k94K98M21n75l22O26J03n30M53L82p56J82
2030b1J47k58k19N17o0m20K80L47k85k41O71n00l85K67O50q87K19O59n07k27K36
2051a7Q3l91J81N64n76J37M62m84l87M36L63p57K1P72m22l52N39j74m38M63K43
2072B66n67j28Q18n86k12L55L52o92K94L02o65Q4M66r8m26M55M20n89j12M68m56
2093b51J101k75l48p92N03K95n13R2R47m27n30N70k58k70k91R03m60k96K37M87
2113D24o52J14K30l76K71R9J36m31L28j96J51o16J090j270J51O55m20j38N53j7
$$ plain form
2133 86 -313 591 158 -19 -297 13 329 -204 -282 102 100 -122 -7 132 -232 -2 7 -68 -325 200 237 -242 207
2156 207 77 -208 -199 -3 -55 -237 -42 35 37 -223 208 -34 214 215 -204 22 -190 255 57 -310 455 -23 -61
2179 -61 180 201 -297 -46 177 -44 -32 181 44 -15 -79 55 -208 227 181 198 -58 72 99 -269 97 -63 -119
2202 -119 -395 178 112 -97 128 243 -120 -53 61 148 -221 136 -77 -241 109 140 30 118 351 52 121 375
2224 375 71 -111 -7 178 -179 61 231 186 -217 -189 -174 122 -121 -63 -69 79 4 126 -221 -7 212 -306
2246 -306 -145 15 -23 -23 76 132 7 57 119 27 -126 141 -16 -76 417 159 -70 15 -74 -71 -15 -112 112 -186 -133
2271 -133 111 5 -86 -84 -15 -428 -13 -86 -118 64 51 -59 -6 385 245 131 -97 14 -312 -28 86 -35 -104
2294 -104 162 177 -477 -161 -81 -85 -256 144 -35 158 -71 297 -271 -125 -12 1 -223 -60 159 -48 -259 -182
$$ packed form
2133H6l99R04m33j77k78L10L16n33p8L84kk22J15J39l64K30Rp5k57N25L7m79M49
2156B07j30k85RJ96n2j82J95P7Kk60M31k42K48Jm19K26k12M45j98l67P65m78l8
2179f1K41K1m98K51K23k21J2K13j37n9o4J34k63M35m6J7k56J30K7l68L66j60n6
2202a19k76N73o6k09K25J15l63O7J14Q7l69L57k13j64L50L1j10Q8K33k99O9K54
2224C75l04j82J04J85l57K40J70m5m03K8J5K96k43N8oJ48p5J22l47K14K19n18
2246c06J61J60l8%R9N6j25N0O2r2j53K67j57o0M93k58k29Q5q9LN6r7K24k98N3
2271a33K44j06r1KO9m13M15p3l2J82j3j10N3L91j40j14k28J11l26K84J14j21o9
2294a04K66J5o54L16Q0mj71M00j79J93k29L68n68J46J13J3k24J63K19k07k11P7
$$ plain form
2316 -182 116 79 221 12 -129 63 -10 -45 166 -71 21 -55 250 -85 -124 -118 -67 -52 19 -184 338 -14 22 -19
2340 -19 89 223 13 321 -215 218 34 179 -12 141 -8 219 -34 55 -43 210 27 -191 50 283 -65
2361 -65 -115 281 -197 -374 83 2 -196 -125 49 39 101 -205 -200 151 129 -66 -177 -103 -100 68 -275 -51 98 -117
2385 -117 114 -215 -42 -46 -320 -66 190 78 81 -73 -296 103 -233 -85 55 -19 -214 66 206 -92 30 -93
2407 -93 -159 97 17 208 -110 164 -63 -117 -274 -48 85 21 190 -48 55 -155 132 -92 53 32 -62 -47 111
2430 111 42 -145 -117 -247 -114 253 157 -187 45 265 183 -155 -95 -6 87 152 -257 -57 -249 -122 -27 -25 92 70
2454 70 -332 163 166 -126 47 124 68 121 -10 201 -77 225 -300 -292 -242 -126 2 -65 116 266 103 122 323 110
2478 110 -35 72 84 82 -52 -44 -43 -77 -79 190 -64 -313 162 103 -319 32 130 -121 -258 -122 -176 -258 171 106 -59
$$ packed form
2316a82K98l7J42k09j41J92p3l5K11k37R2p6L05l35l9ON1J5P1k03N22l52L6m1
2340a9J08J34k10L08n36M33j84J45j91J53j49K27k53Q9r8K53j83k18K41K33l48
2361f5n0L96m78j77M57q1j98P1J74j0O2l06NL51k2j95j11P4LJ68l43K24J49k15
2385a17K31l29J73mk74K54K56j12Lj54k23L99l36J48J40p4j95K80J40k98J22j23
2407i3o6K56q0J91l18K74k27n4j57K26J33o4J69k38J03k10K87k24J45k1r4J5J58
2430A11o9j87K8j30J33L67r6l44K32K20q2l38O0Q9R3O5m09K00j92J27R5KJ17k2
2454G0m02M95Lk92J73P7n6N3j31K11k78L02n25QN0J16J28o7J81J50j63J9K01k13
2478A10j45J07J2kj34QJl4kK69k54k49M75n9m22L51R8k51j37J36n4q2M29o5j65
$$ plain form
2503 -59 -18 -16 325 -77 -18 -22 -67 20 184 -68 -61 37 -68 -166 -114 -100 -197 -132 -204 -38 -11 -168 12 -85 -79 -61 4 -87
2531 -87 116 30 -313 107 222 19 105 78 -139 91 -45 -4 0 118 192 92 77 14 -27 -59 79 75 91 -115 -151
2556 -151 -20 -172 -173 -600 -263 -121 -88 -53 -107 -17 -118 75 -27 -21 63 7 -97 127 37 -175 96 0 173 -74
2580 -74 -122 -14 41 85 69 -49 87 114 55 -142 12 -5 93 -265 1 265 133 -90 -231 2 -98 89 -67
2603 -67 84 157 -203 173 174 99 -31 162 198 -9 57 -90 254 26 76 -83 85 -185 -93 -156 -65 -219 -119 -10
2627 -10 132 -120 126 -343 92 97 109 6 -9 96 36 13 141 16 -163 56 67 -89 -243 -127 795 250 244
2650 244 -49 -280 -108 -4 65 -543 575 54 164 -321 -209 -104 80 256 129 -194 -514 -1 146 -129
2670 -129 -159 -275 -7 185 -116 10 -155 118 83 60 -144 51 231 -276 261 -288 67 15 -123 78 100 154
$$ packed form
2503e9M1KL41m02N9mm5Q7J64k52PR8j05r8N2J4r7O5p2J66K7j57J80r7OJ8O5r1
2531h7K03q6l43M20J15k03Q6k7k17K30j36M1MJ18P4j00j5o3m1l2J38mJ6k06l6
2556a51J31j52jm27L37J42L3L5n4R0j01J93j02OQ4n6j04K24r0k12K71r6J73k47
2580g4m8J08N5M4j6j18J36K7n9j97J54j7R8l58K66K64j32k23j41K33j00J87j56
2603f7J51P3l60L76Jp5j30J93L6k07O6j47L44k28N0j59J68k70R2o3R1j54J00J09
2627a0J42k52K46m69M35NJ2j03j5J05o0k3J28j25j79K19J1j56j54J16R22n45o
2650B44k93k31J72J04O9o08J118n21J10m85J12J05J84J76j27l23l20N13J47k75
2670a29l0j16K68J92l01J26j65K73l5k3k04J95J80n07N37n49L55n2j38K01K2N4
$$ plain form
2692 154 106 155 -224 -87 -77 -72 3 39 58 -63 -15 -103 95 -303 -60 -142 -130 144 -65 270 114 44 -88 99
2716 99 152 28 -135 -218 -86 28 131 -167 -125 -225 175 76 -30 228 -115 113 37 5 -20 17 111 233 96
2739 96 64 -164 -93 -126 140 195 -2 -118 -79 -167 -150 -192 120 -25 71 174 30 6 -76 -48 -355 -22 -2 164 -77
2764 -77 133 104 171 215 243 -93 50 -16 369 -371 337 -267 -254 -375 296 49 394 -34 -330 342 -65 345
2786 345 -249 182 -175 100 -47 286 -64 18 35 -11 -77 222 50 85 230 -169 -196 114 -40 56 176 121 26
2809 26 215 -127 -83 -229 -176 21 -124 -12 78 197 -24 -46 -44 90 -112 88 -61 49 -102 -29 -38 -32 -5 242
2833 242 503 -120 -22 -103 84 210 210 71 0 17 66 -180 110 -13 47 224 -49 -38 -203 -162 -185 -53 127 -78
2857 -78 -63 -123 34 -117 75 98 28 -35 -184 -122 -71 -96 -120 -117 -33 42 172 11 0 -53 -277 103 61 -145 -96 140
$$ packed form
2692A54m8M9l79J37J0NP5L6J9j21M8q8J98l98K43q2J2K74k09L35j56p0j32J87
2716I9N3j24j63q3J32J14J03k98M2j00M00r9j06K58l43K28p6l2k5L7R4J22j37
2739I6l2k28P1l3K66N5j97j16L9q8J7m2L12j45R6J03j44k4q2K8l07L33K0J66k41
2764g7K10k9O7M4K8l36J43o6L85p40P08o04J3j21O71k47L45m28k96O72m07M10
2786C45n94M31l57K75j47L33l50Q2J7m6o6K99j72L5J45l99k7L10j54R6J20n5r5
2809B6J89l42M4j46N3J97j45J12R0J19k21k2KJ34k02K00j49J10j51P3rOK7K47
2833B42K61o23R8q1J87J26%j39p1J7M9k46K90j23O0J77k73J1j65M1k3J32J80k05
2857g8J5o0J57j51J92K3p0o3j49O2N1k5k4LQ4P5J30j61j1n3k24L80m2k06M9K36
$$ plain form
2883 140 -115 -52 219 16 28 -57 -58 -77 -259 -2 -179 17 240 10 93 -314 205 16 -52 151 -216 -30 -185
2906 -185 -63 223 268 -14 -172 166 -270 -34 -137 -56 125 -151 -64 36 -43 -371 -125 78 -95 223 -56
2927 -56 51 19 -130 48 -153 22 -133 252 114 -86 -71 -253 -80 270 146 -137 -56 -155 -124 92 92 -117 -35
2950 -35 112 31 135 115 3 -198 99 65 157 114 158 137 8 -25 -6 33 99 268 145 207 157 106 231 -93 -165
2975 -165 92 -53 135 112 -123 -67 -39 -64 87 88 55 78 55 -107 -214 107 -9 -163 18 -236 14 -151 -190
2998 -190 -27 -98 -296 -229 -280 -273 -262 -357 200 -76 85 181 30 -253 -207 154 2 -10 -90 -309 -60 -143 135 223
3022 223 -61 199 -47 78 -163 118 213 -167 164 -4 -72 -265 41 -113 -156 -124 13 -286 -237 -26 -189 -199
3044 -199 -172 5 -310 -59 240 -15 89 156 16 -108 -120 -239 -126 -71 254 -176 10 270 -239 56 -142
$$ packed form
2883A40k55O3K71k03J2q5jj9j82K57j77J96K23k30Q3m07N19j89o8K03l67J86j55
2906a85J22K86M5k82j58L38m36K36j03Q1J81k76Q7J00p9l28K46K03j73L18k79
2927e6J07l2j49J78k01J75j55L85j38k00J5j82J73L50j24k83Q1r9L1K16%k09Q2
2950c5J47q1J04k0j12k01K97l4R2m3M4k1j29l3J9L9O6J69j23O2n0n1J25l24p2
2975a65K57j45J88k3k35N6K8k5J51Jl3K3k3j62j07L21j16j54J81k54K50j65l9
2998a90J63p1j98O7n1PJ1r5N57k76J61R6j51k83M6L61j52j2q0k19K49q3K78Q8
3022B23k84K60k46J25k41K81R5l80L31j68o8j93L06j54m3L2J37k99M9K11j63j0
3044a99K7J77l15K51K99k55J04O7j40j24j2j19J13N5L25m30J86K60n09K95j98
$$ plain form
3065 -142 31 -102 -146 -174 -45 -35 -438 36 -18 -13 -136 -186 -97 -131 75 111 63 -32 -60 64 38 5 117 117 -18 -240
3091 -240 49 136 98 -64 -36 103 -53 24 -181 -135 47 158 -56 -177 14 144 219 50 -95 26 -271 76
3113 76 -116 -142 -90 -75 -129 -258 -21 -74 135 65 -4 -200 93 -247 -166 329 -22 -43 5 76 192 1 -63 -153 45
3138 45 277 -249 195 -63 51 81 -67 6 -209 -70 -30 -131 117 42 -106 32 -22 -112 -130 -39 139 -125 -57
3161 -57 -4 283 58 -101 194 -295 -4 -116 103 -61 -354 159 92 -195 -200 -110 144 93 69 72 -96 -41 94 18
3185 18 -65 75 -142 53 34 -139 73 -143 2 -333 41 106 -37 17 -261 161 -75 -242 10 -91 -79 25
3207 25 381 -115 -42 -191 -13 -176 -144 -204 164 43 -45 47 -192 115 45 5 156 169 113 -169 12 -107 15
3230 15 -5 -52 -66 100 104 35 -123 -194 149 30 -69 -128 -8 56 -2 -149 -155 -146 143 -58 -60 52 51 -136 -57 172 -114
$$ packed form
3065a42J73j33m4k8J29J0m03M74n4Nj23n0Q9l4K06L6m8r5k8J24k6l3J12%j35k22
3091b40K89Q7l8j62K8J39j56P7k05M6J82J11k14j21J91J30P5j69j45J21k97L47
3113G6j92k6N2J5n4j29K37n3K09p0o9j96K93l40Q1M95l51k1M8P1J16j91o4r0J98
3138D5K32n26M44k58J14L0j48P3k15J39M0j01K48p5j48J38n4r0j8R1J78k64O8
3161e7N3K87k25j59K95m89K91j12K19j64k93N13o7k87nR0K54n1k4Lj68N5J35p6
3185A8q3J40k17J95j9j73K12k16J45l35L74O5j43N4k78M22k36j67K52j01J2J04
3207B5L56m96P3j49J78j63L2o0L68j21q8R2k39L07p0m0J51J3n6k82J81j19J22
3230A5k0m7j4J66Mo9j58p1L43j19r9n9J20O4n8j47oRK89k01kJ12jj87P9K29k86
$$ plain form
3257 -114 173 -103 11 -281 -248 104 -5 30 -221 -197 134 -52 204 56 248 -55 -156 -26 184 -178 -22
3278 -22 -28 -48 134 -22 -17 -70 191 -41 33 105 151 52 333 32 6 -72 -163 -127 -148 -100 -118 177 17 -34 30 0 -34
3305 -34 -29 -108 148 242 -157 -18 108 5 -21 -28 -343 132 89 196 -249 187 -257 220 -40 -37 220 168 1 -209
3329 -209 305 131 49 108 238 -153 46 303 -104 -2 35 116 190 -168 -6 19 -44 -21 -209 51 -418 -106 -77
3352 -77 86 109 -306 43 77 163 38 227 108 -48 55 165 -284 -105 103 -130 76 -127 432 -7 -100 -108
3374 -108 133 41 -39 -3 -63 95 -162 -69 -51 214 152 -48 -15 -44 71 94 173 -44 61 145 21 35 -169 -145 -223
3399 -223 -241 25 27 82 113 -251 14 -32 -2 74 -112 29 -3 -7 260 278 65 116 255 -57 91 -3 -27 -18 -99 -7
3425 -7 -103 -88 95 387 -33 -35 -147 -240 179 8 -37 94 -90 183 -112 -241 28 80 49 50 -49 63 126 178 111
$$ packed form
3257a14K87k76J14k92L3L52j09L5k51K4L31j86K56j48J92l03j01J30K10l62J56
3278b2ok0J82j56Nn3K61k32P4P2M6r9K81l01k6p8r1L6k1M8j8K95j60n1O4l0l4
3305c4Np9K56R4l99J39J26j03k6pl15M75m3J07m45M36m44M77k60LK57n2j67k10
3329b09N14j74q2N9J30l91J99K57m07J02L7Q1P4l58J62K5o3K3j88K60m69L12K9
3352g7J63K3m15L49L4Q6j25J89j19j56J03J10m49J79K08k33K06k03N59m39r3q
3374a08K41r2q0L6o0J58k57R3J8K65o2k00L3k9J15K3P9k17J05Q4j24J4k04K4p8
3399b23j8K66KN5L1l64K65m6L0P6j86J41l2mK67J8k13N1J39l12J48r4k4Rq1R2
3425gr6J5J83K92m20kj12r3M19j71m5J31j84K73k95j29K69N2l1Jr9J12O3N2o7
$$ plain form
3450 111 -117 -86 370 92 -73 57 -119 46 79 -15 -295 0 -27 -283 78 139 12 65 78 -151 60 -312
3472 -312 -82 22 -62 -77 16 40 -8 63 71 -7 23 -210 -134 98 240 -32 -64 62 -129 -148 84 -214 70 5 -152
3497 -152 50 10 -201 -135 -109 -95 -308 -165 190 249 9 -27 146 -23 -171 78 -83 -244 202 -264 70 96
3519 96 -6 49 -120 -11 403 -67 150 40 9 163 197 169 312 150 -243 -239 132 -87 -56 429 307 51 -64
3542 -64 -110 -474 -299 482 53 -311 9 -229 -122 196 864 181 -513 230 -178 -240 -357 -128 -290 -118 410
3563 410 419 -39 -18 288 379 -554 -52 -125 51 9 -104 -201 541 -80 -49 138 -73 147 -36 -185 -193 5 -34 197
3587 197 -216 167 -129 229 -274 -6 80 21 165 67 100 83 180 259 52 -133 5 61 -133 218 -99 -89 -107
3610 -107 93 -189 -297 145 -226 -126 -55 301 -80 -170 -283 4 194 107 115 -6 73 216 -110 39 88 39 -99
$$ packed form
3450A11k28L1M56k78j65J30j76J65L3r4k80K95k7k56L61O1j27N3J3k29K11l72
3472c12K30J04q4j5R3K4m8P1Qp8L0k33P6K32J42k72l2J26j91j9K32k98K84o5j57
3497a52K02m0k11O6K6J4k13J43L55N9k40l6J73j69j48K49j61j61M46m66L34K6
3519I6j02N5j69J09M14m70K17j10l1J54L4k8J43j62l93ML71k19L1M85j22k56j15
3542f4m6l64J75P81m29l64L20k38J07L18O68o83o94P43m08o2j17K29j62J72N28
3563D10Rm58K1L06R1r33N02p3J76m2j13r7P42o21L1J87k11K20j83j49qJ98l9K31
3587A97m13L83k96L58n03K68Q6n9J44r8L3j7R7P9k07j85J38N6j94L51l17J0j8
3610a07K00k82j08M42l71J00P1L56l81r0j13K87J90q7Qj21P9J43l26J49M9m9j38
$$ plain form
3633 -99 -155 304 -11 154 277 9 190 92 44 150 -111 -31 -113 -11 -157 -184 104 -221 -314 -601 6 -267 43
3656 43 -42 34 152 -338 -317 192 -102 76 -257 106 -207 -145 318 193 -345 29 -105 -387 -127 -185 -132 -154 -176
3679 -176 62 82 34 -40 -82 -35 110 -169 286 39 81 76 68 229 -213 19 159 -78 -45 -28 75 89 -106 -1
3703 -1 -14 -65 225 -189 176 -32 127 -88 -14 69 136 -41 27 -106 80 270 56 27 206 -122 187 -69 -8
3726 -8 62 -100 5 177 63 23 -179 200 -65 -290 -163 92 189 -125 3 177 72 97 -101 206 34 -255
3748 -255 5 149 258 -19 411 195 -2 403 -209 417 347 -411 381 506 -29 -25 102 -1 7 -197 56 -110
3770 -110 -71 159 15 -53 -52 -263 -65 -86 -77 -135 -19 -194 -251 21 44 -67 220 135 3 46 -53 -122 -139 -123 -19
3795 -19 85 29 304 -229 381 -381 -201 626 -391 -131 26 17 -529 283 -274 438 267 104 -331 -214 223
$$ packed form
3633i9n6M59l15J65J23k68J81r8m8J06k61Q0q2J02j46k7K88l25r3k87O07k73L10
3656D3q5P6J18m90K1N09k94J78l33L63l13O2M63j25n38L74j34k82K60n8N3k2k2
3679a76K38K0m8p4m2M7J45k79M55k47M2nqJ61m42K32J40k37L3J7J03J4j95J05
3703aj3n1K90m14L65k08J59k15P4Q3O7j77O8j33J86J90k14k9J79l28L09k56O1
3726hP0j62J05J72j14m0k02L79k65k25J27K55R7l14J28J74j05K5j98L07j72k89
3748b55K60J44J09k77M30k16j97M05o12O26p0p58P92J25n35MJ27j03Qk04K53j66
3770a10L9K30j44o8Jk11J98k1Rn8J16j75n7K72K3j11K87q5j32M3r9o9j7J6J04
3795a9J04n6K75n33O10p62J80Q27j017K60J57rn46Q12n57P12j71j63m35J17M37
$$ plain form
3816 223 -15 298 -148 -297 372 89 107 7 183 -108 25 -66 -67 59 25 144 -455 -73 130 0 135 -82
3838 -82 138 -3 -111 26 -156 174 36 -61 -273 118 15 -27 -9 -194 -85 -11 253 15 -143 -53 -92 -39 101
3861 101 227 102 -45 72 -22 49 9 -43 15 240 310 1 -187 -54 168 -81 -38 231 -155 -73 -109 212 83
3884 83 -245 9 44 -136 -70 -172 -56 -121 -204 -37 188 -221 107 16 27 18 -24 -223 256 -32 -36 -74 -174 -107 -35
3909 -35 -198 2 -125 -124 74 -186 -61 -35 -38 -41 -161 127 -178 68 38 144 165 -126 -81 -150 128 -113 -221 73
3933 73 52 37 59 -108 221 25 -16 -2 98 -40 306 -126 -63 32 215 77 52 62 -118 -108 8 -129 10 89
3957 89 85 -248 228 -107 359 97 -218 175 197 249 259 -161 -94 13 -53 -228 19 99 220 54 -13 50 -183 -135
3981 -135 -114 48 -135 56 -34 192 -149 53 -33 200 -78 116 -354 112 -74 -42 84 20 22 -110 105 120 -88
$$ packed form
3816B23k38L13m46j49O69k83J8j00J76k91J33r1jJ26l4J19n99L82K03j30J35k17
3838h2K20j41j08J37j82L30j38r7k12L91j03m2J8j85J09P4K64k38j58R0l9N3J40
3861A01J26j25j47J17r4P1m0n2N8K25P0l09j88J33K22k49M3K69l86Q2l6L21j29
3884H3l28K54L5j80O6j02J16o5q3J67K25m09L28r1J1rm2j99M79k88ml8j00O7P2
3909c5j63K00j27JJ98k60J25K6llj20K88l05K46l0J06K1k91M5o9K78k41j08K94
3933G3k1j5K2j67L29j96m1J4J00j38L46m32O3R5J83j38k5J0j80J0J16j37J39P9
3957H9ml33M76l35M66k62l15L93K2N2J0m20O7J07o6j75K47Q0J21j66o7O3k33M8
3981a35K1J62j83J91r0K26l41K02q6K33k78J94m70M66j86L2J26o4Kj32K15J5k08
$$ plain form
4004 -88 121 -122 24 20 -110 -55 -65 1 46 -108 189 51 -33 -237 96 -1 -232 -99 -137 -5 105 -19 53 150
4028 150 49 197 54 230 182 82 48 -124 70 -75 -29 -173 312 27 53 -9 148 66 -239 -46 56 170
4050 170 83 17 -64 39 18 -354 146 87 -162 72 -18 -35 -260 -20 -108 115 47 208 -97 20 -126 -58 262
4073 262 -259 97 67 -104 -19 54 206 104 7 -125 182 168 -23 -77 -254 103 -153 -80 -211 -94 50 5 35
4096 35 10 3 -3 -327 203 70 102 210 -127 -211 -156 6 -149 -232 -27 -41 114 -23 -302 53 -308 117 -167 -94
4120 -94 51 -137 -99 3 125 -30 -82 -155 154 -171 184 -156 -177 -182 44 -273 -79 84 -257 -4 28 220 264
4143 264 51 -51 -53 83 -91 242 -9 -52 117 -130 -138 -154 -141 -268 199 -16 45 126 -102 183 -93 149 -111
4166 -111 -37 -327 -102 103 13 -95 -220 47 239 47 -10 79 5 -12 -76 -104 121 13 -75 100 145 66 78 -102
$$ packed form
4004h8K09k43J46mj30N5j0O6M5j54K97j38q4k04L33r7k31J33l8J32J10j24P2R7
4028A50j01J48j43J76m8j00l4j72J94j45M6j44M85k85K6o2J57q2l05J93J02J14
4050A70q7o6q1J03k1l72N00n9k49K34r0j7k25K40q8K23o8J61l05J17j46O8L20
4073B62n21L56l0j71Q5P3J52j02r7j32L07j4j91n4j77L57k56P3j31J17J44m5L0
4096C5k5pol24N30j33L2J08l37q4N5J62j55q3K05j4J55j37k79L55l61M25k84P3
4120i4J45j88L8J02J22j55n2p3L09l25L55l40k1nK26l17J94J63l41K53L2J92M4
4143B64k13j02kJ36j74L33k51m3J69k47qj6J3j27M67k15O1Q1k28K85k76K42k60
4166a11P4k90K25K05r0j08j25K67J92j92n7Q9p4j7o4k8K25j08q8J75M5p9J2j80
$$ plain form
4190 -102 118 -30 -192 -93 162 100 -200 257 -106 10 125 -31 -25 88 127 138 -79 -15 -117 59 31 -119 -95
4213 -95 -181 -127 -120 -15 -277 -219 -320 124 -228 192 4 -93 -113 -5 128 42 138 106 -164 -34 114 56 183 -189
4237 -189 -54 -20 -27 -114 154 140 -21 -7 -237 210 -12 39 -33 246 -254 31 167 132 -89 149 231 -7 -235
4260 -235 52 45 8 79 -36 -48 -108 51 -47 -90 -134 -299 -317 496 -266 47 -22 -189 59 67 779 190 -228 -681
4284 -681 -668 -480 241 -170 -79 491 -469 -288 19 537 227 -502 -187 -74 173 -587 50 139 -448 -279 -626
4305 -626 313 -248 -198 -549 287 93 260 180 -60 177 0 92 289 373 -302 243 -336 173 -209 -336 76
4326 76 -249 -614 -61 -295 -307 108 139 -344 678 -48 -836 -463 -346 -233 103 31 -234 -218 56 145 -106 -46
4348 -46 0 -107 -17 201 -138 -59 -108 -31 154 -176 -20 -9 -73 66 84 -140 152 40 45 -284 67 86 131 203 103
$$ packed form
4190a02K20j48j62R9K55o2l00M57l63J16J15j56OJ13L9J1k17O4j02J76k8j50K4
4213i5q6N4PJ05k62N8j01M44l52M20j88r7k0J08J33q6R6l2k70J30J48n8J27l72
4237a89J35L4pq7K68j4j61J4k30M47k22N1p2K79n00K85J36l5k21K38Q2k38k28
4260b35K87pl7P1j15j2o0J59r8m3m4j65j8Q13p62L13o9j67K48QP12n89m18m53
4284f81J3J88P21m11R1N70r60J81L07N18l10p29L15J13K47p60O37Q9n87J69l47
4305f26R39n61N0l51Q36j94J67q0k40K37j77R2J97Q4o75N45n79N09l82j27M12
4326G6l25l65N53k34j2M15L1m83J022p26p88L73J17J13L36p2k65J6K74Q9k51O0
4348d6M6j07R0K18l39P9m9P7J85l30J56J1o4J39J8k24K92j12Nl29L51J9M5P2j00
$$ plain form
4373 103 259 108 52 -19 29 63 -96 -55 -42 -200 55 -72 -63 42 42 0 45 -65 -75 -202 14 -108 281 149
4397 149 43 44 -97 -11 -49 401 17 -80 -134 -112 78 -30 -30 -77 10 97 42 -129 -185 164 167 275 -73 -132 -40 115
4423 115 -209 -195 -90 68 39 -73 -217 -141 142 -41 -250 -131 -106 -240 99 46 14 113 213 -60 -158 126 319
4446 319 -63 -206 -12 -130 -21 62 -57 153 -76 10 -4 -124 -113 -8 -42 222 -149 -121 -119 -18 159 87 -130
4469 -130 292 -26 -346 173 4 80 167 -98 -52 157 -101 -149 215 321 -106 256 -150 5 -160 -116 40 -327
4491 -327 -29 -205 16 144 -210 95 112 -65 -60 -154 -145 21 13 191 0 -113 -100 207 18 214 -62 -63 3 -162
4515 -162 -150 7 75 -368 10 26 -92 93 20 155 157 -108 -116 -59 37 -38 -181 -145 227 -11 -196 -567 -139 326
4539 326 -405 153 362 -278 156 49 -147 -64 35 342 -263 402 -5 -491 -181 -175 288 -267 -334 -145 -106 212
$$ packed form
4373A03J56j51n6p1M8L4j59M1J3j58K55j27RJ05%m2M5j10j0j27K16j22L89j32
4397A49j06Jj41Q6l8M50l84r7n4K2J90j08%m7Q7Q7n5j71n6L49LJ08l48n9R2J55
4423A15l24J4J05J58k9j12j44P6K83j83k09J19K5j34L39n3l2R9J00k73r8K84J93
4446C19l82j43J94j18J09Q3j19K10k29Q6j4j20J1J05l4K64l71K8KJ01J77p2k17
4469a30M22l18l20N19j69P6Q7k65M6K09k58m8L64J06m27L62m06J55j65M4J56l67
4491c27K98j76K21J28l54L05J7j77Nr4RJ66qJ78j91j13J3L07j89J96k76jO6j65
4515a62J2J57O8m43L78J6j18J85p3J35Kk65qN7R6p5j43L6L72k38j85l71M28M65
4539C26p31N58K09o40M34j07j96Q3R9L07o05O65m07m86L10OM63n55o7J89L9L18
$$ plain form
4561 212 106 -285 -200 -52 674 -102 362 -10 123 -194 -316 -649 512 797 81 813 402 -365 168 177 46
4582 46 473 -227 -121 -79 673 283 -174 187 -82 66 -457 -224 -154 145 151 -248 104 -209 23 -88 221 91
4604 91 -187 -76 191 -79 83 36 -240 100 21 -38 58 177 -64 -39 295 -50 -54 172 23 106 35 51 35 -186
4628 -186 -136 -149 -310 109 326 -367 80 -32 312 130 -136 -75 60 -173 149 34 2 77 195 104 15 -222
4650 -222 91 -256 -74 -103 -78 -152 27 415 -364 42 -172 13 262 -66 -41 -112 -106 -236 -221 70 -128 -169 2
4673 2 15 -102 -160 40 5 -15 -244 91 -104 -101 63 -159 -313 -83 -237 -41 301 -107 204 224 -52 -110 205
4696 205 157 -175 98 147 45 323 54 50 144 56 134 136 -99 -86 -144 -109 -47 -167 -9 67 43 -146 30 88 214
4721 214 113 -49 -363 128 44 -23 -33 -127 230 94 150 -221 -108 21 82 105 -159 -136 -128 -8 2 75 -17 70 96
$$ packed form
4561B12j06l91Q5J48P26p76M64l72J33l17j22l33J161K85p16P32m11p67N33Rj31
4582D6M27p00J06M2P52l90m57L61k69J48n23K33P0K99Ol99L52l13K32j11L09j30
4604I1k78J11K67k70J62m7k76L40p9n9R6J19k41K5L34l45mK26j49Q3p1J6j6k21
4628a86N0j3j61M19K17o93M47j12L44j82k66O1J35k33L22j15l2P5J18r1q9k37
4650b22L13l47J82k9K5p4J79L88p79M06k14J85K49l28K5p1Oj30J5K91j98m1J71
4673BJ3j17n8K00l5k0k29L35j95LJ64k22j54K30j54J96L42m08L11K0k76n8L15
4696B05m8l32K73M9j02K78k69mR4q8P8Kk35J3n8L5O2j20J58P6k4j89J76N8J26
4721B14j01j62l14M91q4o7j0r4L57j36N6l71J13J29O1K3k64K3QJ20J0P3r2Q7K6
$$ plain form
4746 96 266 53 6 -234 -11 196 155 411 -200 -39 -33 -102 162 228 -38 148 -93 77 -190 18 -54 75 -98
4769 -98 326 -238 122 -125 274 -242 198 -146 -24 -40 -59 -5 16 -23 -150 129 178 -15 -26 62 -189 39 -37
4792 -37 -20 -217 114 -176 140 -6 -5 -191 -25 -177 -107 4 96 -186 -154 25 213 95 -233 67 88 8 -50
4815 -50 79 -38 3 -176 -87 41 -104 -13 -39 -208 -35 75 -23 9 -42 146 -176 -240 253 -139 181 -20 265
4838 265 258 11 47 99 66 -89 92 101 -12 -81 198 32 -95 15 193 238 -197 0 -101 35 80 -91 -80 136
4862 136 -103 -77 136 93 27 -229 -46 153 181 -283 74 -104 315 95 -92 -163 -19 263 -155 -71 54 -211
4884 -211 153 25 26 20 40 -237 76 28 -78 -168 -234 38 142 -43 57 -13 103 -161 264 -49 30 -58 -330 -183
4908 -183 213 -18 21 -27 -41 50 206 -44 107 -109 -170 -71 74 131 -175 278 19 -13 -22 132 -144 -14 -16 -107
$$ packed form
4746I6J70k13m7k40K23K07m1K56o11J61Oo9K64O6k66J86k41J70k67K08p2J29j73
4769i8M24n64L60k47L99n16M40l44J22j6j9N4K1l9j27K79M9j93j1Q8k51K28p6
4792c7J7j97L31k90L16j46Jj86J66j52P0J11R2k82L2J79J88j18l28L00K1q0n8
4815e0J29j17M1j79Q9J28j45R1k6j69J73J10r8L2n1J88l22o4M93l92L20k01K85
4838B65pk47L6N2l3j55J81Rj13o9K79j66j27J10J78M5m35J97j01J36M5j71J1K16
4862A36k39K6K13m3o6k56J83J99K8m64L57j78M19k20j87p1J44K82m18Q4J25k65
4884b11L64j28JoK0k77L13m8j06r0o6K72J04j85J00p0J16k64M25l13P9q8k72J47
4908a83L96k31L9m8j4R1J56k50J51k16o1R9J45N7l06M53k59l2rJ54k76J30kr1
$$ plain form
4932 -107 -114 -67 96 116 -306 49 20 151 2 78 1 156 -142 -30 -147 -199 -2 -58 -261 117 -6 163 -111
4955 -111 -4 97 -119 -47 -100 -61 60 -1 -156 -56 -49 -4 -20 238 178 -8 -15 -110 -246 -52 33 17 -167 -90 -190
4980 -190 -12 41 -57 -193 -14 -25 -115 88 -3 68 -19 192 -24 -74 119 -81 -72 92 125 -64 -94 -73 -77 28 -186
5005 -186 81 62 1 178 -187 -30 -108 55 -101 42 230 -118 -134 3 85 144 265 127 303 -131 68 55
5027 55 199 -16 -3 15 -153 -82 -252 100 -150 14 126 134 114 132 136 67 -151 88 135 82 58 100 187 -121 -8
5052 -8 -197 -107 197 -172 6 40 104 144 -95 -80 -14 -187 83 249 -127 -13 26 27 26 -81 0 -35 -143 222 118
5077 118 101 22 257 -111 46 41 -122 251 -48 -36 -36 -27 -119 -137 -29 73 -185 -331 -108 93 281 -70 239 197
5101 197 251 122 5 45 -133 -162 -122 91 47 -69 -64 -29 96 353 -225 31 -86 173 0 -160 -63 -88 -198
$$ packed form
4932a07pM7J63K0m22L55k9J31j49P6p7J55k98J12j17n2J97n6k03L78j23J69k74
4955a11J07J01k16P2n3L9J21o1j55J00PM5j6K58o0j86pr5j36J94Q5j6j84P7j00
4980a90J78N3r8j36J79j1r0K03r1P1q7K11k16n0J93k00RJ64L3j89l0K1mJ05k14
5005a86K67j9o1J77l65J57p8J63j56J43J88l48j6J37Q2N9J21j38J76m34J99j3
5027E5J44k15J3J8j68P1j70L52k50J64J12Qk0J8Mo9k18K39M7n3k4M2Q7l08J13
5052hj89R0L04l69J78L4O4M0k39J5O6j73K70J66l76J14L9Jjj07Q1l5j08L65j04
5077A18j7p9K35l68J57nj63L73k99J2%Rr2j8J08J02k58j46K23K01J88l51L09m2
5101A97N4j29j17M0j78k9M0K13m4j16NL5J25K57n78K56j17K59j73j60R7k5j10
$$ plain form
5124 -198 -124 -324 25 2 16 -125 90 -64 -17 -154 -150 157 -208 53 -140 47 22 59 -79 87 154 174 -105
5147 -105 -50 -108 48 171 63 78 -240 270 -92 -194 -52 40 68 -29 -179 7 43 -110 -183 -14 -28 -319 -150
5170 -150 60 -247 -66 158 179 -131 131 -125 33 -126 -38 98 198 -31 200 153 -99 8 -26 -58 122 118
5192 118 11 120 155 156 -34 0 160 -6 81 142 -233 -29 68 6 -222 -283 91 38 26 196 -256 -122 -129 -6
5216 -6 20 -94 -97 -39 0 -11 -220 101 -70 -207 21 -255 2 89 42 80 46 114 -165 -88 158 79 46 -6 105 -90
5242 -90 -107 -6 -230 -130 -46 162 62 -143 -23 -54 -115 7 -113 3 -127 -25 42 113 -44 -1 -44 -100 218
5265 218 -156 15 -160 60 128 82 -137 5 40 -6 -109 104 -63 -42 34 -133 331 144 -19 -31 4 -119 18
5288 18 -108 -271 -49 22 -19 -70 -56 -34 83 -51 53 66 -153 -50 -251 125 -124 -96 -51 -84 19 201 -92
$$ packed form
5124a98P4k00L49k3J4j41K15j54M7j37ML07l65K61j93J87k5L7j38J66O7K0k79
5147a05N5n8J56J23j08J5l18N10l62j02J42R2K8r7j50J86L6j53p3J69j4k91J69
5170a50K10l07J81K24K1l10K62k56J58j59Q8J36J00k29K31m7k52J07l4l2J80m
5192A18j07J09L5Jj90L4J60j66Q7O1l75K04R7o2k28o1L74n3j2J70m52J34pJ23
5216fK6j14lN8L9j1k09L21j71j37K28k76K57Q7m7L8l4O8k79P7K46p9l3n2J11j95
5242i0j7J01k24J00Q4K08j00k05J20l1o1J22j20J16j30J02O7P1j57M3m3n6L18
5265B18l74J71j75K20O8m6k19J42L5m6j03K13j67K1P6j67M64j87j63j2L5j23J37
5288A8j26j63K22P1m1n1J4K2J17j34J04J3k19J03k01L76k49K8M5l3J03J82k93
$$ plain form
5311 -92 -60 180 74 -239 105 -276 -310 -55 -13 -1 11 -31 8 -52 -24 309 78 -6 -103 31 214 -19 -83 273
5335 273 56 6 106 -304 -138 -139 26 -60 125 90 -169 -99 76 129 -62 101 -42 266 -115 45 102 -37 -89
5358 -89 -67 64 15 -148 13 155 -128 -139 55 2 -577 -144 155 24 62 170 -285 8 299 278 -125 -115 129
5381 129 29 -109 -115 -146 -84 221 -31 98 73 147 95 -41 43 79 142 49 165 -37 -46 -71 91 -80 28 -84 34
5406 34 36 -159 16 69 207 -125 -82 -156 264 -279 -151 128 -40 -20 27 -29 219 -86 126 -215 11 -17 -164
5429 -164 -17 219 -78 -6 139 -148 -206 77 -373 15 250 -177 124 160 -204 -12 149 -204 313 -237 210
5450 210 222 -51 62 36 -61 -117 225 -143 154 106 -7 10 45 -22 -136 -225 36 -157 121 187 -144 125 -190
5473 -190 88 53 -30 250 -145 188 126 -40 -270 -540 16 394 -357 269 74 -339 40 -314 -202 -26 -201
$$ packed form
5311i2L2K40j06l13L44l81l4K55M2J2J2m2L9o0K8L33k31q4r7J34J83k33o4L56
5335B73k17n0J00m10J66jJ65q6J85l5k59P0J75N3j91J63j43L08l81J60N7j39n2
5358h9K2J31m9j63J61J42k83j1J94n3n79M33K99j31L8J08m55K93K91k1m03J0K44
5381A29j00j38ol1O2L05k52J29k5P4n2j36Q4L6O3r3J16k02rk5J62j71J08j12J18
5406C4Kj95J75N3J38l32M3p4M20n43J28K79j68K0M7n6K48l05K12l41K26k8j47
5429a64J47K36k97P2J45k87n8K83m50L88K35m27L01L6l64J92J61l53N17n50M47
5450B10J2k73J13k6r7n6L42l68K97m8j13J7L5o7j14q9K61j93K78O6l31K69l15
5473a90K78l5q3K80l95L33o2j66k30k70N56L78p51O26j95m13L79l54J12J76j75
$$ plain form
5494 -201 -123 -216 265 65 -232 29 16 -251 -201 62 729 2 209 139 -111 26 426 133 -142 -52 82 171
5516 171 -111 346 111 -30 -377 -9 60 -202 5 -43 120 98 -184 75 133 183 21 -46 94 -39 151 -345
5538 -345 86 20 152 55 -76 171 -42 -251 108 -266 68 55 -33 -73 81 -160 89 -159 95 211 226 125
5560 125 -236 -36 -116 282 95 -57 20 -59 -137 129 224 77 -228 279 -108 60 -39 -47 -100 -25 -56 -50 33 67 139
5585 139 -201 53 286 30 47 58 136 170 43 48 -9 102 -63 138 -189 -161 -249 -71 -60 71 38 -233 233 -193
5609 -193 -77 -248 -46 97 -247 -225 -57 26 26 -222 -76 205 -81 -2 184 -130 46 13 384 272 -34 174
5631 174 191 -91 -162 -115 -89 -11 188 101 19 90 184 -78 -144 -11 -196 -54 -108 270 -240 12 -55 201 95 32
5655 32 -150 62 18 -100 69 266 -85 -178 312 -74 3 -205 37 379 -48 -102 -201 195 -249 -147 -110 -230
$$ packed form
5494b01P8r3M81k00k97K61j3k67N0K63O67p27K07p0k50J37M00k93k75R0J34Q9
5516A71k82M57k35j41l47L68O9k62K07m8J63k2k82K59N8N0j62o7J40j33J90m96
5538c45M31o6J32r7j31K47k13k09L59l74L34j3q8m0J54k41K49k48K54J16J5j01
5560A25l61K00q0L98j87j52P7p9p8K66R5j47l05N07l87J68r9qn3P5l1OQ3L4P2
5585A39l40K54K33k56J7J1P8L4j27Nn7J11j65K01l27K8q8J78J1J31l3k71M66m26
5609a93J16j71K02J43l44K2J68Q3%k48J46K81k86P9J86l14J76l3L71j12l06K08
5631A74J7k82p1M7K6P8J99q7q2P1R4k62o6J33j85J42n4L78n10K52o7K56j06o3
5655C2j82K12m4j18J69J97l51r3M90l86P7k08K42L42m27n4r9L96m44J02L7j20
$$ plain form
5677 -230 -168 138 -236 -146 -74 161 -506 351 180 -446 -721 408 -445 -453 -31 156 -396 257 212 15 -49 55
5699 55 -9 -799 850 -264 -18 -68 181 -284 52 -256 126 -102 194 164 90 90 -33 -206 -101 48 168 -67
5721 -67 99 79 -41 -12 -60 45 9 191 192 -61 48 -113 145 -5 -60 -116 -81 66 -27 46 64 -73 -174 5
5745 5 -220 -19 61 12 298 286 60 -35 -209 -82 7 -244 -92 -133 -12 265 -19 338 -56 -160 -245 98 110
5768 110 190 -68 7 98 32 211 -102 -1 45 130 165 -45 211 -15 -131 87 81 63 84 17 119 -74 -230 -31
5792 -31 -60 167 -69 -76 239 30 -3 28 27 167 -21 3 25 54 133 22 -74 127 -76 60 -16 -69 96 79 221
5817 221 146 -139 -142 -148 -112 -89 -7 20 15 45 207 -79 -167 21 77 -49 38 -40 -147 426 -228 -29 -277 149 -154
5842 -154 -28 -145 -92 -253 -180 176 40 -78 -96 -62 -149 239 24 -29 -302 -74 -46 -143 -153 92 183 75 26 133
$$ packed form
5677b30O2L06l74R0P2K35o67Q57j71o26k75J129q53qM22J87n52O53m5j97o4J04
5699E5o4p90J649j114K46n0K49m65L36l08L82k28K96l0p4%j23j73J05J49J20k35
5721f7J66k0j20K9m8J05l6J82Jk53J09j61K58j50n5n6L5J47r3P3J8j37j01J79
5745Ek25K01Q0m9K86j2k26r5j74J27Q9k51J52m1J21K77k84L57l94j04q5L43J2
5768A10Q0k58P5R1o6J79l13J01M6Q5L5k10K56k26j16K18oj8K1o7J02j93j56J99
5792c1k9K27k36pL15k09l3L1jJ40j88K4K2K9P9j11r6K01k03J36p6n3J65j7J42
5817B21p5k85loL6K3Q2K7nL0J62k86q8J88N6j26Q7p8j07N73o54J99k48M26l03
5842a54J26j17N3j61P3L56j36j18j8L4q7L88k15n3k73K28K8r7j0K45R1j08m9J07
$$ plain form
5866 133 43 -137 -29 -36 -126 93 -241 173 -20 87 53 3 -159 -14 -108 -127 -37 -51 -97 -120 -14 175 99 8 -122
5891 -122 -97 275 86 -36 224 -237 31 97 53 161 -107 333 128 35 -477 251 -241 -452 -249 -38 -40 -18
5913 -18 -38 -75 16 -63 -47 146 -64 -106 -4 -48 -61 279 -17 33 -218 132 257 -121 -188 -93 -89 -140 231 -101 -132
5938 -132 13 91 16 -18 60 105 -201 -51 -83 -20 151 228 -267 -213 124 218 142 -53 -249 221 135 -54 -55 -29 252
5963 252 191 -67 113 -10 183 -24 58 183 -95 3 -31 -190 -218 -51 -252 150 -15 -2 -214 177 30 -107
5985 -107 52 23 97 20 19 -46 63 7 -8 -147 -196 180 123 -59 198 -102 -9 -121 0 -30 267 -32 -100 -11 11
6010 11 185 93 34 -6 -205 -109 73 75 21 -155 30 5 3 82 -23 -171 -109 66 89 102 339 -245 136 67 -39
6035 -39 154 147 -76 -92 31 -50 69 -95 -62 57 -15 -21 214 -120 27 -11 103 157 -268 191 110 -100 -61 -28 -29
$$ packed form
5866A33r0j80J08pr0K19l34M14j93J07l4n0j62J45r4j9R0j4m6k3J06J89p6r1j30
5891a22K5L72j89j22K60m61K68O6m4J08k68M40k05r3n12P28m92k11K03K11kK2
5913a8k0l7R1p9J6J93k10m2J02m4j3L40k96N0k51L50J25l78o7R5Mn1L71l32l1
5938a32J45P8p5l4P8M5l06J50l2O3J71P7m95N4L37R4p6j95j96M70q6j89jK6K81
5963B52o1k58J80j23J93k07Q2J25k78R8l4j59k8J67k01M02j65J3k12L91j47j37
5985a07J59k9P4p7jo5J09n6j5j39m9L76n7j82K57l00R3j12J21l0K97k99o8Q9K2
6010A1J74r2n9m0j99R6J82Kn4j76J85k5kP9j05j48O2J75K3J3K37n84L81o9j06
6035c9J93pk23j6J23q1J19j64L3J19p2oK35l34J47l8J14N4m25M59q1k10L9L3j
$$ plain form
6060 -29 -177 -118 -15 -46 -134 -178 -72 -228 110 192 183 321 -5 129 -71 48 33 -112 -86 -59 119 -98 164 174
6084 174 -136 -5 -204 -340 142 9 -67 205 -102 103 279 -105 80 76 136 37 -5 -49 -39 -261 162 -37 99
6107 99 196 250 -72 43 119 5 -26 44 -48 75 -117 -27 121 22 40 64 -104 -109 -84 -177 63 -150 -104 -24 97 187
6133 187 101 -86 -225 -51 64 52 -29 86 123 -85 -65 269 -52 179 -12 104 -1 48 -84 -46 168 -254
6155 -254 64 59 -41 -161 -159 68 208 -113 -116 70 99 -122 -145 -140 10 61 102 -82 -181 13 312 -166 -87 66 134
6180 134 -97 146 86 175 15 167 117 -79 67 -33 206 -347 171 325 -202 -149 -94 -170 -30 -197 -155 -385
6202 -385 601 215 238 -28 444 -152 201 115 -211 -303 2 -277 21 280 18 -281 451 945 -372 -170 199
6223 199 23 -624 751 -899 -329 903 -342 -365 -17 79 -268 576 153 -26 551 332 202 16 -291
$$ packed form
6060b9j48N9J03l1q8m4J06j56L38Q2rJ38l26J34k00J19j5j45K6K7J78k17K62J0
6084A74l10J31j99j36M82j33p6K72l07K05J76l84J85mO0r9m2m4J0k22M23j99J36
6107I9R7N4l22J15P6j14l1P0r2J23j92R0J48r9J8K4j68nK5r3K40k13M6Q0J21R0
6133A87q6j87j39J74J15j2q1J15L7k08K0L34l21K31j91J16j05M9j32L8K14m22
6155b54L18nj00j20KK27J40l21lJ86K9k21k3NJ50N1M1j84r9J94K99m78P9J53O8
6180A34k31K43o0Q9j60J52n0j96J46j00K39n53N18J54n27N3N5p6J40j67M2k30
6202c85R86l86K3k66M72n96L53q6l26r2L05k79K98K59k62k99P32M94j317K02L69
6223A99j76o47J375j650N70J232j245k3L48R6l47Q44m23j79N77k19j30j86l07
$$ plain form
6242 -291 -50 48 -9 -84 75 -177 128 199 -133 127 -125 7 -185 36 152 -218 20 133 -1 -61 77 35
6264 35 52 -87 -27 -257 82 -96 30 -189 -180 88 -70 1 -162 -5 101 286 -112 8 -71 204 185 -244 38
6287 38 -1 81 -125 -18 -214 -114 12 81 79 -358 1 -113 58 73 -46 107 -135 -131 329 -50 14 -29 50 -196
6311 -196 -97 123 29 23 55 -131 84 -210 -116 13 -91 64 270 70 10 169 -106 -212 34 35 -112 -129 56
6334 56 199 -9 -11 -193 89 -239 -266 96 125 112 -69 15 78 -65 -190 108 57 16 108 -37 -48 215 192 -112
6358 -112 -84 -47 68 -216 277 102 4 5 -4 164 182 -146 34 -53 353 -131 315 -190 178 235 -58 176 -82
6381 -82 67 -174 -55 -186 -144 -44 110 -190 -23 -74 -64 -181 82 56 140 85 -170 1 288 -45 -102 128 17
6404 17 -98 4 84 -129 247 56 -144 83 -222 18 -209 -168 156 -174 186 28 -250 -17 -48 85 -200
$$ packed form
6242b91K41R8n7p5J59k52L05P1l32K60k52J32j92K21J16l70K38J13j34o0J38m2
6264C5J7j39O0k30L39j78J26k19RK68j58P1j63J57J06J85l98J20p9K75j9m29K82
6287C8l9Q2k06J07j96J00J26O9km37L59j14J71J5j19J53k42MM60l79O4m3P9k46
6311a96R9K20r4oL2j86K15k94R4J29j04J55K06k00o0J59k75j06K46Jj47j7J85
6334E6J43k08kj82K82l28k7L62K9j3j81Q4O3j43j25K98n1m1R2j45j1K63k3l04
6358a12K8L7J15k84M93j75r8JrJ68J8l28J80q7M06m84M46n05L68N7k93K34k58
6381h2J49k41J19j31M2J00J54l00J67n1J0j17K63k6Q4n5k55J71K87l33n7K30j11
6404A7j15J02Q0k13L76j91k00K27l05K40k27M1L24l30L60j58k78K33l1J33k85
$$ plain form
6425 -200 55 -49 -18 91 99 167 -142 66 156 -265 -107 -56 162 -12 3 -186 -151 -40 32 115 -172 -254 -98 101
6449 101 -149 -154 -59 32 -115 145 77 -120 -198 94 -36 118 11 69 144 -30 39 103 -91 -181 -109 13 -101 48
6473 48 -329 -177 -97 -313 107 121 1 -47 27 35 89 235 -269 284 59 -83 138 -23 -7 151 39 -297 317
6496 317 -40 -138 10 6 -15 143 -210 67 -73 -200 100 -55 -50 -31 -46 -99 25 83 18 88 273 -51 119 88
6520 88 171 25 -8 -101 43 193 -70 137 -130 -100 95 36 32 48 -385 16 -30 145 -73 82 83 73 -51 27 -115
6545 -115 121 -23 -20 -306 -89 -226 -12 -49 175 93 67 18 95 82 -77 -191 85 -305 -57 -14 -28 160 204 -5
6569 -5 49 -110 -65 -83 -166 -147 -167 -54 -147 -113 -70 -76 -141 -152 -91 196 -35 -109 -172 -13 -170 -29 -109 262 -174 -18
6595 -18 148 -149 -14 34 9 125 -181 -212 220 146 3 -218 137 -143 75 -65 264 216 12 204 125 -59
$$ packed form
6425b00K55j04L1J09QO8l09K08R0m21J58N1K18j74J5j89L5J11P2Q3k87q2J56J99
6449A01k50nR5R1j47K60o8j97p8K92j30J54j07N8P5j74O9O4j94r0P2J22j14J49
6473D8l77J52Q0k16M20J4j20m8P4QN4J46n04N53k25j42K21j61J6J58j12l36O14
6496C17l57r8J48mk1J58l53K77j40j27L00j55NJ9j5n3J24N8o5P0J85l24J70l1
6520H8Q3j46l3r3J44J50k63K07k67L0J95n9mJ6m33M01m6J75k18J55Jj0j24P8j42
6545a15K36j44Lk86K17j37K14l7K24q2k6m9P7j3j59j14K76l90K48M3j4J88M4k09
6569eN4j59M5j8q3J9k0J13r3L4M3oo5j1O1K87k31p4o3J59j57J41q0L71m36J56
6595a8J66k97J35M8k5J16l06l1M32p4j43k21L55k80K18j40L29m8k04J92p9j84
$$ plain form
6617 -59 -244 -169 -226 153 -68 -153 66 -65 -35 -155 -30 83 33 -46 69 -45 92 82 19 215 -105 -157 71
6640 71 154 206 -41 -39 -132 -191 -13 -101 79 35 47 79 188 -257 -115 98 121 82 23 110 250 21 34 -30 14 22 13
6667 13 -161 -206 -24 62 -132 -120 48 -13 -22 234 -34 -54 80 175 -5 76 14 -75 -229 -10 148 14 -63 115
6691 115 -166 -135 -112 -64 27 -102 -64 279 125 -185 22 33 93 -229 41 89 -98 -2 -132 -91 55 -116 105
6714 105 329 -257 289 -56 -115 -36 104 63 98 123 7 159 -354 -91 -37 58 42 -85 29 44 31 141 -113
6737 -113 -52 -45 -55 -5 211 -53 116 -134 157 -265 -4 81 5 -5 -7 -178 -114 -68 99 -41 49 190 -110 146
6761 146 158 66 -73 -194 -215 -78 -2 -137 -147 -16 90 -76 177 210 165 247 -188 75 -86 -169 39 -36 -83 -34
6785 -34 -103 300 -403 -326 159 -4 10 -48 -1 109 -144 97 313 -72 30 -112 -123 -90 -210 58 147 43 -93
$$ packed form
6617e9j85P5n7L79k21q5K19j31L0j20J25J13n0p9J15j14J37j0o3J96l20n2K28
6640G1Q3N2k47Kr3n9J78q8J80m4J2L2J09m45J42K13K3l9n9Q7J40k29J3o4M4Qr
6667A3j74m5J82Q6j94J2J68o1rK56k68k0J34R5j80Q1o2q9j54K19J58j34p7J78
6691A15k81L1K3M8R1j29L8L43j54l10K07J1O0l22K70M8j87R6j30M1J46j71K21
6714A05K24n86N46l45n9P9J40m1L5K5j16J52n13K63N4R5j6j27J14J5j3J10k54
6737a13O1Pj0N0K16k64J69k50K91m22K61Q5p6j0kj71O4M6J67j40R0J41l00K56
6761A46J2r2j39j21k1J37P6j35j0J31J06j66K53L3m5Q2m35K63j61q3K08p5m7M9
6785c4o9M03p03P7M85j63J4n8M7J10k53K41K16l85J02j42j1L3j20K68Q9j04j36
$$ plain form
6808 -93 -79 -56 -129 136 -252 4 98 -159 85 140 185 -184 164 -7 -88 -171 -51 -11 113 24 -54 31 55 46 -188
6833 -188 -20 -13 54 -191 179 -61 -6 -95 -51 -131 140 150 -89 71 -58 -88 -146 316 31 -110 62 -132 -339
6856 -339 -14 -217 132 287 -238 -21 -3 -28 113 165 149 231 -3 -18 84 -220 -106 -121 -62 345 39 241 46
6879 46 274 -3 -30 96 -130 276 -11 -44 -67 4 137 -36 32 -68 371 122 136 -138 -59 177 -28 -164 -116
6902 -116 -276 254 21 -37 -34 103 -117 51 -82 20 -125 -21 -97 -115 -33 -79 231 116 103 90 -89 -251 -157
6925 -157 58 205 -159 238 35 190 170 -239 -201 57 63 105 -119 -300 29 -8 60 -10 113 -69 139 146 214 -16
6949 -16 25 192 31 -39 76 27 -148 -74 -112 20 9 127 -41 -320 -73 36 46 59 130 148 163 -117 -42 -112 74
6974 74 -48 241 -419 792 200 -271 21 45 -112 15 45 -196 58 -11 78 233 117 155 206 174 -123 -15
$$ packed form
6808i3J4K3p3K65l88K56R4k57K44N5M5l69L48j71q1q3J20M0J24q9p8Q5K4rk34
6833a88J68PO7k45L70k40N5q9M4q0K71J0k39J60j29l0n8M62k85j41J72j94k07
6856c39L25k03L49J55n25K17J8k5J41N2j6Q2k34j5J02l04J14j5N9M07l06K02j95
6879D6K28k77k7J26k26M06k87l3k3P1J33j73O8j00M39k49J4k74P9K36k05j36M8
6902a16j60N30k33n8LJ37k20J68j33J02j45J04p6j8Q2m6L10j15j3j3j79j62R4
6925a57K15J47l64L97k03J55k0m09L8K58OM2k24j81L29l7O8p0J23j82K08PO8k30
6949a6M1J67j61p0J15m9j75P4l8J32j1J18j68k79K47J09J0J3P1J8J5k80P5p0J86
6974G4j22K89o60J211n92m71K92K4j57J27L0k41K54o9Q9J55j16L8N1l2k97J08
$$ plain form
6996 -15 75 -82 116 127 17 -25 -199 63 75 126 86 29 118 -173 155 315 103 230 15 121 15 164 7
7019 7 -107 171 11 123 -179 -118 -128 -108 -25 123 117 -129 37 -85 -128 -65 -26 -27 -247 -38 -115 36 -22 -136 108
7044 108 -163 -2 231 -159 164 -130 -241 -90 -15 180 -166 162 -27 -210 -33 -64 12 -208 161 -39 -80
7065 -80 -199 3 68 -72 -29 -149 91 -30 132 -246 89 133 3 39 63 -134 196 107 6 12 77 95 61 81
7089 81 8 -168 46 89 -53 -102 -14 219 105 169 -71 173 -146 -213 46 -17 13 84 134 -375 -52 -3 124 198
7113 198 -109 75 59 160 -12 42 42 41 67 -25 -58 8 -4 79 18 -281 -92 150 -22 51 -260 226 121 59 -104
7138 -104 276 -8 -7 -123 167 155 -24 50 95 157 -123 115 111 68 -56 -71 65 -169 -16 158 200 251 -64 -203
7162 -203 -94 -139 217 -130 -122 229 417 -103 -192 -49 -113 -244 84 209 153 160 -13 -8 127 121 -29 63 167 -121
$$ packed form
6996a5R0j57J98J1j10m2j74K62J2N1m0n7Q9k91L28J60k12J27k15J06j06J49j57
7019Gj14K78j60J12l02O1j0K0Q3J48ok46J66j22m3O3L9jk20K09p7J51n8j14K44
7044A08k71J61K33l90L23k94j11J51P5J95l46L28j89j83J77l1P6k20L69k00m1
7065h0j19K02O5j40M3j20K40j21J62l78L35M4j30L6K4j97L30q9j01OO5J8l4K0
7089H1p3j76K14M3j42m9Q8K33j14O4k40K44l19o7K59o3L0P1N0n09L23M9J27P4
7113A98l07J84j6J01j72N4%jK6r2l3O6j2Q3o1k99J89K42j72P3l11M86j05o2j63
7138a04L80k84Jj16K90j2j79P4M5O2k80K38mm3j24j5J36k34J53J74M2N1l15j39
7162b03J09m5L56l47QL51J88n20q9J43o4j31L28J25n6Pj73NJ35oj50R2J04k88
$$ plain form
7186 -121 -5 -143 -178 248 -60 -104 -22 102 -177 -157 -339 175 81 207 139 -43 87 175 -102 -59 -66 -91 -96 30
7210 30 189 -154 -37 -44 -55 68 -57 42 -136 -241 16 -103 65 72 -25 -89 66 -177 226 11 -229 -239 42
7233 42 76 -216 187 -265 -176 -3 46 -103 -120 -112 99 127 -152 -102 135 158 -115 -190 16 -66 58 57 -16 -29 3 16
7259 16 -213 101 0 7 111 19 103 87 374 -47 -25 -36 -159 66 -97 146 -8 -77 249 90 -199 -41 2
7282 2 -17 -128 42 293 32 253 79 53 221 42 41 -41 46 200 50 -32 -121 -92 -53 -29 54 74 92 -12 -75 -16
7308 -16 121 61 70 49 161 20 -77 98 -38 -103 51 -85 147 237 -156 -164 187 -168 27 -310 -231 -130 -22 -68
7332 -68 258 93 -92 31 236 74 -239 68 391 -33 90 146 471 -54 193 572 -133 -929 -424 1006
7352 1006 171 314 -464 253 319 377 702 -43 278 -148 -60 -192 -11 -100 122 -79 7 -25 -67 162 299 180
$$ packed form
7186a21J16j38l5M26l08m4Q2J24k79K0j82N14r4J26o8j82J30Q8k77M3pk5nJ26
7210C0J59l43J17pj1J23j25R9j78j05K57j19J68Pr7o4J55k43M03k15k40j0K81
7233D2L4k92M03m52Q9J73M9j49j7QK11K8k79N0K37K3k73p5K06q2J24jp3j3L2J3
7259A6k29L14j01PJ04r2Q4j6K87m21K2j1j23K25j63K43j54o9L26j59k89J58M3
7282Bj9j11J70K51k61K21j74k6J68j79jq2Q7J54j50q2q9K9L9K4Q3K0J8j04o3N9
7308a6J37o0Rk1J12j41r7J75j36o5J54j36K32R0l93qL51l55J95l37P9J01J08m6
7332f8L26j65j85J23K05j62l13L07L23m24J23N6L25n25K47L79p05p96N05J430
7352A006q35J43p78P17O6N8L25p45L21m26Q8j32J81q9K22k01Q6l2m2K29J37j19
$$ plain form
7374 180 -91 184 -5 35 -18 -51 72 -155 -194 -95 -62 -91 -51 -49 -38 -71 -14 -79 -73 295 -80 -109 -62 63 -12 -177
7400 -177 -84 180 261 84 64 52 210 -196 79 -78 61 127 -28 -109 224 33 23 24 150 169 -191 4 72 -201
7424 -201 -75 82 -15 -53 218 -206 -113 -216 -98 156 52 -69 76 -62 -69 -177 -90 159 62 48 -177 -88 166
7447 166 18 7 56 -204 -18 70 166 -87 -4 171 -25 127 152 -114 47 -92 -112 221 46 -17 120 72 -105
7470 -105 -252 -56 -143 17 -132 -128 108 212 -98 -105 -15 -38 -174 -160 -68 -143 -36 6 81 -131 16 159 233 -138
7494 -138 -33 32 -285 -138 113 -59 -164 135 82 133 -265 172 -52 104 122 -105 -180 -192 49 124 -21 -34 -26
7517 -26 205 185 133 37 112 -101 179 320 -149 22 -208 -141 97 -37 -82 221 38 -63 -42 35 215 6 -27
7540 -27 -120 -101 -165 95 -208 102 -58 -93 7 -94 147 161 -41 -171 -6 -64 134 120 23 53 181 -209 81
$$ packed form
7374A80k71K75j89M0n3l3J23k27l9R9L3k9M0KJ1l3N7o5OL68l75k9M7J25p5j65
7400a77R3K64Q1j77k0j2J58m06K75j57J39O6j55q1L33j91j0JJ26J9l60J95O8k73
7424b01J26J57r7l8K71m24R3j03J18K54j04j21J45j38pj08Q7K49r7j4k25Q9K54
7447A66j48j1M9k60J86Q8R6k53Q3J75j96J52K5k66J61j39k0L33j75o3J37m8j77
7470a05j47J96q7J60j49MK36J04l10pR0k3j36J4R2p5J07M2P5k12J47J43P4l71
7494a38J05O5l17J47K51j72j05K99n3N1l98M37k24J56J8k27p5j2K41P5j45j3Q
7517b6K31k0n2r6P5k13K80J41m69J71k30O7K38j34m5L03j83j01K1P7J80k09l3
7540b7r3J9o4K60l03L10j60l5J00j01K41J4k02j30J65n8J98j4r7L0J28l90K90
$$ plain form
7563 81 -76 92 74 156 -14 145 -53 -139 28 -170 125 0 -134 17 -23 179 -88 186 109 63 -96 -96 -2
7586 -2 252 210 48 93 149 85 -29 152 0 58 -52 -46 -140 64 -96 -182 -80 17 -47 226 299 87 -134 -131 11
7611 11 -178 -19 -22 -43 127 258 33 73 249 46 73 -14 135 -165 -66 -18 23 -141 52 -59 -141 149 11 -8
7635 -8 -222 -42 -195 184 -103 -36 -64 235 -113 70 292 -64 152 -141 336 -31 153 -277 4 -128 -99 77
7657 77 -105 287 -152 -114 -290 -180 88 -63 -96 -109 99 -210 -122 -5 13 125 61 -165 -41 0 -81 41 -257
7680 -257 48 151 84 -67 93 -136 -28 -13 -1 -147 148 -207 65 -61 175 -14 349 13 -111 119 20
7701 20 158 32 -41 84 119 -9 22 32 73 132 91 24 -193 27 -12 -96 -42 51 302 87 57 113 -142 -14 145
7726 145 20 175 -67 124 65 -40 15 -165 86 91 -191 -103 152 -60 -199 -120 65 -89 -133 36 188 283 28
$$ packed form
7563H1j57J68j8Q2j70J59j98q6J67j98K95j25j34J51m0K02k67K74p7m6j59%R4
7586bK54m2j62M5N6o4j14J81j52N8j10Or4K04j60q6J02R7o4K73P3k12k21LJ42
7611A1j89J59lk1J70J31k25M0J76k03K7q7J49l00R9M8M1j64J93j11q2K90j38j9
7635hk14J80j53L79k87O7k8K99l48J83K22l56K16k93M77l67J84m30K81j32K9J76
7657G7j82L92m39L8j76J10K68j51l3j3K08l09Q8J17J8J12o4k26J24M1q1J22k98
7680b57L05J03o7j51J60k29J08J5J2j46K95l55K72j26K36j89L63l36j24K30r9
7701B0J38j26p3J25L5j28L1J0M1N9m1o7k17K20l9q4N4R3K51k15l0N6k55J28J59
7726A45j25J55k42J91n9j05N5j80K51Nk82Q8K55k12j39P9J85j54m4J69J52R5k55
$$ plain form
7749 28 166 7 98 -1 -41 26 -123 -9 39 22 -105 -53 52 96 102 -123 196 218 -113 87 28 105 -68 -149 76
7774 76 62 33 -4 114 -60 -21 -34 -97 -73 -116 44 30 142 76 -90 -100 93 250 -156 -42 329 -49 -73 -193
7798 -193 -137 41 54 -103 -42 96 76 118 -27 -182 -28 109 41 73 -6 -13 -161 77 107 -228 -61 -17 2 81 -88
7823 -88 -75 16 48 -27 28 -235 8 -107 -16 -151 299 219 54 64 -111 -20 -261 -127 -189 86 -125 28 213 -148
7847 -148 40 -27 7 43 -142 60 127 -225 47 -24 161 -42 33 123 102 11 -14 -116 113 42 12 16 -92 -19 -160
7872 -160 -98 -71 -133 -110 -206 -33 92 155 265 123 55 44 -232 44 -36 -138 47 -140 -43 -19 4 172 119 45 172
7897 172 -124 237 164 74 -9 35 -12 -81 15 26 -81 314 172 290 96 -33 202 -68 -59 84 -117 -116 -136 -278
7921 -278 -137 168 138 -33 -133 -28 -94 -101 3 3 66 -281 -19 -93 -58 -146 -181 69 23 -173 -155 -153 9 34 25 -27
$$ packed form
7749B8J38j59R1r9m0O7j49J14M8j7j27N2J05M4Ok25L19K2l31K00n9P7j73q1K25
7774G6j4k9l7J18j74L9j3o3K4m3J60j4J12o6j66j0J93J57m06J14L71l78k4j20
7798a93N6J78J3j57O1J38k0M2j45j55J54J37o8L2p9pj48K38L0l35J67M4J9P9j69
7823h8J3R1L2p5N5k63K43j15R1j35M50q0j65J0j75R1k41J34o2K75k11J53J85l61
7847a48J88o7L4L6j85K02O7l52K72p1J85k03P5R0k1r1k5j02K29p1l0Mj08P3j41
7872a60O2K7o2K3r6J73J25O3J10j42o8j1k76K76q0j02J85j87R7K4K3J68n3p4J27
7897A72k96L61p3r0q3M4m7o9R6J1j07L95j42J18j94j29K35k70RJ43k01Jk0j42
7921b78J41L05l0j71j00J05o6pJ04%O3l47K62p4L5q8l5K50m6j96J8KJ62K5rn2
$$ plain form
7947 -27 -85 22 39 -76 -5 17 174 177 65 -282 -184 -84 135 9 172 -274 -26 101 59 253 139 147 -41 74
7971 74 -236 54 -119 41 26 -42 279 39 -167 -344 -92 -190 -14 -94 224 -512 270 -185 -46 450 -68 -3
7993 -3 37 -299 82 -438 307 157 -635 -9 -347 34 -128 270 751 -164 -399 -339 66 25 106 -18 -440 349
8015 349 -385 -76 -239 61 43 -90 194 129 -3 -86 94 -297 116 42 -55 13 270 82 -200 -12 -255 9
8037 9 167 1 -113 37 -115 60 178 25 12 -44 -231 89 -48 -38 352 -83 256 29 47 31 -9 157 -61
8060 -61 195 -188 -93 -137 23 -19 68 277 15 -59 80 50 -77 -9 119 -218 222 -234 52 -106 107 189 82
8083 82 -54 28 -142 0 124 95 61 83 -22 -171 117 3 158 -199 74 -2 260 -152 -38 -306 12 81
8105 81 120 52 -40 -27 -210 -55 -6 -30 147 134 113 -32 69 -220 -23 -12 12 266 4 358 84 62 61 -112 -6
$$ packed form
7947b7n8J07J7j15P1K2J57Lj12l47R8J00K19j26J63m46K48J27m2J94j14Qj88J15
7971G4l10K90j73J60j5o8L21k40k06j77K52r8J76q0L18p36P82m55J39M96n18O5
7993cM0l36L81n20P45j50p92O26l38L81j62L98M81r15k35O0M05m1Q1j24m22P89
8015C49p34L09j63L00j8j33K84o5j32q3J80l91M13p4r7O8K57j88k82J88k43K64
8037IJ58j66j14J50j52J75J18j53j3n6j87L20j37J0L90m35L39k27J8j6m0J66k18
8060f1K56l83R5m4J60m2Q7K09k62p4J39l0j27O8J28l37M40m56K86j58K13Q2j07
8083H2j36Q2j70J42J24k9l4K2j05j49K88j14J55l57K73p6K62m12J14k68L18O9
8105H1L9o8r2J3j83J55M9k4J77j3k1j45J01k89J97J1K4K54k62L54k74k2jj73J06
$$ plain form
8130 -6 -17 252 -101 -186 72 154 17 -37 73 -135 59 -117 22 9 78 -113 71 -38 85 -70 19 -129 189
8153 189 174 -337 153 244 -184 -3 -128 72 132 144 -125 53 -7 43 56 -143 152 -102 -123 177 60 93 -32
8176 -32 59 195 -34 159 -200 51 -178 -283 -20 -255 46 -97 -59 -46 -24
$$ packed form
8130fj1K69l53q5K58Q2j37n4J10k08J94j76J39j3O9j91J84j09J23j55Q9j48L18
8153A89j5n11M90R1m28J81j25K00O0J2k69J78o0N0J3j99K95k54k1L00j17L3j25
8176c2R1J36k29J93l59K51k29j05K63k35L01j43L8J3K2
8191b4
$$ Imaginary data points
##PAGE= N=2
##DATA TABLE= (X++(I..I)), XYDATA
$$ plain form
0 0 0 0 0 0 0 0 0 0 0 0 0 0 0 0 -8 8 -8 8 -8 16 -16 16 -24 24 -32 32 -40 48 -55 62 -71 80 -90 103 -118 132
36 132 -148 166 -182 205 -229 253 -280 311 -344 380 -419 463 -508 562 -618 681 -751 829 -916
55 -916 1013 -1127 1253 -1404 1582 -1793 2053 -2382 2811 -3399 4254 -5617 8131 -14328 64814
70 64814 49194 -73446 -17640 -40288 -42349 2617 50070 52638 15538 16301 -2251 -76221 -30476
83 -30476 18165 -9616 13862 60739 20484 -29857 -16629 -7801 -38238 -14845 34708 22086
95 22086 -2399 23876 3411 -45965 -11047 13476 -20953 289 37306 16441 -20982 -5152
107 -5152 14389 -29288 -17891 30445 -4605 -6113 27403 592 -21408 -3192 13149 -13216
119 -13216 -19682 31574 11207 -28010 16726 13390 -25539 -2656 13695 -6197 -9121 15852 10101
$$ packed form
0@%%%%%%%%%%%%%%qJ6j6J6j6K4l2L2m0M8n6O4p2Q8j03J17j33J51j70J93k21K50
36A32k80L14l48L87m34M82n33N91o55P24p99Q82r71J070j180J299j432J580j745
55i16J929k140K380k657K986l375L846m435N193o210P653r871J3748k2459P9142
70F4814j5620j22640N5806k2648k061M4966M7453K568l7100P63j8552p3970M5745
83c0476M8641k7781K3478M6877m0255n0341J3228Q828l0437K3393M9553j2622
95B2086k4485K6275k0465m9376L4918K4523l4429K1242L7017k0865l7423J5830
107e152J9541m3677J1397M8336l5050j508L3516k6811k2000J8216J6341k6365
119a3216o466N1256k0367l9217M4736l336l8929K2883J6351j9892k924K4973n751
$$ plain form
132 10101 -20501 2819 19529 -21745 -13908 25981 -1474 -18646 15686 11937 -16376 -3841
144 -3841 12665 -6264 -12876 16403 8517 -20891 9785 17996 -22124 -6739 18888 -3385 -13749
157 -13749 8914 14607 -14215 -6303 19195 -11341 -14037 20322 -852 -15693 10793 10696 -13776
170 -13776 -8544 17364 -151 -19843 13239 13431 -18766 2117 14455 -11954 -6643 13525 107
183 107 -13282 6962 13878 -14305 -7508 19425 -5037 -16833 14247 5776 -14829 3259 10300
196 10300 -7554 -7369 11252 2167 -16052 8309 12967 -17751 -1287 17337 -8081 -10275 10022
209 10022 5052 -11444 -571 12929 -8096 -9103 15472 -2730 -14652 12000 6705 -13872 590
222 590 12438 -4732 -11162 9403 6735 -14289 2299 13024 -11129 -3546 13268 -5041 -9056
$$ packed form
132A0101l0602K3320J6710m1274P837L9889k7455j7172L4332l749k8313J2535
144c841J6506j8929o612K9279p886k9408L0676Q211m0120J5385K5627k2273j0364
157a3749K2663N693k8822P912K5498l0536k696L4359k1174j4841K6486r7k4472
170a3776N232K5908j7515j9692L3082J92l2197K0883J2338k6409N311K0168j3418
183A07j3389K0244O916k8183O797K6933k4462j1796L1080q471k0605J8088P041
196A0300j7854J85J8621r085j8219K4361M658l0718J6464J8624k5418k194K0297
209A0022m970j6496J0873J3500k1025j007K4575j8202j1922K6652n295k0577J4462
222E90J1848j7170o430K0565k668k1024J6588J0725k4153P583J6814j8309m015
$$ plain form
235 -9056 8448 5447 -10653 -1770 13750 -4780 -11803 13004 3109 -13476 6178 7271 -8491
248 -8491 -1745 8474 -1703 -9481 7264 7323 -13528 488 14110 -9014 -7137 11308 75
261 75 -8882 3017 6901 -6443 -3924 10811 -2714 -10238 10470 3721 -12851 4191 9225 -7344
275 -7344 -5225 8029 2453 -9446 2472 8517 -8948 -1932 10796 -6156 -5910 9746 767 -8474
289 -8474 2071 8032 -5040 -6815 9211 1541 -10356 5797 5373 -8710 1118 6456 -4627 -4312
303 -4312 6313 2529 -8835 1832 9293 -7923 -4567 10150 -1782 -7176 5055 2795 -5116
316 -5116 -377 5817 -3073 -5608 7613 1531 -9956 4451 6841 -7580 -1777 6746 -981 -5423
330 -5423 3004 4484 -5365 -868 6932 -4636 -3703 8338 -1488 -7213 4527 4535 -4949 -2465 5994
$$ packed form
235i056J7504l001j6100Q883J5520j8530p023K4807r895j6585J9654J093j5762
248h491O746J0219j0177p778J6745N9k0851J4016J3622k3124J877J8445j1233
261G5q957J1899L884j3344K519J4735j3525p524K0708o749j6572J7042N034j6569
275g344K119J3254n576j1899J1918O045j7465P016J2728j6952K46J5656q979r241
289h474J0545N961j3072j775J6026p670j1897J6153m24j4083R828N338j1083L15
303d312J0625l784j1364J0667P461j7216L356J4717j1932n394J2231k260p911
316e116M739O194q890k535J3221o082j1487J4407K390j4421N803Q523p727m442
330e423Q427J480r849M497P800j1568R33J2041r826n725J1740Qr484K484Q459
$$ plain form
345 5994 601 -6798 4332 3567 -6705 2058 4963 -5322 -1254 5721 -786 -5314 2345 5244 -5263
360 -5263 -2923 7544 -2099 -5279 5191 916 -4470 2325 2560 -3198 -1829 4545 306 -6509 3732
375 3732 4896 -6698 -340 5688 -2789 -2467 3037 953 -2830 277 3754 -3352 -2600 6311 -1721
390 -1721 -5484 4758 1914 -4666 316 3499 -808 -3373 2410 2081 -4287 1431 3537 -4283 -281
405 -281 4666 -2684 -2686 3140 1819 -3207 -1246 4386 -1070 -3937 3773 601 -3755 2838 900 -3171
421 -3171 656 2563 -752 -3112 2354 3002 -4736 16 4565 -2413 -1423 2917 -608 -1399 1087 1250
437 1250 -1647 -754 3352 -1264 -3640 3807 1270 -3977 1381 2318 -1767 -1115 1459 645 -1312 697
453 697 1795 -2688 215 3294 -2767 -1504 3266 -192 -2094 192 1748 -357 -2280 2118 551
$$ packed form
345E994n393p399J1130p65j0272Q763K905j0285M068O975o507m528P659K899j0507
360e263K340J0467r643l180J0470m275n386O795K35n758J369O374m239o815J0241
375C732J164j1594O358O028q477L22N504k084l783L107L477p106P52Q911q032
390a721l763J0242k844o580M982L183m307k565N783l29o368N718K106p820M002
405b81M947p350kN826j321n026J961N632n456k867P710l172m356O593j938m071
421c171L827J907l315k360N466O48p738M752M549o978R90M340l525p91K486J63
437A250k897Q93M106m616k376P447k537n247N358R37m085O52K574q14j957K009
453F97J098m483K903L079o061J263M770l458j902K286J556k105j923M398j567
$$ plain form
468 551 -2600 2147 710 -2600 1714 1165 -1712 -732 1108 1219 -2714 -559 3084 -1903 -1305 2336
484 2336 -882 -744 1481 -760 -1108 742 1208 -974 -1714 2375 834 -2931 1043 1843 -1727 286
500 286 1056 -541 235 -127 -97 -824 -69 1796 -1998 -1100 2874 -721 -1676 1030 641 -247 -625 275 723
519 723 -1304 514 361 -1744 1438 1046 -2164 -44 1416 -47 -1084 -96 1466 -336 -1338 1120
535 1120 -101 -883 1061 -747 -801 1406 66 -1056 3 1171 409 -1783 265 1538 -1282 -15
551 -15 796 -889 701 -117 -834 585 87 540 -462 -580 2028 -350 -1430 1025 205 -302 -54 -439
569 -439 641 -122 -211 421 -541 379 666 -1145 7 1112 -874 -526 108 222 -58 -1194 144 471
587 471 -583 293 -454 -196 1158 -513 -827 519 213 149 -662 74 1149 -521 -757 482 -452 529
$$ packed form
468E51l151M747j437l310M314n49k877R80J840J11l933K155L643m987N98L641
484B336l218J38K225k241l48J850M66k182p40M089j541l765L974Q00l570K013
500B86P70j597P76l62L0p27P55J865l794Q98L974l595r55K706l89q88l78R00M48
519G23k027J818j53k105L182l92l210K120J460j463j037R88J562j802j002K458
535A120j221p82J944j808n4K207j340j122J059J168p62k192K048J273k820J267
551a5Q11j685J590q18p17J419m98M53j002j18K608k378j080K455q20n07K48l85
569d39J080p63q9O32r62R20K87j811J152J105j986L48O34J14k80j136J338L27
587D71j054Q76p47K58J354j671l14J346l06o4q11P36J075j670k36J239r34R81
$$ plain form
605 529 -2 -899 539 406 -388 -272 -238 968 -89 -864 724 255 -402 431 -179 167 429 -514 73
624 73 397 -15 475 -653 118 1098 -674 -380 621 -109 269 -643 -209 887 -398 -93 134 -587 779
643 779 -214 -948 1003 -21 -99 -178 -426 874 23 -796 224 170 172 -155 -507 614 625 -699 -133 41
663 41 298 158 -703 66 871 -416 -108 84 -104 448 -583 -447 636 45 -68 -6 -213 640 -441 -735
683 -735 803 -15 37 -55 -359 759 -29 -529 65 -164 431 -32 -790 448 354 -456 6 -157 145 233 -580
704 -580 301 569 -149 -252 -8 49 523 -493 133 342 -233 113 -102 -81 661 36 -296 492 -201 233 5
725 5 -257 571 11 -518 168 35 428 61 -477 772 309 -268 152 -55 283 325 -794 248 240 -66 -36
746 -36 -420 251 447 -429 -67 335 101 -253 -325 69 372 -238 -16 164 38 315 -502 -266 633 39 -294
$$ packed form
605E29n31q97J438j33p94J16L4J206j057p75J588m69o57Q33o10L46K62r43N87
624G3L24m12M90j128P71R80j772K94J001p30L78r12M34J096j285L05K27p21J366
643G79r93p34J951j024p8p9k48J300q51q19J020n4Kl27l52J121J1j324N66J74
663D1K57j40q61P69Q05j287L08J92j88N52j031J36J083n91j13O2k07Q53j081k94
683g35J538q18N2r2l04J118p88n00N94k29N95m63p58J238r4q10M62j63L02Q8q13
704e80Q81K68p18j03K44N7M74j016O26K09n75L46k15K1P42o25l32P88o93M34k28
725Ek62Q28n60n29O86j33L93l67n38J249m63n77M20k07L38M2j119J042ql06L0
746c6l84O71J96q76L62M02k34l54p2L94L03o10K22J80j26K77q17K36Q99n94l33
$$ plain form
767 -294 -92 -267 496 -2 -567 497 108 122 328 -65 337 -56 -609 354 58 154 56 -495 350 230 -381
788 -381 155 261 99 249 -562 -148 673 -91 10 -345 -9 429 -325 -486 605 162 -159 147 -198 547
808 547 -74 -342 459 -89 180 -103 -255 866 105 -659 54 166 130 -81 -380 398 141 -346 -8 -53 414
829 414 206 -535 -68 736 -307 -210 -148 281 68 -404 -3 476 -246 484 -97 -21 614 -243 -328 -143 53
850 53 44 -332 -365 546 -86 -718 92 -10 -99 140 -551 290 576 -21 -192 -249 432 286 -579 43 406 -3
872 -3 73 -280 198 284 -253 -175 129 265 243 -531 -39 458 -111 -434 248 176 -167 -298 -136 431 -198 -249 -83
895 -83 41 368 191 -533 241 431 -284 -286 -235 423 50 -374 104 267 -90 114 -106 71 519 -270 -428 36
917 36 487 -141 -544 -4 561 -285 -203 239 -202 4 -167 -150 55 106 85 -281 -190 357 68 -736 81 136 -239
$$ packed form
767b94K02j75P63m98n65J064l89J4K06l93M02l93n53R63k96R6r8n51Q45j20o11
788c81N36J06j62J50q11M14Q21p64J01l55L36M38p54j61J091m43l21L06l45P45
808E47o21k68Q01n48K69k83j52J121p61p64P13J12l6k11k99P78k57m87L38m5M67
829D14k08p41M67Q04j043R7O2M29k13m72M01M79p22P30n81P6O35q57q5J85J96
850E3rl76l3R11o32o32Q10j02q9K39o91Q41K86n97j71n7O81j46q65O22L63m09
872cP6l53M78Q6n37P8L04J36k2p74M92M97n69l23O82p2l43j31J62N67o29n1J66
895h3J24L27j77p24P74J90p15kN1O58l73m24M78J63l57K04k20J77M48p89j58M64
917C6M51o28m03N40N65q46Q2M42m41K06j71J7K05N1k1l66R1N47k89q04Q17N5l75
$$ plain form
940 -239 131 47 382 61 -21 63 -89 19 96 -694 54 498 -241 -223 156 375 -261 -243 260 120 -211 3
962 3 -207 -136 545 -22 -547 237 296 -279 -344 408 356 -168 -186 250 104 46 62 -211 60 22 -155 72 -59 286
986 286 85 -492 478 457 -270 -150 119 82 18 -190 -259 -20 41 303 -367 -113 404 -404 -400 649 231 -285
1008 -285 -22 128 -251 -148 52 -140 -161 322 -67 -343 252 415 -601 -355 322 115 -126 -473 -94 -23
1028 -23 -44 164 -146 11 332 -477 -144 265 336 -68 -255 247 286 -274 -84 194 -131 -202 54 -93 243 -23
1050 -23 139 -156 -99 488 -375 -364 243 -82 -182 167 34 -32 5 -139 -110 77 181 -80 -421 322 308 -461
1072 -461 65 24 147 4 66 104 294 -177 130 -207 -46 322 -154 131 298 -12 -191 61 135 256 -461
1093 -461 -287 162 -14 152 272 -100 134 375 -194 -251 426 101 56 -76 163 209 -372 101 366 -7 129
$$ packed form
940b39L70q4L35l21q2Q4j52J08P7p90P48M44p39J8L79K19o36J8N03j40l31K14
962Ck10P1O81n67n25P84N9n75o5P52n2n24j8M36j46n8J6k73K71l8j77K27j31L45
986B86k01n77R70k1p27J20K69l7o4k08o9K39O1K62o70K54N17q08MJ049m18n16
1008b85K63J50l79J03K00j92k1M83l89k76N95J63j016K46O77k07k41l47L79P1
1028b3k1K08l10J57L21q09L33M09P1m04j87N02L9n60J90K78l25p1K56j47L36k66
1050b3J62k95N7N87q63J1O07l25j00L49j33o6L7j44K9J87J04k61l41P43j4p69
1072d61N26m1J23j43O2L8J90m71L07l37J61L68m76K85J67l10j79K52P4J21p17
1093d61J74M49j76J66J20l72K34K41n69n7O77l25m5j32K39M6n81M73K65l73J36
$$ plain form
1114 129 -80 -76 193 118 -95 -97 153 139 -428 152 223 -111 -113 -180 304 132 21 83 179 -152 232 -43 -273 471
1138 471 -88 -245 8 94 -67 -356 38 49 271 262 -22 -216 214 -36 -304 -141 162 -168 -42 72 437
1159 437 389 -47 146 240 -224 124 82 -210 376 -46 -56 56 -93 -126 -242 -68 157 -124 -278 29 -100 193
1181 193 -25 -282 173 -37 90 -81 244 291 70 -236 154 162 302 -56 105 46 49 -297 22 0 204 243 -64
1204 -64 1 608 419 -144 76 -17 366 -368 -83 161 66 -45 -184 13 354 -73 -30 193 74 49 -93 -201
1226 -201 164 171 281 -227 573 -539 353 -127 -34 603 -344 -80 -55 41 -150 18 -122 278 -119 -273 -168
1247 -168 -19 114 -231 -185 173 44 231 -78 -2 247 6 -197 56 50 -146 -397 -322 8 71 -46 -260 22
1269 22 333 219 32 138 231 76 -129 100 108 -29 -52 110 126 -19 219 -6 77 -203 -137 44 213 183 -125
$$ packed form
1114A29k09MK69p5k13kK50j4n67N80P1l34ko7M84j72j11O2R6l31L84k75k30P44
1138D71n59j57K53Q6j61k89L94J1K22rk84j94M30k50k68J63L03l30J26J14L65
1159D37m8m36J93R4m64L48m2k92N86m22j0J12j49l3j16J74K25k81j54L07j29K93
1181A93k18k57M55k10J27j71L25M7k21l06L90QJ40l58J61n9Ll46L19k2K04L9l07
1204f4O5O07j89n63K20r3L83p34K85K44r5j11j39J97L41m27M3K23j19k5j42j08
1226b01L65PJ10n08Q00j112Q92m80R3O37r47K64K5R6j91J68j40M00l97j54J05
1247a68J49J33l45M6L58j29J87l09P6K49k41k03K53oj96k51P5L30O3j17k14K82
1269B2L11j14j87J06R3j55k05K29Qj37k3J62J6j45K38k25Q3k80O6J81J69l0l08
$$ plain form
1292 -125 -34 2 -296 -7 64 110 156 101 -382 -35 235 -199 69 -172 -193 -72 -300 -435 -93 487 -64 -199
1314 -199 118 653 -335 48 -387 -343 271 -143 -4 315 -266 795 915 447 240 -545 196 -516 113 -158
1334 -158 232 -13 17 344 -234 160 130 175 -243 21 -105 -36 -80 -146 -20 -76 -32 42 76 -155 74 80 97 -156
1358 -156 504 -160 -74 5 301 30 278 119 55 -20 181 -207 115 144 -387 -286 -26 153 -89 -280 -40 213
1380 213 -97 -21 -237 43 8 -117 73 28 -139 -85 68 305 0 -139 -194 178 95 -38 -320 67 -20 -99 -116
1403 -116 128 -41 106 -104 -210 132 -53 -240 -160 241 164 -255 -23 -85 -80 31 270 -43 185 -51 -47 -21 240
1426 240 110 -109 -233 -39 207 -171 -115 194 80 -5 265 109 14 88 -40 -119 29 312 60 -259 146 224
1448 224 -278 -145 -83 -65 -260 19 169 117 37 -54 -386 119 130 -195 -291 164 79 -348 376 145 -90 132 216
$$ packed form
1292a25R1L6k98K89P1M6M6n5m83L47K70m34K68k41k1J21k28j35L42N80n51j35
1314a99L17N35r88L83m35M4O14m14J39L19n81J061J20m68k07p85P41p12O29k71
1334a58L90k45L0L27n78L94l0M5m18K64j26O9m4o6J26n6M4P4L4k31K29OJ7k53
1358a56O60o64Q6P9K96k71K48j59o4p5K01l88L22K9n31J01K60J79k42j91K40K53
1380B13l10P6k16K80l5j25J90m5j67N4J53K37l05j39n5L72q3j33k82L87q7p9j7
1403a16K44j69J47k10j06L42j85j87Q0M01p7m19K32o2NJ11K39l13K28k36MK6K61
1426B40j30k19j24J94K46l78N6L09j14q5K70j56r5P4j28p9J48K83k52l19M05P8
1448B24n02J33O2J8j95K79J50n2q0r1l32N05J1l25r6M55q5m27P24k31k35K22Q4
$$ plain form
1471 216 -217 189 18 -324 -205 285 64 -329 -194 294 -152 -265 15 -127 -82 -22 64 -4 -86 366 -377 -144
1493 -144 91 237 -128 39 221 160 -25 334 168 -258 61 168 -85 96 232 -76 -372 499 -201 -391
1513 -391 -146 356 41 -263 175 349 -72 106 328 -15 62 164 -208 -80 430 146 -391 -3 256 -217
1533 -217 -288 166 -98 -273 -56 95 -120 54 33 -116 -146 336 134 -597 -25 137 -306 -266 335 252 -540 -51
1555 -51 2 -69 60 420 44 -400 343 142 -256 168 447 -364 -175 510 -56 -348 194 427 -392 71 467
1576 467 28 -409 638 -38 -567 -147 214 -47 -369 359 -266 -359 186 153 -540 -34 354 -512 -297 365
1596 365 -70 -430 289 534 -407 -407 337 -59 -390 334 259 -194 164 449 -278 -399 416 -93 -504 236 367
1617 367 -508 -212 472 310 -319 532 5 -354 327 464 -365 23 681 -220 -411 427 479 -214 61 354
$$ packed form
1471B16m33M06j71l42J19M90k21l93J35M88m46j13K80j42M5O0Q6o8q2M52p43K33
1493a44K35J46l65J67J82o1j85L59j66m26L19J07k53J81J36l08k96Q71p00j90
1513c91K45N02l15l04M38J74m21J78K22l43P7J02l72J28N10k84n37L88K59m73
1533b17p1M54k64j75K17J51k15J74k1j49l0M82k02p31N72J62m43M0O01q3p92M89
1555e1N3p1J29L60l76m44P43k01l98M24K79q11J89O85n66k92N42K33q19M63L96
1576D67m39m37J047o76n29M20L61k61l22P28o25r3N45l3o93N06L88q66K15O62
1596C65m35l60P19K45r41%P44l96l31P24p5m53L58K85p27j21Q15n09m11P40J31
1617C67q75K96O84j62o29Q51n27l59O81J37q29L88O58r01j91Q38N2o93K75K93
$$ plain form
1637 354 18 -306 -26 87 -234 43 341 -406 -253 592 -192 -426 286 496 -515 -97 552 -259 -504 252
1657 252 -56 -364 526 335 -161 -45 738 -272 -566 299 249 -530 -224 311 -224 -172 417 123 -509 246
1677 246 237 -430 -120 428 -230 -387 591 321 -716 43 530 -439 -66 384 -56 -567 107 478 -582 65
1697 65 698 -587 -716 514 259 -671 223 329 -147 -151 415 165 -561 313 425 -358 -9 524 -611 -280
1717 -280 610 190 -423 159 741 -219 -376 616 -81 -587 326 286 -428 -97 395 -475 -403 480 87 -760 94
1738 94 461 -307 -275 406 -147 -422 462 165 -586 68 615 -490 -210 631 199 -754 110 375 -283 -73
1758 -73 584 -166 -287 505 128 -508 95 624 -555 -329 817 -110 -457 367 464 -652 -34 423 -94 -529
1778 -529 275 21 -581 94 601 -748 -267 767 -164 -523 238 406 -593 10 472 -213 -592 720 -2
$$ packed form
1637C54l36l24K80J13l21K77K98p47J53Q45p84k34P12K10j011M18O49q11k45P56
1657B52l08l08Q90j91m96J16P83j010k94Q65n0p79L06N35n35N2N89k94o32P55
1677B46ro67L10N48o58j57R78k70j037P59M87r69L73M50m40n11O74L71j060O47
1697F5O33j285j29J230k55r30Q94J06m76mN66k50p26Q74J12p83L49N33j135L31
1717b80Q90m20o13N82N82r60j57R92o97n06R13m0p14L31M92q70P2Q83l93q47Q54
1738I4L67p68L2O81n53k75Q84k97p51O54N47j105K80Q41m32r53Q64K65o58K10
1758g3O57p50j21P92l77o36O03N29j179K26J146r27l47Q24R7j116O18M57n17m35
1778e29Q04k54o02O75N07j349M81J034r31l59P61J68r99O03M62o85l79J312p22
$$ plain form
1797 -2 -647 34 653 -438 -361 708 -128 -676 399 675 -568 268 560 -480 -582 752 362 -730 356
1816 356 609 -450 -251 464 -363 -492 416 175 -578 -22 277 -501 -366 787 123 -606 461 555 -530
1835 -530 -94 514 156 -797 429 352 -646 228 331 -504 -427 624 -74 -452 572 550 -702 -141 473 -185
1855 -185 -449 839 397 -583 23 656 -527 -77 367 -145 -539 264 482 -427 -136 659 -593 -429 530
1874 530 12 -80 93 363 -242 -122 590 -53 -473 322 345 -695 -152 790 -277 -344 351 -36 -666 60
1894 60 515 -424 -360 537 -7 -657 787 295 -862 -68 461 -336 -317 370 215 -488 550 613 -513 115
1914 115 555 -312 -394 711 -21 -548 211 696 -262 -339 444 -34 -391 124 291 -776 199 448 -383 -458
1934 -458 431 200 -775 342 401 -579 -304 467 9 -632 245 505 -672 42 749 -375 -604 398 94
$$ packed form
1797bo45O81O19j091P7J069q36n48J075K76j243Q36K92j040j02J334l90j092J086
1816C56K53j059J99P15q27j29R08k41p53N56K99p78J35J153o64p29J067R4j085
1835e30M36O08l58r53J226p7r98Q74J03q35P7J051o98l78J024k2j252N61O14o58
1855a85k64J288m42r80O06O33j183M50M44n12l94Q03K18r09K91P95j252J64R59
1874E30n18r2J73K70o05J20P12o43m20P95K3j040N43R42j067o7O95l87o30P26
1894F0M55r39O4Q97n44o50J444m92j157P94N29p97J9O87j55p03J038O3j126O28
1914A15M40q67q2J105p32n27P59M85r58p7P83m78l57N15J67j067R75K49q31p5
1934d58Q89k31r75J117N9r80K75P71m58o41Q77K60j177P14P07j124k29J002l04
$$ plain form
1953 94 -423 340 252 -326 -326 407 82 -481 199 148 -328 189 498 -376 -182 764 52 -358 259 478 -667
1974 -667 -260 478 16 -269 105 15 -318 131 399 -340 -246 415 -140 -381 157 347 -406 -207 655 -273 -413
1995 -413 652 76 -544 191 530 -286 -138 331 291 -140 159 202 -503 -90 666 -260 -349 422 179 -826
2015 -826 66 416 -581 -226 419 117 -399 290 602 -472 -116 430 39 -570 124 26 -448 241 240 -467 -10
2036 -10 437 -267 -292 444 161 -549 16 334 -44 -253 419 37 -347 140 159 -247 11 203 -115 -626 196
2057 196 190 -98 -159 521 -234 -226 360 188 -456 118 512 -535 -9 268 -181 -430 333 136 -299 165 192 -324
2079 -324 -167 498 42 -230 104 173 -435 89 4 -598 -293 136 234 33 203 344 -232 82 177 423 -405
2100 -405 299 281 -251 9 790 -305 -317 294 141 -532 -96 175 -211 224 565 -237 -320 316 -108 -252 312
$$ packed form
1953I4n17P63q8n78%P33l25n63O80n1m76N17L09q74J94R46p12m10O17K19j145
1974f67M07P38m62k85L74r0l33M49K68p39R4O61n55k41N38J90p53J99Q62r28j40
1995d13J065n76o20P35L39q16J48M69m0m31K99M3p05M13P56r26q9P71k43j005
2015h26Q92L50r97L55O45l02n16O89L12j074L56N46l91o09O94r8m74O89jp07M57
2036a0M47p04k5P36k83p10N65L18l78k09O72l82l84M87J9m06K58J92l18n11Q22
2057A96ok88o1O80p55QN86j72o44N74L94j047N26K77m49k49P63j97m35M64K7n16
2079c24J57O65m56k72L34O9o08N24q5o02L05M29R8k01J70J41n76L14R5K46q28
2100d05P04j8n32K60P81j095j2O11j53o73M36K71l86M35L41q02q3O36m24j44N64
$$ plain form
2121 312 718 -32 -484 980 -249 -288 117 478 -13 -291 251 -7 -461 139 185 424 -371 355 -339 -152
2141 -152 432 79 -308 97 207 18 -25 328 -19 -124 120 185 -137 -9 158 -257 -25 212 16 -145 197
2162 197 143 -50 28 262 -218 -102 78 -118 -279 155 63 -352 -9 331 -136 -325 267 1 -137 -188 102
2183 102 -148 -27 42 -159 -143 215 123 -147 -219 168 160 104 310 12 -407 -61 177 -142 -155 242 -1 -103 -121
2206 -121 63 -135 -125 250 -205 -101 117 -64 42 27 -43 -151 -6 112 -211 2 264 128 -229 -45 -66
2227 -66 -83 -17 109 193 6 -90 121 -129 30 338 -50 -267 -54 64 -87 161 84 -222 -206 130 263 -177
2249 -177 49 -2 -65 -72 194 -91 -301 184 -21 -276 -68 218 -69 -107 170 -36 -76 75 -123 -56 60 147 -47
2272 -47 96 83 100 5 177 47 347 -139 -55 -51 -276 112 139 6 192 168 -70 -81 -40 -63 -186 137 223 -74
$$ packed form
2121C12M06p50m52J464j229l9M05L61m91k78N42k58m54O00M6K39p95P26o94J87
2141a52N84l53l87M05J10j89m3L53l47j05K44O5l22J28J67m15K32K37j96j61L42
2162A97n4j93P8K34m80J16J80j96j61M34r2m15L43L40m67j89N92k66j38n1K90
2183A02k50J21O9k01J6L58r2k70p2L87qn6K06k98m19L46K38l19j3L97k43j02j8
2206a21J84j98J0L75m55J04K18j81J06j5p0j08J45J18l23K13K62j36l57J84k1
2227f6j7O6J26Q4j87r6K11k50J59L08l88k17K13J18j51K48p7l06J6L36J33m40
2249a77K26n1o3pK66k85k10M85k05k55K08K86k87l8K77k06m0J51j98O7J16Q7j94
2272d7J43j3J7r5J72j30L00m86Q4Mk25L88K7j33J86k4k38j1M1k3j23L23Q6k97
$$ plain form
2296 -74 -54 201 175 -310 -165 301 82 -24 -9 -20 -3 4 16 -156 202 439 -53 -188 192 -355 249 -6 19
2319 19 -74 -233 71 -42 -178 83 266 -312 -60 -105 114 -58 16 26 -247 -98 -9 -198 180 97 -11 124
2341 124 -1 -49 -159 130 45 294 105 -48 -56 -55 140 112 -342 -23 56 68 108 4 -121 16 119 -17 -55 -100
2365 -100 -25 2 81 124 51 -136 92 -58 -43 113 76 158 -164 57 5 -167 50 295 -35 -63 28 -225 156 57
2389 57 241 123 -248 -52 -43 -175 5 100 -9 -305 -10 114 -322 -38 106 192 3 23 -16 185 60 -39 50
2412 50 102 24 -224 -70 146 -68 -181 -75 -44 106 77 93 81 80 321 210 50 166 -36 -62 -17 101 40 -229
2436 -229 -70 -3 -89 -135 -12 -178 -94 31 170 -36 30 -66 -7 285 43 -64 422 -69 -95 -23 123 -332 104
2459 104 248 -259 -21 -242 370 -269 -252 52 292 -25 -95 64 33 -51 -132 -203 -37 38 21 -103 151 -204 5
$$ packed form
2296g4K0K55k6m85J45M66k19j06J5j1J7PJ2j72L58K37m92j35L80n47O04k55K5
2319A9r3j59L04j13j36K61J83n78K52m5K19j72P4J0k73J49Q9j89L78q3j08J35
2341A24j25m8j10K89q5K49j89j53qJJ95k8m54L19P9J2M0j04j25J37J03j36l8m5
2365a00P5K7P9M3p3j87K28j50J5J56l7Q2l22K21n2j72K17K45l30k8R1k53L81r9
2389E7J84j18l71J96Rj32J80R5j09k96K95J24m36K84J44Q6j89K0l9K01j25r9Q9
2412E0N2p8k48J54K16k14j13J06L1J50k9J6j2jK41j11j60J16k02k6M5J18o1k69
2436b29J59O7q6m6J23j66Q4J25J39k06O6r6N9K92k42j07M86m91k6P2J46m55M36
2459A04J44n07K38k21O12o39J7L04K40l17p0J59l1q4q1p1J66P5j7j24K54l55K09
$$ plain form
2482 5 -206 -219 240 41 103 -135 114 202 -55 -183 122 30 52 1 21 -72 27 -205 9 -103 67 27 -36 126
2506 126 28 91 59 -226 -187 3 -101 311 -168 -326 141 140 -40 -216 -96 27 249 -83 -175 -89 -110 5 -208
2529 -208 -70 32 88 88 10 22 -298 -8 257 -9 -43 -99 55 -84 -31 9 -231 106 94 48 -62 183 130 -127
2553 -127 58 2 348 -70 -35 -96 -50 -28 53 -37 -157 20 87 53 -229 -156 12 78 -173 221 -238 211 219 -182
2577 -182 -201 -117 -23 1 -155 92 -219 19 197 -79 23 58 -15 21 -123 13 -208 -47 12 -77 -250 113 -15
2600 -15 171 -35 -7 -54 160 203 145 105 180 74 4 170 -39 119 152 253 253 39 -48 177 59 -4 59 -71 21
2625 21 -83 -41 -122 151 -91 -20 -69 147 64 -159 45 -179 -258 132 250 -166 -668 -282 -334 23 -105 -282 353
2648 353 -205 -172 286 -22 -56 312 -133 -461 -9 -56 97 122 58 -409 349 58 111 -226 -166 78 100 170 117
$$ packed form
2482Ek11j3M59j99O2k38K49Q8k57j28L05r2K2n1K0r3R9k32K14j12J70m0o3J62
2506A26r8O3l2k85L9J90j04M12m79j58M67jj80j76J20J23K22l32r2Q6k1J15k13
2529b08J38J02N6%p8J2l20K90K65k66l4n6J54j39N3M0k40L37j2m6j10K45n3k57
2553a27J85n6L46m18L5o1M6K2Q1r0j20J77O7l4k82P3J68O6k51L94m59M49Qm01
2577a82j9Q4R4K4j56K47l11K38J78k76J02L5p3L6j44J36k21J61N9q9j73L63j28
2600a5J86k06K8m7K14M3n8m0P5j06p0J66k09J58L3J01%k14q7K25j18o3O3j30R2
2625B1j04M2q1K73k42P1m9K16q3k23K04k24p9L90J18m16n02L86n2L57j28j77O35
2648C53n58L3M58l08l4L68m45l28M52m7J53K5o4m67P58k91N3l37O0K44K2P0n3
$$ plain form
2671 117 228 -289 -87 -193 276 -219 -54 -4 -80 -121 -338 47 64 14 135 -113 96 181 -132 89 26 101 30
2694 30 108 5 122 -34 -35 152 14 -66 47 -63 -13 259 -30 -136 15 61 -68 43 -101 -218 8 -59 42
2717 42 -74 -14 206 -134 -30 -130 31 109 -122 -34 52 -70 -71 68 -97 -167 5 -49 145 33 -63 -167 55
2740 55 -15 103 59 -221 -51 -15 92 -369 34 -277 86 138 72 -95 1 86 25 -132 -80 207 24 22 142 -94
2764 -94 175 -12 123 91 -221 64 125 -152 -178 150 60 206 -138 -107 -99 -193 -22 -64 10 101 134 -161 -360 86
2788 86 -84 -90 59 -145 -60 68 -81 -77 35 311 25 65 -62 -78 28 -2 77 -62 35 -351 9 109 -98 -57
2812 -57 56 185 64 -104 110 16 -146 61 234 62 -150 94 155 45 -218 -15 -252 -59 -100 -138 -78 -51
2834 -51 168 322 -78 -221 7 97 26 -11 -69 34 -9 -65 -27 -67 142 5 19 160 120 146 39 163 -27 164
$$ packed form
2671A17J11n17K02j06M69m95J65N0p6m1k17L85J7n0J21k48K09Q5l13K21o3P5p1
2694C0P8j03J17j56jJ87j38q0J13j10N0K72k89j06J51M6j29J11j44j17K26o7J01
2717D2j16O0K20l40J04j00J61P8k31Q8Q6j22jJ39j65p0J72n4J94j12r6j04K22
2740E5p0J18m4k80J70L6J07m61M03l11L63N2o6j67R6Q5o1j57N2K87j83kJ20k36
2764i4K69j87J35l2l12K85O1k77k6L28r0J46l44L1Qr4J71m2P4R1L3k95j99M46
2788H6j70oJ49k04Q5J28j49MJ12K76k86M0j27j6J06l0P9j39R7l86L60J00k07M1
2812e7J13J29j21j68K14r4j62K07J73j72k12K44O1j10k63K03k37J93m1l8O0K7
2834e1K19J54m00j43K28R0p1l7n8J03m3n6L8m0K09j37J4J41m0K6j07J24j90J91
$$ plain form
2858 164 -165 179 -202 136 -32 18 99 61 127 82 116 -25 161 404 322 -72 51 83 -176 -165 -350 -183 -223
2881 -223 3 366 -152 -267 91 -82 -147 215 -75 7 14 -65 64 -247 -200 242 37 67 -93 -133 -46 109 59
2904 59 44 -252 22 290 -124 153 62 96 116 -325 -103 3 86 277 98 305 19 169 52 95 -178 -10
2926 -10 6 110 86 108 105 -28 -37 -7 -83 -219 -28 -8 99 -33 -63 -25 62 217 -59 53 124 -9 -57 -4 244 -45
2952 -45 -116 152 18 13 -36 226 177 82 78 -16 -124 115 -270 -78 6 68 -128 83 -161 -60 65 116 70 208 165
2977 165 91 111 203 -155 276 17 -76 -7 14 187 142 -110 -140 -26 229 -188 -229 150 -83 52 -97 119 7
3000 7 145 -112 71 -10 49 94 -23 39 -10 -4 -48 25 35 50 85 186 125 248 -54 68 100 184 -105 -64 10 -171
3026 -171 22 38 -191 44 -7 -131 51 -137 -8 -88 6 -281 -49 216 -189 -225 65 142 -165 -35 60 -134
$$ packed form
2858A64l29L44l81L38j68N0Q1l8O6m5L4j41J86K43q2l94J23L2k59J1j85J67m0
2881b23K26L63n18j15L58j73o5L62k90Q2Pp9J29l11M7M42k05L0j60m0Q7J55n0
2904E9j5k96K74K68m14K77r1L4K0m41K22J06Q3J91j79K07k86J50j17M3k73J68
2926a0J6J04k4K2lj33rL0p6j36J91K0J07j32l0L8Q7J55k76J12P1j33m8N3K48k89
2952d5p1K68j34nm9K62m9r5mr4j08K39l85J92Q4O2j96K11k44J01J25N1m6J38m3
2977A65p4K0R2l58M31k59r3O9K1J73m5k52l0J14K55m17m1L79k33J35j49K16j12
3000GJ38k57J83q1N9M5j17O2m9Om4P3J0J5L5J01o1J23l02J22L2Q4k89M1P4j81
3026a71J93J6k29K35n1j24J82j88J29q0R4k87K32K65m05l6K90P7l07J30R5j94
$$ plain form
3048 -134 244 130 103 -62 154 234 -33 169 205 -144 -32 -314 176 18 142 -121 -4 -138 111 -21 236
3069 236 -54 110 -174 35 69 331 106 -119 146 65 -40 162 -39 -218 51 14 55 -171 181 32 100 62
3091 62 -56 108 4 -48 -18 -329 118 -161 -104 77 94 -188 -305 105 28 -81 109 -113 -243 121 -30 -168
3113 -168 4 -9 -76 -52 -16 15 -119 -121 332 142 6 175 121 145 33 87 -111 3 -21 -242 -153 -49 202 -54
3137 -54 -139 -71 -3 205 -183 133 327 26 34 264 173 -17 -49 1 54 11 -315 -214 82 -38 -312 24 33 -86
3161 -86 240 57 76 -94 16 331 64 -182 197 97 -171 -11 16 79 -24 65 49 -72 34 171 -103 -207
3183 -207 -146 171 152 -3 19 70 150 -186 112 -88 -16 -162 86 122 76 54 9 27 60 -235 -66 -128 69 140 5
3208 5 106 -227 59 -211 0 -52 -219 311 -207 -77 -31 120 101 34 -104 -5 -248 54 -167 -160 198 288 -79
$$ packed form
3048a34L78j14k7j65K16Q0k67K02L6l49J12k82M90j58J24k63J17j34K49j32K57
3069B36k90J64k84K09L4K62k25k25K65q1j05K02k01j79K69l7M1k26L52j49O8l8
3091F2j18J64j04n2L0l11M47k79N7J81J7k82j17M10p7j09J90k22j30L64j51j38
3113a68J72j3o7K4L6L1j34kM53j90j36J69n4K4j12N4j98J14k4k21Q9J04K51k56
3137e4q5O8O8K08l88L16J94l01QK30r1j90l2N0N3m3l26J01K96j20k74L36Rj19
3161h6L26j83J9j70J10L15k67k46L79j00k68J60K7O3j03Q9j6j21J06J37k74j04
3183b07O1L17j9j55K2N1Q0l36K98k00P2j46K48L6m6k2m5J8L3k95J69o2J97P1j35
3208EJ01l33K86k70K11n2j67N30n18J30M6J51j9o7j38R9k43L02k21PL58R0l67
$$ plain form
3231 -79 102 148 77 298 29 -107 -133 -58 59 79 -161 120 96 -36 98 113 107 45 196 -38 -168 -108 260 109
3255 109 -29 122 38 104 -173 285 -5 204 25 -68 -94 -124 -47 75 122 45 -211 70 50 50 145 -19 254 29
3279 29 236 70 -94 -90 -93 141 58 87 14 256 21 -9 195 -11 212 32 37 97 -280 250 20 38 249 -210
3303 -210 158 -28 -144 -114 -79 49 -2 165 36 -11 87 -137 -122 -82 282 149 146 -49 -4 -229 -9 -36 125 160
3327 160 217 -162 109 98 -45 161 169 198 125 -136 -236 -229 124 -62 62 -35 25 -81 48 -65 148 117 66 -158
3351 -158 8 -24 -132 -272 -141 -45 113 70 -226 30 -175 39 280 -39 181 235 -102 -8 58 -267 27 165
3373 165 142 79 -8 -20 -222 25 20 -7 -89 184 63 -11 -32 -97 -102 -248 163 -11 39 258 23 -275 -35 94 -357
3398 -357 -288 143 -186 18 -10 -37 106 -52 -7 18 -64 394 -19 -91 24 336 185 29 -110 -44 133 -183 311
$$ packed form
3231g9J81M6p1K21k69j36k6P5J17K0k40K81k4j32J34J5oo2J51k34j30O0L68j51
3255A09j38J51q4O6k77M58k90K09j79r3k6l0P7J22M7p7k56K81k0%R5j64K73k25
3279B9K07j66j64MlK34q3K9p3K42k35l0K04k06K23j80NO0l77N30k30J8K11m59
3303b10L68j86j16L0L5J28n1J67j29m7R8k24J5M0L64j33lj95M5k25K20k7J61L5
3327A60N7l79K71j1j43K06QK9p3k61j00PL53j86J24r7O0j06J29j13K13l1n1k24
3351a58J66l2j08j40J31R6J58m3k96K56k05K14K41l19K20N4l37R4O6l25K94J38
3373A65k3o3q7j2k02K47nk7q2K73j21p4k1o5nj46M11j74N0K19k35k98K40J29m51
3398c57O9M31l29K04k8k7J43j58M5K5q2M58m13p2J15L12j51j56j39O6J77l16M94
$$ plain form
3421 311 -186 52 157 -55 -155 70 -20 -193 -175 222 -120 -106 -204 306 -23 80 -51 -131 144 4 38 37 -76
3444 -76 108 -50 29 381 -74 67 -95 -68 -73 45 -128 99 150 56 75 77 -58 -95 -85 53 181 -179 38 -103
3468 -103 -225 -70 79 -4 -250 107 76 -42 111 63 29 -16 71 201 -412 145 -187 -229 -241 65 -16 119 254
3491 254 -26 -19 40 109 -175 65 173 118 25 -13 -73 13 -70 68 146 126 -25 214 -23 -77 -126 -41 -61 -263 -113
3516 -113 -53 57 -100 92 -17 295 152 -192 4 253 240 -186 563 -104 -252 -520 0 -259 40 324 -329
3537 -329 -341 428 286 117 -644 -64 -125 263 -106 -520 875 151 378 678 -486 81 -75 -169 -208 364 -18
3558 -18 180 -4 -699 584 175 38 242 -141 -108 4 -533 -245 -1090 -825 -489 -282 68 -284 -406 40
3578 40 -294 -5 -80 93 -89 224 -267 -292 -73 -82 160 15 -104 -219 -261 -42 20 104 193 -67 -113 -120 -71 1 -138
$$ packed form
3421C11m97K38J05k12j00K25r0j73J8L97l42J4r8N10l29J03j31q0K75j40L4jj13
3444g6J84j58P9L52m55J41j62K7nJ18j73K27N1r4J9Kj35l7J0J38J28l60K17j41
3468a03j22J55J49q3k46L57l1j18J53m8l4m5Q7J30o13N57l32m2j2L06q1J35J35
3491B54k80PN9O9k84K40J08n5r3l8o0Q6q3J38P8k0j51K39k37n4m9Q5k0k02J50
3516a13O0J10j57J92j09L12j43l44J96K49j3m26P49o67j48k68N20k59K99K84o53
3537c29j2P69j42j69p61N80o1L88l69m14J395p24K27L00j164N67j56r4l9N72l82
3558a8J98j84o95J283m09j37K04l83L3J12n37K88q45K65L36K07L50l52j22M46
3578D0l34K89p5J73j82L13m91k5K19rK42j45j19j15m2K19O2Q4Q9k60m6pM9P2j39
$$ plain form
3603 -138 -81 60 69 7 118 -8 -238 142 -58 -311 295 -73 -188 85 -171 -72 -170 29 28 -85 -27 -238 -169
3626 -169 -70 -75 92 -187 -162 69 -101 37 41 -165 30 300 58 -13 262 17 -26 133 42 -220 -178 -70 -101 14
3650 14 -172 288 196 206 301 -230 -66 -204 -98 126 515 -250 -185 -107 122 -104 362 2 24 67 32 151 -217
3673 -217 3 339 74 -84 207 34 -126 172 172 -23 -21 169 80 -305 -14 -89 -132 -36 174 -201 -46 155 68
3696 68 5 116 292 97 121 61 -194 52 4 -13 184 69 -107 -101 -87 -54 6 -104 -166 -1 -242 1 -105 -39
3720 -39 88 25 166 76 280 -38 13 66 29 -36 -150 330 63 -52 62 110 -9 -244 105 -12 43 6 96 -86
3744 -86 -95 207 34 -93 165 -69 -101 13 -361 69 -311 -330 -522 -108 203 348 312 1128 85 31 -304 -102
3766 -102 119 -116 -115 -63 -174 81 243 -42 -58 161 -94 37 -40 57 -63 272 -314 37 346 103 -80 312
$$ packed form
3603a38N7J41Ro2J11j26k30L80k00k53O06l68j15K73k56R9r8J99jj13N8k11O9
3626a69R9nJ67k79K5K31j70J38Mk06J95K70k42p1K75k45m3J59r1k62M2J08l1J15
3650A4j86M60r2J0R5n31J64j38J06K24L89p65O5P8K29k26M66l60K2M3l5J19l68
3673b17K20L36k65j58K91j73j60K98%j95KJ90q9l85K91p5m3R6K10l75J55K01q7
3696F8o3J11J76j95K4o0k55K46m8j7J97j15j76OJ4L3O0j10o2J65k41K43j06O6
3720c9J27o3J41r0K04l18N1N3l7o5j14M80k67j15J14M8j19k35L49j17N5l7R0j82
3744h6rL02j73j27K58k34l2J14l74M30l80j9j92M14L11J45l6Q16j043n4l35K02
3766a02K21k35JN2j11K55J62k85j6K19k55J31p7R7j20L35n86L51L09k43j83L92
$$ plain form
3788 312 200 -169 -117 -278 -15 -167 19 -59 -122 -154 31 579 234 -32 -161 -186 -38 220 -37 -273 14 55
3810 55 -14 -991 69 270 261 438 34 -33 -103 42 53 -23 140 135 -47 -44 69 113 -169 107 -13 -269 49 -53
3834 -53 59 -290 -46 77 -139 -16 159 204 -126 -172 -105 -52 95 -48 193 -75 -284 -93 -234 155 -68 102
3856 102 136 325 -17 206 275 -40 136 -106 112 -153 72 25 129 -29 -72 3 162 73 113 145 -60 32 84
3879 84 -38 -53 -36 31 140 180 -112 176 -92 3 -247 -179 57 -76 77 -27 -39 49 -4 -180 -56 54 18 -61
3903 -61 103 -30 124 -163 65 -18 43 -149 349 -143 79 206 -85 -286 -116 128 -68 77 68 -73 -453 22
3925 22 45 -110 -1 118 -148 -89 0 -35 -149 -267 -48 89 -26 -94 -33 -181 4 20 76 174 -355 70 65 194
3949 194 121 76 77 -69 -243 210 138 158 -46 -118 47 -159 308 212 156 -274 1 -128 140 87 73 -153 -116 -133
$$ packed form
3788C12j12l69N2j61K63j52J86p8o3l2J85N48l45k66j29k5J48K58k57k36K87M1
3810E5o9r77J060K01rJ77m04o7p0J45J1p6J63nj82LJ13M4k82K76j20k56L18j02
3834e3J12l49K44J23k16J23J75M5l30m6O7N3J47j43K41k68k09J91j41L89k23J70
3856A02L4J89l42K23O9l15J76k42K18k65K25m7J04j58m3P5J59q9M0L2k05R2N2
3879H4j22j5J7O7J09M0k92K88k68R5k50O8K36j33J53j04j2Q8n3j76J24J10l6p9
3903f1J64j33J54k87K28q3O1j92M98m92K22J27k91k01J70K44j96J45rj41l80M75
3925B2K3j55J09J19k66N9Q9l5j14j18K19J37j15o8O1j48J85J6N6R8n29M25nJ29
3949A94p3m5Jj46j74M53p2K0k04p2J65k06M67r6n6m30K75j29K68n3j4k26L7j7
$$ plain form
3973 -133 -64 103 -249 -339 -103 73 84 -134 -110 195 161 -65 55 -9 -122 -175 -24 156 160 -241 -23 136 225
3996 225 -84 12 136 -143 157 -41 16 -107 14 -47 27 55 252 102 242 90 -39 -110 -77 77 240 -170
4018 -170 -237 -57 145 254 110 -67 22 148 226 -153 -40 37 -239 -76 3 53 -111 -191 314 241 73 -179 85
4041 85 132 -391 224 53 21 -86 -64 63 107 33 111 -54 -62 -78 -90 29 227 -193 -140 130 3 15 -18 -42 20
4066 20 -100 1 50 -190 -250 55 49 89 142 0 49 205 63 156 -6 192 -103 -31 -63 -58 -102 -38 0 18 42 10
4092 10 30 -191 292 -5 -11 56 84 -250 21 8 11 62 -20 67 3 -116 145 -120 -327 236 -105 -77 25 271 -196
4117 -196 -43 -160 43 -141 -21 -239 -15 -187 -122 -46 -106 -84 139 97 -83 -171 -122 -85 -47 48 39 -172 -71 0
4141 0 -188 133 -119 -206 63 102 55 -38 -180 128 31 168 -358 117 -272 -117 241 41 117 273 17 -18 177
$$ packed form
3973a33O9J67l52r0K36J76J1k18K4L05l4k26J20o4j13n3J51J80Mm01K18J59Q9
3996B25l09R6J24k79L00j98N7j23J21o1P4K8J97j50J40j52j29p1L3J54J63m10
4018a70o7J80K02J09j44j77Q9J26P8l79J13P7k76J63P9N0j64q0N05p3j68k52K64
4041H5M7n23O15j71l2j07K2J27M4p4P8j65qj6j2J19J98m20N3K70j27J2l3k4O2
4066B0j20J01M9k40o0L05oM0N3j42M9J56j42R3j62J98k95P2l2Nm4O4L8J8K4l2
4092A0K0k21M83k97oO7K8l34K71j3LN1q2Q7o4j19K61k65k07N63l41K8J02K46m67
4117a96J53j17K03j84J20k18K24j72O5P6o0K2K23m2j80q8M9L7L8R5rk11J01P1
4141@j88L21k52q7K69L9m7r3j42L08r7J37n26M75l89J55L58k00P6J56k56l5J95
$$ plain form
4164 177 -110 101 -216 -237 -133 -15 -17 -269 34 59 -163 -215 -255 -141 -71 158 -183 189 84 131 236 -174 -37
4187 -37 50 -111 -22 89 185 -89 -109 -133 194 -131 -125 25 -28 -12 -88 256 -76 -19 26 -3 -147 163 -183 154 -43
4212 -43 27 152 63 212 315 -226 22 -66 -100 118 -95 -43 5 -48 -54 286 14 -11 4 -159 -19 80 119 138 -362
4237 -362 -91 86 -124 -60 8 73 -61 147 156 63 44 -50 22 254 -40 -102 119 3 -143 138 182 -94 10 -397
4261 -397 -303 -29 146 -148 -139 37 195 -362 302 259 -298 -399 -215 -382 -69 -25 -41 -178 55 -420 -360 -143
4283 -143 -975 -320 542 832 340 242 657 275 -52 405 95 482 877 541 -249 48 -232 -633 -350 740
4303 740 -480 -116 -133 -109 31 -364 221 233 57 -3 -345 -94 158 -68 -101 -143 -60 -488 291 -379 -48 198
4325 198 -198 -627 -716 94 17 405 439 445 -85 68 193 95 320 46 -197 -269 187 -212 52 74 -39 -1 -308
$$ packed form
4164A77k87K11l17k1J04J18kk52L03K5k22n2m0J14P0K29l41L72j05M7J05m10J37
4187c7Q7j61Q9J11R6k74k0k4L27l25OJ50n3J6p6L44l32N7M5k9j44L10l46L37j97
4212d3P0J25q9J49J03n41K48q8l4K18k13N2M8n3oL40k72k5J5j63J40R9L9J9n00
4237c62K71J77k10O4O8O5j34K08Rr3j9r4P2K32k94o2K21j16j46K81M4k76J04m07
4261c97R4K74J75k94RJ76J58n57O64m3n57j01J84j67L13M4j6j37K33m75O0K17
4283a43q32O55Q62K90m92r8M15l82l27M57l10L87L95l36p90K97k80m01K83J090
4303G40j220L64j7K4J40l95N85J2j76o0l42K51K52k26l3m2Q3m28P79o70L31K46
4325A98l96m29q9Q10p7L88L4On30J53J25r8K25k74k43p2M56l99K64K2j13L8l07
$$ plain form
4348 -308 -67 -26 -168 -145 46 -8 125 12 75 -6 87 -242 -197 -10 36 55 173 -279 143 -18 -186 92 128
4371 128 -163 -262 -209 40 -22 -30 -14 255 249 -107 -58 -15 59 -157 -99 3 -119 3 -85 -10 104 162 7 -5 -279
4396 -279 -128 -96 159 -103 -150 68 98 -87 -174 124 72 -75 -28 -10 165 -85 27 -148 -76 54 -67 -93 28
4419 28 100 -128 28 -115 -101 -150 -70 -122 -35 -119 -21 98 -13 63 -177 96 238 359 85 -8 -37 -253 -41 -24
4443 -24 -130 92 135 185 54 -33 -344 -34 -79 -236 -107 -64 -5 -52 -164 -24 138 74 145 -51 -296 117 -7
4466 -7 150 43 -61 65 -92 32 282 -148 -208 104 98 9 19 9 116 -153 85 140 5 91 -3 -44 -172 -125
4490 -125 103 -21 111 60 104 127 247 134 -105 157 -6 -31 -60 104 -144 35 128 12 -11 165 127 20 5
4513 5 62 55 55 -182 -51 -179 -8 69 17 140 72 166 134 81 -12 41 78 92 -115 1 32 79 402 -294 -202 194 328
$$ packed form
4348c08K41M1j42K3J91n4J33j13O3q1R3l29M5J87M6J9J18m52M22j61j68K78L6
4371A28k91r9N3K49o2qJ6K69ol56M9M3P4k16N8J02j22J22q8P5J14N8j55j2k74
4396b79J51L2K55k62m7K18L0j85q7K98n2j47M7J8J75k50J12j75P2J30j21k6J21
4419B8P2k28J56j43J4m9Q0n2Q7q4R8J19j11P6k40K73J42J21k74r3k9k16K12J7
4443b4j06K22M3N0j31q7l11L10m5j57J29M3N9m7j12J40J62o4P1j96k45M13j24
4466gJ57j07j04J26j57J24K50m30o0L12oq9J0j0J07k69K38N5j35Q6r4m1j28M7
4490a25K28j24J32n1M4K3J20j13k39K62j63k5k9J64k48J79R3j16k3J76l8j07j5
4513EN7p%k37J31j28J71P7n2J23o8R4l2n3r3N3L7J4k07J16L1M7L23o96R2L96J34
$$ plain form
4540 328 -469 -25 274 -280 219 -134 -73 183 359 -329 281 -231 -191 -91 418 -177 -118 0 330 138 255
4561 255 396 -336 -250 -225 65 -53 -83 -201 -303 -273 119 535 -662 650 332 -532 -173 -159 124 30 446
4582 446 78 -243 217 -232 744 22 499 -118 389 246 225 -202 -35 93 55 79 -86 -56 111 118 -112 -50
4604 -50 -1 67 146 -276 100 -16 -320 125 75 49 91 -51 202 83 85 -53 -11 -47 -101 43 -77 120 180 35
4628 35 -130 -143 95 94 -248 155 21 -15 245 -8 -210 -116 147 148 -37 -13 17 96 -34 300 55 331 139 -153
4652 -153 76 47 301 54 216 -74 10 282 -127 -79 -59 301 73 35 156 -99 0 -173 214 37 -72 -112
4674 -112 428 -181 -22 -181 -29 -134 -86 160 34 -237 -24 207 147 3 -234 -1 143 -82 -34 -119 -54 -333
4696 -333 120 -226 -188 30 -39 138 8 88 -60 -59 -99 144 27 -110 83 -220 21 188 -52 -326 -203 34
$$ packed form
4540C28p97M44K99n54M99l53O1K56J76o88O10n12M0J00N09n95N9J18L30j92J17
4561B55J41p32Q6K5K90j18l0j18j02L0L92M16j197J312l18q64L59J4K83r4M16
4582D46l68l21M60m49R76p22M77o17N07j43k1m27J67J28l8K4j65L0J67Pk30O2
4604e0M9O8P9m22L76j16l04M45n0k6M2j42K53j19Kj38M2l6n4J44j20J97O0j45
4628C5j65j3K38jl42M03j34l6K60k53k02R4K63Jj85K4L0P9j30L34k45K76j92k92
4652a53K29k9K54k47J62k90Q4K72m09M8K0L60k28l8J21k55R9j73L87j77j09m0
4674a12N40o09J59j59J52j05M8K46j26k71K13K31o0j44k37K33J44k25M8q5O5k79
4696c33M53l46L8K18o9J77j30Q0j48Jm0K43j17j37J93l03K41J67k40k74J23K37
$$ plain form
4718 34 -56 122 129 -81 -63 -90 -97 186 142 148 -7 135 75 53 -2 141 -130 -325 -8 35 -6 40 16 -120 43 -148
4744 -148 -99 174 18 40 -128 199 86 254 -15 235 60 -47 38 200 234 -86 193 -5 6 222 229 22
4766 22 -24 174 -12 69 -112 140 52 13 -46 132 135 -253 0 -57 128 -125 11 -131 31 -29 -85 19 -161 -87
4790 -87 -275 -20 -31 74 188 -74 -61 108 -99 -27 21 6 183 302 -128 -87 -138 -46 -92 -182 -39 -71 180 -145
4814 -145 -3 -131 -57 106 126 136 -28 -94 -266 54 45 -122 91 -214 151 146 325 -87 31 48 -251 -19 -64
4837 -64 -202 86 206 -154 -206 170 -75 65 257 7 -141 -19 18 -49 -191 -90 -83 23 -178 -31 -36 76 -105
4860 -105 166 -58 128 -61 86 -210 -164 109 221 -69 -150 -105 -149 70 -123 140 -43 59 -106 -100 66 -107
4882 -107 -54 112 -171 -111 64 -4 48 -166 -86 46 42 172 -98 -142 -48 45 -124 -43 -61 107 -133 -77 -57 33 3
$$ packed form
4718C4r0J78Pk10J8k7pK83m4Oj55J42o0k2n5J43k71j95L17M3m1M6k4j36J63j91
4744a48M9K73j56K2j68L27j13J68k69K50j75j07Q5J62L4l20K79j98J1K16Pk07
4766B2m6J98j86Q1j81K52q8l9n9J78Ll88K53n7J85k53J36j42J62o0n6J04j80P4
4790h7j88K55j1J05J14k62J3J69k07P2M8j5J77J19m30M1n1R2m6r0J43l2K51l25
4814a45J42j28P4J63K0J0j64o6j72L20rj67K13l05L65nJ79m12J18J7k99K32m5
4837f4j38K88J20l60n2L76k45J40J92k50j48J22L7o7j42J01PJ06k01J47nJ12j81
4860a05K71k24J86j89J47k96M6K73J12k90q1M5m4K19j93K63j83J02j65OJ66j73
4882a07N3J66k83O0J75o8N2k14Q0J32mJ30k70m4R4R3j69Q1j8J68k40N6K0R0l0
$$ plain form
4907 3 -48 182 140 189 46 61 228 -24 16 75 -84 51 66 -98 56 -152 121 -130 -105 -57 -107 -80 196 -148
4931 -148 152 -130 -46 214 -92 -68 -46 -26 92 198 201 -112 -260 74 161 -37 -3 63 237 80 -199 160 -92
4954 -92 130 40 300 -261 42 57 -198 -131 261 -69 125 -39 3 95 -67 42 -121 11 57 180 -39 11 33
4977 33 125 -60 292 -48 0 185 -96 9 -109 137 64 112 11 108 96 -8 62 -1 -112 84 -17 -108 50
5000 50 17 -90 -264 -212 -87 229 183 -68 35 -25 89 -87 81 -28 215 -23 3 6 9 -17 -112 -65 172 258 -137
5025 -137 -26 -22 31 -111 174 24 223 128 -328 53 -92 -130 111 -56 -60 289 124 -178 69 99 -149 5 85
5048 85 -78 24 17 -86 -131 -23 45 -90 -95 -104 -165 -147 -107 -93 43 57 -87 114 -74 26 -45 -25 -80 -17 98 -178
5074 -178 -18 -143 81 167 -179 -72 80 22 65 -41 152 -125 -134 91 -104 95 82 -153 -1 -290 29 -69
$$ packed form
4907Cn1K30m2M9j43J5J67k52M0N9j59J35J5j64J54k08K73k51K5M8n0K7K76l44
4931a48L00k82Q4K60l06K4K2K0J18J06Ll13j48L34Q7j98L4O6J74j57k79L59k52
4954i2K22r0K60n61L03J5k55O7L92l30J94j64M2R2j62J09j63J32M6J23k19N0K2
4977C3R2j85L52l40M8J85k81J05j18K46p3M8j01R7j2j04P0o3j11J96j01r1J58
5000E0l3j07j74N2J25L16m6k51J03o0J14j76J68j09K43k38K6LLk6r5M7K37Q6l95
5025a37J11MN3j42K85j50J99r5m56L81j45l8K41j67mL49j65l02K47L0k48J54Q0
5048H5j63J02pj03m5J08O8j35nro1J8M0J4J36J4j44K01j88J00p1K0n5O3J15k76
5074a78J60j25K24Q6l46J07J52n8M3j06J93k77rK25j95J99j3k35J52k89L19r8
$$ plain form
5096 -69 -166 40 -50 6 89 33 46 139 -84 -108 41 -38 -173 -69 -47 -197 -142 -80 -85 81 13 -108 3 -204 -49
5121 -49 -42 218 180 92 34 -248 -56 -29 -150 248 59 314 -14 177 27 46 12 125 -33 69 221 131 23
5144 23 74 -18 275 -115 -46 43 -86 -96 72 -57 -86 181 2 124 -226 -20 -186 92 -44 -72 -89 71 -198
5167 -198 -203 177 -157 -148 29 -57 214 15 90 -171 -3 125 176 -118 30 -155 -87 -195 120 -164 -193 12 42
5190 42 278 98 -119 134 -61 -169 27 -251 -7 -19 17 -20 45 -93 158 62 182 -51 -37 -36 85 32 -4 34
5214 34 -247 -155 -198 311 63 -245 22 90 -25 -208 -163 45 30 161 -76 24 -29 83 -79 -123 127 129 -110
5237 -110 -25 -7 80 -159 199 -16 -11 71 212 -124 -287 -105 137 133 -69 -34 -126 36 43 142 -69 -30 -70 -152 -172 -27
5263 -27 11 4 -296 -109 -165 113 52 270 -16 66 62 -49 -129 -248 184 -4 -162 -93 -154 -16 -149 103 -124 165
$$ packed form
5096f9r7K06r0N6Q3n6J3R3k23k4J49p9j35J04K2j50N5O2nJ66o8j21J11k07J55
5121d9PK60l8q8n8k82J92K7j21L98j89K55l28J91j50J9l4J13j58J02J52r0j08
5144B3N1r2K93l90O9Q9j29j0J68j29k9K67j79J22l50K06j66K78j36k8j7J60k69
5167a98nL80l34RJ77q6K71j99P5k61J68J28N1k94J48j85O8j08L15k84k9K05L0
5190D2K36j80k17K53j95j08J96k78K44j2L6l7O5j38K51r6J20k33J4JJ21n3l6L8
5214C4k81R2m3N09k48l08K67O8j15j83M5K08j5J31k37J00n3J12j62m4K50Kk39
5237a10Q5J8Q7k39L58k15NQ2J41l36j63J82K42mk02L5r2J62PR9k11L9m0q2k0J45
5263b7L8pl00J87n6K78o1K18k86Q2mj11q0j19M32j88j58O9o1J38j33K52k27K89
$$ plain form
5287 165 149 -5 168 201 42 186 151 -229 -38 119 7 229 -4 -49 74 298 -211 -75 26 -4 -22 -232
5309 -232 -1 -74 -71 -18 3 51 0 94 44 5 14 -142 64 -165 -206 -239 -142 -33 100 -278 226 -49 -42 -13 -96 15
5335 15 -138 111 34 -165 -19 -125 -123 131 -129 -64 132 -101 -5 -110 -58 141 46 -149 73 70 39 61 -75 -163
5359 -163 34 228 -120 121 -110 209 32 46 63 -185 -28 -59 -194 179 124 -104 -127 -156 197 132 111 48 -288
5382 -288 -132 4 60 -9 -177 105 -45 -84 36 61 -22 153 -20 -87 -72 394 108 -77 50 56 -112 242 -11
5405 -11 -133 97 75 -249 148 6 64 -23 243 -11 -77 -147 212 -161 -289 247 59 138 -94 115 -227 71
5427 71 150 100 -38 127 132 93 -131 -78 21 -108 -101 -62 37 156 179 26 157 -84 45 67 94 184 -35 184 141 -42
5453 -42 24 136 -121 -28 -106 -68 179 -5 -234 289 -57 64 -64 -6 4 -102 -115 41 28 56 -69 -35 9 -117
$$ packed form
5287A65j6j54J73L3j59J44l5l80J91J57j12K22k33m5J23K24n09J36J01l0j8k10
5309b32K31p3LN3K1M8n1R4n0l9Rj56K06k29m1l3R7J09J33l78N04k75PK9q3J11
5335A5j53K49p7j99J46j06KK54k60O5J96k33R6j05N2J99r5j95K22ll1K2j36q8
5359a63J97J94l48K41k31L19j77J4J7k48J57l1j35L73n5k28k3k9L53o5k1o3l36
5382b88J56J36N6o9j68K82j50l9J20K5q3J75j73o7J5M66k86j85J27Oj68L54k53
5405a1j22K30k2l24L97j42N8q7K66k54o6p0L59l73j28N36j88P9k32K09l42K98
5427G1P9n0j38J65Nl9k24N3R9j29PL9R9J19K3j53J31k41J29K2K7R0k19K19m3j83
5453d2O6J12k57R3p8L8K47j84k29N23l46J21j28N8J0j06j3J56j3K8j25L4M4j26
$$ plain form
5477 -117 206 78 -119 94 268 390 204 65 322 -124 65 192 104 169 288 -353 172 -61 -128 -269 -180
5498 -180 132 -63 10 158 289 -37 -163 77 37 -98 55 -67 -377 -155 37 -7 140 357 -100 99 -63
5519 -63 -33 -284 -193 48 23 19 158 -11 2 90 -142 22 -230 -45 -26 80 30 109 17 -87 -159 6 -80 -86 -10 -25
5545 -25 36 40 158 118 26 -210 -147 131 -63 87 34 -189 -96 -11 66 38 -58 7 264 55 186 272 154 -71 -67 93
5571 93 100 -228 21 71 22 160 -174 -289 -97 -267 96 -219 62 16 -3 9 -4 27 -5 -87 -21 -17 -139 113 -145
5596 -145 83 -177 153 -139 67 34 -143 98 42 -63 132 234 -182 38 -107 -182 116 4 -104 208 41
5617 41 -60 142 -171 171 -138 -41 73 -42 -78 52 -182 -119 -100 49 -19 -30 -53 184 5 18 286 -143 -111
5640 -111 -79 1 260 -243 -32 -73 -24 98 -143 46 -191 226 -190 345 21 96 -42 49 135 33 -130 9
$$ packed form
5477a17L23j28j97K13J74J22j86j39K57m46J89J27q8O5J19o41N25k33o7j41Q9
5498a80L12j95P3J48J31l26j26K40m0j35J53j22l10K22J92m4J47K17m57J99j62
5519f3L0k51R1K41k5mJ39j69J3Q8k32J64k52J85J9J06n0P9r2j04p2J65q6oP6j5
5545b5O1MJ18m0r2k36O3K78j94J50n3k23R3Q5P7k8r6O5K57k09J31Q6j18k25MJ60
5571I3Pl28K49N0m9J38l34j15J92j70L63l15K81m6j9J2j3L1l2q2O6Mj22K52k58
5596a45K28k60L30k92K06l3j77K41n6j05J95J02m16K20j45p5K98j12j08L12j67
5617D1j01K02l13L42l09R7J14j15l6J30k34O3J9J49o8j1k3K37j79J3K68m29L2
5640a11L2Q0K59n03K11m1M9J22k41J89k37M17m16N35l24P5j38R1Q6j02j63J39
$$ plain form
5662 9 -159 -122 171 -48 -82 472 -250 67 3 -84 -46 -143 -67 -60 -28 16 250 -259 7 -165 60 78 -149 -364 167
5687 167 370 -14 -187 260 -73 -91 -144 -167 -306 -364 -126 -413 -81 -772 -449 53 32 -57 -37 -287 80 76 -114
5710 -114 6 -99 88 -222 126 -56 -152 181 -65 150 -247 -22 -41 223 111 18 -147 257 -67 -13 -68 50
5732 50 -124 -84 150 188 219 277 67 -157 -32 -91 -72 -16 -8 -31 -33 203 -5 56 -74 311 -36 122 -138 -52 45
5757 45 -59 -33 -1 170 95 -78 14 -125 105 -107 -66 -126 -185 -52 -195 -33 -63 139 6 57 167 137 -127 81
5781 81 -193 -13 44 -40 0 -84 244 -36 -73 192 118 183 76 -213 -13 -159 167 -127 63 97 -111 -71 23 -127
5805 -127 81 177 66 -168 -117 -51 67 9 259 359 -57 -329 -297 225 142 -83 -165 56 -108 54 -37 -29 149
5828 149 63 110 -263 192 9 89 -119 133 76 50 -216 -88 251 -169 -159 -77 -51 -23 -40 82 43 -8 50 -7 125
$$ packed form
5662Ij68L7K93k19l4N54p22L17o4q7L8r7P6PL2M4K34n09K66j72K25J8k27k15N31
5687A67K03l84j73M47l33j8n3k3j39n8K38k87L32o91L23N02k1q9K0k50L67mj90
5710a14J20j05J87l10L48j82r6L33k46K15l97K25j9K64j12r3j65M04l24N4n5J18
5732E0j74M0K34L8L1N8k10k24J25n9J9N6Qk3kK36k08O1j30L85l47J58k60Q6R7
5757D5j04K6L2J71p5j73R2j39K30k12M1o0n9J33j43J62l0K02j33N1J10l0k64K08
5781H1k74J80N7q4M0q4L28k80l7K65p4O5j07k89K00j46L26k94J90L4k08M0R4j50
5805a27K08R6j11k34N1O6J18n8K50J00m16k72L2N22q3k25q2K21j64J62r1QJ78
5828A49q6M7l73M55j83Q0k08K52n7k6k66J28L39m20J0Q2K6K8j7J22l9n1N8n7J32
$$ plain form
5853 125 -38 6 -16 -63 79 116 -113 34 54 28 112 -26 -157 33 -279 -46 -41 -112 89 135 132 -27 -15 160 -159
5878 -159 0 13 -33 63 119 85 53 88 49 188 -150 88 -11 37 -10 11 -68 -49 7 -42 -10 298 134 140 187 -202 -71
5905 -71 -52 140 104 509 289 66 85 250 -201 -5 -7 159 -1 46 110 -213 -34 17 -124 -41 -60 -85 -38 88
5929 88 45 -14 -102 40 29 -70 5 71 -30 131 90 46 20 -85 -113 134 169 -158 123 140 152 121 -37 45 121 -65
5955 -65 145 -162 -30 -45 -64 217 355 202 1 16 -152 254 241 -128 57 35 32 41 -57 198 -7 316 182 -7
5979 -7 268 203 167 -216 -368 25 46 68 -104 90 -155 75 -23 94 -41 126 66 -109 47 50 -22 -170 -49 17
6003 17 34 -112 -40 -5 -56 -61 62 121 14 4 -50 -85 -27 146 18 -10 -260 -87 91 -260 -42 76 -246 -10
6027 -10 227 -113 -71 7 -185 37 -7 186 35 -38 -4 157 182 3 -82 -160 186 4 -145 -72 31 -160 -44
$$ packed form
5853A25j63M4k2m7J42L7k29J47K0k6Q4j38j31J90l12K33Np1K01M6lj59J2J75l19
5878a59J59J3m6R6N6l4l2L5l9J39l38K38r9M8m7K1p9J9N6m9L2L08j64OM7l89J31
5905g1J9J92l6M05k20k23J9J65m51J96kJ66j60M7O4l23J79N1j41Q3j9k5M7J26
5929H8m3n9q8J42j1r9P5O6j01J61m1m4k6j05k8K47L5l27K81J7J2l1j58Q2P6j86
5955f5K10l07J32j5j9K81J38j53k01J5j68M06j3l69J85k2lRr8K55k05L23j34j89
5979gK75o5l6l83j52L93K1K2j72J94k45K30r8J17j35J67o0j75J56Lp2j48J21O6
6003A7J7j46P2L5n1nJ23N9j07j0n4l5N8J73j28k8k50J73J78l51K18J18l22K36
6027a0K37l40M2P8j92K22m4J93j51p3L4J61K5j79q5p8L46j82j49P3J03j91J16
$$ plain form
6050 -44 -82 -82 22 -188 51 10 -208 -66 -32 107 -16 273 -18 -9 36 -73 32 -17 84 161 44 40 45 348 158
6075 158 36 -109 18 101 -3 32 -213 -137 8 -21 0 129 -244 -68 -19 -6 -137 148 108 373 197 -183 116
6098 116 106 87 -126 -31 -124 104 13 -212 -219 224 83 2 -170 4 78 72 -166 -83 -9 129 -44 -93 8 -1 -55 196
6124 196 142 -91 150 13 4 -187 -158 45 -99 -79 -26 169 -17 35 -280 86 68 -56 -24 225 31 -134 105
6147 105 -52 -249 60 -229 258 43 32 78 -158 82 -190 50 -118 18 190 207 141 4 75 -24 -93 36
6169 36 32 -70 117 115 186 -62 -187 -74 15 -33 -60 213 50 38 207 -47 236 -131 -153 189 -117 213 -60 43
$$ packed form
6050d4l8%J04k10K39m1k18J42L4J39j23K89k91RM5j09J05m9J01P7j17mNL03j90
6075A58j22j45J27Q3j04L5k45P6J45k9K1J29l73J76M9J3j31K85m0K65j76l80K99
6098A16j0j9k13R5r3K28r1k25pM43j41q1j72J74P4ok38Q3P4J38j73m9J01rn4K51
6124A96n4k33K41j37rj91K9K03j44K0N3J95j86N2l15L66j8j24L2K49j94j65K39
6147A05j57j97L09k89M87k15j1M6k36K40k72K40j68J36J72J7o6j37P1r9o9J29
6169C6mj02J87kP1k48j25J13Q9m8k7K73j63j2J69k54K83l67k2L42l06L30k73J03
$$ [...]
8191e4
##END NTUPLES=NMR FID
##END=
