##TITLE=1H_SAM_24.171
 CDCl3, 108 sc, 
 17.12.2019
##JCAMPDX= 6.0         $$ Bruker NMR JCAMP-DX V2.0
##DATA TYPE= NMR FID
##DATA CLASS= NTUPLES
##ORIGIN= UXNMR, Bruker Analytische Messtechnik GmbH
##OWNER= root
$$ XWIN-NMR		Version 3.5
$$ Tue Dec 17 16:25:31 2019 Russian Standard Time (UT+4h)  she@DPX200
##.OBSERVE FREQUENCY= 200.12
##.OBSERVE NUCLEUS= ^1H
##.DELAY= (6, 6)
##.ACQUISITION MODE= SIMULTANEOUS
##.ACQUISITION SCHEME= undefined
##.AVERAGES= 108
##.DIGITISER RES= 17
##SPECTROMETER/DATA SYSTEM= spect
##.PULSE SEQUENCE= zg30
##.SOLVENT NAME= CDCl3
##.SHIFT REFERENCE= (INTERNAL, CDCl3, 0, 15.7039)
##AUDIT TRAIL= $$ (NUMBER, WHEN, WHO, WHERE, WHAT)
$$ ##TITLE= Audit trail, XWIN-NMR		Version 3.5
$$ ##JCAMPDX= 5.01
$$ ##ORIGIN= Bruker BioSpin GmbH
$$ ##OWNER= she
$$ F:/spectra/data/she/nmr/H-F/1/audita.txt
$$ ##AUDIT TRAIL=  $$ (NUMBER, WHEN, WHO, WHERE, WHAT)
(   1,<2019-12-17 16:24:07.68 +0400>,<she>,<DPX200>,
      <continue with go, POWCHK disabled, PULCHK disabled
       configuration hash MD5:
       00 E9 B6 7A A2 85 ED C7 34 08 36 98 17 FE 4E 26
       data hash MD5: 16K
       E0 4D C2 DB 74 9B 82 D3 CC B2 6D A3 3C 7B 5D E3>)
$$ ##END=
$$ 
$$ hash MD5
$$ 5D 56 50 9B B2 C4 2D 92 9B 85 25 A4 AC 67 24 AB
##$RELAX= 
##$RELAX= 
##$RELAX= 
##$RELAX= 
##$RELAX= 
##$RELAX= 
$$ Bruker specific parameters
$$ --------------------------
##$DU= <F:/spectra>
##$EXPNO= 1
##$NAME= <H-F>
##$PROCNO= 1
##$TYPE= <nmr>
##$USER= <she>
##$AMP= (0..31)
100 100 100 100 100 100 100 100 100 100 100 100 100 100 100 100 100 100 
100 100 100 100 100 100 100 100 100 100 100 100 100 100 
##$AQSEQ= 0
##$AQ_mod= 1
##$AUNM= <au_zg>
##$AUTOPOS= <>
##$BF1= 200.13
##$BF2= 200.13
##$BF3= 200.13
##$BF4= 200.13
##$BF5= 200.13
##$BF6= 200.13
##$BF7= 200.13
##$BF8= 200.13
##$BYTORDA= 1
##$CFDGTYP= 0
##$CFRGTYP= 5
##$CHEMSTR= <none>
##$CNST= (0..31)
1 1 145 1 1 1 1 1 1 1 1 1 1 1 1 1 1 1 1 1 1 1 1 1 1 1 1 1 1 1 1 1 
##$CPDPRG= <>
##$CPDPRG1= <>
##$CPDPRG2= <>
##$CPDPRG3= <>
##$CPDPRG4= <mlev>
##$CPDPRG5= <mlev>
##$CPDPRG6= <mlev>
##$CPDPRG7= <mlev>
##$CPDPRG8= <mlev>
##$CPDPRGB= <>
##$CPDPRGT= <>
##$D= (0..31)
0 1.2 0 0 0 0 0 0 0 0.06 0 0.03 0 0 0 0 0.0002 0 0 0 0 0 0 0 0 0 0 0 0 
0 0 0 
##$DATE= 1576585261
##$DBL= (0..7)
120 120 120 120 120 120 120 120 
##$DBP= (0..7)
150 150 150 150 150 150 150 150 
##$DBP07= 0
##$DBPNAM0= <>
##$DBPNAM1= <>
##$DBPNAM2= <>
##$DBPNAM3= <>
##$DBPNAM4= <>
##$DBPNAM5= <>
##$DBPNAM6= <>
##$DBPNAM7= <>
##$DBPOAL= (0..7)
0.5 0.5 0.5 0.5 0.5 0.5 0.5 0.5 
##$DBPOFFS= (0..7)
0 0 0 0 0 0 0 0 
##$DE= 6
##$DECBNUC= <off>
##$DECIM= 4
##$DECNUC= <off>
##$DECSTAT= 4
##$DIGMOD= 1
##$DIGTYP= 9
##$DL= (0..7)
0 120 120 120 120 120 120 120 
##$DP= (0..7)
150 150 150 150 150 150 150 150 
##$DP07= 0
##$DPNAME0= <>
##$DPNAME1= <>
##$DPNAME2= <>
##$DPNAME3= <>
##$DPNAME4= <>
##$DPNAME5= <>
##$DPNAME6= <>
##$DPNAME7= <>
##$DPOAL= (0..7)
0.5 0.5 0.5 0.5 0.5 0.5 0.5 0.5 
##$DPOFFS= (0..7)
0 0 0 0 0 0 0 0 
##$DQDMODE= 0
##$DR= 17
##$DS= 0
##$DSLIST= <SSSSSSSSSSSSSSS>
$$ [...]
##$SUBNAM2= <"">
##$SUBNAM3= <"">
##$SUBNAM4= <"">
##$SUBNAM5= <"">
##$SUBNAM6= <"">
##$SUBNAM7= <"">
##$SUBNAM8= <"">
##$SUBNAM9= <"">
##$SW= 179.748266148225
##$SWIBOX= (0..15)
0 0 2 0 0 0 0 0 0 0 0 0 0 0 0 0 
##$SW_h= 35971.2230215827
##$TD= 16384
##$TD0= 1
##$TE= 0
##$TE2= 300
##$TE3= 300
##$TEG= 300
##$TL= (0..7)
0 120 120 120 120 120 120 120 
##$TP= (0..7)
150 150 150 150 150 150 150 150 
##$TP07= 0
##$TPNAME0= <>
##$TPNAME1= <>
##$TPNAME2= <>
##$TPNAME3= <>
##$TPNAME4= <>
##$TPNAME5= <>
##$TPNAME6= <>
##$TPNAME7= <>
##$TPOAL= (0..7)
0.5 0.5 0.5 0.5 0.5 0.5 0.5 0.5 
##$TPOFFS= (0..7)
0 0 0 0 0 0 0 0 
##$TUNHIN= 0
##$TUNHOUT= 0
##$TUNXOUT= 0
##$USERA1= <user>
##$USERA2= <user>
##$USERA3= <user>
##$USERA4= <user>
##$USERA5= <user>
##$V9= 5
##$VALIST= <valist>
##$VCLIST= <CCCCCCCCCCCCCCC>
##$VD= 0
##$VDLIST= <DDDDDDDDDDDDDDD>
##$VPLIST= <PPPPPPPPPPPPPPP>
##$VTLIST= <TTTTTTTTTTTTTTT>
##$WBST= 1024
##$WBSW= 4
##$XGAIN= (0..3)
0 0 0 0 
##$XL= 0
##$YL= 0
##$YMAX_a= 235281
##$YMIN_a= -494408
##$ZGOPTNS= <>
##$ZL1= 120
##$ZL2= 120
##$ZL3= 120
##$ZL4= 120
##$ABSF1= 10
##$ABSF2= 0
##$ABSG= 5
##$ABSL= 3
##$ALPHA= 0
##$AQORDER= 0
##$ASSFAC= 0
##$ASSFACI= 0
##$ASSFACX= 0
##$ASSWID= 0
##$AUNMP= <proc_1d>
##$AZFE= 0.1
##$AZFW= 0.1
##$BCFW= 1
##$BC_mod= 2
##$BYTORDP= 1
##$COROFFS= 0
##$CY= 11.3945322036743
##$DATMOD= 1
##$DC= 2
##$DFILT= <>
##$DTYPP= 0
##$F1P= 16.9975609425685
##$F2P= -3.02152046262296
##$FCOR= 0.5
##$FTSIZE= 0
##$FT_mod= 4
##$GAMMA= 1
##$GB= 0.15
##$INTBC= 1
##$INTSCL= 1
##$ISEN= 128
##$LB= 0.24
##$LEV0= 0
##$LPBIN= 0
##$MAXI= 10000
##$MC2= 0
##$MEAN= 0
##$ME_mod= 0
##$MI= 1.114404
##$NCOEF= 0
##$NC_proc= 0
##$NLEV= 6
##$NOISF1= 3.799351
##$NOISF2= 2.8
##$NSP= 1
##$NTH_PI= 0
##$NZP= 0
##$OFFSET= 15.70392
##$PC= 1
##$PHC0= -9746.594
##$PHC1= 90.80081
##$PH_mod= 1
##$PKNL= yes
##$PPARMOD= 0
##$PSCAL= 0
##$PSIGN= 0
##$REVERSE= no
##$SF= 200.130013532006
##$SI= 16384
##$SIGF1= 3
##$SIGF2= 2
##$SINO= 400
##$SIOLD= 16384
##$SREGLST= <1H.CDCl3>
##$SSB= 0
##$STSI= 0
##$STSR= 0
##$SW_p= 3612.71676300578
##$SYMM= 0
##$S_DEV= 0
##$TDeff= 0
##$TDoff= 0
##$TI= <>
##$TILT= no
##$TM1= 0
##$TM2= 0
##$TOPLEV= 0
##$USERP1= <user>
##$USERP2= <user>
##$USERP3= <user>
##$USERP4= <user>
##$USERP5= <user>
##$WDW= 1
##$XDIM= 8192
##$YMAX_p= 0
##$YMIN_p= 0
$$ End of Bruker specific parameters
$$ ---------------------------------
##NTUPLES= NMR FID
##VAR_NAME=  TIME,          FID/REAL,        FID/IMAG
##SYMBOL=    X,             R,               I
##VAR_TYPE=  INDEPENDENT,   DEPENDENT,       DEPENDENT
##VAR_FORM=  AFFN,          ASDF,            ASDF
##VAR_DIM=   8192,          8192,            8192
##UNITS=     SECONDS,       ARBITRARY UNITS, ARBITRARY UNITS
##FACTOR=    2.78e-05,      1,               1
##FIRST=     0,             0,               0
##LAST=      0.2277098,     0,               0
##MIN=       0,             -494408,         0
##MAX=       0.2277098,     235281,          0
$$ Real data points
##PAGE= N=1
##DATA TABLE= (X++(R..R)), XYDATA
$$ [...]
2941b06j15R71J194k297J705j384j320J350j003J040N73k46k84l74J291o22P01
$$ -206 -321 650 1844 -453 1252 -132 -1452 -102 -1105 -65 508 262 -22 -396 895 273 974
2958I74j103J185l317K848J132k403N67J79Q25L11j464O62j164J167m22K048l576
$$ 974 -129 1056 -2261 587 1719 -684 -117 62 887 1198 -266 396 -768 399 -23 2025 -1551
2975a551K043j222J166O68k480K350k189L22R34J33o44K27k37K46J559j337o0
$$ -1551 492 -730 436 1104 -1376 974 -1215 -893 41 174 -470 -243 -480 -234 1325 -12 -72
2992g2r32J466j953M18J913k525Q34J795o47K58J175k445q79K343o97p54Q76k7
$$ -72 -1004 462 -1491 -1073 840 -1685 -851 944 297 555 1730 -715 -1594 749 52 -702 174 147
3010A47n62R03R09k829J569pQ12j874p7L44R48J974k473J124j691M24K76J862
$$ 147 -415 488 1397 -1432 137 130 942 -932 -1009 -665 283 2257 -216 908 -783 -359 -83 1779
3028A779j543j279l10J074Q32k29k408K218q43J320N8r29N63j465J132M48k23
$$ 1779 236 -1043 -1353 -279 553 324 -2084 134 -709 611 669 -260 303 -1162 -30 418 195
3045A95j015P63p52J366M80j09j677Q69m05R44j849K331j942J875R0j752O45L38
$$ 195 -820 -57 -809 557 1037 928 -749 120 -285 659 -1190 1141 -801 1074 1164 -588 57 395
3063C95q13N26J015j213K2R62j122o0j615J568Q31o83J158j511J057J08q25o00
$$ 395 -418 108 1123 -90 -68 894 -228 -288 -1903 -335 496 -187 971 -540 517 625 -200 -800
3081h00M87N4M67Q41j740O64M21K1n95J389r42j531J352l47Q16N4j99p09l02L01
$$ -800 -313 -259 208 1049 -691 -27 394 415 -180 1209 267 -1264 88 -259 557 611 412 -297 -599 -298
3101b98O51p06p86J221m09R80q67K45O68j503J126j181N32J453j355J036l96l93
$$ -298 353 -353 -1139 82 -327 653 -214 31 699 -804 322 -859 -327 1126 -229 807 411 18
3119A8k10n69N14j035J005kN81r80J621j467L05n65P6P09k97O72k118K463m80
$$ 18 -192 -761 -247 -1282 -277 -279 302 -678 943 -524 -219 -784 -708 1 -296 376 -1742 721 241
3138B41o92j52M80j69K50P10K98j505L11K55K97O8j212OJ147j539m86J132J356
$$ 241 -451 -603 -123 -292 -42 668 966 -539 -228 27 324 392 -820 -814 333 -1206 -1692 -560 796
3157G96l52k79m68J10j91J18n17Q41k90L33j779J039L19l55J144J097j692M80
$$ 796 444 165 -303 -193 -384 -266 -783 58 -232 101 -1678 -639 -320 -675 469 1566 -126 354
3175C54m5j648N98J598j163J88m28J211l65r48J259j687R68l19L18K67Q05l012
$$ 354 309 -1339 -741 857 -306 -118 -546 665 300 -648 611 -1076 -108 -427 -109 158 963 -2049
3193b049J899L53J062m30J37j223P93K58j157l70J647q96n94k21M35K93J404%
$$ -2049 -150 203 1265 835 972 -251 542 800 -357 -727 920 24 -570 -791 -356 -63 1341 1341
3211A341k536K026J58q61J61o27k26J007J70l350L700m6j743J381q03R76m20Q5
$$ 1341 -1195 831 989 128 289 -338 -564 443 613 -2737 963 917 -826 555 -248 728 308 393
3229C93r89p02M03J958m45K3K95p08l13J010k238K8J345o62M84j011K5J696L44
$$ 393 -596 -1298 -895 1063 618 641 936 228 -85 925 -1313 -1285 60 -602 -118 -1129 -1104 592 936
3248I36j86J86r74P08J94l03j293L30N48j061J854p35P40j287N29N4L52j170P82
$$ 936 750 936 -38 670 864 561 -732 -402 146 -915 939 204 944 -343 186 240 592 -578 204
3267B04O88j224k19L33J423j574N90m4J11J04n8n81O0j136J126L45n8K14P15k028
$$ 204 892 -332 -551 -218 1205 -369 221 177 288 392 334 -247 -187 -1323 -197 148 90 304 1019 -1009
3287a009J601L92q88R52j037n23P56K32m78r10O27L11p60J315m15J1O71j225P58
$$ -1009 592 984 96 1048 11 -512 244 476 -2 -912 -285 26 -734 581 166 177 848 -377 381
3306C81n56R7m54J154q74m73J252Q0j38j276Q90R42j65j556R87j154J203j004
$$ 381 -175 -78 -532 622 -252 -725 527 607 469 -807 83 1025 860 -696 291 -863 340 -664
3324f64l5M11L03L73j143j40j090J992q7J448j381J590j180j41o19j76j39R99
$$ -664 -699 -288 15 388 -755 -895 -1985 7 -80 1368 -13 1577 397 256 -363 -539 -678 321
3342C21k052J986j046O20K01j59o34P82j103R93l19K17J003j331J633p33j114
$$ 321 -1731 255 -791 -171 30 -129 -763 19 -1084 -91 -410 -193 810 -521 1112 379 -735
3359g35O33j116K08J87L8J380k42M6q77J529j465P48j370M04K349k937J913m6
$$ -735 -102 -1218 -1010 -823 -785 595 353 399 -478 1051 -414 334 -1036 -632 1717 -1220 693 647
3377F47j296r2M0P09j50P71j383O11J492j002J177M60k72r59K38J381k127J042
$$ 647 -649 -741 -701 8 -142 629 -754 -143 1349 347 1524 1984 1712 753 991 2372 245 1287
3395A287j401J180j223L35o69J292k689J386k70N66K39N58o69j355J608N75p36
$$ 1287 -114 1066 -157 178 -491 801 -1888 -502 -772 -206 33 591 -78 -1433 175 750 14
3412A4p37J545j925J351J82K67j131J132Q77k707J237P22j040q96K479j930j15
$$ 14 -723 822 -1103 248 430 697 -434 698 1575 -1132 105 827 -213 -1109 1370 -560 -675
3429f75N44r26R46j297K383j124m23J626l081K629O07q27j729J596Q4P90K14k399
$$ -675 -131 -1057 -111 -1408 975 -149 -572 1054 -2027 602 1209 382 -1347 249 333 1123 1337 -1062
3447a062J014j17J189q95j30p39r8O58m09M45J386j880Q98L42K90j654O24J511
$$ -1062 -48 -165 1024 129 -1 -740 -838 -180 -589 -144 1242 -638 260 602 892 -762 -138 1373
3465A373k492O34K10J661L29j079j884J352j441J104L87Q26j062k74n58K01K18
$$ 1373 -1119 -485 -275 1386 1715 636 -1248 104 -1337 -233 154 980 -82 -356 -914 -713 -495
3482d95K042j164j989R98J507r16M3J997k693J106P43p54j837K292L46k441M21
$$ -495 1547 383 -1606 -608 899 -17 26 2023 -670 436 1179 425 -1412 880 1226 -1215 -794
3499g94N68K05J034r95p66O25j50K28l20r21R53P48n81K8O8l71P94L44q38O45
$$ -794 -226 -21 1013 18 -748 -123 -273 -45 -365 -1286 -333 415 -166 -138 -70 -441 353 697 -141 504
3519E04p03m40J670j003J33M39p92Q68q77k98O02q48J89m10M76K95q97K416j219
$$ 504 -199 -639 1031 28 161 600 -192 676 -201 -499 103 -745 -556 -966 -490 -195 -1092 1324 105
3538A05k24L63J337r66j642m54J82J506M55j836K24M07N47P9q04J430q51J123
$$ 105 -119 244 1581 615 -1027 -1481 -1299 207 662 -1174 -950 -543 4 83 -721 709 -142 981
3556I81j026j790J045J202n41J163j2j541O42o85M54N29L36n43R98j128j024J226
$$ 981 -45 -1835 -790 412 -129 1034 1022 -519 123 -562 -108 421 757 214 1212 84 -940 286
3574B86o98KJ399q13m08M4j96K09J06p42P6M78L40N75L57O37k875P10J447J106
$$ 286 -412 -410 989 176 -232 -188 -384 -175 -69 -811 -735 -257 83 658 1015 1652 -1223 -513 934 2040
3594B040r77J033j193j924J064o23O4M78L64j341L18J222j222J773j102k96o13
$$ 2040 1063 2096 903 -1021 43 -580 -516 -38 326 -1015 -697 525 -697 1076 -26 -322 -935
3611i35O00j94M14J285r72k63J003k26l13j27j641M54K032l104J37J637L12k72
$$ -935 -335 -529 -115 1170 198 -65 938 712 399 272 -1369 -915 1117 -1987 -1850 -213 99 -173
3629a73J55N54k527L022K20j077l04j105J058J287j471Q60P6K72j163N50j82O12
$$ -173 -18 536 -1991 1031 1251 174 -130 -1235 -177 1110 -361 499 575 847 -316 234 52 664
3647F64j654J489J91L74j833J307K84j404J507j800K372m79j013K9J963k115n17
$$ 664 -990 499 690 1064 -769 538 822 -582 925 -875 1497 1018 5 34 1997 -118 -635
3664f35J080L2j933K52J027j151K555p97m00j9k29o09j89J735j199O36O68j067
$$ -635 445 477 -1456 -1204 -177 -1328 1227 430 30 11 -218 -827 -1016 719 -480 156 824 -243
3682b43J360n54j131J512j021k47N73J60p34J6Q65o11Q8Q40p06j648Q88J648j054
$$ -243 1117 563 -568 944 -77 -324 249 409 -325 -309 556 -55 33 873 167 -1481 -593 1055 1
3701Ar31Q30M78j225K046r51n55l3o28J182k75Q48j281n03j71O71M12q45P87j847
$$ 1 -930 -100 378 -847 1199 248 -307 -340 -968 214 -61 787 -494 -997 -1168 -497 -85 -930 -143 -1990
3721a990J128R89q6n36N13L49O1J97p79j2P5J674k812k82J742K01K85k79l60O18
$$ -1990 -862 127 41 -495 18 367 428 625 -154 -166 -91 1583 -1229 -1511 231 432 717 438 78 696
3741F96m59m15R41o82q73N84Q9N51J183k715J133Q75k086Q60M97n53L09r4p2p9
$$ 696 237 -178 763 81 -792 -208 -119 432 1615 -1100 33 908 -1178 -318 179 -374 -65 -159 -231 -310
3761c10J488o96p48m55J738P7j012j099L55J033L06o13j84J20K40j141R45o30
$$ -310 1178 482 -266 -721 1017 1094 82 -1017 -662 371 677 64 -120 0 240 -901 44 -586
3779e86J106L44q44O86n26o20K05k84J105j097J371q22J033j754O15j20R52o70
$$ -586 520 864 20 706 180 -440 -235 -519 586 -511 860 38 1071 -683 -68 -188 764 94
3797I4K98j529K769j273n43k25Q9l82r0J073l7o56J51l25J071j373J247j884N91
$$ 94 392 -1137 1632 359 -184 -409 -320 -702 -792 281 244 -412 -261 -586 485 -888 359 -1525 -934
3816i34J304m58k15j97k06J410j071N0P70n97j010O86J552j084Q06j84j776J464
$$ -934 370 -88 -303 -500 -706 704 -367 -317 453 -144 -1154 -468 1084 0 806 622 -1154 310
3834C10O11m99L97j528N68M33K24P56j793P44m65m09J66J84j137P96P57O28j173
$$ 310 921 422 819 -709 -141 292 516 1272 -521 223 -242 -651 -485 -301 -1438 -642 115 743 -430
3853d30J394j258k1P95j563J742r01P75j674J400M69r37J200n18NL47o19j177
$$ -430 964 -294 -315 480 -1083 659 -242 533 -1141 259 728 -209 991 473 478 825 206 -971
3871i71J153m3m81n08M72P01p44K03M61j057J259j277J39L32L69J325m06j353
$$ -971 182 139 -342 -850 -378 323 -421 -218 243 -814 445 -832 -693 -361 8 1333 927 -426
3889d26P28M40o23j34j993J772J620j625J661j268J17j156N13J361j547J363R77
$$ -426 302 742 119 -15 -2008 -236 1384 -241 1420 152 269 -887 -374 987 -560 803 1780
3906A780j931O79j58Q61r20k23o46N4O85L50k45j051K257k575J283m58O04q72
$$ 1780 -151 528 370 1231 311 88 -558 -504 181 531 286 -765 1492 -1083 200 -258 346 -526
3924e26r34K669j985P75j789J531J518o29j67m67j000L38J402j566J323p75m30
$$ -526 -1460 1209 -776 -1 -1790 -259 1259 630 463 -4 -1004 -666 736 -830 493 -282 -712
3941g12R73J192j753J79q40J489j005J559j38j49j072j082J401j18K02m26j61
$$ -712 261 1453 -300 -121 -961 528 -477 1082 944 795 -277 -1359 42 -76 126 -300 -461
3958d61%m34Q51j846J513J137j019J238j907J460q31j053O39K26Q8N46j938J986
$$ -461 -461 -895 -44 -1890 -377 760 -259 979 -928 532 -299 -1352 -713 -487 -399 147 -1791 195
3976A95m70k35n62J246O17j148J669k964L684j678m13k89k8N0M34n00K100j696
$$ 195 -275 -510 -1072 174 791 -357 1312 -1652 2032 354 -59 -348 -376 -326 108 -392 1708 12
3994A2o04Q05n84J041n41q6n50O88j06M64J141k961J223O13j033m42J228j74k72
$$ 12 -592 213 -371 670 129 43 -507 181 75 539 1680 -1281 -58 555 -478 -920 308 134 -138
4013a38m25J371p02j267J342N51j983J775j462J299l63P92K56o00j157K27M13
$$ -138 -563 808 106 -1161 181 732 -1251 524 -938 361 -2 790 1046 446 -711 -484 -71
4030g1o17P45Q52k04j650J422l44N28j35j33n28P09j626N64J046J021j259j379
$$ -71 -688 57 909 705 -945 477 133 661 526 393 -135 574 -1052 -488 558 1579 320 -1059
4048a059J656m69N09r25m96J747q10m57N04j74K09l78J651j517j389K231q35j036
$$ -1059 597 128 637 -288 -784 963 153 -304 200 26 235 -143 1508 -9 -1398 833 -2 -1038
4066a038J163j111j78J546j269J22R97K11j017J99J012j082J019m88L7q54O92
$$ -1038 125 -986 -1164 382 -887 -765 232 443 -574 -375 637 -445 574 86 123 -731 -39
4083c9p93R13M7n8J26j056J214O1j043J686j397J891q74n08J102j048o72P78Q2
$$ -39 -832 81 128 70 196 -860 354 415 -628 1058 -339 1552 678 170 1272 224 -448 330 412
4102D12m74p45K239l23j439R88j504J14J302j528N86J433n46j088N93k19K86j317
$$ 412 -62 -807 1432 1109 -330 658 -846 -732 570 -958 -372 1061 515 -573 20 -199 87 -1230
4120a230J620L16O84n6j321n70J8k27j90Q74k78J043k58J126j698q46P12j046
$$ -1230 390 706 1390 1334 13 -557 -539 -766 -956 -82 -360 683 425 1551 -147 -993 -281 -1327
4138a327J944N27k524K443j721L014k088q17J19K85J5J97O26o48J236j889L80
$$ -1327 617 1144 -1380 1063 -658 2356 268 -549 -430 -145 -130 67 693 45 1281 -608 -228
4155b28j362J431M59l40K41Q80k155Q21J01o96K45J765j534L82O84K47j287N4
$$ -228 -1590 -159 300 -40 201 1081 -1074 -253 -152 -848 -603 1162 -372 10 694 941 -346 -292
4173b92L78PJ075k13j409M06o06J304k602J113R95j435J973j798R83N83K87J42
$$ -292 86 93 1168 955 -454 -48 -654 650 -1952 -839 156 -1279 694 -1104 -121 462 749 891
4191H91j504J743j993Q52L36J188k550J990j16j264P91n86o34k17J615J48j232
$$ 891 -613 1130 -863 -11 325 1513 -1037 953 837 -427 364 -222 -856 -1073 542 690 -542
4208e42J375k390J077J168r17Q96j097L93J26j29M89q78N76J181j127n77j107
$$ -542 833 -1557 -480 688 -229 667 -430 -37 89 -40 449 -429 147 1328 201 -376 -1483
4225a483J590j667P65R74P3j892K663m45l00n36l77M32j91J312m0j556N15j19
$$ -1483 107 -1560 -795 179 252 -1640 1023 578 278 -258 -635 -203 -394 918 878 -678 -163 -282
4243b82L62N46j291L97k60J810j843O40O94l88r94M41j410L072j026k790J202
$$ -282 80 626 -665 -268 -528 1282 -561 79 773 385 -609 -168 -1578 1494 468 -2322 -1120
4260a120P78j58J23j165N46J630r70J109j585J822j604n02J939j927J109K28O22
$$ -1120 -342 -500 -377 -1542 -996 634 -336 773 -812 1010 -594 -1096 843 -1084 25 253 875
4277H75M39j441k10J089J506k448M42O1p07J814k095K52R73r15k23J060J72m26
$$ 875 1314 -127 -337 752 2258 -190 252 313 -394 1420 -675 -423 550 -365 -588 472 644 218
4295B18j063J385L69j407K208l90l57l53j482k67J196M43k99j061k13J350n35
$$ 218 -845 540 909 -498 1710 1320 963 610 -872 -1139 57 500 201 -860 -1073 277 -258
4312b58k59J302j33o64j412J78J984O36o74l21k94J378j920R18m25m52P53j162
$$ -258 -517 785 652 -12 -1424 -1246 738 1374 700 379 85 1463 -457 461 36 -416 337 -825
4330h25j75J391j35j470L96K409o97j173L48j63M67k19J03M98n21j333O22N08
$$ -825 -1000 391 256 -1214 -818 1591 894 -279 69 -94 373 154 257 755 234 -1099 -477 31
4348C1r81J441k991J875l2k01J021L0J168m88p44J104L57j303j092N99j231P94
$$ 31 -950 491 -2500 -625 -657 -858 163 193 1361 873 129 1233 1590 287 -805 -206 -1437 -643
4366f43J567o17pn41m08N60m64N80J283j453J47K40j86M88k75M56o87o77k05J063
$$ -643 924 307 300 -241 -649 -89 -553 27 1310 -143 4 244 58 546 271 727 40 -637 -842 221
4386B21J033j754K3P38n16l54J326N26j122q29q70J734o83Q24n51K04k92o52J304
$$ 221 1254 -500 -477 261 -255 -609 717 1243 121 -708 -1578 156 -527 297 -254 -50 -342 -994 310
4405C10j241J686r92j59R74m07j65M25o46J269r2J59j218j825K633J606k107j083
$$ 310 -931 755 -237 -396 578 171 6 431 -215 1054 962 1121 -97 -1922 711 2317 210 -873
4423h73J173O56n58l98m8nm79J755r56l60M01n63K21j253L054j516K11j222Q06
$$ -873 300 956 398 0 -48 -53 -532 1223 267 -93 308 -255 -34 -1287 1767 251 462 -760 46
4442D6r9M95O20k553J560r77J920o70M74j049R0J7J909k381L03L21r00J025K25
$$ 46 -53 442 1062 -1491 69 -908 1012 342 816 -233 -143 -126 1783 -598 -295 26 -874 151 376
4461C76M91j331m98K95p53J90J668R21j494m60N61R92q05O33k172J333j440J725
$$ 376 867 -464 -962 -667 -1420 -1230 438 1359 -135 -595 -34 958 153 786 -1386 -53 -1493 232
4479B32k27O54o52q27L417l143J15K08J878j459k62Q88r17l76Q22j57l40L21l67
$$ 232 5 659 7 -820 2597 -546 -431 -223 1655 196 -66 822 -95 -471 351 194 -146 175 -192
4498a92O64q06k39J479p01P36p2L30o40j068N38m37R31j195n8J330q0k234L351
$$ -192 472 -334 -573 906 205 941 869 1199 559 -509 29 -408 523 -672 -730 600 520 -1714 1637
4517A637k859O69J171j459J254j771P95J722m53j395J485j343l31J763j683q38
$$ 1637 -1222 -553 618 -841 413 -1358 -563 1159 706 -689 796 -547 -878 885 -798 -1636
4533a636J662Q88j632J720L1k111J429M50j071m31Q40k3n33P29k09j97M58k22
$$ -1636 26 914 -718 1002 1033 -1078 351 801 -270 -701 139 116 -417 312 103 -94 364 142
4551A42q37J037l44q39j90J63J162p04J395p26m03J052o96j445l8J329j34j081
$$ 142 -695 342 -2 -841 -1031 -868 294 -410 985 259 -144 908 212 -1233 -1271 58 -76 -1157
4569a157J782j254m4O93P0l50k87l73M59O9M96M82m62N90j232n01Q81J22k36p98
$$ -1157 625 -629 -673 20 90 -260 -547 -920 -461 -392 104 586 124 714 -518 -1019 -138 -16 -252 -1050
4589a050J728J21j124R04o79J472j143L11o98j216J684j150M88K01j55N42l89
$$ -1050 678 799 -325 579 -100 1372 229 540 -158 -1374 310 -840 -352 -151 -306 236 -153
4606a53K336k305l11J730j241k37O84J7k50P54j01o51L13l35k71o06Q69l34J058
$$ -153 2183 -122 -433 1297 56 -181 503 520 270 1024 923 272 585 250 -21 -627 242 -92 966
4625I66j116j247J545m81r1N65P21j42l80oL0j225J226q8j244P67J323j036M87
$$ 966 -150 -1397 148 -333 -424 141 862 720 340 334 364 -861 365 277 -967 -200 1123 87 574
4644E74n60n23J039n25J62k50J099j457J820j172j502N74JJ095m65J7m08P88M0
$$ 574 14 -509 530 5 167 -83 1016 -441 1379 207 -1295 -721 -720 375 -90 -73 -481 307 347
4663C47j246K18L65j05N19J11k48J106r83r78K84M22n31LJ444j783P1J274l15
$$ 347 -899 -681 -316 -421 98 209 -39 1067 84 -894 -610 -188 -719 -716 728 -1055 -984 290 -25
4682b5J48j658J487L63n07r76M69k38J077o12J064m38n20k145K400o28N58K799
$$ -25 123 -1535 -48 315 -192 -1168 -699 -937 140 -472 592 154 -366 -2511 -111 -739 -181 2618
4700B618j474P09m62j020k269J451l68P32Q52j417P82j091J036L35r24J052O38
$$ 2618 1144 1853 1391 371 -1898 -447 -815 -83 769 -648 134 -957 79 414 -510 542 1180
4717A180j486p47J645p47K682j306l99p58k69L27p81R97p29L30q0J455j300l02
$$ 1180 -306 -1053 592 -155 2527 1221 822 64 -205 122 -659 338 -391 -61 -141 1314 14 -288
4735b88j7P56j659j38N19J53J279j239r4J679r86J68o33J256k287Q82J132q25
$$ -288 -305 451 -1208 -1346 -827 -674 605 -634 -728 951 -35 133 -500 756 -1531 -649 483 -342
4753c42J46P76O40q61J8j527J430j468O74m94P91J474r75j043M80j35P36P96j993
$$ -342 -196 580 1220 359 377 -1150 280 -1188 -514 -1008 -217 1257 282 -761 -281 -416 320 1116 -877
4772h77J322j8L31j165M14L73N84j397k72L24P02Q7o09j18P66P27k170K447r53
$$ -877 445 427 758 -407 7 380 964 -433 -705 -381 321 408 -201 -319 447 1174 -996 1451 498
4791D98j273N61J249j226L74j137O10p68O32K65J32Q14j574n97K354l01j409J557
$$ 498 -775 -214 1035 -191 183 -954 -344 -1112 -480 -215 -83 731 -843 -1440 914 613 -796 761
4809G61j247K32j19J156p5k272J557L22l25m22K69J2m95K212r59n55J10m35k50
$$ 761 -486 -254 -373 783 708 -1564 -7 315 -10 -432 -163 -151 -646 1566 607 52 162 -273 -523
4828e23P83J67r36J008L24l76Q40j492P59q34m0k29q9j21J78J364k036J365N06
$$ -523 260 427 -509 499 823 447 1287 -205 554 -280 -320 -549 -638 -759 -581 783 -1253 112 618
4847F18k361J603J358j788J291j360n48J120l22R59j600Q73J81l90m8P68L9q09
$$ 618 -1743 -140 1218 -570 721 -639 -1187 -67 -389 570 -1030 -157 24 -366 -414 354 393 -416
4865d16j6J030p33r0j166O55P77m07L36l58J584k167K812j388j382J188P23j341
$$ -416 -432 598 -135 -225 -1391 -736 41 -366 -30 -388 1196 -971 1841 453 -929 259 982 -359
4883c59J30O65j48j463L88J096J20j357L041k854M74m57l52J187n33m99J40J205
$$ -359 -229 436 288 -1175 -787 309 429 -928 2113 -741 -267 -724 -1076 111 -422 -921 -781 424
4901D24j567J477L57M40m66J03j246J483j109o53R34j249J649j083r31r0K011
$$ 424 -1143 334 691 1131 665 768 -478 1005 -104 -757 177 -1072 577 -506 -1437 -1527 484
4918D84j446M73N70k59Q17j201Q60m6n94Q33p75j002J989j030J04R40k345R39
$$ 484 -962 -489 81 -178 639 -562 298 252 -342 491 -284 -1286 703 -327 -223 717 -1628 -689
4936f89j070K442j273k09M24J112n96q18J146j008r42J520j49J493n51o38o68
$$ -689 -1759 683 -590 -799 -375 737 141 -677 469 -539 -1481 39 -110 1383 832 194 -474
4953d74K46K51m69k67P26r98J165n97l46N53J231j275j11J70p53K364j012o11
$$ -474 -228 23 -446 -713 13 -985 180 -417 -763 -210 1021 -254 -365 -195 -948 1416 404 -207
4971b07Q09k61K060k178J27K22j19L78j70j313J99K5p1J741j206K76r49M73R80
$$ -207 602 341 2401 223 350 572 453 831 661 -652 -453 -428 -499 1242 36 312 -637 -164 816
4990H16p45J417j646J54J11P22j752P5p31J690j47J642j183o03Q30q0j441J889
$$ 816 71 1488 -158 -4 107 829 -923 -848 -1579 111 -36 1606 423 -180 650 570 -871 1018
5008A018P65q32j574M26K93j243J756j089p00M52K037m51l98P54j706R31j32P67
$$ 1018 1783 951 -623 -197 96 -1147 609 -480 -1180 -728 1309 858 460 1214 -492 439 307 1074
5026A074q74M20o33k12J63K26j661K272l57j04J41j199M66l57R35Q7k41N01n6
$$ 1074 200 620 -13 -225 -62 164 -1497 775 418 314 455 -744 -278 -635 300 387 146 647 591
5045E91k855J943n87J377O04k271j83Q46J037k22n66L49K29L52l24J30o37J188
$$ 591 -2264 -321 -908 469 1073 -1198 -1381 -535 502 280 -286 63 292 644 320 450 -187 1001
5063A001k325J168J04M49j062J98K108k118J076j095m80K269j513K90n9M01j057
$$ 1001 -1324 -156 -52 397 -665 -467 1641 -477 599 -496 -976 1293 -220 70 11 412 -645
5080f45J422k94m9j488J375n06R49k238J305j410M45J422k8L76p19q90P41R09
$$ -645 777 483 434 -1054 321 -185 764 -1474 -169 -1579 -1134 288 260 636 -83 -973 -232 677
5098F77k896L245j036R26q78j015N44R44m76r57J548k06J091j438l80N0j042J866
$$ 677 -2219 1026 -10 916 38 -977 -433 511 35 -922 626 420 1511 73 -307 -257 -1299 567
5116E67j616J272k27J286l42k09L90j765L22O50o77K43J503j443J74J76O87q62
$$ 567 -1049 223 -4 1282 940 731 1121 -644 -322 328 -349 -106 1397 -46 128 304 991 129
5134A29k47K07L77k15J183k322Q29J308j045M9r44M23m9m9p99L71o09J389j44
$$ 129 -118 89 466 251 1434 -888 -59 1249 204 253 -691 -268 -317 -366 -1165 -794 -1403 -14 -158
5153a58L72J23j022R12m44J31J45r26J248Q44j606r4J583l92r11r15P39J696j684
$$ -158 214 337 -685 227 -217 -86 59 -867 381 1225 -381 -475 1108 716 -195 -1110 -371 1325 -359
5172c59J18J270k83k001M12J175m27r45O00k38J076l74J117j458M29M24n51k017
$$ -359 -241 1029 746 -1255 -843 332 -95 -1040 -440 -678 398 24 1141 -317 112 536 -15 -2032
5190b032L439j956P02j63N93l66l98N47J75j40j715L473j334q41k22q87O74o53
$$ -2032 1407 -549 153 -10 583 217 -181 366 541 401 -1314 2159 825 -16 -238 -1125 -451 -1104
5208a104M0R83J118j796J136k44K97j238M50N47j18J20k61Q2j299J261j563J986
$$ -1104 -1064 -81 1037 -759 377 133 430 -808 -358 189 71 191 -70 12 -1287 -26 -1589 397
5226C97m0p61Q69l39N66q58k25q0J54Q08m59r99M52kN05N88p55L19K29k69M08
$$ 397 357 -404 465 126 692 -166 -391 -471 -317 491 32 -967 -515 -517 -12 576 -179 140 369 100 508
5247E08j60p14Q69o43O03j064N97j019J698o71O82m14r11o76J776j54p43K186
$$ 508 348 -366 503 -140 463 -601 -4 -1023 675 4 686 272 -639 -1315 461 307 -436 1750
5265A750j640k073J754k06J23J495j50l919L324r73J243q64K07p99O66Q36j460
$$ 1750 110 -1963 -209 -415 -292 1203 1053 -2866 458 -515 728 -136 71 -728 -62 774 -686
5282f86M84J042m75M43p46m51J236n99J082j344M85n61q61M56J661k148R7P76
$$ -686 -202 840 365 808 62 -389 847 248 1330 -14 471 -90 -951 -495 1166 -982 -885 -109
5300a09Q95k6J63N23k266P03J118q11n49J070j84j84k23L15J12K23q81O6l96k48
$$ -109 786 760 923 1446 -820 -117 1001 190 -359 711 527 343 120 435 547 770 -111 -45 -441 -689
5320f89Q36M20j197q29j40J041j21O09pK20m14j29J44k29L94J381j573j183J184
$$ -689 147 567 -630 -1459 -1599 -558 -679 -70 -77 143 -271 -400 -256 -485 -91 1290 -283 -1466 -282
5339b82Q73n50M86N09n99j289M76R51r2p91Q40j210L49J279j061Q74k83K82Q2
$$ -282 591 41 527 1036 437 -852 -376 575 483 -308 532 -678 -329 950 -111 763 480 762 844
5358H44j150J090m78L73L47r84M44p85J018j201O90l98l43n04J057n87N80j56
$$ 844 -306 784 306 679 1026 42 486 -299 719 -482 208 -190 -533 -1037 20 -567 13 -143
5376a43L4R36r10Q51J141k007P03m00P78M33j908J492r32m1l37J72M49J170k762
$$ -143 -109 827 -83 768 1909 -98 605 205 983 1416 -492 1000 68 27 -310 -138 311 1481 -1281
5395a281J183n03K32O45M99k400J751k53k10J597p93p02R20m89l38M07M08j207
$$ -1281 -98 -601 -369 276 775 -1625 126 -127 -337 1260 467 -235 685 196 -142 265 673 -534
5413e34j36J086m46o44J444q3q10K68N0k79q64R35Q97j642J330m41R8j15o22o68
$$ -534 -670 416 -30 -674 770 687 -123 145 195 -84 -948 -13 884 -758 572 131 229 114 -508 -1176
5433a176R94J253m13n21J03j62r88J041k26O2q91L6R29L93R29k112J414j447l37
$$ -1176 -182 1071 658 137 240 78 -910 131 -95 -33 -924 -888 41 434 1363 -749 665 -782 -1119
5452a119R36q35J498q78q7L6O42J379j019j264J891j442L08N68j044p41K223j540
$$ -1119 -183 -1018 480 -398 -485 -449 193 1572 553 -711 1180 -262 46 614 -430 -1171 1052 -488
5470d88j87P81R9n95j157J009O34j34J011p06N3M07j779K092k322P92J840j088
$$ -488 -675 106 205 -390 -1547 -538 96 -38 973 267 320 727 -1052 1040 -1282 -490 1350 262
5488B62O11J001q02o85m99j654J988k011K298k82r61k22J340K12M37p20j543N77
$$ 262 873 1874 1072 387 -112 -1766 222 -1789 509 227 -734 -956 384 596 1033 313 -1230 -653
5506f53%k16Q08K14J93j159o73J545p71o22J331L40p08J076r09l35o49O66L88
$$ -653 -653 -869 -61 153 346 -813 -1486 59 -712 -1334 -3 337 -371 705 -204 -539 -1188 -522 -134
5525a34m38P14j680R02J493J50q25Q37n17N42n33J071j859Q32j741M63J497p48
$$ -134 -572 142 -1538 -636 857 1007 182 1019 502 1044 511 1582 -277 555 -1186 -723 774 26
5543B6M23n46J546j212L84N2l3j416L57M73q5p93P92p15J193j065N57L15J460
$$ 26 449 -97 1449 237 621 673 640 -776 -419 54 -31 -824 -32 -747 446 -619 -62 253 1713
5562A713k306R46m62Q39j132R70j797J165J529j444j96O01K91j477J032K40q40
$$ 1713 -593 353 -109 730 -402 568 -1229 -64 1465 21 -175 426 717 -760 272 512 -328
5579c28J088m40K89j376N03K66q82J401j716K514j253J42QM24j297k86J104J260
$$ -328 760 320 609 -767 -264 2 -880 521 -1195 1319 66 208 216 640 -657 -943 161 1421
5597A421k570R46J92J187j39k158J733j015O31P73j402P86m43j35l50J772k093
$$ 1421 -1149 -203 -11 1176 1037 -1121 612 -403 228 1001 -401 385 -58 -193 -543 1229 -864
5614h64j88J221j016K433q30j144J82Lq19J649k95N91k23o10q9L14o21j319J487
$$ -864 -1052 169 -847 1586 756 -388 -206 -203 -1022 627 332 923 700 90 1 315 -306 -1625 -138
5633a38Q88q54K77m21j026l3J697j332K813j704k449L054n80k81n79r5P78P32
$$ -138 750 -104 173 -248 -1274 -1307 390 -942 1871 167 -2282 772 192 -89 -668 -763 15 747
5651G47J69J040k110m92K079j832L44j98j35m86M28J15M46r64J722j76R8K61j936
$$ 747 916 1956 -154 -646 1433 -399 -55 -253 -388 -874 -446 -331 115 -849 873 697 795 1056 -880
5670h80R66P33j382n4J039L4m56N52j346J733p93L03N59k71j068q91J452j9j722
$$ -880 86 819 -563 -617 422 456 0 552 -794 939 146 449 1008 737 -331 -1222 230 211 -1511
5689a511J673m4M01j70o88Q2O63L7j7J661k503j058J279n27J459j814R69L0K75
$$ -1511 162 118 519 349 -339 -257 406 443 426 2087 -416 -1474 -195 -722 737 -1077 -108 -78 197
5708A97k1k36R46o74J261j212j294R36K638j125k011J248p6l26K55j663J283j351
$$ 197 176 -60 886 212 1473 261 -1033 -97 2541 1416 -595 653 577 251 506 -1157 126 -1225
5726a225J346j91p75J053j330J924j910K26Q63Q45j276l91N03L50k17J206j639
$$ -1225 121 -70 -845 208 -1122 802 -1108 -882 -19 826 -450 -841 -338 12 -205 1001 -638
5743f38J194j768J285k29j184J711r97J427j364m83j243K306n5J23Q73j32m61
$$ -638 556 -1212 73 -156 -1340 371 -626 801 -563 -1046 -2289 17 -38 85 958 826 365
5760C65j208J546n12m99K45J477o41j160J034J03L07j326P96R22j585O76j823
$$ 365 -843 703 191 -308 -63 1414 773 -387 647 750 1057 -269 527 1449 -136 540 -1283
5777a283J431M32o98J166o26K18k06M80q64o3p51n82K041l60r26J061r64J6m95
$$ -1283 148 580 -118 1048 422 640 434 914 50 -13 -764 -1346 695 335 -591 470 -494 -478 -973
5796i73P92M11o04N37P83j540L5j5N8L62J189k03P2j395L48J48m35K02M45K69
$$ -973 -181 230 -374 163 946 -594 -559 -574 -516 -154 1035 832 904 -491 -143 5 -430 -228 217 486
5816D86p82J35r63J271J88r60J005o1M33q22p32R74j205O71q3Q86r12n16K146
$$ 486 -296 -161 -1124 147 335 -625 380 319 752 -70 -802 172 -1033 -362 -445 441 -471 -987 1159
5835A159k011K91lJ180o90p50K078j118o93J074q09K59L68o03L50N58J31o08k441
$$ 1159 -852 -561 -564 616 -74 -824 1254 136 -557 517 -292 -33 335 -268 82 640 771 163 -2278
5854b278K703j782O70J570j856j87K286l83r58N1j98Q83L45j918K848j917J145
$$ -2278 425 -1357 -687 883 -973 -1160 1126 743 -215 -164 -362 521 866 -1052 1796 -121 1024
5871A024j54p43O29L45l50q74K44J413k64k007Q21P42j375P6Q90m49j230J633
$$ 1024 870 127 756 1101 751 -123 121 1534 1270 -737 84 826 -549 -473 417 -32 -1262 371
5889C71j056J083j499J353j127O9P34k88J351r05J31r29J388n69N97m84l81N12
$$ 371 -685 398 -1101 252 -875 -806 -72 -360 991 86 217 -712 676 107 704 220 -161 351
5907C51Q27j149J88j123J587j664R34L61P51j883J287k6N22j914O27N77m4k05
$$ 351 1178 29 217 -906 681 -983 -49 312 1063 -820 467 441 963 -951 -324 253 209 4
5925Dl53j05J870k199P12O12Lm00P5l89K35J67j471L046j458K93j016M48n56p49
$$ 4 -349 -454 1416 -783 -71 541 544 144 219 -170 65 232 -1239 1807 349 642 -374 74 -482 -1231
5945a231J346M34k62P93j034R39q71j052J331j065J571j630N01P24j94M6Lj428
$$ -1231 115 549 287 1080 46 985 114 -938 393 -672 899 -731 -230 494 300 346 349 -1079
5963a079o2K10R66l26m95J396r07R58k105K281L06j486N07L66j696J240m31Q53
$$ -1079 -1141 -931 35 -291 -786 610 -297 661 -1444 837 1143 -343 164 530 -1166 74 -357 496
5981D96Ql78j447P91k86J020n57l71P05k96K736k805J525j019j1P24k224J709
$$ 496 504 126 -1321 -530 -816 204 -353 -724 -19 -315 2421 -384 1141 122 111 835 -1389 320
5999C20K60K33m76N86j426J409j694J618o36n28K467j808p46L56J14K45r44N05
$$ 320 580 813 337 923 -503 906 -788 830 194 -334 2133 325 -421 -65 49 294 -650 -145
6017a45M15j221J146o22M19l43R21j203Q83j376J704j237K332k44j372m02p38
$$ -145 270 -951 195 -427 -8 -351 570 -633 250 -1126 578 -659 1673 1429 57 -345 -1083
6034a083O26L27m78l02J175P0n28K90Po13K95k92J040j324L16j80N21p25J355
$$ -1083 -457 -130 -608 -910 265 335 -193 97 104 -509 -214 -506 534 -790 -474 -654 -133 -858 497
6053D97j584K426j616p00O6J176Q2j088K140l22j584M74N18p63O97r35J755j746
$$ 497 -1087 1339 -277 -977 -911 265 347 -741 1399 1077 -507 -33 485 -278 419 -516 1239 -507
6071e07J31K297k264J006p76j699J041K41P58l22m3K94n5M47p23J99m98J81q91
$$ -507 -376 1921 -343 663 -113 -1812 -771 -530 228 -94 -137 157 102 549 -174 25 -473 -292 -1183
6090a183O78K188l200J775M27j681M09J669r23k43o50J007Q69j388J07k06j535
$$ -1183 -505 1683 -1517 258 685 -996 -587 1082 159 -84 -734 273 1142 -246 -139 -345 -1880
6107a880J152N33n13J086j160K082j673N68j146R30q24O83k4K53J559j241n46
$$ -1880 -728 -195 -708 378 -782 1300 -373 195 -951 -21 -845 -162 -186 67 1626 385 -161
6124a61p52Q24J137p67q02J461l82r34M33o89L83l2m78K014o72j166j128L102
$$ -161 -913 -89 1048 281 -521 940 558 -376 57 -632 -249 -281 -759 1255 583 -583 -1711 1391
6142A391j276j429N7J092N22j185J633l06K7j021M70l86n06O80n32p1O52mN61
$$ 1391 115 -1314 -1257 -165 357 -828 805 499 526 -495 -25 -411 -917 -237 -769 -840 -188 -192 369
6161C69L83r49J35J165j880P80P82J75j006k2LO42K21r44J391j253o53M33Q75
$$ 369 752 -197 -62 1103 -777 3 785 960 -46 -68 -65 577 798 -146 1245 -8 -661 -228 647
6180F47K5j635J439r27j45J424k604Q18J108K84j07k025J624J446j188J89m4o18
$$ 647 672 -963 476 -451 -596 828 -1776 -958 150 434 327 -1698 -74 1372 184 373 329 -289
6198b89J83J55R25j511J264j539K97M57j475J942Q04j599P84j488K478j135q62
$$ -289 -106 49 974 -537 727 -812 -515 -58 -1533 409 1213 -386 398 -1090 1388 253 -609
6215f09P92o47M80N0j622K773q33q94N72l82J35P07k96o09J043o36j33J184l36
$$ -609 183 -464 16 66 -1556 1217 384 -510 62 -320 -185 522 226 -383 660 24 -109 1075 739
6234G39o96L72K47k07r30J287q54K8m41J209l92q28K049j129q17Q09j527J292
$$ 739 43 415 662 455 -475 812 -42 -14 -455 754 362 -466 1583 454 -363 446 -1081 211
6252B11O69q50M19j552J183l9l18j22J295k358N65J818K9j247J215L9q16Lk67
$$ 211 880 30 449 -1103 80 41 -277 -399 896 -1462 -897 921 950 -297 918 957 141 144 -123
6271a23j900J739j550J699p2K4Q00r42M39M2L49J19j335J569n92J67k18o82k60
$$ -123 -2023 -284 -1834 -135 -207 -183 617 -325 114 156 505 624 -711 858 266 433 215 -467 -727
6290g27p79K671k646K252j289J68k64K60J612m31k17j02q34j080J443l66P28q97
$$ -727 -1506 1165 -1481 771 -518 -350 -614 -354 1258 827 610 508 -326 -1406 37 -329 399 -498
6308d98J404j571R20J5P21p57J293j732L90p03l50J40J493j941J551j74Q89j372
$$ -498 906 -665 255 270 991 234 1527 -205 185 -518 -868 -728 765 -1176 375 201 1090 -282
6326b82P13n70J127j263Q30n53Q94j59k55O99r94r1K27k40k24J19q82N88J36P97
$$ -282 431 -139 988 -275 555 2 896 737 482 1181 187 96 323 83 -141 -22 -904 -316 -180 617
6346F17k60j74m58P43n92k55J2p1N59j02M99j224J356o15J191j419n49r62J719
$$ 617 357 183 -275 468 -124 -379 -367 -438 121 19 518 -706 650 35 1226 -193 -742 -1704 15
6365A5m03M95o71R47j900J301k91J043m85J28m94J313j614N70N25K09p14O29q24
$$ 15 -388 107 -564 383 -1517 -216 -507 536 51 179 -315 998 -616 -46 479 688 -26 603 -221
6384b21J086j903N22J027j450N90O7J225j809P02m88J11o74J150j29N87K02q15
$$ -221 865 -1038 -516 511 -939 -349 -282 943 -866 -164 -652 -541 -1215 -65 -194 393 595 -220
6402b20Q20j287N71P10R35r81j60R01r66j429J852j544J398J36q74P54j830J412
$$ -220 600 -687 -116 594 1529 548 388 1289 323 -1106 746 -798 600 736 -138 616 -1214 198
6420A98o71L41n34J300j107L78N54k04j248N74J91O52l69j447K099K23k332J255
$$ 198 -473 -132 -666 634 -473 -95 459 255 -993 -419 -228 424 55 -1392 707 930 -1402 -147
6438a47N7j29N91o53l98R58j55J140j196j84l85P71k89J164p32p11J024k37j004
$$ -147 -90 -219 372 -281 -679 279 124 1264 68 -116 -501 270 -19 1145 413 -298 726 489 -515
6457e15N06J074k695J774J22j006Q69J272j502l81j3j44p30J824k2o03n73o28
$$ -515 -9 1065 -1630 144 266 -740 129 1401 -101 -482 -495 -639 -1369 455 433 -170 -743 -1371
6475a371J263m10J565r80o52J426j385n34M98o03J849p64q17J330m48r68m66K068
$$ -1371 -108 -518 1047 67 -585 841 -544 -1078 -580 -1183 666 -98 -915 415 -33 -1001 -1467 601
6493F01J51P32k470J08J426M66j868P49k51O75m09K57J179k077K21J104q67k0
$$ 601 752 1484 -986 -878 548 1014 -854 -105 -356 319 -90 167 1346 -731 -510 594 -273 -293
6511b93J065j06l85N68j836J613q65p41J202o09J85j868K106K342k036l22P6m80
$$ -293 772 666 281 849 -987 626 -239 -980 222 -387 -202 -2070 36 2378 342 20 96 -384
6529c84j414Q06J098J90j368O51k97p84N23J274qj519j18J388j073J469j918J942
$$ -384 -1798 -992 106 296 -1072 -421 -718 -1502 -979 295 287 -1232 -1350 38 -1035 434 -1484 458
6547D58j393J478p63j502K700j165L79j108K64R22R47K7j577P3Q84J60r92R06
$$ 458 -935 543 -220 -1722 978 -187 192 -916 -652 270 1217 1244 -333 -260 624 784 -208 698
6565F98o93j015J320K28j381N16J397K03r49q86m60J755j406Q30K46j027J641
$$ 698 5 -1010 310 538 -843 -327 1070 1273 324 -562 -1022 733 -673 157 403 -624 1017
6582A017j699M46P60m16m20l50L57o53m73J134L90J16n33k09k84K25J033j213
$$ 1017 -682 -236 524 108 -312 -662 -305 -958 -1431 -297 93 209 -324 -533 -817 -592 441 -772
6600g72K69Q56K66k51o89L70J83r4q23P56K32n77o40J918o91o64O12l98Q06j399
$$ -772 -503 353 619 368 -321 49 232 138 -685 71 303 -274 -914 1004 313 -351 261 -137 669 -730
6620g30r97J698j15J07O17l515L169j340N2Q95j316J954Q48k602J542q21P63o40
$$ -730 -1727 -29 -144 -37 580 -2935 234 -1106 -1054 -159 -1475 479 1327 -1275 267 -554 209 -431
6638d31m61J614j247Q55Q58j075j627K87Q31J581j260m77J569Q0j960N52J145
$$ -431 -892 722 -525 330 1188 113 -1514 -1227 -396 1185 -75 -552 1017 1097 -863 -311 834
6655H34k160J124J409Mj484J59q36J024j319K189L5j886n51J289J15j88L74j045
$$ 834 -1326 -202 1207 1211 -273 -114 -950 74 -1245 944 979 -907 -1458 -169 -54 -242 132 -913
6673i13O6J236P97j409N98n70L39j139J065O75n05L03M1j782K127q99p9o36J317
$$ -913 -847 389 1186 -223 375 -195 144 -995 70 745 240 543 584 -1198 929 30 -49 -685 632
6692F32r45n27J094n19J374j812N30P31m03q36J307k99n18Q40p08l04o41R39K60
$$ 632 -313 -840 254 -265 1109 -703 -173 558 155 -681 626 327 -191 649 -59 -363 -1004 -65 195
6711A95j217J641l8P75j214j55o20n3J843j142N36p98L73l52J490j556Q36Q16
$$ 195 -1022 619 581 1356 142 -13 -633 -686 1157 15 551 -247 126 -226 1264 -292 544 1360
6729A360j791K458j783l01K12O44n67o72J194q73j589K496Q1n00K36j327J606
$$ 1360 -431 2027 244 -57 155 799 232 -440 754 -119 -1708 788 869 369 605 -722 884
6746H84J74j419l63J288l16j10Q44o64n73j15M91p45J32k86R20N92j847J593j25
$$ 884 1058 -361 -724 564 248 138 982 318 -255 -370 121 -624 -492 -778 142 734 -1113 480 355
6765C55L27n28p17Q23Q49j636O07l8R98r02j418L74j51P81J730L85p97o88n32
$$ 355 682 154 -563 260 1109 -527 80 42 1040 138 -1280 -906 -1057 -276 1454 1839 1042 354 -178
6784a78N52j550J107o42J896l46j276R78j586P82j016J221J519j055j194k34J087
$$ -178 374 -1176 -69 -711 1185 839 -437 541 -1045 -263 -1279 -58 1461 406 -788 -1022 65
6801F5L85q84J142l80L7M4p83J025n40k83R16j672Q52l69J71N28n39N15J57l59
$$ 65 450 -434 708 328 365 409 -374 651 111 -172 744 -928 -76 -445 -274 254 -285 230 387 28
6821B8k1O2N05N20j627K018j444k01m69J288M35j898Q15L62j28O62N83j097r76
$$ 28 7 69 574 1094 -533 1485 41 -160 -629 659 1094 -804 11 373 245 907 1490 393 -583
6840e83J32j71Q44P71M63j434L27j101m86J209N99j409J133J256l088J225J109
$$ -583 -451 -622 222 993 1456 22 349 -752 -1238 -29 570 -839 294 1550 -1538 -313 796
6857G96o80Q4j07m3m89l83J851l24o40L27P81J83k141J939q0j086J203n85r7j186
$$ 796 116 200 93 50 -439 -822 1029 705 65 392 1173 1356 -785 1154 1074 -12 1191 606 509 -677
6877f77Q20M23n46R81m70O17o01j016M34O40m06j167J884j873J208K35m40o13
$$ -677 143 566 20 1001 531 1148 547 -469 -35 605 199 -968 916 -957 251 486 46 -567
6895e67R15k026K068j172Q27M44o92r57J747n23r28K636j497L76L0M96p86R4r95
$$ -567 348 -1678 390 -782 45 489 -203 -1160 587 64 -864 1772 275 651 681 1177 391 485 -510
6914e10M15l84J695l46r80O3q7Q7O64l09R36j932L15m90J563l83k59k28N09o95
$$ -510 -95 -479 1216 870 -110 -47 -134 -47 617 308 1244 -688 -373 -863 700 317 58 -170 339 -356
6934c56K47k83J673j505o34R48j352R89m70M60m50J233r51N62j96n7J696j985
$$ -356 -109 -392 1281 -224 -858 90 -1262 -273 -743 -283 -733 500 -451 111 -85 -142 1554 -431
6952d31M05J111j347J464j972Q37r1j951K982k96M72j637R12r68j26j74J717j744
$$ -431 -26 1085 -262 1202 -770 67 -24 -1975 1007 711 1183 -454 458 -510 -636 -810 907 -837
6970h37J055R9P22j142p00O18R42j874J788r56l24P88p78O30P48k153R1J823r80
$$ -837 218 317 1039 -103 -803 -185 757 -1117 671 -285 -609 179 -599 31 779 -1374 -1283 540 -440
6989d40N46J156j858P80P48j447J617k064J386n61J065n54r24J269l20q25J093
$$ -440 106 1262 -596 184 932 -515 1102 -962 424 -137 928 374 -550 719 399 -426 667
7006F67k13k62o99J038k95r63K06J816q35j561J386L41j152n70K551k169o21J148
$$ 667 454 192 -507 531 236 -727 -521 1295 460 -1101 285 626 -526 -1096 1455 -714 -1335 -187
7024a87K13M97j027R8J354m86n3k92j73K19P8j550K118j104R92r28O28R56k266
$$ -187 26 523 -504 -406 948 462 409 117 -56 163 241 -1309 809 -295 697 -231 397 1353 -913
7043i13J752j156r3R18n13K70K5j570n84L249j378K11j047J710n1p62K46J35N29
$$ -913 839 -317 -410 508 -5 265 290 -1280 -1864 1385 7 218 -829 881 830 68 314 449 978
7062I78n66k026K008j058J44j72M80Q21j023R26n4M49n71M21q85J14Q00j742P18
$$ 978 412 -1614 394 -664 -520 -692 -212 609 -414 512 458 907 336 757 -128 -14 786 -956 -238
7081b38n36R89j090R41n48m31k70L24J998j416k14j093Q70J218j069l2L13L66
$$ -238 -774 215 -875 66 -482 -913 -1183 -859 1139 -277 -491 -1584 -714 504 -565 -597 -284 82
7099H2N98p53r43j1J220k87J187j196M62r65Q44Q66j774J511q65n56P11n75J449
$$ 82 680 -73 -1016 -1027 193 -94 1093 -103 359 -606 238 1104 -670 841 -24 -580 131 -444 1005
7118A005j216M19p71j4K340j545m68o58L80J214j89j725J368m71J709l99L46r86
$$ 1005 -211 208 -563 -577 1763 218 -250 -908 -528 686 497 -1228 140 -331 1378 979 1325 339
7136C39q47J635l74o30J3J07j315Q26L90R23n13j051j714Q90J497j34n24O21k03
$$ 339 -508 1127 753 123 136 243 -1072 -246 144 1067 554 -497 -2211 -1321 176 42 -482 139 -64
7155f4j552P41J09J241N84j163P60j198J203n11R61j672R40n59J87K68K42L25
$$ -64 -1616 -875 -766 475 1059 -104 656 -542 661 150 1111 -561 379 -180 7 275 517 842
7173H42o21J302k014J695j946L44L97M56L02Lq44J66M15j241m91L70J551k058
$$ 842 221 1523 -491 1204 -742 -398 -1 455 757 760 -84 82 497 -744 -1235 -865 686 -1372
7191a372J539O59l19j68m25m26m7n22J069J455n17o50J694j707j84k72l48J190
$$ -1372 167 826 507 339 -86 -512 -559 -1081 -12 1443 926 276 1970 263 79 -193 -541 649
7209F49j625Q50n31J257P10k251R76k063J014J604k37j94J11L24j017j172K657
$$ 649 -976 -126 -657 600 1310 -941 35 -2028 -1014 590 353 159 270 594 -423 -1595 1062
7226A062k392K032q58P16j500L60J206j782J518j768K209j961R55k86j10m5L26
$$ 1062 -1330 702 -156 560 -940 -580 626 -1156 362 -1406 803 -1158 -203 -489 -599 -644 -318
7243c18J131j202J017o1N84j315L44O27k006l73J207O41p34J682j859M62jk417
$$ -318 813 -389 628 567 1151 -164 180 807 -1199 -1572 -365 276 -458 1224 -635 -173 -174 -2591
7261b591J339Q19J309P37j743j267O02O55M94r70R90m21N98K58j048Q94M4r87
$$ -2591 -1252 -433 876 1613 -130 -1397 -795 -140 354 -616 374 -47 551 809 -239 655 699 -288
7279b88Q30j060K64j41K00O7M1j38K78m89j46P92K79R4j420N3M66J99j8n88J528
$$ -288 542 -518 -254 -395 -195 -128 -87 -225 53 -436 -582 210 489 583 -837 -784 -318 -119 -137 -725 803
7300H03l18j020J27P85J534j792j646K828j505m26N45Q72R87j832n1L80O28j427
$$ 803 485 -535 -408 377 1911 119 -1527 1301 -204 -630 -85 787 1774 -58 -109 271 899 -528
7318e28K20K48k05J274q44N78k374K014J8J92r80J418M60o53j136j070J274N8
$$ -528 -308 -60 -265 1009 165 743 -1631 383 401 593 -387 1031 1491 838 -298 -1368 -94 -36
7336c6J224N67k279K22Q28l50O58q92M20o33O46P3j322m41M99J008P25j35p39
$$ -36 1188 1755 -524 -302 526 176 834 -58 362 -271 375 448 -874 -1315 -816 192 917 782 43
7355D3l69k043K264m09R70j700K560j383O88j426O40J608k415J08J783j745R3
$$ 43 -326 -2369 -105 -514 456 -1244 1316 -67 621 -805 -165 1443 -972 -864 919 -826 -733
7372g33M17J89n32M88N43N3J12J051k428j60J781j045l36M86P87r43j29N43P16
$$ -733 -316 -127 -659 -171 372 425 537 1588 -840 -1000 781 -264 -600 -114 673 -270 -399 144 860
7391H60q22q59J100O9r1l08j57J05M81j441O98m4k000J559J698k56r88P15l75
$$ 860 38 -821 279 348 257 -51 -208 -103 378 -1063 -365 -409 -2409 -850 848 592 -396 319 -56
7410e6r2J93l21M28J429k489J499k130K264k149K534l76j946K299m27j866J646
$$ -56 -148 45 -276 152 1581 -908 591 -1539 725 -1424 1110 734 -1212 1087 660 -1206 440
7427D40q44J245j621Q06L69J133j713m77L14n08j21Q14l68r2P60q78J283K15P95
$$ 440 -404 841 -780 26 395 1528 -185 -662 -348 -856 -977 -163 -531 -623 137 -741 542 757 1552
7446A552l777L516n98J61j336J193o27j484K169Q75j206j707N50J122o18p53o4
$$ 1552 -2225 1291 693 854 -482 711 84 -1400 769 1644 438 -1269 -719 403 -215 -968 -1032
7463a032J126r37L17J007p76P67j040n50N50O04N44J156k461L54J088J373l381
$$ -1032 94 -843 -526 481 -295 472 -568 -1118 -568 36 580 1736 -725 -371 717 2090 -1291
7480a291L45J167P11m98M95j401O44p1J41P07k163N60m20r07J667Q07l45k039
$$ -1291 -946 221 932 434 929 -472 172 101 242 949 -1214 -654 -1074 -1981 -314 493 148 -1891
7498a891K107k73O55q42l31N93N45o07q28j91K444j199m96P22O82j192O17p94
$$ -1891 216 -57 598 -244 -575 18 563 -44 -872 -1063 1381 182 -314 408 1090 -102 515 -279
7516b79K92k2J18j729K128j119j57R13K6n28R5j46L05j49r15K28J596j015L09
$$ -279 13 -9 109 -1620 508 -611 -768 145 171 -357 -262 -408 -103 -252 -1167 -939 657 -358 -49
7535d9J3o05J009k24J442j968J438p88J261k089M65K50K79o12J175j270N59J88
$$ -49 -36 -641 368 144 1586 -382 1056 268 1529 -560 -95 155 434 -178 997 -273 286 474
7553D74p4j241l43J139l92j262J260L19R57j232o20K43P78R03j303N29r74M71
$$ 474 400 -841 -1184 -45 -437 -1699 -439 -120 837 -395 -1015 -772 6 909 -394 135 -839 -368
7571c68L17Q64j080L44M52J99j368L07O13J242k48k030l81J737L38o95o57n95
$$ -368 -51 813 -267 77 529 728 -640 -333 280 1522 1274 -756 -1137 600 938 243 -414 -1009
7589a009N45j09J156j310J227m58J12l73J411j368K76r79K18Q6m83O96K81n52
$$ -1009 -464 -573 583 -727 500 42 154 -219 1192 -176 100 -879 -661 -575 -1058 -362 -81 -633
7607f33K41J057J9n15K50O46m47j685R74K61q72J50j594Q63k26J342L03L05n86
$$ -633 -392 665 684 169 419 1065 618 -1067 -93 168 -704 -554 -2148 -1285 -1511 -169 134 439 -147
7626a47K75q52j17P93j16l03P56L64m3q29J062J54o69n09J299j147R00N2J96l46
$$ -147 128 -724 -841 -48 -164 -467 289 653 610 -219 843 997 328 -181 1118 -29 871 923 1119 773
7646G73j129O85N7P96k158R98p91N35J334k253J307j286J183J94j861K875j476
$$ 773 -356 329 386 1182 -976 22 -769 -234 1100 -1153 154 -1132 51 245 -1616 1259 -217
7663b17M92N78j738J320j095O82K16j63j224P82k26J460l33r69o72K007p0J34
$$ -217 275 853 -885 435 -660 22 238 75 -1149 -367 -593 867 534 -435 -1107 900 830 964
7681I64r64L21j43n25J038j257O82n16Q25N48j452j19k68J028L55j706L65O13
$$ 964 0 321 178 -347 691 -566 116 -400 425 973 -479 -598 -866 162 517 -1189 -824 -211
7699b11K07n43O49N36j29n8j010k37M35n12P85k73J297j564K04J060l18j190J420
$$ -211 -4 -547 102 638 509 451 -559 -796 -361 -873 -88 -361 936 -628 -424 636 318 -872 548
7718E48M18p46J6Q18l39r80M83o81J054N00q01J058k467K009j791J419k56m34
$$ 548 966 220 236 1054 715 -265 218 -463 591 1091 290 1348 -1119 890 -901 518 262 -172
7736a72J123j64j290O28j69n01J127j784J951M70k900J538J139j407r9K77J288
$$ -172 951 787 -503 125 -44 -545 582 -1202 749 1219 -1681 -143 996 -411 -510 -233 1055
7753A055j051N70Q08p12n13m42O01j055K442k531k95K014j560N01J039P16j534
$$ 1055 4 574 1382 670 157 -285 316 -739 1703 -828 -1123 891 -669 -168 871 1587 53
7770E3j112R92o9L37L04o18K3n58j49L64K37m10R84k35L1l60k9J414K79r96n71
$$ 53 -1059 -67 -136 201 505 -113 -90 -648 -797 -433 -196 -606 378 143 174 -186 -215 1199 1478 482 -89
7791h9J608r55k08r42P73l08R37k428J735m73J519j337L24o17l18J25N59M5l87
$$ -89 1519 564 356 -586 187 -121 816 -1612 123 -350 1169 -168 156 -461 -779 -654 -95 -50 -437
7810d37q66J124J419k392J565j18j735K000j919J200J766k554J841r16j476J180
$$ -437 -1303 -179 1240 -1152 413 295 -1440 560 -1359 -159 1607 -947 894 -22 -1498 -318
7826c18p37N53k89J034Q19k317J252P0N81p74j2r87K837j827l76n32n24J759n28
$$ -318 -1055 -502 -791 243 1062 -1255 -3 67 648 -126 -138 -1125 1712 -115 -491 -1023 -1547 212 -316
7845c16L70N17p56o00L69J119K66k187R08J161J07j255J071r4r15J43L90o88P68
$$ -316 54 571 -185 -785 -416 703 969 -1218 -310 851 958 -297 774 680 -235 -92 298 -390 378
7864C78n67N0K30o18J274J8j267q89J172M54M93N94k120J461j031n77J428j830
$$ 378 -189 -139 91 -527 747 765 -502 -1391 -219 235 728 1322 -798 663 -368 -945 483 -1347
7882a347J574j086J965j650Q62n76K252o68j038k03p52O23K54M40K93n43N88j30
$$ -1347 227 -859 1106 -544 318 -258 1994 1326 288 85 -667 -44 210 650 943 400 988 858
7900H58j633O88m13j01O31J167j900q20K253k458J834j14j221J964r59J184q57
$$ 858 -775 -87 -500 -601 30 1197 -703 -1523 730 -1728 106 -8 -1229 735 -224 960 103
7917A03M59o99j096R6M29R79j318K202k62j443m9J70N00m44j2M79j759J740K18
$$ 103 562 -137 -1233 -1137 -708 271 -1047 1155 893 -550 -599 -429 71 -373 -385 94 -1665 75 293
7936B93q99j442Q96j19J335j459Q31O52p52J573m75J8J40J657k437N47o80j027
$$ 293 -606 -2048 -1152 -1271 64 -1395 -564 88 -664 909 434 452 592 2249 -188 359 -321 -1348
7954a348J124N8P39j363O9N51K39m82n21R6N18J181n51n4q73p48J763j496K384
$$ -1348 -224 -166 573 -790 -721 -170 69 -413 -934 -838 -320 861 310 256 -617 -1365 398 -1098 1286
7973A286j510j033P69J82K92j948J613R9N14j203J486o97J352k86j490R19j424
$$ 1286 -224 -1257 -488 -306 -14 -1962 -349 -250 264 -939 547 -150 1202 916 -574 345 -1079
7990a079J149L64q48j78N0O62j453K029r66J962p32j888P17J217j444M05N77r59
$$ -1079 70 434 -414 -592 -542 120 -1333 696 -270 1692 960 -928 -211 1006 -438 -33 544 -415
8008d15J266l61k33j727J674k304L770k924J303j20l98N78J224j932J646j602
$$ -415 851 490 257 -1470 204 -2100 1670 -1254 49 -71 -469 109 1333 -599 1047 -555
8024e55o00M34PJ064n11o84J059J28j040n6J540j018N7R83j115N85n16l95J553
$$ -555 -1155 -721 -714 350 -161 -845 214 342 -698 -754 786 -232 -175 808 -307 278 -238 -633 920
8043I20j220K91l91J227m55j852K249j721J482k1J36j995J865J04m5L77j041j82
$$ 920 -300 -9 -400 827 372 -1480 769 -952 530 509 645 -1350 515 619 574 951 -90 -272
8061b72m2Q9L58Q50j47j548J916n85N19r17j186J297o87O67j479J340M56j172
$$ -272 -314 -225 133 983 836 -712 1204 619 1138 221 -965 332 -355 312 -1167 173 629 -543
8079e43K59J38P29l90O64j176J500m83q28P41r56k29o21K573J135j617p58o9Q01
$$ -543 -284 -146 583 193 857 -319 1181 698 -130 611 -345 -574 -1195 1378 2513 896 138 69 870
8098H70n43o15Q30n43K79m54N80n95k77J052r81M28r48J050n63J82J42Q03p54
$$ 870 327 -288 542 -1 278 -176 404 -191 -468 584 -397 31 -917 133 -430 -248 -106 697 -57
8117e7q26J501o62l49K45m0P74j472J43k0J416j774P77j498K099m05l82n6j224
$$ -57 -883 618 -44 -393 -148 -188 586 -886 -743 -763 653 -1121 -344 -1842 257 -148 -530 -586 -1810
8136a810J721l20J433q59k53L44K90j037L11n45J904j090J239j618k6n11K406
$$ -1810 -89 -409 1024 165 -88 256 546 -491 -180 -725 1179 89 1328 -290 -316 -827 1579
8153A579p60K07j936M1K25j12J867q90j322O48m80J055r32P42M83p85P70L89j473
$$ 1579 819 1026 -910 -869 -644 -756 1111 221 -1101 -453 -933 122 -810 -68 415 -370 400 789 -684
8172f84P4J098q99J64j197K040p59Q75J651j902Q3j455M35J08L85j75L82Q59o49
$$ -684 -610 488 -411 -247 -1444 596 -163 712 2363 461 544 -911 -476 -368 17 -158 224 1083 434
8191D34
$$ Imaginary data points
##PAGE= N=2
##DATA TABLE= (X++(I..I)), XYDATA
0@%%%%%%%%%%%%%%%%%%%%KoK0m6P6j05J26j40J56j79K06k33K64k97L31l67M11
$$ 0 0 0 0 0 0 0 0 0 0 0 0 0 0 0 0 0 0 0 0 0 2 -4 16 -30 46 -59 67 -73 83 -96 110 -123 141 -156 175 -192 219
37B19m61N17n77O38p10P87q74R64j058J170j287J414j563J719j890K093k313K562
$$ 219 -242 275 -302 336 -374 413 -461 503 -555 615 -672 742 -821 898 -992 1101 -1212 1350
55A350k855L178l545L984m512N153n950O971q305J0060j1845q8844j55289J07754
$$ 1350 -1505 1673 -1872 2112 -2400 2753 -3197 3774 -4531 5529 -6316 -95160 -250449 -142695
69a42695K60550j07197l5422L0753l4250L5859R0950j06669r4818R4930Q3929
$$ -142695 117855 10658 -24764 5989 -28261 7598 98548 -8121 -102939 -8009 75920
80G5920o5553n7248R958O3909K5836n8745k8102M3427j8827p864O0668k7350p2486
$$ 75920 10367 -46881 -36923 26986 52822 -5923 -34025 9402 -9425 -17289 43379 16029 -56457
93e6457O1566K8902o7383L2693M9575o8697p54N9343o3566l4052Q7882J0099n2204
$$ -56457 5109 34011 -33372 -679 48896 -19801 -20555 38788 -24778 -58830 29052 39151 -13053
106a3053J6578k858j5134L2496j8942l8229M6887K2842m5814J7952J3980l0895
$$ -13053 3525 667 -14467 18029 -913 -39142 7745 30587 -15227 2725 16705 -14190
118a4190K2397M244n8080L4017O4114n9555k6266O3245k1308l7574M2662p588
$$ -14190 8207 12451 -45629 -11612 52502 -7053 -33319 29926 8618 -28956 13706 6118
130F118k8546M0943q766m0910M3610J2963n1047J7537L2182k6204K467L72k8142
$$ 6118 -22428 18515 9749 -31161 12449 25412 -25635 -8098 24084 -2120 347 719 -27423
143b7423L5880K5076o6562P750P6359l1876m7417K1380j2029O132N8429m1142
$$ -27423 8457 33533 -33029 -25279 51080 19204 -28213 -6833 -18862 -12730 45699 4557
155D557n4009P1501K3524p3497L919L5257j7724J4949Q301m5307J8850M9514l9961
$$ 4557 -49452 22049 45573 -27924 -24005 11252 -6472 8477 16778 -28529 -9679 39835 -126
168a26k4296L1899j6542l357L6756k1248k0399L0541j8343j7903N2711j2341n5059
$$ -126 -24422 7477 -9065 -12422 24334 3086 -17313 13228 -5115 -23018 29693 17352 -37707
181c7707M2190K1062m9292J3013K5557k7246K6010J8991o6951j019P1459k5554
$$ -37707 4483 25545 -23747 -10734 14823 -12423 13587 32578 -34373 -35392 36067 10513
193A0513l6255L0354n149n078L4886k8230l2827M6198j965m5239L0603K6369l2705
$$ 10513 -25742 4612 -537 -5615 29271 1041 -31786 14412 12447 -32792 -2189 24180 -8525
206h525J6531Q190m3054J8995L0541l9685J0034M0147m2052k0487M9240r029k4809
$$ -8525 8006 16196 -26858 -7863 22678 -17007 -6973 33174 -8878 -29365 19875 10846 -13963
219a3963K3239j2216j4537L7741j5231l5970M5064J3927m7859R357K5653k1768
$$ -13963 9276 -2940 -17477 20264 5033 -30937 14127 28054 -19805 -10448 15205 -6563
231f563J2952L589m5978K7884N2823m9988j9870M8639j4846k6879K2682j5993
$$ -6563 6389 9978 -36000 -8116 44707 -5281 -25151 23488 8642 -18237 4445 -11548
243a1548n288M9366j7225n0596L8498K2031l9137Q380J3446k4647J9602J7866
$$ -11548 -16836 32530 15305 -35291 3207 25238 -13899 -5519 7927 -16720 2882 20748
255B0748l6558J2732K7266l8774n432M3188k2791j9425L2883j1563j5235K8749
$$ 20748 -15810 -3078 24188 -14586 -20018 23170 379 -19046 13837 2274 -12961 15788
267A5788k0794k0928N2681k941n7496J7483L3654k0135P566j56l0775L1168L2701
$$ 15788 -5006 -25934 26747 23806 -33690 -16207 17447 -2688 4878 4722 -26053 5115 37816
280C7816n5578j5045N1331j3660j7088K2439j4628m936L8197k5123l9456L7999
$$ 37816 -17762 -32807 18524 4864 -12224 10215 -4413 -9349 28848 3725 -35731 2268
292B268J3456l2116K1917J2470l6215J5661J7993k8722J0448K0969l6692P223
$$ 2268 15724 -16392 5525 17995 -18220 -2559 15434 -13288 -2840 18129 -18563 -11340
304a1340L7972l1908j5783L7349j1559j6056K2774j7351j2893M3904j4050m5396
$$ -11340 26632 -5276 -21059 16290 4731 -11325 11449 -5902 -18795 25109 11059 -34337
316c4337L4695K4808l1397N238J0771k4433J6024J4999l9841J2988M6738l3543
$$ -34337 358 25166 -6231 -993 9778 -14655 1369 16368 -23473 -10485 36253 2710
328B710k4704L0392p881j0146K3353j9316j5788M3868p729l9945K9913J5851l5400
$$ 2710 -21994 8398 517 -9629 13724 -5592 -21380 22488 14759 -25186 4727 20578 -14822
341a4822R951J3610k3805J9277J7163l6886N963L1951l2263p079L7523j6103k0112
$$ -14822 -4871 8739 -15066 4211 21374 -15512 -9549 22402 -9861 -16940 20583 4480 -15632
354a5632K2121j0352p824L3569j7259l0251L8015P595m2024J2855K1691j7443
$$ -15632 6489 -3863 -11687 21882 4623 -25628 12387 19982 -22042 -9187 12504 -4939
366d939J0307O309l2464J9975L2978m5192j2099L7398r477j2316K3488j5109j0409
$$ -4939 5368 11677 -20787 -812 32166 -13026 -25125 12273 2796 -9520 13968 -1141 -11550
379a1550L1250j9161k9609L9680J1316l9526J3357J8468k2939J0623P989k8918
$$ -11550 19700 539 -29070 10610 21926 -17600 -4243 14225 -8714 1909 9898 -19020
391a9020J8460K5322l8863n844L8401j2857j4276J5769j4597l298L4804k0206
$$ -19020 -560 24762 -14101 -19945 18456 5599 -8677 7092 -7505 -10803 24001 3795
403C795l1243L3783N182k7366J9666Q594k7772J9464J2146l5231J0000K7730k6836
$$ 3795 -27448 6335 11517 -15849 3817 12411 -15361 4103 16249 -18982 -8982 18748 -8088
416h088K623K9395l0843j0262L3259j0206k1943K2548q672r545L1518j0400l5160
$$ -8088 -5465 23930 -6913 -17175 16084 5878 -16065 6483 -2189 -11734 19784 9384 -25776
429b5776L1257J3913l4932Q401J5549j4649J3415N950l5937J4248L7073k9142
$$ -25776 5481 19394 -15538 -7137 8412 -6237 7178 13128 -22809 -8561 28512 -630
441f30j7716K6529n555q799J5402j8086n576L9410j4851l9059K9410J8803l0799
$$ -630 -18346 8183 2628 -6171 9231 -8855 -14431 24979 10128 -28931 479 19282 -11517
454a1517P990O908j9765K4169J4686l7897L449L2641k4597j3487K7419o625r254
$$ -11517 -3527 3381 -16384 7785 22471 -15426 -11977 20664 -3933 -17420 9999 3374 -5880
467e880J9561j5753j3720K9371p591k4114K6645L169k7026J5884J0400k0758J3692
$$ -5880 13681 -2072 -15792 13579 5988 -18126 8519 11688 -15338 546 10946 -9812 3880
480C880P207l0747J5784K7060l1033p755L0116j2869j1332J9955j1729j0613K7883
$$ 3880 11087 -19660 -3876 23184 -7849 -15604 14512 1643 -9689 10266 -1463 -12076 15807
493A5807j0644k7010K6508N918k1905J5274P314k5642J3071J2038k4060J2244
$$ 15807 5163 -21847 4661 10579 -11326 3948 11262 -14380 -1309 10729 -13331 -1087
505a087J7403k9725L765K9814j9801j7492K5135n301j1871K0464j3598j3466L1044
$$ -1087 16316 -13409 -9644 20170 369 -17123 8012 2711 -9160 11304 -2294 -15760 15284
518A5284k770l4140J7888J7901j7524N119M280k1981J9477J5745l1554Q93L0059
$$ 15284 12514 -21626 -3738 14163 -3361 1758 6038 -15943 3534 19279 -12275 -11382 18677
531A8677j6788j3408J9605j1213m933K2971j7075j5133L0671j319k9038J8658
$$ 18677 1889 -11519 8086 -3127 -8060 14911 -2164 -17297 13374 12055 -16983 1675
543A675R640k2578R822Q842j7973J4961J3065l2372N698K6278k0678p838K1125
$$ 1675 11315 -11263 -1441 7401 -10572 4389 17454 -14918 -9220 17058 -3620 -11458 9667
556I667r564o531J6223j4333p909K7091q846k4603K1356R963k1618R813P110j9458
$$ 9667 103 -6428 9795 -4538 -12447 14644 5798 -18805 2551 12514 -9104 709 7819 -11639
570a1639J5035J0738k8333P213K4302k3226o637K0900q878n149J8609j3949j2566
$$ -11639 3396 14134 -14199 -6986 17316 -5910 -12547 8353 -525 -5674 12935 -1014 -13580
583a3580K3928q055j8495K4974K179k3272J4626P821j8679R169Q400k1073R463
$$ -13580 10348 2293 -16202 8772 10951 -12321 2305 10126 -8553 616 9016 -12057 -2594
596b594J9014k7860j098K9247j4034j4598J5608n934m367K1182j3003k1856K5984
$$ -2594 16420 -11440 -12538 16709 2675 -11923 3685 -2249 -6616 14566 1563 -20293 5691
609E691R120k5127Q954P890j2967J0594M383k3742J2708K0554k4537k944K2229
$$ 5691 14811 -10316 -1362 6528 -6439 4155 8538 -15204 -2496 18058 -6479 -9423 12806
622A2806j6523l017J8866j3714r031K1573r861j4811K7145k720k6192J5943J1145
$$ 12806 -3717 -6734 12132 -1582 -10613 10960 1099 -13712 13433 10713 -15479 464 11609
635A1609k0213O961P963j4499J0924J1058k7545K813K6369j5438q685J2374n585
$$ 11609 -8604 -1643 6320 -8179 2745 13803 -13742 -10929 15440 2 -8683 3691 -1894
648a894j983J9076j9970j1706K9178l534k4509J5145Q893j7042J0151N051k0079
$$ -1894 -3877 15199 -4771 -16477 12701 9167 -15342 -197 8696 -8346 1805 6856 -13223
661a3223J3973J5202k5282N66K0469j5006m345J7933j2743l808J7076j2380j2271
$$ -13223 750 15952 -9330 -8764 11705 -3301 -7646 10287 -2456 -6264 10812 -1568 -13839
674a3839K3244p318j5662K0022K834j9983J2356Q019j5766O562Q552k2061J0809
$$ -13839 9405 2087 -13575 6447 9281 -10702 1654 9673 -6093 469 9021 -13040 -2231
687b231K0364k1520q864K1738q165p776J2742j2378k287K2029j0653k1673K3787
$$ -2231 18133 -3387 -12251 9487 1322 -6454 6288 -6090 -8377 13652 2999 -18674 5113
700E113O967k0786Q712N631j7131J4809P111k1485O246J8225j8443p93J5980j2353
$$ 5113 12080 -8706 6 5637 -11494 3315 10426 -11059 -4813 13412 -5031 -5824 10156 -2197
714b197o309J7155r386p254J8312q525j3541K1389j141k0932J1860R271j4534
$$ -2197 -8506 8649 -737 -7991 10321 1796 -11745 9644 8503 -12429 -569 8702 -5832
727e832Q059K309j5869J2770J3097k2726k037K0337r855p684J4717r951m286J8946
$$ -5832 2227 4536 -11333 1437 14534 -8192 -10229 10108 253 -7431 7286 -2665 -6951 11995
741A1995j1017j3907K1508j16j7889J2797K794j4025J0148N818j7637J1292J0697
$$ 11995 978 -12929 8579 8463 -9426 3371 6165 -7860 2288 8106 -9531 1761 12458
754A2458k2175J357J9008j3685m838J5428q944k894J2133j0555p257K1422n674
$$ 12458 -9717 -8360 10648 -3037 -7875 7553 -1391 -4285 7848 -2707 -9964 11458 5784
767E784k0277J5424P393j5702R757K996j6138J1515J1391k2912M338J9069j4655
$$ 5784 -14493 931 8324 -7378 2379 5375 -10763 752 12143 -10769 -6431 12638 -2017
780b017n442J3396o170l963J4470j2673q329J7651j709j4363J3010J730j4037
$$ -2017 -7459 5937 -233 -4196 10274 -2399 -10728 6923 5214 -9149 3861 5591 -8446
793h446J3057J673j5428R591Q709j7325P225J3097j7324j858J9600j3563p762
$$ -8446 4611 6284 -9144 447 9156 -8169 -944 12153 -5171 -7029 12571 -992 -8754
806h754J4827n869m947J3750p683j3905J9874K213j9706Q208O418j1177J0322
$$ -8754 6073 204 -4743 9007 1324 -12581 7293 9506 -10200 -1992 4426 -6751 3571
819C571K545j7458J0802J4371j8479n215J7202q237k490J1331j1352m013J8718
$$ 3571 6116 -11342 -540 13831 -4648 -9863 7339 -898 -3388 7943 -3409 -7422 11296
832A1296q496j4850J8742j81j6029J2260L680j3246R198M728j6065Q525J0528
$$ 11296 2800 -12050 6692 6511 -9518 2742 6422 -6824 2374 7102 -8963 -438 10090
845A0090j7218K481J5772j2027o279J2791p385l670J4900j0713j0302J8966j456
$$ 10090 -7128 -4647 11125 -902 -7181 5610 -1775 -5445 9455 -1258 -11560 7406 5950
858E950j4274J0569M193j1525P339L219j5120J0909R004j7533K266J4144j1681
$$ 5950 -8324 2245 6438 -5087 2252 5471 -9649 1260 10264 -7269 -5003 9141 -2540
871b540k849J3047q650m841J3390p307j0949J6666k138j2807J1476J978j0845
$$ -2540 -5389 7658 -992 -5833 7557 250 -10699 5967 3829 -8978 2498 4476 -6369
884f369Q042N062j4292P956N485j2368N034J2998j4950l468J3690p215m004J1071
$$ -6369 1673 6735 -7557 399 5884 -6484 -1450 11548 -3402 -6870 6820 -395 -4399 6672
898F672q753m535J7378p608j4528J3386M967j3396P535J667r564R099N821j7076
$$ 6672 -2081 -6616 10762 3154 -11374 2012 6979 -6417 1118 2785 -6779 2320 8141 -8935
912h935N550J2386j1957l154J2568r323j93R110q075o145J5490m269j3344J3901
$$ -8935 -3385 9001 -2956 -6110 6458 -2865 -3058 6052 -2023 -8168 7322 3053 -10291 3610
926C610Q35j3464R893K233r862R024K749j2395O877R718j4133k086J3467p144
$$ 3610 4445 -9019 874 3107 -6755 2269 5018 -7377 -500 9218 -4915 -7001 6466 -678
940f78k480Q841q608k235J4150j0397q151J4921J377j4168R952K439j1983R798
$$ -678 -3158 5683 -2925 -5160 8990 -1407 -9558 5363 6740 -7428 2524 4963 -7020 2778
954B778L114j4429P057R340j4285J961J2599r223l224R064o411l298J1475o789
$$ 2778 5892 -8537 -1480 7860 -6425 -4464 8135 -1088 -4312 4752 -1659 -4957 6518 -271
968b71o551J3288k657j2792J1296L234j1135P288L090j3176R205O811j3290R45
$$ -271 -6822 6466 3809 -8983 2313 5547 -5588 1700 4790 -8386 819 7630 -5660 -4715
982d715J2996j1286k110J0480p343k126J0123q174m584J4998m407j1647R428K505
$$ -4715 8281 -3005 -5115 5365 -1978 -4104 6019 -2155 -6739 8259 3852 -7795 1633 4138
996D138r993P911J590j1637R282N914j3652M523R781j0803j103J0783q960m113
$$ 4138 -5855 2056 3646 -7991 1291 7205 -6447 -1924 7857 -2946 -4049 6734 -2226 -6339
1010f339J3151r298l627J4616o173j1054J2515R67j1081P771J312q375P718N214
$$ -6339 6812 -2486 -6113 8503 2330 -8724 3791 4758 -6323 1448 2760 -5615 2103 7317
1024G317j4131N527J0045j1977k029R909o380j343Q581q753k131J1139l080j1959
$$ 7317 -6814 -1287 8758 -3219 -5248 4661 -1719 -3062 5519 -3234 -5365 5774 2694 -9265
1038i265J2888n64q689Q918J153j0687Q649M046j4067O597P752j1654J037J2638
$$ -9265 3623 3059 -5630 3288 4441 -6246 2403 6449 -7618 -1021 6731 -4923 -3886 8752
1052H752r704l159J0637o637n018J2090o432p371J1628j688r450O929M099j0342
$$ 8752 -952 -4111 6526 -111 -5129 6961 529 -6842 4786 3098 -6352 577 4676 -5666
1066e666P558K907j3465R263O967j3076K125J0494q811p16P590o695j895J0057
$$ -5666 1892 4799 -8666 597 7564 -5512 -3387 7107 -1704 -2420 5170 -1525 -3420 6637
1080F637n779p890J2561k677q990Q121J440p887O594K244j0711P887M016j0233
$$ 6637 858 -7032 5529 2852 -6138 1983 3423 -4464 2130 4374 -6337 1550 5566 -4667
1094d667L109Q092q268k255R177p981L9R228p168n469J1145l137r740R716L143
$$ -4667 -1558 6534 -1734 -3989 5188 -2793 -2754 6474 -694 -6163 4982 1845 -7895 1821 4964
1109D964j0163Q586m20r433P740M756j2117L487J0533j0039o55Q466p106l081
$$ 4964 -5199 3387 2967 -6466 1274 6030 -6087 -2600 7933 -2106 -2761 5705 -1401 -4482
1123d482J1226q820m047J1839n248p644J1023L26j0699Q567M21p246O366J886
$$ -4482 6744 -2076 -6123 5716 468 -7176 3847 4173 -6526 2041 2462 -4784 1582 3468
1137C468q561M941P061j1687k1J1260q286J31O303n655l236J0442m690q244R616
$$ 3468 -5093 -152 6909 -4778 -4799 6461 -1825 -1694 4609 -1046 -4282 6160 1470 -6774 2842
1152B842l83o487N803J527p547P949J486j1125M081Q625r248j151Q643p467j8
$$ 2842 2459 -4028 1775 3302 -4245 3704 5190 -5935 -1854 6771 -2477 -3628 5015 -2452 -2470
1167b470Q507r121j80P772l702n862Q533q67p359P969n12q158P656J558j0199
$$ -2470 6037 -3084 -3264 4508 806 -5056 3477 2610 -4749 3220 2708 -5450 2206 3764 -6435
1182f435P331L821r537J917Q487o753j535O194o956n45J1592p985o159R373L67
$$ -6435 896 4717 -4820 -2903 5584 -1169 -2704 3490 -3466 -4011 7581 -404 -6563 2810 3177
1197C177p590M906J537o661P102K32p235M515M216q949L383O550q464J536M692
$$ 3177 -4413 493 2030 -4631 2471 2703 -4532 -17 4199 -4750 -1367 5183 -3281 -1745 2947
1212B947n622r50R671p892l441J1192n572p146R718J054q565O075M41n773N615
$$ 2947 -2675 -3625 6046 -1846 -5287 5905 333 -6813 2905 3959 -4606 1469 1910 -3863 1752
1227A752L645j0736M307P179o498j942N316n907J629O812o632m113R812k774o770
$$ 1752 5397 -5339 -1032 6147 -351 -2293 3023 -2884 -1255 5557 -1075 -5188 4624 1850 -4920
1242d920P900j016p377O898J643q372O446L081q587L010N772p952J041P394p473
$$ -4920 2980 1964 -5413 1485 3128 -5244 1202 4283 -4304 -1294 4478 -3474 -2433 4961 -2512
1257b512j123Q391n482k895R456m828o579R004r39o461O201k07q055O660J940
$$ -2512 -3635 4756 -726 -3621 5835 1007 -5572 3432 2493 -3968 2233 2026 -6029 631 2571
1272B571q304N282O019r128J515O578n339j121O623o974p46Q608n475m686R002
$$ 2571 -5733 -451 5568 -3560 -2045 4533 -806 -1927 4696 -2278 -3024 5584 109 -4577 4425
1287D425k818o675O191J177o092O172K610r973N022O075r348J316O130n273j051
$$ 4425 1607 -5068 1123 2300 -3792 2380 4990 -4983 39 6114 -3234 -1918 4212 -1061 -2112
1302b112P133p370J443L689l626m719R258l164n369P377j622m920M829P19p618
$$ -2112 5021 -2349 -906 2783 -843 -5562 3696 532 -4837 2540 918 -4002 827 1546 -6072
1317f072P856K143q342K306N609o510J181M605m852R32N533n345l382P440k021
$$ -6072 1784 3927 -4415 -2109 3500 -3010 -1829 2776 -2076 -1144 4389 -956 -4338 3102 1081
1332A081m193M958Q62o704O433q44p195N529M793r291L777M508n633l48M907m195
$$ 1081 -3112 1846 2708 -3996 2437 1593 -5602 -73 4720 -4571 -794 3714 -1919 -2267 2640 -1555
1348a555l07M357n180L55O991l181o465P063J72o143N626l34p079Q897J632r746
$$ -1555 -1862 2495 -2685 -2330 4661 1480 -4985 2078 2250 -3893 1733 1399 -5680 3217 4849 -4897
1364d897M074N886p293Q13N116n529j129O846m233l049O470k527m715O899j999
$$ -4897 -823 5063 -2230 -1417 3699 -1830 -2959 3887 -346 -3395 3075 548 -4167 2732 733
1379G33m484N895J208p330N030O10n428N179K480p393K889M870o346l36O800n772
$$ 733 -3751 2144 3352 -3978 1052 1662 -3766 1413 3893 -3500 -611 4259 -2087 -2423 4377 -1395
1395a395k675R006o369l949Q078J23p033M556J861n796N048K200q725N550L754
$$ -1395 -4070 4936 -1433 -5382 2696 2819 -4214 342 2203 -3593 1455 3655 -5070 480 4234
1410D234o848K362L759n434M60O044o507p15N192j655n485Q592l298m043N520
$$ 4234 -2614 -252 3507 -1927 -1467 4577 -1930 -2645 2547 892 -4593 3999 701 -3342 2178
1425B178J147p492O015N61o790N118J516n861L308L270m472q55N609m550j218
$$ 2178 3325 -4167 1848 2409 -4381 737 2253 -3608 -300 2970 -1502 -2357 3252 -1298 -2516
1440b516N906l613k276O519k561m749N120o04l934M338n72m641M252K939o226
$$ -2516 3390 -223 -2499 4020 1459 -3290 1830 1226 -2708 1630 1058 -3583 669 3608 -2618
1455b618K289M282o603M73M632l792m67O032o140q49O566m005l366O869j677n426
$$ -2618 -329 3953 -2650 -2177 2455 -1337 -1804 4228 -1912 -2761 3805 -200 -3566 3303 1626 -3800
1471c800M307o52m054N285M211r927O544Q41m859J051N084n586p4N400n894o74
$$ -3800 507 -145 -4199 1086 5297 -4630 1914 2755 -2104 -1053 4031 -1555 -1629 3771 -2123 -2797
1487b797O319l948k777O123r40m010N302k027n218N332J060o519M102L532o708
$$ -2797 3522 -426 -3203 2920 1980 -2030 3272 1245 -3973 1359 2419 -4100 2 3534 -3174
1502c174J286N020n100M48M501l483j708N715l665l518O651p16n913M861l7n109
$$ -3174 -1888 3132 -1968 -1520 2981 -502 -2210 3505 -160 -3678 2973 2257 -3656 1205 1168 -3941
1518c941N321P28m793L857K356p241K964M844n083j179N090m399P07N025n133
$$ -3941 1380 2108 -2685 1172 3528 -3713 -749 4095 -988 -2167 2923 -1476 -769 4256 -877
1533h77j653P049l043n083N080J014o204N380P89n422M296K693o278K924L367
$$ -877 -2530 4519 1476 -3607 1473 2487 -3717 1663 2452 -2970 1326 4019 -2259 665 4032
1548D032o674K594K794l489j732O777m258k277N915l465k837N640k061m363M531
$$ 4032 -2642 -48 2746 -743 -2475 4302 44 -2233 3682 217 -2620 3020 959 -3404 1127
1563A127k5l676M455m08m767K249N804n261m36L903m261o27O264n223j182N833
$$ 1127 1102 -2574 1881 1473 -3294 -1045 4759 -502 -938 2965 -1296 -1923 4341 -882 -2064 3769
1579C769l516k585N758k574k544M813k999k758L544J089n755L526M789o280M40
$$ 3769 253 -2332 3426 852 -1692 3121 122 -2636 908 1997 -3758 -232 4557 -1723 -1283
1594a283M565m229M24L894n156L41M890l877l071N072j867k265L809K03m749N716
$$ -1283 3282 -947 -523 3371 -1785 -1444 3446 -431 -3502 1570 -297 -2562 1247 1450 -3299 2417
1610B417n87n085M485J766l673k684O979o446J610M104l167j272M944k441m016
$$ 2417 1830 -3255 1230 2996 -677 -3361 3618 -2828 -1218 2886 -281 -1553 3391 950 -3066
1625c066N837l069j313L142N02n282L936K071n918L236K396m544J240L189m963
$$ -3066 2771 -298 -1611 1531 2033 -3249 687 2758 -3160 76 2472 -2072 -832 2357 -2606
1640b606J322L882k713l09L112m191j565N667k207j574K905l74j692J552n45l357
$$ -2606 -1284 2598 -115 -424 2688 -1503 -3068 2599 392 -1182 1723 1349 -343 1209 664 -2693
1656b693M039P16m247K397K907m292J26M596n340L95L746l200k165N705k957r28
$$ -2693 1346 2062 -2185 212 3119 -1173 -1047 3549 -1791 -1396 2350 -850 -3015 2690 -267 -1195
1672a195L816l18l814K055J347m811L794M51k867J726K207l919K91M185m864K12
$$ -1195 2621 2303 -1511 544 1891 -2920 874 1325 -1542 184 2391 -1528 -1237 2948 -1916 -1704
1688a704L137j330k223M487k933j148J816P20l298L312R8k840J429K044l695K952
$$ -1704 1433 103 -2120 2367 -566 -1714 102 822 -2476 836 934 -1906 -477 1567 -2128 824
1704H24R03l064N05K735k832r19M610k976k299L788j066l159N387k298l456N452
$$ 824 1727 -1337 -832 1903 -929 -1848 2762 -214 -2513 1275 209 -2950 2437 139 -3317 2135
1720B135j882k995L806N93l659K111K958o027J925L348m141o40L822j675n49L419
$$ 2135 253 -2742 1064 1657 -2002 109 3067 -2960 -1035 2313 -1828 -2468 1354 -321 -870 2549
1736B549k337j854K214j233l031M857L52k929L223n02k953J661K774n692K437
$$ 2549 212 -1642 572 -661 -3692 1165 1517 -1412 1811 1309 -1644 17 2791 -2901 -464
1751d64J353l046J613M025l918l543O844m500j323N042j306l193M047k21j316
$$ -464 889 -2157 -544 3481 -437 -3980 2864 -1636 -2959 2083 777 -2416 1631 1410 94
1766I4N29M55l140K634K078l963L56L417l241J395J460l111M9L642k509j736L739
$$ 94 623 1078 -2062 572 2650 -1313 -957 2460 -781 614 2074 -1037 -988 2654 145 -1591 2148
1783B148j409m310M397J028l437M036r89l164K492j87j366J227R53j600J79K782
$$ 2148 739 -3571 826 1854 -1583 2453 1464 -1700 792 605 -761 466 1419 -181 -2 2780
1799B780m802R46J921O16m125M543k218j919M209j800k554M254n77l266K988R20
$$ 2780 -2022 -1076 845 1461 -2664 1879 -339 -2258 1951 151 -2403 1851 1274 -1992 996 1916
1815A916m162K951J507k801K474Ok003q93K136j989k461M718j610r92L614l003
$$ 1916 -2246 705 2212 -589 1885 1891 -112 -1005 1131 -858 -3319 1399 -211 -1203 2411 -592
1831e92k170M771r78k571L478j751k523J876J333l210J798K173l916J436L514
$$ -592 -2762 2009 1031 -1540 1938 187 -2336 -460 873 -2337 -539 1634 -2282 -846 2668
1846B668l521k760O156m165k74M101j156j688J199j149q37L810L2m245J867J865
$$ 2668 -853 -3613 2543 -1622 -1896 2205 1049 -639 560 -589 -1426 2384 2416 -1829 38 1903
1862A903l855K564K818k866o15J816j115k280L914k696j494K892q00j600L453
$$ 1903 -1952 612 3430 564 -51 1765 650 -1630 2284 -412 -1906 986 186 -1414 2039
1877B039k224k025L416l00k454P51K657k721J580J097k566o86K435j793r0L642
$$ 2039 -185 -2210 1206 906 -1548 -797 1860 -861 719 1816 -750 -1436 999 -794 -884 2758
1893B758m721M72M271k985j152K618m36j859K894j312l125K707K241l578K852
$$ 2758 -1963 -1491 2780 -205 -1357 1261 825 -1034 1860 548 -2577 130 2371 -1207 1645
1908A645M14l866J980J281l326J21M546l271j232K540r83j577L622q27l478K577
$$ 1645 2059 -1807 173 1454 -1872 -1751 2795 -476 -1708 832 -151 -1728 1894 1067 -2411 166
1924A66L72l434M107N21l045O47K599j565L74J171k742L84K737k044j619L110
$$ 166 538 -2896 1211 1732 -1313 -666 1933 368 742 1913 -829 -445 2292 248 -1371 1739
1940A739l486J489K930k115k339K592l03l269L522m6k837K017K557l887J187M61
$$ 1739 -1747 -258 2672 557 -1782 810 507 -2762 760 714 -2123 -106 2451 -1436 -249 212
1956B12J24k43K53j275K46P95r25q88M230l369j983M551j565k251L142k38l409
$$ 212 336 93 346 -929 -683 112 -813 -1701 2529 -840 -2823 1728 163 -2088 1054 816 -2593
1973b593M042J238k463j165J768k256J873R07k486j048M022j783k409L754k579
$$ -2593 1449 2687 224 -941 827 -1429 444 1351 -1135 -2183 1839 56 -2353 1401 -1178
1988a178p51L167j116j870J854J926m369L439q41k667K767K80k294Q02K623l734
$$ -1178 -1929 1238 122 -1748 106 2032 -2337 1102 261 -2406 361 641 -1653 -851 1772 -1962
2004a962O16L422j870k185K932k143O18K513j912k039L623j927k680M737o41l352
$$ -1962 -1346 2076 206 -1979 953 -1190 -572 1941 29 -2010 1613 -314 -2994 1743 1102 -2250
2020b250K049J332j795J116J279k613l9J435j848m59K182m78l036L295M32l290
$$ -2250 -201 1131 -664 452 1731 -882 -921 514 -1334 -1793 389 -89 -3125 170 602 -2688
2036b688L352k331J339K211o68k546J276L29j886J396J791l201J639J057k104
$$ -2688 664 -1667 -328 1883 1215 -1331 -55 274 -1612 -216 1575 -1626 13 1070 -1034
2051a034L99L270k533j517K819q79k745M736k376m90K716n76k700M90Q45k2l95
$$ -1034 -635 2635 102 -1415 1404 525 -2220 2516 140 -350 2366 1790 -910 -420 425 403 8
2068HJ020j628q68L137k959J329K160k590j02J090R94k617K387j023j468K883
$$ 8 1028 -600 -1468 1669 -1290 39 2199 -391 -493 597 1591 -1026 1361 338 -1130 1753
2084A753j492k911K709J604j706MQ84k137R43P54j625K204M92q67j473L229k340
$$ 1753 261 -2650 59 1663 -43 -39 845 -1292 -349 405 -1220 984 1476 609 -864 2365 25
2101B5k38K320k125Q54P18j060k268L357j8l345J523Q22k131J414J984l005L64
$$ 25 -213 2107 -18 836 1554 494 -1774 1583 1565 -1780 -257 565 -1566 -152 1832 -1173 -809
2118h09K676j506j563J364k79o14K174j848j171K348q50j632K960k45l256Q49
$$ -809 1867 361 -1202 162 -117 -731 1443 -405 -1576 772 -78 -1710 1250 1005 -2251 -1402
2134a402L369l268L73K822l005N42J350j355N30N91p2k021K040o72j190J131Q45
$$ -1402 1967 -1301 -928 1894 -1111 -569 781 -574 -44 547 475 -1546 494 -178 -1368 -237 608
2151F08j700J111K70j302O20J723k705R83k82l76J597J506l656J049K775k701
$$ 608 -1092 19 289 -1013 -393 1330 -1375 -392 -674 -1050 547 2053 -1603 -554 2221 -480
2167d80o70K057n97l298M073j598j355L171j780n21L82J443k179J527J171j573
$$ -480 -1150 907 310 -2988 1085 -513 -1868 1303 -477 -998 -616 827 -1352 175 1346 -227
2183b27m33J415r43K99R43o16j344J660j152J219o27J176k168K097r1k680K968
$$ -227 -660 755 -188 111 1054 438 -906 754 -398 821 194 1370 -798 1299 1208 -1472 1496
2200A496L09j851n98J507k279J385R80k242Q06K124j978O1K584j372l663M932
$$ 1496 1805 -46 -644 863 -1416 -31 949 -1293 -487 1637 -341 -280 2304 932 -2731 2201
2216B201l385J234J944k430j492L108L15k602R14K511k672K217j689j343J320
$$ 2201 -1184 50 1994 -436 -1928 1180 1495 -1107 -193 2318 -354 1863 174 -1169 151
2231A51J593k480r76L605j917j157K052p70j454K649p00k008J873j208p06K021
$$ 151 1744 -736 -1712 1893 -24 -1181 871 101 -1353 1296 596 -1412 461 -747 -1453 568
2247E68q85P3j07J324k362J750J401k396j083J372J007j140K005k180P52J274
$$ 568 -317 -244 -351 973 -1389 361 1762 -634 -1717 -345 662 -478 1527 -653 99 1373
2263A373j160o24n1K136k717J639n20r00R36L26j255J013q35Q11m70J253l722
$$ 1373 213 -411 -462 1674 -1043 596 76 -824 112 438 -817 196 -639 172 -298 955 -2767
2280b767R12L625j345j545L762j715j842Q73J392j570j55K778m014J721J939k621
$$ -2767 -1855 1770 425 -1120 2642 927 -915 -42 1350 -220 -375 2403 -1611 110 2049 -572
2296e72J944j000j375J323k17J57j267K298j486p80K488j291j399K195k27j257
$$ -572 1372 372 -1003 320 103 260 -1007 1291 -195 -975 1513 222 -1177 1018 791 -466
2312d66J977p85j238P95r24j206J314K314k052N70R36m20k081K510r37l2J159
$$ -466 1511 726 -512 283 -641 -1847 -533 1781 -271 299 1235 815 -1266 1244 307 275 1434
2329A434j364q51J082J86L23k21p19j183K542n67k877J782K425k138O1M46l182
$$ 1434 70 -781 301 487 810 589 -130 -1313 1229 662 -2215 -433 1992 -146 -85 361 -2821
2346b821L346r6L61m49J136j167j09o6j43n53J517J468l925J536J320k662K012
$$ -2821 525 429 790 341 1477 310 201 135 -8 -561 956 2424 -1501 35 1355 -1307 705
2363G05N05k468L199j75k305J386j27m11k928L074j660R35J319m02j536K141k219
$$ 705 1210 -1258 1941 1766 -539 847 720 309 -2619 455 -1205 -270 1049 647 -889 1252 -967
2380i67n51K497N09k918K33Q69p20J51J185j000m76J779k000J429q0Q25k457L016
$$ -967 -1518 979 1488 -1430 -1197 -328 -1048 -897 288 -712 -1188 591 -1409 20 -60 765 -1692 1324
2398A324j560L1J847k56k872K569j383o73K575O26l193L86J238k084P74O28j361
$$ 1324 -236 -205 1642 1386 -1486 1083 -300 -973 1602 2228 -965 -579 659 -1425 -651 -23 -1384
2415a384R18J92k66n79K136L77k348J508j001NR62J058j615n81J262p44R27O36
$$ -1384 -466 -274 -540 -1119 1017 1394 -954 554 -447 -442 520 1578 -37 -618 644 -100 827 1463
2433A463j543M9K128k420J262L68j909j117K423k27k702L396j743q94J425k54
$$ 1463 -80 -31 2097 -323 939 1307 -602 -1719 704 477 -2225 1171 -572 -1466 -41 -295
2449b95J048o58L74m70l09n97J65l04J592j254J77O7J353j855K135j724O65J515
$$ -295 753 95 469 -1 -310 -907 -742 -1046 546 -708 -531 -464 889 -966 1169 -555 110 1625
2467A625k397O70Q97K04k787K253p46j623K259o39q8O41K0m57L68J937k142R82
$$ 1625 -772 -102 795 999 -1788 465 -281 -1904 355 -284 -372 269 289 -168 200 2137 -5 977
2485I77j352O20j040J535M08l039K761J144k868j0K237k370Q51J617r25k159L650
$$ 977 -375 245 -795 740 1148 -1891 870 2014 -854 -864 1373 -997 -146 1471 546 -1613 2037
2502B037l233J057J317j480q86M34J318K51j110J156j315J108k78j736J512n60
$$ 2037 -1196 -139 1178 -302 -1188 -754 564 815 -295 861 -454 654 376 -1360 152 -408
2518d08j286L272r04j845J558J198j049j02R29k135r3M26j57P55J545j145j829
$$ -408 -1694 1578 674 -1171 387 1585 536 434 1363 -772 -865 -439 -596 159 1704 559 -1270
2535a270J050j276M69J806o02k428K169J377j644j078J362j947J577J339r9j566
$$ -1270 -220 -1496 -1027 779 177 -2251 -82 1295 -349 -1427 -65 -2012 -435 904 805 -761
2551g61J405q33K19J802j983J84M17j258K1m01J849k513L085j37r08m96Q95n66
$$ -761 644 -189 30 1832 -151 33 450 -808 -787 -1188 661 -1852 1233 1096 188 -308 587 21
2569B1k72k76M68r32Q06p1N1K002j885r13J557L1j167K001j42j815J509m63j458
$$ 21 -251 -527 -59 -991 -185 -256 -205 1797 -88 -1001 556 587 -580 1421 1279 -536 973 510 -948
2588i48J37P55n20O38j51j5m28P83j16J08l72o70l88J950Q38k808J552j345j259
$$ -948 -811 -56 -576 62 -89 -104 -532 251 135 243 -129 -799 -1187 763 1601 -1207 345 -1000 -2259
2607b259K497K66j598J789j43k969L247N86l105J691J140K27p79R55j089p03j22
$$ -2259 238 504 -1094 695 552 -2417 830 1416 -1689 2 1142 1369 590 1545 456 -247 -369
2624c69K208k876R96j80O79R30n33j183O78P05k124J383L25j113j51J242j475
$$ -369 1839 -1037 -41 -221 458 1388 855 -328 350 1055 -1069 314 639 -474 -625 617 -858
2641h58J379Jj108O04P28o24j726K178j048k0j89J951j645J208l11p07J28j43
$$ -858 521 522 -586 18 746 122 -1604 574 -474 -494 -683 1268 -377 831 520 -187 -59 -202
2659b02j77j59K011r11o58O89K53p25J688k163p59K193k339J191J325k290J795
$$ -202 -379 -538 1473 562 -96 593 846 121 1809 -354 -1113 1080 -1259 -68 1257 -1033 762
2676G62r85J030j933J894J791l571Q32J729j184j833J850p28q04N42L01J33R67
$$ 762 -223 807 -1126 768 2559 -1012 -180 1549 365 -1468 382 -346 -1150 -608 -307 -174 793
2693G93k32j269J528j208r14O26K579k092m01K177k630M04Q34K3K6n51L67R04
$$ 793 561 -708 820 -388 -1302 -676 1903 -189 -590 1587 -1043 -639 195 218 244 -307 60 964
2711I64l0n63p65R04L57j692P12M46j323P47O3J130r03j87R1J027K09j500J098
$$ 964 934 371 -394 510 867 -825 -113 333 -990 -243 -180 950 47 -140 -49 978 1187 -313 785
2730G85J087k307l57K82J149k379K948o52o40J157l28p44J725j479Q18l23p58
$$ 785 1872 -435 -792 -510 639 -1740 1208 556 -84 1073 745 1 1726 247 1065 742 -16
2747a6j023J047l47K59j002K376j423L02Q62q62n54J233j080n05J185l58j565
$$ -16 -1039 8 -339 -80 -1082 1294 -129 173 1035 173 -381 852 -228 -733 452 94 -1471
2764a471J556J452l303M530k669K72q17M67k91O75r55Q82J237q29j831N24J724
$$ -1471 85 1537 -1766 2764 95 367 -450 17 -274 401 -554 328 1565 736 -1095 -571 1153
2781A153j439O57p74m51M42J771j205j343K376k008M28L7n46J161j12l61p85J323
$$ 1153 -286 371 -403 -854 -412 1359 154 -1189 1187 -821 -393 -356 -902 259 147 -214 -999 324
2799C24j828K294j088R9m63L81Q29k3l72J534j587j093J532j418J021j25N32k008
$$ 324 -1504 790 -298 -199 -662 -281 548 525 153 1687 100 -993 539 -879 142 17 549 -1459
2817a459J247J772k190M29P93j143N98J326j048j295L96j23P6N64j042J105N57
$$ -1459 -212 1560 -630 -201 592 -551 47 1373 325 -970 -574 -697 -621 -57 -1099 6 563
2834E63k499J325K47J765k684J617Q39j482P79q98r05J050j448J220k15J858o79
$$ 563 -1936 -611 -364 1401 -1283 334 1173 -309 470 -428 -1333 -283 -1731 -511 -726 1132 453
2851D53j324K831j896j49J51Q28j370K54J382j095O19K79j94o34j97m99J018m00
$$ 453 -871 1960 64 -85 66 894 -476 -222 1160 65 684 963 769 135 -62 -561 457 57
2869E7k605J844J131j271j46Q90k55j218K863o72l06m07o1j677K058l37j480Q03
$$ 57 -2548 -704 427 -844 -990 -100 -355 -1573 1290 618 312 -95 -156 -1833 225 -112 -1592 -789
2887g89J358j32R67n66r64l63k31N24J69J777j711j645K103q60K85Q00q60l29
$$ -789 569 437 1404 838 -126 -489 -720 -196 -27 1750 39 -1606 497 -363 -78 722 -138 -467
2905d67q5P5j27M27O81q93K87N57o22m77M27q16J635M09j398J2q70J206L33R21
$$ -467 -552 -477 -604 -177 504 -389 -102 455 -167 -644 -217 -1033 602 1011 -387 -375 -1245 -39 294 1215
2925A215o85j432K28K85m19J766p25j375J35J332p75P92Lj698J241K23L16k056
$$ 1215 530 -902 -674 -389 -808 958 233 -1142 -1007 325 -450 342 345 -1353 -112 111 427 -1629
2943a629J389O67j084M59J657n89l46m8j256J161j069J357o88K17o20j38Q38o35
$$ -1629 -240 427 -657 -198 1459 870 524 476 -780 381 -688 669 -19 198 -422 -560 278 -357
2961c57R68L19m34j311L0j005n25L455r69N49p81J7j307R34n56J443j093J577
$$ -357 611 930 496 -815 -785 -1790 -2315 1140 171 720 -61 -44 -1351 -417 -973 470 -623 954
2979I54j896K075j008J274k101J41L51r98J278N94p01K25Q50l091K835r94J603
$$ 954 -942 1133 125 1399 -702 -561 -210 -1208 70 664 -37 188 1038 -2053 782 -212 1391
2996A391p75j405J047o10Q35N74j186L02p11J66l17J357k321J426J226j205J69
$$ 1391 616 -789 258 -352 483 1057 -129 173 -538 -372 -689 668 -1653 -227 999 -206 -37
3013c7Q68j279M40J26J45J47N72j263m37K44M38O62j40j142J019L5n66K90n10
$$ -37 831 -448 -8 118 263 410 982 -281 -718 -474 -36 626 486 -656 363 398 -168 122 -388
3032c88m79J737k021J053L31L79j025L89p15P87m02R87N82j556J3l31o9J61J618
$$ -388 -867 870 -1151 -98 233 612 -413 -24 -739 48 -354 633 1215 -341 -328 -659 -728 -567 1051
3051A051q78L24j58j569q36K938j511o57J707m78k62J785q77r7m63q07P69k7o80
$$ 1051 173 497 339 -1230 -2066 872 -639 -1296 411 -67 -329 1456 579 482 19 -788 -19 -46 -726
3070g26k242K896N65l50O0P51j398l38j2O26J41O86r78j157J907J2n31n40O45
$$ -726 -2968 -72 493 143 203 954 -444 -782 -794 -168 -27 659 -319 -1476 431 443 -88 -628 17
3089A7j751K056K0j491R1O77J36N29q33P7k05M96m68M13R39l81j311J304J06j041
$$ 17 -1734 322 342 -1149 -1058 -381 -245 284 -549 -472 -677 -181 -649 -236 703 322 -989 315 421 -620
3109f20N74j55KP00Q56j043j111J458n15j804J601R82p37j615J296p57N12P54
$$ -620 -46 -201 -199 501 1357 314 -797 661 146 -1658 -57 925 188 -1427 -131 -888 -376 378
3127C78j477J050L30j633J617M06q36j167j05J13J408K05O7p58O50J13J41N87
$$ 378 -1099 -49 281 -1352 265 671 -165 -1332 -1437 -1324 84 289 356 -402 248 361 502 1089
3145A089o23j852O63m7J02q14K501j607N08k45n24P23j6O80l27L6j73L41Q68k285
$$ 1089 466 -1386 -723 -770 -668 -1482 1019 -588 -80 -325 -849 -126 -142 538 211 247 74 415 1283 -1002
3165a002Q10L43q42K183n88o24k083L548k315r46K707k049q77J868O85j98r96
$$ -1002 -192 151 -691 1492 904 280 -1803 1745 -570 -1516 1191 -858 -1735 133 818 620 -376
3182c76J448j074k073J452J91n80J731j350k28M90J70j242J965k97l26M48j252
$$ -376 1072 -2 -2075 -623 -432 -1012 719 -631 -859 -369 -199 -1441 524 227 -99 349 -903
3199i03R98P67j024j230K415q27p25N58J308q92R66o89N71N24j414j583Q20J526
$$ -903 95 862 -162 -1392 1023 196 -529 29 1337 445 1411 722 1293 1817 403 -1180 -360 1166
3217A166j589L79R55n55o06L86N62j594K013j099j373K181n40p60M82J488k927
$$ 1166 -423 -44 911 356 -250 136 698 -896 1117 18 -1355 826 286 -474 8 1496 -1431
3234a431R56M08L44K35L89Q1o37N10r78j21K52m75J40O7P85o42o01O63p78K99
$$ -1431 -475 -67 277 512 901 982 345 855 -123 -244 8 -467 -327 -260 525 -117 -718 -55 -833 -534
3254e34K175l104J524m87o62O04j04L66j82J382p21n07o44l10J205j97j87R83
$$ -534 1641 -1463 61 -426 -1088 -484 -588 -222 -404 978 257 -250 -894 -1204 1 -196 -383 600
3272F00j077k95M47m57M42M27p26J141j993Q39J081q87L28R12l20o57q68R70P1
$$ 600 -477 -772 -325 -782 -340 87 -639 502 -1491 -652 429 -458 -130 782 462 -195 -1063 -93 -22
3291b2m08P2R29j612J859j354Q86j059K21M88Rj170J509J29k76l9j252J267l84
$$ -22 -430 -358 571 -1041 818 -536 350 -709 -488 0 9 -1161 348 477 201 162 -1090 177 -207
3310b07j074K750k747J933P8m57p44J97R76m25O77o25Q65l78k43j36j83j53l74
$$ -207 -1281 1469 -1278 655 733 276 -468 -271 705 280 957 332 1197 819 576 440 257 104 -270
3329b70M42M85j048M75p46J043J45Q6r09L4J006j041J295k112L74R0k78J017R3
$$ -270 172 657 -391 84 -662 381 526 612 -297 -263 743 -298 997 -1115 -741 -651 -929 88 181
3348A81o20l09J283m51J416k410n49J561j666J559O87o52K54j347J589j010J525
$$ 181 -439 -748 535 84 1500 -910 -1459 102 -1564 -5 682 30 284 -1063 526 -484 1041
3365A041j999O43O09O35j968O77J19QM08J46j336q6P20Q25l02j670K556j030m36
$$ 1041 -958 -315 294 929 -1039 -362 -243 -235 173 319 -1017 -1103 -383 442 140 -1530 1026 -4 -440
3384d40L30P16k605K818p68J09j364J262Lj481N54J314J282j835n71j65k14J081
$$ -440 -110 606 -1999 819 51 160 -1204 58 61 -1420 -866 448 1730 -105 -676 -841 -1055 26
3402B6J059l69j037R10M73j136j62j37K60K74j536K744k657l99J740j115P38j82
$$ 26 1085 716 -321 589 1062 -74 -236 -373 -113 161 -1375 1369 -1288 -1687 53 -1062 -324 -506
3420e06R15K06J52j441q82K64J648p1m2M13O81r99o68J365k148P26M84J199j471
$$ -506 409 615 767 -674 -1556 -1292 356 285 243 656 1337 338 -330 1035 -1113 -387 97 1296 -175
3439a75J38M43j544J396q89J222j93J11j623K459o21K61j225J263j105J757j245
$$ -175 -37 406 -1138 258 -631 591 398 509 -1114 1345 724 985 -240 1023 -82 1675 430
3456D30m58l9J456k035K20K229l463K084r30j94P01P36o92k55J057j345n0J260
$$ 430 -28 -67 1389 -646 -426 1803 -1660 424 -506 -700 1 737 45 -210 847 -498 -548 712
3474G12m79J065r60j034Q42K20l49l49M48m96j143J932J06j148L02J168J878l831
$$ 712 233 1298 338 -696 146 366 17 -332 116 -380 -1523 409 515 -633 -331 837 2715 -1116
3492a116J793r70O07q71M41m43l91J749j301J67N89J61n86k28j23R99O02Q58l170
$$ -1116 677 -293 314 -557 -116 -559 -950 799 -502 -335 254 415 -171 -399 -522 477 1079 1937 -1233
3511a233K140q23J731k725J516j37m09j594N44Q94J382k22j554m54p51K369j425
$$ -1233 907 84 1815 -910 606 469 60 -1534 -990 -96 1286 1064 -490 -944 -1695 674 -751
3528g51J201J61q25M43j02n62N51M94m71N57j387P09j2j74L86J74o88L79k81K70
$$ -751 450 611 -214 229 127 -435 116 610 139 696 -691 18 6 -168 218 392 -296 83 -198 72
3548G2L19j582R83P24M0j494R04K76J31k49j613K751k907L24J166j72K01Q75j918
$$ 72 391 -1191 -208 516 556 -938 -34 242 373 124 -1489 1262 -1645 -1321 -155 -327 -126 749 -1169
3567a169K58Q56J872j777l39k02j399L230q52K27oj726l79J212Q9j906K443o84
$$ -1169 -911 -55 1817 40 -299 -501 -1900 1330 478 705 699 -1027 -1406 -194 -105 -2011 432 -252
3585b52l56M33R82l78j057J372j806N71q17J010O77J518j126j090N55l3k18m71
$$ -252 -608 -175 807 429 -628 744 -1062 -491 -1308 -298 379 1897 771 -319 236 203 -15 -486
3603d86p8N66j16J93j25n69n5P84r42N3J146p73J9K54M23O94j99p59r47J364k37
$$ -486 -564 2 -114 79 -46 -615 -670 114 -828 -775 371 -402 -383 -129 294 988 789 30 -917 447 210
3624B10r45j03M20O56k09m6j025O76N87k32K13J106j953L11j033J301n60J693
$$ 210 -735 -838 -418 238 29 -17 -1042 -366 221 -11 202 1308 -645 -334 -1367 -66 -626 1067
3642A067p06M79o72j73m10J010m48J099o64n55N7J9q03J248j706J591O08j347
$$ 1067 361 840 168 -5 -415 595 147 1246 582 27 84 103 -700 548 -1158 433 1041 -306
3660c06o77J040j42Q38j361r10J075l59O01m90J726j627K43k29K993j233q87p25
$$ -306 -983 57 -85 753 -608 -1518 -443 -802 -201 -691 1035 -592 -349 -578 2415 1182 295 -430
3678d30J292j275K51l87n01Q28K42q64K389j538M72j93k243K721j320l61K111
$$ -430 862 -413 -162 -549 -1050 -222 20 -844 1545 7 479 286 -1957 764 -556 -917 1194
3695A194k91j355O78j223M70l80P18p90J192o34J136l53l47q75J089n41R08p84
$$ 1194 903 -452 226 -997 -527 -907 -189 -979 213 -421 715 362 15 -860 229 -312 596 -188
3713a88kl23j109M09J321l89K5j583K652j939J33O73R02j97L37M6o20l83J53L26
$$ -188 -190 -513 -1622 -1213 108 -281 -256 -1839 813 -1126 -993 -320 582 385 722 768 148 -235 -82 244
3733B44j04J056j065L28p39Q11j067P73m88l30q56K410q32k10k06Q89p67O21q63
$$ 244 140 1196 131 459 -280 531 -536 237 -251 -581 -1437 973 141 -69 -275 614 -153 468 -395
3752c95J223p71j429J204J319j256R64l71M75j89l20j074Q3J781j615N76O57j048
$$ -395 828 57 -1372 -168 1151 -105 859 488 963 774 454 -620 -537 1244 -371 205 862 -186
3770a86J239j223N70j887J856Q97l64l82o52J251j461Q78J50j253R26O6k16J105
$$ -186 1053 -170 400 -1487 369 1266 902 520 -132 1119 -342 536 686 -567 359 425 209 1314
3788A314k042Q62l17N51l5o5j250N01M0O24m04J716l63j657L57J015o61r86J775
$$ 1314 -728 134 -183 368 333 268 -982 -481 -441 183 -221 1495 1132 -525 -168 847 186 -800 975
3807I75j285J41l26O73q38J299p82j976K274N96j300p43J285j677J284o15J051
$$ 975 -310 -169 -495 178 -660 639 -143 -2119 155 751 -549 -1292 -7 -1684 -400 -1015 36
3824C6m90M27Q16j694J499j055P40M75J40j547K226j803L21m46J520j518J54M83
$$ 36 -454 -27 789 -905 594 -461 279 754 894 -653 1573 -230 91 -355 1165 -353 -199 284
3842B84r42N26m92J29j250J453L11q83O55J827p05j327p23N49J268q50o5Q0J027
$$ 284 -658 -132 -624 -495 -1745 -292 19 -864 -209 1618 913 -414 -1137 -588 680 -170 -235 -155 872
3861H72K11J276k118J167j881K57J236j274R11L13l88n60P53j235K86J67j342
$$ 872 1083 2359 241 1408 -473 -216 1020 -254 657 970 582 22 775 -460 -174 -7 -1349
3878a349O32O40l84P72PQ3P17j108M61J108j584q62n72K173q71k95K73J97L85
$$ -1349 -717 -77 -461 311 318 401 1118 10 471 1579 -5 -867 -1439 734 -137 -432 -159 38 423
3897D23k08r47L61Q42K31L74j702M22K00N73l76K75n54N90M16j4j356l82N09J885
$$ 423 215 -732 -371 471 702 1076 -626 -204 -4 569 193 468 -86 504 920 906 -450 -832 -323 1562
3917A562k191J106K40q55R9mL19nj672K11J682J029k774J370j403R63o34L69J688
$$ 1562 -629 477 717 -138 -39 -43 276 271 -1401 -1190 492 1521 -1253 117 -1286 -323 -957 -588 1100
3936A100j314P11j599n25K158p86J053j574l00J079o93J003N58j750J19J871q48
$$ 1100 -214 497 -1102 -1627 531 -255 798 -776 -1076 3 -690 313 871 -879 -760 1111 263
3953B63J609j564j314M00J169n88m66J95n32N09L49m03J042K21j243Q82O01l04
$$ 263 1872 308 -1006 -606 563 -25 -491 -296 -828 -319 30 -373 669 890 -353 529 1130 826
3971H26j511P93n78K56Q19l20j814J054O42k51j42j096K003k199J666L19o70K41
$$ 826 -685 108 -470 -214 605 285 -1529 -475 167 -84 -226 -1322 681 -1518 148 467 -203 38
3989C8R7q95N58K80l73M04Q62n86j445J640j266n3J699r24j552J610J691j967
$$ 38 135 -760 -202 78 -295 109 971 385 -1060 580 -686 -739 960 36 -1516 94 1785 -182
4007a82j122P02J28M16r16J507k64J20L11M09l39o66o4m67K18p74J286P47J07
$$ -182 -1304 -602 -474 -58 -974 533 269 389 700 1109 770 104 40 -427 -209 -983 303 1050 1157
4026A157o78j031J647J23j266q51j61J442J82k133K053Q71r91j052R21k011J862
$$ 1157 479 -552 1095 1218 -48 -899 -1060 382 564 -1569 484 1355 364 -688 233 -1778 84
4043H4n65n47K051P53r67j088k93O65Q15j704o36L29O47L72Q9J59M16n50p95J798
$$ 84 -481 -1028 1023 1776 809 -279 -572 93 908 -796 -1432 -1103 -456 -84 5 164 580 30 -765 1033
4063A033o32O33j254j312K608o25Qo10k68J04M01n26J344j402J733p95J323r22
$$ 1033 401 1034 -220 -1532 1076 451 459 -151 -419 -315 86 -440 904 -498 1235 440 1763 841
4081H41m58p64O72j45j471J138J24R47n06p74J413o40N0K68k174J328J112Q33
$$ 841 383 -381 291 146 -1325 -187 -63 884 378 -396 1017 377 427 695 -1479 -151 961 1794
4099A794j908l75m44p57J811N90j361P07k03M71J36o89J060p57r67J508N12j614
$$ 1794 -114 -489 -933 -1690 121 711 -650 57 -146 325 461 -228 832 75 -892 616 1128 -486
4117d86p4J598j489L49n74J15j09J084n84j09m87L13P19j310J148j039J281o94
$$ -486 -560 1038 -451 -102 -676 -561 -670 414 -170 -279 -766 -453 266 -1044 104 -935 346 -348
4135c48N44k03M59J33o93K92m4o35Q32k20M55O9q37q18J990j271J460j049j35
$$ -348 196 -7 452 585 -108 184 140 -495 337 117 572 641 -196 -1014 976 -295 1165 116 -19
4154a9r17J369J148j066N4j323N02M3j64l5Q27p5j96J59m04J039j63k772J371
$$ -19 -936 433 1581 515 569 -754 -252 -209 -373 -408 419 344 148 307 -97 942 779 -1993 -622
4173f22P50O2Q54q41J93r46J415m67O5o84L48j197J075j542K078Q85m40M46r51
$$ -622 128 190 1044 203 396 -550 865 398 463 -221 127 -1070 5 -1537 541 1426 986 1432 481
4192D81n74m97J85M37k01l02J496m55J25k95P40p30r25p34J457K58J098j430m61
$$ 481 -93 -590 -405 32 -169 -471 1025 570 695 400 1140 410 -515 -1249 208 466 1564 134 -327
4211c27O57l04M24n45O61r46K45J916j710P86M94j905J103P88q80j581J640n44
$$ -327 330 26 450 -95 566 -380 -135 1781 71 857 1351 -554 549 1337 457 -1124 516 -28
4229b8p63j46J615j655J117K12n31o87O67k92L14k39K44m65J112kJ542k938Q97
$$ -28 -791 -937 678 -977 140 352 -179 -866 -199 -491 -177 -416 -172 -637 475 473 2015 -923 -26
4248b6q4l38J419q29J634j307j180K47L09O50m53K17q98J38N33o29O76l54J132
$$ -26 -110 -448 971 142 1776 469 -711 -464 -155 495 42 259 -639 -501 32 -597 79 -275 857
4267H57j545Q57k63q69j6P61M07j640R05J358j924J910r48K23K92K31j482L152
$$ 857 -688 169 -94 -963 -979 -218 189 -1451 -546 812 -1112 798 -150 73 365 596 -886 2266
4285B266l065N62P73q0p46P84K9r89P36j020J36M02n92J549j040L80k22J25n3
$$ 2266 -799 -237 536 456 -290 494 523 -466 270 -750 -614 -212 -804 745 -295 85 -137 -12 -65
4304f5R4NP80L35r36N48j316k32M68J53q80m0J306L79j047J263j416O74j720J597
$$ -65 29 34 814 1149 213 761 -555 -787 -319 -166 -1046 -1086 220 599 -448 815 -601 73 -1647 -50
4324e0j31J355k429J847l31J43n69m13M2N35o23K42M80K69l66Q40o32j141l05
$$ -50 -181 1174 -1255 592 261 404 -165 -578 -536 -1 -624 -382 98 367 1 841 209 -932 -1237
4343a237J486K43P45j028M01q49J67j137K31J400K59j171J002o7M29j528Q89n43
$$ -1237 249 492 1237 209 610 -239 -72 -1209 -978 422 681 -490 512 445 874 -654 235 -308
4361c08j022J557n68Q10O23j253L55J22j412K431j784N15J793k474j62Q57p90
$$ -308 -1330 227 -341 469 1092 -161 194 316 -1096 1335 -449 66 1859 -615 -777 80 -710
4378g10O64O19j060O45j30L22j163J56M08n9O81r84J375j435m89J172R20j689
$$ -710 -46 573 -487 158 28 350 -813 -657 -249 -308 373 -611 764 -671 -1160 12 932 -757
4396g57K59O11j753K193l1j629j114O96J589O90j009J465n77K16j029J661j620
$$ -757 -498 113 -1640 553 522 -1107 -2221 -1525 64 754 -255 1210 633 849 -180 1481 -139
4413a39J217j003R2j207N94M66r90J991o27m98J155j349k06J717j863J054M22
$$ -139 1078 75 167 -1040 -446 20 -970 1021 394 -104 1051 -298 -504 1213 -650 404 826
4430H26r66l86N56N19n54Q22oq68J4l56R31p50K73L22r79N74J018l68Q47j647
$$ 826 -140 -526 30 549 -5 817 811 -57 -43 -399 532 -218 55 377 -602 -28 990 622 1469 -178
4450a78l88O7J074m46r20J152j513M29N68J119j513P62j70j66N58k00O9j351J057
$$ -178 -566 -499 575 129 -791 361 -1152 -723 -155 964 -549 213 43 -123 435 235 304 -1047 10
4469A0L27j308J269j523P13L20n22j199J462L71J604j333r67k22P1L521j749k177
$$ 10 337 -971 298 -1225 -512 -192 -714 -1913 -451 -80 1524 191 -776 -998 -927 2594 845 -1332
4487a332J259J205j087n89L26m99N27J09o97O35j02m49K48n24p2R83K407k495
$$ -1332 -73 1132 45 -544 -218 -717 -190 -81 -778 -143 -245 -694 -446 -970 -1042 -59 2348 -147
4505a47J115l34j488R92p13J195M71N68j473j89n89O6m00J286m80q22P2L09M72
$$ -147 968 634 -854 138 -575 620 1091 1659 186 -3 -592 -526 -926 360 -120 -942 -870 -561 -89
4524h9R82j198K73N46r52Q56M63p17n45J9n45N59m34n0P58L46K49n01m45K46K91
$$ -89 893 -305 -32 514 -438 418 881 164 -381 -362 -907 -348 -782 -832 -74 272 521 20 -425 -179 112
4545A12j082O75Q48l25Q83j724J5Q33L67o46J11J385k332P4J149M51j047J215
$$ 112 -970 -295 553 228 1111 -613 -598 235 602 -44 67 1452 -880 -806 343 794 -253 962
4563I62p14K043k295L69r0n90k91j911K799K87J571k158n70J77J425j060J16n38
$$ 962 248 2291 -4 365 275 -315 -606 -2517 282 569 2140 -18 -588 -411 1014 -46 70 -468
4581d68j31n31P38l54J49J024P21j351R47p31N72L65m58q08K65n50J728k00k95
$$ -468 -599 -1130 -392 -746 -597 427 1148 -203 744 13 585 950 492 -316 -51 -601 1127 927 632
4600F32l65l58j361K007J573m47j895L82N66j512P86M55K7j022P08r69J199k267
$$ 632 267 -91 -1452 555 2128 1681 -214 168 734 -778 8 463 490 -532 176 -793 406 -1861
4618a861J782N81p48N88n07L01n54J451L38j415J143K67j080o25Q06l14k44n74
$$ -1861 -79 502 -246 342 -165 136 -418 1033 1371 -44 1099 1366 286 -339 467 153 -91 -665
4636f65P54m01q78L27n66K432j052J16M8m44N61r46Q98J03m48l90P35l47n42O62
$$ -665 89 -312 -1190 -863 -1429 1003 -49 67 115 -329 232 -714 184 287 -161 -551 184 -163 -705 -43
4656d3j012J906j302j051L037j938J197j775J267o34J135j918Q22J105j715L42
$$ -43 -1055 851 -451 -1502 1535 -403 794 -981 286 -348 787 -1131 -309 796 -919 -577
4672e77K19L13k22L92k333O55M16O65K08L8l84Q12q12p01J004Q25j215Q81j78
$$ -577 -358 -45 -267 125 -2208 -1553 -1137 -472 -264 -226 -610 202 -610 -1311 -307 518 -697 184 6
4691Fk81Q89N70k94j06j282Q4R30n93p6Q15k766J488m00R01m58J528j132Q35j483
$$ 6 -275 614 1184 890 784 -498 -414 516 -77 -153 662 -2104 -616 -1016 -115 -573 955 -177 658 -825
4711h25kK334j288J50j15r74l55J013n35J257p15O28K08j587J31P92k140K043
$$ -825 -827 1507 219 369 254 -720 -1075 -62 -597 660 -55 573 781 -806 -675 117 -2023 20
4729B0l96k68l63K030j731J918m23j569L35N12o26j565K031J830j729j071J46
$$ 20 -376 -644 -1007 1023 -708 1210 787 -782 -447 65 -561 -2126 -95 1735 6 -1065 -919
4746i19O38K18J267j399j270M95n69J495o87J506j239m4J097n23l14P32j177O31
$$ -919 -281 -63 1204 -195 -1465 -970 -1539 -44 -731 775 -464 -508 589 66 -248 484 -693 -62
4764f2j237K147j342J529j846J393L19m50m70N31j428O66O53o07q02M12R91l87
$$ -62 -1299 848 -494 1035 -811 582 901 451 -19 512 -916 -250 403 -204 -1006 -594 397 10
4782A0l8O12m52K52j058J181l6m53M02J332j324j816P01Q55l85n25P65O26Q5j086
$$ 10 -28 584 132 384 -674 507 471 18 420 1752 428 -1388 -687 168 -217 -742 23 649 734 -352
4802c52J14j84L17j021O54J58Q59j204J284j118j525J484J395L97o51j597q1J363
$$ -352 -238 -422 -105 -1126 -472 -314 545 -659 625 -493 -2018 -534 861 1258 607 -990 -1071 292
4820B92j443K522j238J000q64k03l00N07o87l22J333J53m61q23J640j167n99J375
$$ 292 -1151 1371 133 1133 269 66 -234 273 -414 -736 597 750 289 -534 1106 -61 -660 715
$$ [...]
8191D33
##END NTUPLES=NMR FID
##END=
