##TITLE=1H_SAM_23.173
 CDCl3, 108 sc, 
 18.12.2019
##JCAMPDX= 6.0         $$ Bruker NMR JCAMP-DX V2.0
##DATA TYPE= NMR FID
##DATA CLASS= NTUPLES
##ORIGIN= UXNMR, Bruker Analytische Messtechnik GmbH
##OWNER= root
$$ XWIN-NMR		Version 3.5
$$ Wed Dec 18 14:53:47 2019 Russian Standard Time (UT+4h)  she@DPX200
##.OBSERVE FREQUENCY= 200.121
##.OBSERVE NUCLEUS= ^1H
##.DELAY= (6, 6)
##.ACQUISITION MODE= SIMULTANEOUS
##.ACQUISITION SCHEME= undefined
##.AVERAGES= 108
##.DIGITISER RES= 17
##SPECTROMETER/DATA SYSTEM= spect
##.PULSE SEQUENCE= zg30
##.SOLVENT NAME= CDCl3
##.SHIFT REFERENCE= (INTERNAL, CDCl3, 0, 15.7039)
##AUDIT TRAIL= $$ (NUMBER, WHEN, WHO, WHERE, WHAT)
$$ ##TITLE= Audit trail, XWIN-NMR		Version 3.5
$$ ##JCAMPDX= 5.01
$$ ##ORIGIN= Bruker BioSpin GmbH
$$ ##OWNER= she
$$ F:/spectra/data/she/nmr/H-F/1/audita.txt
$$ ##AUDIT TRAIL=  $$ (NUMBER, WHEN, WHO, WHERE, WHAT)
(   1,<2019-12-18 14:52:27.39 +0400>,<she>,<DPX200>,
      <continue with go, POWCHK disabled, PULCHK disabled
       configuration hash MD5:
       00 E9 B6 7A A2 85 ED C7 34 08 36 98 17 FE 4E 26
       data hash MD5: 16K
       42 4E 57 88 8A A1 57 98 71 27 29 B1 4F 5D 3A 1B>)
$$ ##END=
$$ 
$$ hash MD5
$$ 51 5F 51 B2 2F 80 48 43 CC A6 DF DC B1 01 CF 55
##$RELAX= 
##$RELAX= 
##$RELAX= 
##$RELAX= 
##$RELAX= 
##$RELAX= 
$$ Bruker specific parameters
$$ --------------------------
##$DU= <F:/spectra>
##$EXPNO= 1
##$NAME= <H-F>
##$PROCNO= 1
##$TYPE= <nmr>
##$USER= <she>
##$AMP= (0..31)
100 100 100 100 100 100 100 100 100 100 100 100 100 100 100 100 100 100 
100 100 100 100 100 100 100 100 100 100 100 100 100 100 
##$AQSEQ= 0
##$AQ_mod= 1
##$AUNM= <au_zg>
##$AUTOPOS= <>
##$BF1= 200.13
##$BF2= 200.13
##$BF3= 200.13
##$BF4= 200.13
##$BF5= 200.13
##$BF6= 200.13
##$BF7= 200.13
##$BF8= 200.13
##$BYTORDA= 1
##$CFDGTYP= 0
##$CFRGTYP= 5
##$CHEMSTR= <none>
##$CNST= (0..31)
1 1 145 1 1 1 1 1 1 1 1 1 1 1 1 1 1 1 1 1 1 1 1 1 1 1 1 1 1 1 1 1 
##$CPDPRG= <>
##$CPDPRG1= <>
##$CPDPRG2= <>
##$CPDPRG3= <>
##$CPDPRG4= <mlev>
##$CPDPRG5= <mlev>
##$CPDPRG6= <mlev>
##$CPDPRG7= <mlev>
##$CPDPRG8= <mlev>
##$CPDPRGB= <>
##$CPDPRGT= <>
##$D= (0..31)
0 1.2 0 0 0 0 0 0 0 0.06 0 0.03 0 0 0 0 0.0002 0 0 0 0 0 0 0 0 0 0 0 0 
0 0 0 
##$DATE= 1576666122
##$DBL= (0..7)
120 120 120 120 120 120 120 120 
##$DBP= (0..7)
150 150 150 150 150 150 150 150 
##$DBP07= 0
##$DBPNAM0= <>
##$DBPNAM1= <>
##$DBPNAM2= <>
##$DBPNAM3= <>
##$DBPNAM4= <>
##$DBPNAM5= <>
##$DBPNAM6= <>
##$DBPNAM7= <>
##$DBPOAL= (0..7)
0.5 0.5 0.5 0.5 0.5 0.5 0.5 0.5 
##$DBPOFFS= (0..7)
0 0 0 0 0 0 0 0 
##$DE= 6
##$DECBNUC= <off>
##$DECIM= 4
##$DECNUC= <off>
##$DECSTAT= 4
##$DIGMOD= 1
##$DIGTYP= 9
##$DL= (0..7)
0 120 120 120 120 120 120 120 
##$DP= (0..7)
150 150 150 150 150 150 150 150 
##$DP07= 0
##$DPNAME0= <>
##$DPNAME1= <>
##$DPNAME2= <>
##$DPNAME3= <>
##$DPNAME4= <>
##$DPNAME5= <>
##$DPNAME6= <>
##$DPNAME7= <>
##$DPOAL= (0..7)
0.5 0.5 0.5 0.5 0.5 0.5 0.5 0.5 
##$DPOFFS= (0..7)
0 0 0 0 0 0 0 0 
##$DQDMODE= 0
##$DR= 17
##$DS= 0
##$DSLIST= <SSSSSSSSSSSSSSS>
$$ [...]
##$SUBNAM2= <"">
##$SUBNAM3= <"">
##$SUBNAM4= <"">
##$SUBNAM5= <"">
##$SUBNAM6= <"">
##$SUBNAM7= <"">
##$SUBNAM8= <"">
##$SUBNAM9= <"">
##$SW= 169.965198265933
##$SWIBOX= (0..15)
0 0 2 0 0 0 0 0 0 0 0 0 0 0 0 0 
##$SW_h= 34013.6054421769
##$TD= 16384
##$TD0= 1
##$TE= 0
##$TE2= 300
##$TE3= 300
##$TEG= 300
##$TL= (0..7)
0 120 120 120 120 120 120 120 
##$TP= (0..7)
150 150 150 150 150 150 150 150 
##$TP07= 0
##$TPNAME0= <>
##$TPNAME1= <>
##$TPNAME2= <>
##$TPNAME3= <>
##$TPNAME4= <>
##$TPNAME5= <>
##$TPNAME6= <>
##$TPNAME7= <>
##$TPOAL= (0..7)
0.5 0.5 0.5 0.5 0.5 0.5 0.5 0.5 
##$TPOFFS= (0..7)
0 0 0 0 0 0 0 0 
##$TUNHIN= 0
##$TUNHOUT= 0
##$TUNXOUT= 0
##$USERA1= <user>
##$USERA2= <user>
##$USERA3= <user>
##$USERA4= <user>
##$USERA5= <user>
##$V9= 5
##$VALIST= <valist>
##$VCLIST= <CCCCCCCCCCCCCCC>
##$VD= 0
##$VDLIST= <DDDDDDDDDDDDDDD>
##$VPLIST= <PPPPPPPPPPPPPPP>
##$VTLIST= <TTTTTTTTTTTTTTT>
##$WBST= 1024
##$WBSW= 4
##$XGAIN= (0..3)
0 0 0 0 
##$XL= 0
##$YL= 0
##$YMAX_a= 247231
##$YMIN_a= -180384
##$ZGOPTNS= <>
##$ZL1= 120
##$ZL2= 120
##$ZL3= 120
##$ZL4= 120
##$ABSF1= 10
##$ABSF2= 0
##$ABSG= 5
##$ABSL= 3
##$ALPHA= 0
##$AQORDER= 0
##$ASSFAC= 0
##$ASSFACI= 0
##$ASSFACX= 0
##$ASSWID= 0
##$AUNMP= <proc_1d>
##$AZFE= 0.1
##$AZFW= 0.1
##$BCFW= 1
##$BC_mod= 2
##$BYTORDP= 1
##$COROFFS= 0
##$CY= 11.3945322036743
##$DATMOD= 1
##$DC= 2
##$DFILT= <>
##$DTYPP= 0
##$F1P= 16.9975609425685
##$F2P= -3.02152046262296
##$FCOR= 0.5
##$FTSIZE= 0
##$FT_mod= 4
##$GAMMA= 1
##$GB= 0.15
##$INTBC= 1
##$INTSCL= 1
##$ISEN= 128
##$LB= 0.24
##$LEV0= 0
##$LPBIN= 0
##$MAXI= 10000
##$MC2= 0
##$MEAN= 0
##$ME_mod= 0
##$MI= 1.114404
##$NCOEF= 0
##$NC_proc= 0
##$NLEV= 6
##$NOISF1= 3.799351
##$NOISF2= 2.8
##$NSP= 1
##$NTH_PI= 0
##$NZP= 0
##$OFFSET= 15.70392
##$PC= 1
##$PHC0= -9868.825
##$PHC1= -73.39919
##$PH_mod= 1
##$PKNL= yes
##$PPARMOD= 0
##$PSCAL= 0
##$PSIGN= 0
##$REVERSE= no
##$SF= 200.130013532006
##$SI= 16384
##$SIGF1= 3
##$SIGF2= 2
##$SINO= 400
##$SIOLD= 16384
##$SREGLST= <1H.CDCl3>
##$SSB= 0
##$STSI= 0
##$STSR= 0
##$SW_p= 3612.71676300578
##$SYMM= 0
##$S_DEV= 0
##$TDeff= 0
##$TDoff= 0
##$TI= <>
##$TILT= no
##$TM1= 0
##$TM2= 0
##$TOPLEV= 0
##$USERP1= <user>
##$USERP2= <user>
##$USERP3= <user>
##$USERP4= <user>
##$USERP5= <user>
##$WDW= 1
##$XDIM= 8192
##$YMAX_p= 0
##$YMIN_p= 0
$$ End of Bruker specific parameters
$$ ---------------------------------
##NTUPLES= NMR FID
##VAR_NAME=  TIME,          FID/REAL,        FID/IMAG
##SYMBOL=    X,             R,               I
##VAR_TYPE=  INDEPENDENT,   DEPENDENT,       DEPENDENT
##VAR_FORM=  AFFN,          ASDF,            ASDF
##VAR_DIM=   8192,          8192,            8192
##UNITS=     SECONDS,       ARBITRARY UNITS, ARBITRARY UNITS
##FACTOR=    2.94e-05,      1,               1
##FIRST=     0,             0,               0
##LAST=      0.2408154,     0,               0
##MIN=       0,             -180384,         0
##MAX=       0.2408154,     247231,          0
$$ Real data points
##PAGE= N=1
##DATA TABLE= (X++(R..R)), XYDATA
$$ [...]
2270a31M51N28j509O39L36l94j54N76p68M85Q63r58K78k87n21K94K34L0l70L09
2290f9J5k9r2N7m70O58q7n1o31P89J32p01J23L99m87L62M84j143O13J2m0K14o5
2313gn21L3N62j67p4P66k50o78K03Q20k97r35P31m8r1N8K60r84P37N87o70o09
2335e74M19Q98j091P96m87J41O0l98K30o8K63k2m17P50r57N5M55l9M14r61O27
2356I4l34K53P3j04K33J05L39p79l14R09p20mN43o40k29L24oj09N5N30p5J48l87
2379i5m72Q37J45r42M25M23k72m68N73k81P11l41j27l17j68J91j75k3M71J2m96
2400c89Q46j091K13R66j033N42J30M0n81M05L47m46l78P70o5N4o65N46m76j40
2420d05J49Q07k78k23j8m75M57l74J95J48N45o77P55k78J01p52L9L63k91O71q41
$$ plain form
2270 -131 320 848 -661 -22 314 -80 -234 342 -426 59 922 -36 242 -45 -566 -272 -38 -8 -378 -69
2290 -69 -54 -83 -175 -118 -588 70 -17 -68 -699 90 222 -479 -356 43 -444 -82 402 -741 -128 -116 -156 58 -7
2313 -7 -528 -495 67 -100 -174 592 342 -336 -133 687 390 -545 186 138 47 105 365 -619 118 705 35 -574
2335 -574 -155 743 -348 448 -39 102 162 -236 -6 -74 189 167 -250 500 -457 -402 53 14 428 -533 94
2356 94 -240 13 86 -18 215 320 659 -120 -434 475 -245 -249 294 -346 -575 -251 -257 -366 -311 219 144 292 -95
2379 -95 -567 270 415 -527 -102 321 49 -419 154 -127 584 243 116 -201 -369 -178 -353 -376 95 107 -389
2400 -389 457 -634 -421 545 -488 54 184 224 -357 48 395 -51 -429 341 276 330 -335 211 -265 -405
2420 -405 -256 551 273 50 32 -443 14 -360 -165 -17 528 -149 606 328 429 -323 -284 79 -212 459 -382
2441c82q4L28O99q13qM11n05J17M45Lm26R69n97l07l28N07p48Q00J5k35M96L30
2463F87j086L14L88j27m42M49J21p88R03Q2o63J36jL95m74J4j86J4M4K18J12P3
2485A83K20o54M78J01q31N47k29M83m56p9Q01o62l8O1l48K08K09j3q37Q68J35
2506A47n02M01Kl73n9M66P4k85O14q15k58P48l1l51l0L30l81J96J43j08M01m06
2528g7kj80K82J8n7o58J38N19p31J96K77o33R51J1O6M46n60j74K60O4k95J68J37
2551A66n67M68N87p11K19k95j70K96M55m31o0o4K93L08J88p77m59K84Q62j20n88
2572a16j27J041j004k40N73n28L64j2L49m53P42o51lL81p66P13j00kp95Q87l51
2593i8l13N04l76M73o71L68j1J11O5J81m61M07K06l79m31O19l78l40P00J42J33
$$ plain form
2441 -382 -466 -138 561 -252 -260 151 -354 -237 208 211 -215 754 157 -150 -478 29 -719 81 96 -139 357 687
2463 687 -399 -85 303 176 -266 183 304 -484 419 501 -162 -26 -27 368 -106 -92 -278 -264 -220 -2 110 183
2485 183 403 -251 227 328 -503 44 -185 298 -158 -237 564 -98 -136 -75 -423 -215 -6 -19 -856 12 147
2506 147 -355 46 48 -325 -384 82 156 -129 485 -330 -588 160 129 -222 -252 78 -303 -107 36 -72 329 -77
2528 -77 -79 -259 23 41 -16 -674 -536 -17 -748 -552 -275 -908 43 54 120 566 6 -168 92 156 -139 29 166
2551 166 -401 67 654 -57 162 -133 -303 -7 448 17 -43 -107 186 494 682 -95 -554 -270 592 472 -116
2572 -116 -243 798 -206 -446 127 -401 -37 -49 300 -153 589 -62 -65 316 -450 263 163 161 -634 253 -98
2593 -98 -411 93 -283 190 -481 -113 -124 -13 52 233 -228 179 385 6 -425 194 -184 -524 176 318 451
2614D51o04M61p37L21p32M59k18M59J47J7L88m63l64M2O43r61N49J4O7J77J01
2635B17J65o47P9J91J1J19J47o70P43M3n09P23o55L39q54R98R6l68o8n63l81J094
2657B50l93P01o20n05N56Q69n13O0m17L96n24Q1P24r98L09l92R48p90K02K6l2
2678f2Q39r91M84k44k60Q79m23l35j02L66J71m04K70M61o39L09l84N48o36l8L10
2699A19r8j79q97J302n80L80L85m10m01R0K08M38k57M11j037K09P83q99N67l9
2719I5m40M35O7j00l85L72K21k07m17M19O08r31m5k65O16j00J38M86l74J0%o2
2741A41j25K84k54M11J31p98L76o08M35k23k1O03m23M37j35k99J82J41o85k18
2761f48J431j409P49J42k73J49M85p79O1K1R46r87l17P07k28J36n21P52p71K13
$$ plain form
2614 451 -153 308 -429 -108 -840 -381 -599 -140 7 24 412 -51 -415 -373 270 -691 -142 -128 -61 116 217
2635 217 382 -265 -186 5 16 135 282 -388 355 398 -111 612 -43 296 -558 440 536 168 100 -463 -844 250
2657 250 -143 558 -62 -567 -11 858 345 405 -12 384 -140 -59 665 -333 -24 -416 532 -258 -56 -30 -62
2678 -62 777 -214 270 26 -234 645 222 -113 -215 151 322 -82 188 649 10 319 -65 483 -153 -191 119
2699 119 21 -158 -1055 247 -333 47 432 22 -379 -289 -81 357 100 511 -526 -317 466 -433 134 95
2719 95 -345 90 157 57 -328 44 265 58 -359 60 668 -263 -308 -573 43 -57 81 567 193 203 203 141
2741 141 16 300 46 457 588 -210 166 -442 -7 -230 -251 352 -71 366 231 -68 114 255 -430 -648
2761 -648 783 -626 123 265 -8 141 626 -153 -92 -71 875 -112 -429 278 50 186 -335 417 -354 -141
2781a41L29q6k31K57m79J18J51J53r0K32j2l4j96k32L10o11N70k42M62J56j87
2802A97l84N59j21k62K02M19r81J32M2L99m67K77o59P3Q55L11p73L71K2K64m45
2823C1k34K50R2J51l96K24k78O73o95P29n21o23M02P94m38L30j098P51o38N25
2843C1l35k77L34J69l11K8M55m77N31j68J70K47l03l4j19J0M89o91P4J07k83M16
2865F3L3m79j51L78M74m06L31K22r77K86O10j030M16J68J67j68L91m30K81k52
2885g3l06O56p35P77q67R05l79K40R6J82L6q26R8N64o34L6L29o2n6l60j34R27
2907D14J4k02j57L70o63j50P55n86j58L42j02L52q6k69M44k80m08K82p7k24K11
2928a78k06J68o7N30L3j36J16p24j38Q43n61M8M00J5O8k3L16mj62k83L0K51k44
$$ plain form
2781 -141 188 102 -129 128 -351 -233 -82 71 -19 213 201 167 -29 -261 49 -562 8 -234 228 384 197
2802 197 -187 372 251 -11 191 610 -371 -239 -197 202 -265 12 -647 -574 281 592 -181 190 212 476 31
2823 31 -203 47 139 290 -106 118 -160 513 -182 547 26 -597 -195 599 161 491 -607 144 -494 31
2843 31 -304 -581 -247 -78 -389 -361 94 -383 148 -20 150 397 94 60 -59 -49 440 -251 -177 -70 -353 63
2865 63 96 -383 -534 -156 318 -88 243 465 -512 -226 384 -646 -230 -62 105 -63 328 -102 179 -73
2885 -73 -379 277 -458 319 -548 357 -22 218 314 496 532 -294 -196 368 -266 -230 99 37 -19 -379 -513 414
2907 414 428 226 69 439 -224 -374 381 -205 -363 -21 -123 229 143 -126 318 38 -370 -88 -165 -389 -178
2928 -178 -384 -216 -283 247 280 144 260 -464 -602 241 -320 -272 128 143 211 188 504 500 338 55 85 336 92
2951I2o00O02L22p39j70J120o92M72J47l85o07J010j0n74J67k75p7M92m76K49
2971F8m65L32J14j75J44p6K63m7j54N25o03M15m05l23N97O7n47Q0q3M28l83L80
2993A52j11l51K31j04M16k15N01Q6m70m67k24K80K78L8k50J0k29n9O08M57l42
3014B35k01J59kn22L55k75O47n12l69K22M61l87L38j01J53m53K3L30L8k25J16
3035C0L30o13N79m4m73k58M45l74N44K01q49N93j41QL87m82N20l68J13l71K28
3056ER5m88P06k64j45l05Q2O67l77L2k61K29M60l70R2k19N13o35j32N28Kk95J5
3079f5N5OK36j36L9n36O68l94J32L5j2j10k55J195r00J12k23J77K9m04L33l90
3101d08Q38Kk90J16J96n79R1M1K03l78j57M49R3j11k65L89l15L65m58j05J43k8
$$ plain form
2951 92 -508 94 416 -323 -493 627 -65 407 554 169 -438 572 562 -12 155 -120 -197 295 -181 68
2971 68 -397 -65 49 -126 18 -58 205 158 4 529 -74 341 -64 -387 210 277 -270 -190 -273 155 -228 152
2993 152 41 -310 -79 -183 233 18 519 605 135 -332 -556 -276 2 40 -210 -200 -429 -488 120 577 235
3014 235 34 193 191 -331 24 -251 396 -116 -485 -263 198 -189 149 48 201 -252 -229 101 139 -86 30
3035 30 360 -253 326 282 -191 -449 -4 -378 166 367 -482 111 -30 -22 365 -117 403 35 148 -223 5
3056 5 100 -388 318 54 -91 -396 -314 353 -24 8 -253 -24 436 66 158 -61 452 -183 -315 213 215 -80 -65
3079 -65 -10 -4 232 96 135 -401 267 -127 5 40 28 -82 -337 858 -42 70 -153 24 53 -351 -18 -408
3101 -408 430 432 142 258 454 -125 -34 7 210 -168 -325 124 217 106 -159 230 -85 280 -178 -283 -140 -168
3123a68R2k58M11N2Q1n96K06J15j93O77n39j87M62o1j67L70j177R38k35l35O13
3144A01l03O25o78j76L32m8K9j43jL12j68J00m20m9P19k58m52O60l08J59K59m95
3166b03M95k27k63P5m66N63L49l02M15l35m03P68l49k99K4L2M79R7p15j67K69
3187a63J24k2m03L34o4m33Q40N2k72j21l57K5j32J256j158Q68k05o2J93j37j53
3208A0N1j19J59l5O3j8l88N35J77k69M5m04N29r4Q3k07m3o10O14M6o68K94m06
3231f55J04M40L54p31L49R20q39J70lk07J14k49N20j99k57L29p7p53N50J07j08
3252a21L5L60m81k16J22P61l11J74l46L21j49j58M23J80O6l76l08kl93M52L10
3273C43N60l40p27M91m88L45J53j50m43L10k45L02o03K22P17k72l23l42M66k70
$$ plain form
3123 -168 -76 -334 77 129 210 -386 -180 -65 -258 419 -120 -307 155 94 -73 297 -880 58 -177 -512 101
3144 101 -202 423 -255 -431 -99 -147 -118 -261 -262 50 -118 -18 -438 -487 232 -26 -478 182 -126 33 292 -203
3166 -203 292 65 -198 -123 -589 -26 323 21 436 101 -302 466 117 -182 -158 -126 353 450 -265 -432 -163
3187 -163 -39 -61 -464 -130 -194 -627 213 265 -7 -128 -485 -460 -592 664 -494 374 169 107 300 163 10
3208 10 61 -58 101 66 129 111 -277 258 435 166 211 -193 336 242 325 118 75 -535 79 125 -543 -249 -655
3231 -655 -551 -111 243 -488 -139 781 -58 112 109 -98 16 -233 287 88 -169 160 83 -670 -120 -13 -121
3252 -121 -86 274 -207 -423 -301 460 149 323 -23 298 149 -9 414 594 660 284 -24 -26 -419 33 343
3273 343 903 563 -164 327 -161 184 337 187 -256 54 -191 111 -492 -270 447 175 -148 -490 -24 -294
3293b94l69M20J54j34L85l25j19L21O19p13K3KL66k86k66j27j66P78k96P5j00
3314e2q2J98L49O7j36k2m11J30l64P34o94J55J57K70m46L05r7k50K61R3m01N55
3336C19n48n4j14J39J77K04K43q07M48O30j106j84O16k4M14n18l8qk87M01m0O32
3358D95p90K91J97n19J26M69L5j016M04O66l61q5N6k60N4J68K57k06M42n23j00
3379b00N7L67k70J14j05L37j86j28L64J43j6m35j1m1r15M10R10p49N8O99p80N52
3401A75J15J73n81M34L29r21P87m86n0K38j64m4O52r12J90l57L84P29j027K94
3421d2L41k5l10J91k58j80l66L66N19l00N37k94K74r4J3p61L07K87k54M40m98
3442a07M30j63l5J0k43j57J013r59J76l9k98N08l43N52l6K26n50RJ02K41m37M29
$$ plain form
3293 -294 -663 -243 -89 -223 162 -163 -282 39 658 -55 -32 -30 336 50 -216 -343 -509 269 -27 48 -52
3314 -52 -134 64 413 480 344 322 -89 41 -323 411 -283 -128 29 299 -147 158 61 -189 72 165 -236 319
3336 319 -229 -283 -397 -258 -81 123 366 -441 7 637 -469 -653 -37 -61 353 -165 -203 -211 -498 -97 -137 495
3358 495 -295 -4 193 -326 -200 269 304 -712 -308 358 -3 -88 -32 -292 -238 -70 187 -19 423 -100 -200
3379 -200 -143 224 -46 68 -37 300 114 -14 350 493 477 42 31 -10 -925 -515 395 -354 -296 403 -377 175
3401 175 290 463 -118 316 645 -276 511 25 -25 213 49 5 657 -255 -65 -422 -38 691 -336 -42
3421 -42 299 274 -36 155 -103 -283 -649 -283 236 -64 473 179 453 359 372 -389 -82 205 -49 391 -107
3442 -107 323 160 125 135 -108 -265 748 -211 -35 -74 -372 136 -207 345 309 535 -15 -6 96 337 -100 329
3464C29m89M69O8m94N69j86m23j85L49J80O11p63O85m53k49J26J06j77K86l53
3484FM02j66l92j84P40m41M0M11l14NNl42J48M05m73K4M31p02M80Q5m55R83o79
3507A7k2J06K8l50L66k27j7L53L2l58K28j62l8o01L78J71q1l01P14l92N42m92
3529a06j35L12K79k04j8K2n13J76N68m35K77O0j22n68L04L97l14j7J07k96Q0o9
3551b15j20P30p04K62k30O7L51k53L39o10M74P5P1n76J54m01L23L38l72N56l58
3572i9m5k4L27l66J95k07l21N41n42k16O70M7J65L44j67p75N81j31k3L96j4k32
3594A04J17k16m57K9M21k02l8N38n4m56M11j28l80M08J71j0k4R5m17K34o39O15
3616A22K20J2l44K69j6k0j62l75m6q1P78q65K73P14m67L03r40K86O68p94Q50m56
$$ plain form
3464 329 -160 309 377 -117 452 266 -157 -342 7 187 798 35 720 267 18 144 250 73 359 6
3484 6 408 242 -150 -334 406 -35 5 416 102 107 112 -230 -82 323 -150 -126 305 -397 83 168 -287 696 17
3507 17 -5 101 129 -221 145 -82 -99 254 286 -72 156 -6 -44 -645 -267 -96 -177 -478 236 -156 386 -106
3529 -106 -241 71 350 146 128 150 -363 -187 381 -54 223 283 161 -407 -103 294 -20 -37 70 -226 -146 -215
3551 -215 -335 395 -309 -47 -277 -210 141 -112 227 -383 91 166 237 -339 -185 -586 -263 75 -297 259 -99
3572 -99 -144 -168 159 -207 -12 -219 -540 1 -541 -757 -87 -40 125 469 302 -473 108 -23 -46 350 336 104
3594 104 221 5 -452 -423 -2 -204 -242 296 242 -214 197 69 -311 97 268 258 234 329 -88 146 -493 122
3616 122 342 354 10 279 263 243 81 -294 -340 -421 357 -508 -235 479 12 315 -625 -339 329 -465 385 -71
3638g1J0K42n64L53L53q07L81K07l37K80k69l0p7k1J29m09O44P6J28n93K57k30
3660c48P4K12J78k86K6o3N6j44N49k41m06N04L20k39l86J45J29J69l19K2j52M1
3682a59r7R15p67N79j77L97p61k04P09j24O5k44J50k7l75L85r2J42k92K49k64
3703HL66n92M72j49m61J99M18p61L30L05o11M97L98o95M66k61K81m75L51n47J389
3724I28j058k33J11k6j01K35N32r52M87l0j55M70n51N50m64L37M5O2o34N22p7
3745bL08l2J39n59L60n77K62n1j5k87N99M43k35J78l37j11J75k84K4J9j62K36
3767I1k57Q48k49o5l78M78n26J32L31m23J7K2P5m1N48j553J354o71N38j17O3K82
3789D99l17j97j70M94l39L88K00j332L74J12K46K18j38Ml5L80k97J49k1q0J21
$$ plain form
3638 -71 -61 181 -383 -30 323 -484 -103 104 -233 47 -222 -252 -329 -350 -221 -630 14 90 218 -375 -118 -348
3660 -348 -274 -62 116 -170 -144 -207 -151 -295 254 13 -393 111 431 192 -194 -49 80 249 -70 -48 -200 -159
3682 -159 -256 659 -108 471 294 691 -70 -274 435 311 376 132 282 255 -120 265 173 315 23 272 8
3703 8 374 -218 254 105 -356 -157 261 -500 -170 135 -476 21 419 -276 190 -71 210 -265 86 -461 928
3724 928 -130 -363 -252 -278 -379 -144 388 -564 -77 -107 -262 208 -343 207 -257 80 125 187 -447 75 -2
3745 -2 306 274 413 -146 214 -363 -101 -152 -167 -454 145 588 353 531 194 83 258 -26 -2 17 -145 91
3767 91 -166 682 433 368 -10 468 -58 74 405 -18 -1 21 96 55 603 -950 404 -267 271 154 217 499
3789 499 182 -15 -185 309 -30 358 558 -774 -400 -288 -42 176 38 42 7 387 90 239 218 138 259
3810B59o99K34L06R9j58l35Q63P4l58m94J01j84q3P62n49J62L3l52K1P61n72k03
3832c12K88k43j80J22K99M53l47k25K8O08m11J17K47m01l5K37N93o85P11r75M71
3853C60m32j21K27P82j325K16L68J17M61p89N13lm39j34N33m77O57k68m27M69
3873B88j37k9n3m00O90o64K65j91N65l11n17M01L3j75n51Q06O1K4n5K36k29N25
3895E82m1l54m3j98K48j98l23P73k68m63k56R34m79J11k38L23k86k02Q28j79m45
3916a74J52R5k54K59L1n54N33K75n91n7J23N45o93M2M24o7o8j13l81P23n36p0
3938c56L84j57m5j05P66m67Q5l7k93M97o61O65M10p95L39L14P1k53m7p45O45k04
3960A1N51o59M76N7q86J267m27k82m91J80L22M02l64L73q27K93n49J209j39o05
$$ plain form
3810 259 -440 -206 100 199 41 -294 569 643 285 -209 -108 -292 -375 387 -162 0 33 -319 -298 463 -109 -312
3832 -312 -24 -267 -447 -325 -26 427 80 -145 -117 491 80 197 444 43 8 245 838 153 864 -111 360
3853 360 -72 -193 34 816 -509 -293 75 192 653 -136 377 374 -65 -199 334 -143 514 246 -181 288
3873 288 151 122 69 -331 359 -305 -40 -231 334 23 -494 -93 -60 -235 -786 20 81 105 50 286 57 582
3895 582 541 187 144 -54 194 -4 -327 446 178 -285 -541 393 -86 25 -213 110 -176 -378 450 271 -174
3916 -174 -22 73 -181 78 109 -445 88 363 -228 -285 -162 383 -310 -268 156 89 21 -92 -473 250 -286 -356
3938 -356 28 -129 -174 -279 487 20 105 68 -225 272 -389 276 686 -109 230 544 615 362 315 -430 215 11
3960 11 562 -97 379 436 -450 817 390 108 -383 -203 119 521 157 530 -297 -4 -553 656 517 -88
3980h8M38m59M32l56k34K19m1K04m5j06M88j26l49m47R08n80J60l27j72J35K10
4001a36M68l03L04o89J03J33m1J11j66N03K54k91k86o2L18j35n1j26K89K34p83
4022c52J93N09p59K08M72P54r11q3L6L87l05m8q3k11K41j54N09l57l30L85m63
4043c62N74o41N84K18q76L33j52q3P02o36L61O8J87l42j89K94K3P4J13k22m88
4064d60K54K73j89l6K37J52K25p5n93o32N73K99j99M27J11O4r6J71R9p8m52k11
4086a36K07k52J10j88K81N00j000J45j42L73O09n84M23k90j54N7M29k26R1o99
4106d46K79QL96l67M08p15P8M77K05j00l63L54m4o42P67l76K24L34r72Q78l4m46
4128i7q1N47k58n04j45J181j248K81J0J349p67p72J94j12Q59l32J34Q4J9o50M75
$$ plain form
3980 -88 350 -109 323 -33 -267 -48 -89 115 70 -36 452 326 -23 -470 438 -142 18 -309 -481 -346 -136
4001 -136 332 29 333 -356 -253 -120 -161 -50 -216 287 541 250 -36 -98 220 85 34 -92 197 431 -352
4022 -352 -159 350 -409 -201 271 1025 114 31 67 454 149 101 18 -193 48 -106 403 46 -284 101 -362
4043 -362 212 -429 155 373 -503 -170 -322 -405 297 -339 22 90 277 -65 -254 40 63 137 250 28 -460
4064 -460 -206 67 -122 -158 79 231 456 381 -212 -844 -271 28 -171 256 367 431 335 506 605 527 75 -136
4086 -136 71 -181 -71 -259 22 522 -478 -333 -475 -102 507 -77 346 56 -98 -41 388 162 253 -446
4106 -446 -167 -159 237 -130 278 -437 -359 118 323 223 -140 214 170 -472 295 -81 143 477 -495 383 349 -97
4128 -97 -178 369 111 -393 -538 643 -605 -324 -314 1035 268 -504 -310 -422 437 105 239 323 342 -308 167
4149A67K86j89r58Q19J28l02M92l71r43L63Q69m48J25M5K46p00N03J38q8k23L52
4170C11L92n24K46l94j17Q2j87L16j04m07M63j81N79m55K32J49m25J87l20R0m4
4191a11J92p3M89j440J101k09N4N9k4n9o8K57m70M59l12M31q18M89K48n43N50
4212B02l97M47l73p8O61n73K35n15l2P40j89q5l63J89R6J17k70L27n11L38k2j01
4234a57j45N51l81L38k79j2k14O66L78q37K16N9K6l68l25N8N48k31j29M85l14
4255f7K77k58K85m31J29J42j59P4P1M10m41m16N76l61j82j92K25K23M59n01Q6
4276e1k40M28M3K52l00l30N16k72R9k45q1K26m9L52L48j163l7Q1J051p15p02R53
4298A64q42Q11j42R4K9j82J68M7K46K83o03K7K37K0n99Q73p95L92K69l27r4m83
$$ plain form
4149 167 453 264 -694 125 253 -49 443 72 -871 -508 361 -87 38 83 329 -371 132 270 182 -41 311
4170 311 703 179 425 31 -86 -4 -191 125 21 -386 77 -104 475 20 252 401 -24 163 -157 -67 -111
4191 -111 81 8 497 -943 158 -51 3 62 38 -21 -89 168 -302 157 -155 276 -542 -53 195 -348 202
4212 202 -195 252 -121 -199 462 -111 124 -391 -423 317 128 43 -320 -131 -35 82 -188 139 -372 -34 -56 -157
4234 -157 -302 249 -132 206 -73 -85 -299 367 745 -92 124 183 209 -159 -484 -426 122 -109 -238 247 -67
4255 -67 210 -48 237 -194 -65 77 -82 -8 63 473 32 -384 192 -169 -351 -543 -318 -95 364 -137 -51
4276 -51 -291 137 180 432 132 -198 318 46 145 -100 -181 45 -4 348 696 -467 -504 -423 628 -87 -789 164
4298 164 -678 133 -9 85 114 -68 100 147 393 676 73 100 337 357 -242 631 -164 228 497 170 76 -407
4320d07L59j64L22n94M65K26m17m00M23l50Q61l74K95k37lj79R8n32O24j7J80
4341A79k08R7j40L71p61PL00m6N38j0J50j014L25L68l40J76K89M31o72K93m60
4362a27L37p07O97j67n45L98L88j188J159k95J4R4P1n11L10p5j60M99l54J34M91
4383D63k09j26J59q94J62O02J6k23m63O14r95P70K41M56k92r33R48L05j037P17
4403B81l46P3j62j3M03n51K88J44m64L08O17M5p61J04j06o13M71J195r87J72K20
4424C18l9k62l20M40j03Q8m56K68M27n48J126n63m88l10N73m61J19o8Q72j157
4444e44L93q6j20J109n46k5j46k81l56J422o46l96K71k52L60k49n19M46j71N00
4464A64l24L3M70rm29O5k36L42Q1j86J57p29q1N60j60O91q59P89j18m66L9J52
$$ plain form
4320 -407 -48 -212 110 -484 -19 207 -210 -610 -187 -537 324 -50 245 8 5 -174 -76 -608 16 -1 179
4341 179 -29 68 -72 299 -462 -455 -155 -201 337 327 477 -537 -212 156 -184 -8 281 712 40 333 -127
4362 -127 210 -497 200 33 -512 -114 274 -914 245 -50 -36 58 129 -382 -72 -147 -307 192 -162 -28 463
4383 463 254 128 287 -607 -445 157 173 -50 -513 101 -894 -124 117 573 281 -652 296 601 -436 281
4403 281 -65 8 -154 -167 236 -315 -27 117 -347 -39 578 623 -138 -34 -140 -753 -282 913 -74 98 318
4424 318 279 17 -303 137 34 122 -334 -66 361 -187 939 376 -112 -422 151 -310 -191 -259 613 -544
4444 -544 -151 -237 -357 752 206 181 35 -246 -602 820 174 -222 49 -203 157 -92 -611 -165 -336 164
4464 164 -160 -127 343 334 -95 -30 -266 76 157 -29 128 -601 -682 -122 -282 409 -450 339 221 -245 -206 -54
4486e4K02n68J85M24M36j43k40j42j61L01n48J24J94m7j97K99m78M82m46J00P56
4507D79l26L49l40o63O36Kq31P45N8L69o45n74O7Q31l0K00l72P9K7M59o22m67
4529e69N89l7L58p59Q52l49r08O43L88jM0q2m05R5L57k43r4K99j60J8m20K44K21
4552G7O28k02j37n58L89o88L00M42L14o35m01L17M12o64k61P53j79l97P23k97
4572f4M14k50l15M48O6L0p01O55o0n20J95J72l25O98j237J094m93M58m00j20P96
4593E41n11k78N9O62m59N42p17NON22o46K59k13M50n94P53m83L67n7m25K84m52
4615c85L30Q1m03k8n28J160K56n57L19n03J042n16n24L74K03n64M48l12K67L15
4635D75j040M77M4L38l84n5K73l93M80L28m50K50r86M57j10L11j57k93N88q7L16
$$ plain form
4486 -54 148 -420 -235 189 625 482 242 100 -61 240 -308 -184 10 -37 -234 65 -413 69 -377 -277 479
4507 479 153 502 162 -501 135 137 -694 51 109 478 -167 -741 -674 157 127 327 -45 34 61 520 -102 -569
4529 -569 20 -17 341 -418 434 85 -823 -180 208 207 247 165 -240 -145 212 -31 -125 174 14 32 -388 -144 77
4552 77 705 503 366 -192 197 -491 -191 251 565 -70 -471 -154 258 -406 -667 86 -93 -490 233 -64
4572 -64 350 100 -215 233 299 329 -372 283 223 -297 -102 70 -255 443 -794 300 -193 265 -135 -255 541
4593 541 30 -248 -189 473 14 556 -161 -156 -150 372 -274 -15 -228 222 -372 381 -102 265 208 -217 67 -385
4615 -385 -55 26 -377 -405 -933 227 483 -74 245 -258 784 268 -256 118 321 -243 205 -107 160 475
4635 475 -565 -88 -44 294 -90 -145 128 -265 215 543 93 343 -643 -186 -296 15 -142 -435 153 66 382
4656C82j65k02K32q9L31n67k43O36Q9n78K99p3l90M72j72JK02q6j75m6J83L47
4678C88q24L80J25K41ml92k12Q81n91m28M46o77N63K78m1m70M32j87N60k92r9
4699G7j48J46L8m86O92k68L03l25q1K96j34k84K03l46O74K13l69p28Q08n71J08
4720a82R5K04r4Q08j383Q04k0m04N93k23L0p60P15K34k08j7k06m30P07L52r56
4741c41J70m65N20m01K89N56o08j76O27J61j64n09P38m10K82k40m6M80n08k32
4761b77M0K05L23p75l5Q5M65j46O5J99l3j38j93N69l90K33n31K93J50J59p41K95
4783a78J35m98Q9k7K8M22O8M13n48O3Q8O8l15K50l1J97K50o38J05k40K99K91l67
4806g6mK01K22n83K47J12k59N41m12J36l64M92N04j043O53l04J02r4O4q5r3l22
$$ plain form
4656 382 217 15 247 158 489 -78 -321 315 404 -174 125 52 -338 134 -38 -37 165 79 -96 -142 41 388
4678 388 -436 -56 69 310 306 -86 -298 583 -8 -436 10 -667 -104 174 133 -337 95 -92 468 176 77
4699 77 -71 75 113 -373 319 51 354 29 -52 244 110 -174 29 -317 357 570 201 -527 281 -290 -182
4720 -182 -87 117 23 831 -552 252 232 -172 421 198 228 -532 183 417 209 192 -14 -444 263 615 -341
4741 -341 -171 -636 -116 -517 -228 328 -280 -456 171 332 168 -341 397 -13 269 29 -17 463 -45 -277
4761 -277 -237 -32 291 -484 -519 -434 31 -115 -50 149 116 -22 -215 354 -36 197 -334 -41 109 268 -473 -178
4783 -178 -43 -541 -452 -479 -451 -29 39 452 -96 -33 55 123 -192 58 27 224 474 -164 -59 -299 0 291 -76
4806 -76 -80 121 343 -240 7 119 -140 401 -11 125 -239 253 757 -286 367 63 165 71 135 50 -43 -365
4828c65j15K65L91M46o03n79N43k33K74L47j77O0l75K46L59m37n2k33K96N53n81
4849C0j74K80l35j61K96q81N46J74J19M3P23n58j98L15J4J32p24N11k69K43m68
4870c42m21N93l50M68j89j91N61J99n91M78j60m78J61J6O0O86k55k36K82O22r88
4891g5j3k3J75R5m47J50J31J31R9j56j57L98m7n72L93J05q7o1M84q24K31qK6j89
4915b41N53p04P01K21n47M17j80o53O54l12J45J42O34r79NM17p19j41N90K76n96
4936c17L12M55n06R2K81o47P93q32J04L2K52p4N2k44o2n9j91K30L28M63k99n6
4958A07n00O84l40k07k38J97K09M08k46J30j44q6l42J31M32l55K3Q5J70N16j138
4979e04J292j596J304r67N13k76P27l36l95J75J1p5M90k0l37J58j55J60L13N5
$$ plain form
4828 -365 -480 -215 176 622 19 -560 -17 -250 24 371 194 254 -121 125 484 47 -5 -238 58 611 30
4849 30 -144 136 -199 -360 -64 -945 -399 -225 -106 -63 660 102 -96 219 233 365 -359 152 -117 126 -342
4870 -342 -763 -170 -520 -52 -241 -432 129 328 -263 215 55 -423 -262 -246 -186 500 245 9 291 913 -75
4891 -75 -88 -111 64 159 -288 -138 -7 124 223 67 -90 308 261 -311 82 187 100 39 523 -301 -70 -78 -52 -241
4915 -241 312 -392 309 530 -17 400 220 -433 221 -91 54 196 830 -149 -144 273 -446 -587 3 279 -317
4936 -317 -5 450 -56 36 317 -330 463 -369 -265 -233 19 -55 -3 -247 -309 -368 -559 -329 -1 462 163 107
4958 107 -393 291 -49 -256 -494 -297 -88 320 74 204 60 -26 -368 -237 195 -160 -137 -52 118 634 -504
4979 -504 788 -808 496 -471 42 -234 493 157 -238 -63 -52 -127 363 343 6 164 9 169 482 537
4999E37q88P3O17l60m4l04O53l17m75J79P33K80p57k0p05J032m42M68l2k34j05
5020a11J18M63o11J89k05M35N1q46P54j36M14l13k49K03n22K79L09k11j4j70M38
5041B65k56p4m05j84m7J055o79O49o02P46o46M79l91L2n97N57L78k10K07M5K86
5062F08n23k41K58l27p8M83n1L88n80l19O07k25J14n5l10M33m99N71K14q09N21
5083A80j95q6pk77N09j38J8l3L51K95m11j26l62M58n74K59j97J086q74k10O01
5104B67j03J66j06j074O89R4L41l6l36L64L6R3n77K23N03j32l81M8m72P73O9n02
5126e3m78N65n03L33K00m28O25l37l67J57M86L10k82J23P1o47m7K84m06R11q48
5147c31j48j80O81J60m02Q01j119Q97m81L23K14q62O17n55k5K81N87o57L06lp02
$$ plain form
4999 537 -351 -278 339 -21 -65 -369 284 -33 -508 -329 404 684 -73 -93 -798 234 -208 260 228 -6 -111
5020 -111 7 470 -141 48 -157 278 329 -517 237 101 515 202 -47 156 -366 -87 222 11 -3 -173 265
5041 265 9 -65 -470 -654 -701 354 -325 324 -278 468 -178 301 -90 -58 -655 -98 280 70 277 322 608
5062 608 85 -156 102 -225 -303 180 129 517 -63 -382 225 0 114 59 -251 182 -317 254 468 -341 180
5083 180 -15 -101 -108 -385 124 -14 4 -29 322 617 206 80 -282 176 -398 -139 -336 750 -124 -334 267
5104 267 164 330 224 -850 -161 -67 274 238 -98 266 302 395 -182 41 544 412 31 79 -393 380 449 -53
5126 -53 -531 34 -469 -136 64 -364 261 -76 -443 -286 200 510 228 351 422 -225 -272 12 -394 517 -331
5147 -331 -479 -659 22 182 -220 581 -538 359 -122 201 415 -447 170 -385 -410 -129 458 -199 107 104 -598
5168e98J016l67l20o0K96M70o97M07o95K49j2o29P81l43M61j91L74J41J51r8m68
5189a32k08O52q23P12K40k08k38L30j43L53j065J3M40j34o0M73k64l38O41k00
5209D1m1k0m2m63J20O39p04P74k54L37m93K14Q1K6K02p99j28J59m48N77N44q16
5231d94K67O77m11k77l11P19j01j34J25k47M58m24O1p0L78l71l00M58K08n79J44
5252b24mK29M98l81L86n57K08p78Q37J8m73J82M07J62o95O39m34O9J24J52n36
5273a71J11L32K4o32L39r7m85P35m0n27K24L91l66k25R41l27n7K33o2l38N06p72
5295b63K94n32L08L06j02k08R8R7m23L91J1M49l38l85J78K97P7m59M58q69J110
5316D95n36o6Q62j030K1N97m4o19K21R5K21R0k36J44N3Q6O6J56n59j47J94l75
$$ plain form
5168 -598 418 51 -269 -329 -33 437 -260 147 -548 -299 -311 -940 -159 -502 -41 -232 142 283 434 336 -132
5189 -132 -340 312 -511 201 441 233 -5 325 182 535 -530 -517 -77 -211 -271 202 -62 -400 241 41
5209 41 0 -20 -62 -525 -405 234 -470 304 50 387 -106 108 189 215 417 -382 -510 -351 -799 -222 322 -494
5231 -494 -227 450 39 -238 -549 170 69 -65 60 -187 271 -153 -92 -162 216 -155 -455 3 211 -368 -224
5252 -224 -228 1 499 118 504 -53 155 -623 214 232 -241 -59 348 510 -185 454 20 89 213 365 -171
5273 -171 -60 272 296 -336 3 -94 -579 156 116 -411 -187 204 -162 -387 554 227 170 403 341 3 509 -263
5295 -263 31 -501 -193 113 11 -197 -99 -2 -425 -34 -23 426 88 -297 -119 178 255 -204 254 -615 495
5316 495 -41 -107 755 -275 -254 343 299 -320 -99 -4 217 307 71 215 268 354 420 576 17 -130 64 -311
5338c11J55Q9m03N67l03K65m96M49j55P08m29K89o19J6jj70J9K83N60m09L70l30
5360A44j07N1j31J88l48k53K26j36N39m38O7J62J15j4j17j85K57J00O2j93K0K79
5382B88M65l94k72j81O66k0l23l18K78N90n26r15Q30n7m75N6P92m56l97P10m07
5403f6n13O71j05J47j55n86N44N02k24L36K5m81J42O94j258j3L03p9J45k44K40
5424B5J40R3k20L61k93r2N36n04k41J53l28Q9M8N36R1r37O30J07n96Q53m61P72
5446G62m38q0k55R0k58K01o54o5N88j05m58J388j088P09j140R22L4j70m72R07
5466D18k19k34J8J00q9j63O59j028N79J55m40M71K92j260O05n38R40j33J65m61
5486a63J95J0k98J77j08l6j30M4N35r43R91k12K44r25J95O05n22J38L63M6p41
$$ plain form
5338 -311 -156 -67 -470 97 -206 59 -437 12 -143 565 136 425 -194 -178 -179 -349 -330 -47 513 104 474 144
5360 144 37 88 -43 145 -203 -456 -230 -366 173 -265 -198 -36 79 65 -52 -237 20 120 182 -11 9 288
5382 288 753 359 87 -94 572 552 229 -89 189 779 253 -662 168 111 -364 -308 484 28 -369 341 -66
5403 -66 -579 92 -13 134 -21 -607 -63 439 215 551 576 95 237 931 -327 -340 -37 -116 29 -215 25
5424 25 165 258 38 399 106 14 550 46 -195 -42 -370 -281 -233 303 394 -543 87 194 -402 451 -10 762
5446 762 324 244 -11 79 -179 22 -632 -697 -109 -214 -672 716 -372 337 -803 119 153 -17 -489 418
5466 418 199 -35 -17 83 -6 -169 490 -538 41 196 -244 227 519 -741 -136 -674 266 133 298 -163
5486 -163 32 42 -256 -79 -187 -223 -353 -309 226 -717 274 62 306 -619 -424 181 -341 -203 160 206 -535
5507e35k7R26n34J7l3j01Q06n50M10j003O11P9O79p04l57O51m01L0j29J10j3O7
5529aK47n71K37L71J9m58j98J22K32M1j1j13N21m75j00O84m0j84p3q41K40K27
5551a24l7J33j0K9n1j77R50q73O37l24K08L54k70j26m00l26L32L33m19L05l73
5572b29J71K52j56K29l25k59p3j44M15M1K7r5K58J55n70L50j49j06L77Q6j03j42
5594A0J72m06O67J17p84N29p30Q59q39O57O82j153J8M07k48O58q0o02j56l60N21
5615f1P9k73P73n29k06M46o20N80r6j75L3K91R1o21pL94J71m7p46P57n42j24R03
5638D71j56m34L53n59Q61l92k55m5j91J93K62j55l30P5K55J76Mj93l7k17M88l87
5660b13L32K45p18Q22j91k2K01r49Q84n60L4J36M44l85k35k69j1n5K68K57K45
$$ plain form
5507 -535 -562 364 -170 -153 -186 -287 519 -31 379 -624 -13 66 745 41 -316 335 -66 -36 -165 -55 -68 -1
5529 -1 246 -325 -88 283 302 -156 -354 -232 0 41 30 -83 438 -37 -137 547 507 323 250 -591 -351 -124
5551 -124 -161 -28 -38 -9 -60 -237 713 -160 477 153 361 715 445 319 -81 -407 -75 258 -161 144 -229
5572 -229 -58 194 38 267 -58 -317 -390 -534 -119 -78 -51 -146 112 267 -303 47 -102 -208 169 255 152 10
5594 10 182 -224 443 560 -224 305 -425 434 -405 252 934 -219 -201 206 -42 616 536 -66 -222 -582 -61
5615 -61 18 -255 518 -11 -217 229 -391 189 93 -82 -49 242 333 -288 -295 99 270 223 -523 234 -308 -432 471
5638 471 315 -119 234 -325 536 144 -111 -156 -347 -154 108 -47 -377 -302 -47 129 133 -60 -97 -314 174 -213
5660 -213 119 364 -354 468 277 255 456 -493 391 -169 -135 1 445 60 -175 -444 -455 -510 -242 15 260
5681B60o4q7J74L85m30n78j49M22O19n15KL29l06j40j62J45N0O13q67j62M47J29
5703A15J48K7l54j25q9K15J78n30O64K70j86n03M56j093O10K30L47l91N9k2n65
5724e39L75n0M92l72K74j61j29K59m43P93p05j63L17K87J8k27K49O0m65K72K81
5745D23L19n86l26J89N9q2j91o7K23O03m92k40J51K88j64o36L87M7M50o02j98
5766d45M15N42l31j57k49L0k1M40L19o38M1k14k48M34M06o70L24k30L51k23N62
5787D38q23L76k93N28k65M32J73m95J36J01o3J0m77M84R9p94L55M35j4k60M54
5808E37m33p8O57j335P35N96r28R64q40K9O7M99n6m79j92L58n76Q82r53P97l8
5829B13K00n23O4J86r9Q3J26r66M83k44pQ67q31N6P39j27j97J88J55p30N0K30
$$ plain form
5681 260 196 109 283 668 238 -340 -489 -67 552 37 39 368 62 -78 -240 -95 -45 568 -299 -461 -14 115
5703 115 263 290 -64 -189 -278 -63 115 -415 249 519 333 -170 286 -807 -197 33 380 -11 48 26 -539
5724 -539 -164 -214 278 -94 180 19 -110 149 -294 499 -206 -369 -52 235 253 26 275 335 -130 142 423
5745 423 742 156 -170 19 78 -4 -195 -262 -39 564 72 -168 -17 271 107 -529 -142 -95 355 -247 -445
5766 -445 -30 512 181 24 -225 -195 -216 224 543 -95 -54 -268 -516 -82 324 -346 -22 -252 99 -124 438
5787 438 -385 -9 -302 226 -39 393 566 71 207 308 245 255 -222 262 361 -433 -78 357 343 83 537
5808 537 104 26 683 -652 83 679 -249 715 -125 -96 -29 470 414 -65 -257 101 -475 407 -546 251 213
5829 213 413 -110 -46 140 41 124 250 -716 -233 -477 -484 383 -448 -392 347 220 23 211 366 -364 -314 -84
5851h4K27k01j67M43k52O35j329O60N95m26K73j57n9k1Lj61l1j09K55L14k11k53
5873e6M51r00K83M88k56L5O0J01o5J51l08k0O2k41O2o5N49q32L40J049p79j07
5895Bm7J75l28o51J403n70RJ4l93N75mj74P4k04L49l55j6k59Q78Kq0J27n31n5
5919e9K3J96P54r10m7O6JL42M60o80m18j30M02k5N93n88n98Q12K58J08m71j65
5941g6k91N66l0K35l84l7L79o31L39J15p4J2m32P98m68r9L6p47R59o43j37O26
5963A6L28l6l77j05l13K39r5M25L23r74L19P64k4o17N54K73q56K55K44j86%k08
5985e1K97r09K73J10L05j01J83o59O85L23j82j36L40p20N47m71l03L0P98K16l55
6006B20l1M1L25p30k87O94k01J42r5m95rJ92l7k99N01l92m6O27J95k20J65r9n00
$$ plain form
5851 -84 143 -58 -225 218 -34 601 -728 -68 527 101 374 217 158 137 140 -21 -52 -161 94 408 197 -56
5873 -56 395 -505 -222 266 10 45 105 206 141 292 -16 -36 26 -215 -153 -218 331 -501 -161 888 109 2
5895 2 -45 130 -198 -849 554 -16 -7 7 -386 189 185 11 85 -119 230 -125 -141 -400 478 480 400 527 -4 -59
5919 -59 -36 160 914 4 -43 23 24 366 826 146 -272 -402 0 -25 568 -20 -618 194 452 560 89 -76
5941 -76 -367 199 169 404 20 -17 362 -269 70 185 111 123 -309 489 21 -78 -42 -789 170 -473 -610 16
5963 16 344 308 -69 -174 -487 -248 -343 82 405 -569 -250 514 490 -127 427 700 -156 99 343 157 157 -51
5985 -51 246 -663 -390 -280 25 -76 107 -552 133 456 274 138 478 -242 305 -166 -469 -439 359 575 220
6006 220 189 230 555 -175 -462 232 31 173 78 -417 -426 -234 -271 -570 -69 -461 -507 120 315 95 260 161 -339
6029c39J31l5J11r0P73j5o03J78m5m71K40M30k94l5L68j18k97L01l21N91j070
6050f10O23k5K62j2j25l2m59J05K79l5M7m97N88J45m50O77m20q6l7j02N31l32
6072C5J82m86J49j40l95L24J127l95j87J70n75J46l71%K43O34j23j13o48o0M77
6093fk62m7kJ84k11L45j74o7m19N98j76l75O31j35j4J42k11J79j61P44l58J83
6115C88k66o51R63n64Q7K05Q1n42M6J53K75k21J40J23o33J96M91q53M51N20m19
6136c0J18k16j54M01m93M99L5p17P09j76K19n27N37n69O93r92J050n31l97J045
6156E04m16K55J39k55l35K93m0Q1j43j01O3K87j87K57m69l31J31K35L00l59l22
6177d13Q03k38k17j56K06L8J147j197J07N7j25P0L31l19O11j146n3P52m31q6M05
$$ plain form
6029 -339 -208 -243 -132 -222 551 536 -67 111 66 -405 -165 265 -29 -64 304 186 -111 190 -131 460 -610
6050 -610 13 -12 250 238 113 81 -378 -273 6 -29 18 -479 109 254 -196 481 61 -25 -62 -164 367 35
6072 35 217 -269 -120 -260 -655 -331 796 401 214 384 -191 -45 -416 -416 -173 461 338 225 -423 -483 -6
6093 -6 -268 -315 -317 -133 -344 1 -173 -240 -659 -61 -237 -612 19 -116 -130 12 -199 -20 -181 563 205 388
6115 388 122 -529 434 -130 -43 162 243 -299 -253 -100 175 -46 94 217 -416 -220 271 -582 -131 389 -30
6136 -30 88 -128 -282 119 -374 125 160 -557 152 -24 195 -332 205 -364 329 -663 387 -144 -541 504
6156 504 88 343 482 227 -108 185 145 226 83 -18 45 332 145 402 -67 -398 -267 -32 268 -91 -413
6177 -413 390 152 -65 -221 -15 23 1170 -27 80 137 12 82 413 94 705 -441 -494 258 -173 -259 146
6198A46K16n08J31k50o1J83M56j005O37L19p39R51m16m10J97j60L69j47p21R33
6218A21j06L30k0o4k27Q2L40L0n84P9O63n03o48O17j41k10l49J054j042O47p03
6239f34P01p30M78M8J73m42J8q2L20K96J70o53N87J85q02K04m49J021n83J94n15
6260d95Q24m58L02n42j58N64KO4L3l7M18l06k51K83j50N5l52M49l98k18P32J68
6282E29k28m68L44K6k36j86K8O54o58L29K07m05k46N47k44p0lo1J42K6J78k92
6304h7M16p6m03K62k39M00L5r30O60J85J35j00J2k67n1q5J29N97n35K63j03o2
6326A56l13L65J65N6k25k60N11j86j26j52p6l33j3N47k73L18J2j09j84l4j61K26
6348h9L25j50k31m03P70k97L73j89p84L00J096q26k22L67m86O24k49Q16o75M43
$$ plain form
6198 146 362 -146 -15 -265 -326 -143 313 -692 -55 264 -475 476 60 -350 -153 -313 56 -91 -812 121
6218 121 15 345 325 261 34 116 456 486 -98 -19 644 141 -507 110 -31 -241 -590 464 -578 69 -634
6239 -634 67 -663 -185 -137 36 -406 -388 -470 -150 146 316 -337 250 435 -367 -163 -612 409 -174 20 -495
6260 -495 329 -129 173 -369 -527 37 39 103 136 99 517 211 -40 243 93 148 -204 245 -153 -371 361 529
6282 529 301 -167 177 203 -33 -219 -191 463 -195 134 341 -64 -310 237 -7 -77 -80 -141 1 27 205 -87
6304 -87 329 253 -150 112 -127 273 308 -622 38 223 358 258 270 3 -48 -133 -4 593 58 321 218 156
6326 156 -157 208 373 429 204 -56 455 269 143 -9 -85 -418 -431 116 -157 161 173 64 -120 -154 -315 -89
6348 -89 236 86 -145 -548 222 -75 298 109 -675 -375 721 -105 -327 40 -446 178 -71 745 70 513
6368E13n82pK80m84N58Q2l90O12o48k87%L74N62j305M04P12l76o2M43n28L34k4
6390A81K40r8l99kM32q63M58N70j57m09m43P83k70L48j93M84p83R2P2M46k37j72
6412H0k01K7O14k08N6r15K51k90N93l24N16J02m25K5M01p46K37k87L42qN26n41
6434a75O8J24N00j74m84k12K15N87j45m23K78J3l80O70n11k18m04R31n57k22N65
6455D6J05R7J34l91L16q61N83Q6m44R03l40k59l0J5K5j96j53N23l37O04j40m1
6477B45l15k25L24n12L74k45L81k04L6l84N38L25K82k15J57l29j05K63k46J51
6497B96r2r1R4j71J50k53K07l1j68N13k97k76k48L12K37J68j30k86l8O7K79m32
6519a90MM90n75P2k30O53rk37J00j96N2j08m65P37o7k60M49o53N02L75l56j42
$$ plain form
6368 513 -69 -76 204 -280 278 360 -30 582 -66 -353 -353 21 583 -722 -318 394 18 -44 399 -129 205 181
6390 181 421 323 -76 -78 354 -509 -51 519 362 -47 -490 293 23 371 178 662 -121 -29 43 489 252 80
6412 80 -121 -94 520 312 368 -547 -296 -586 7 -317 199 301 -124 -99 302 -444 -207 -494 -152 -160 366 -175
6434 -175 -107 17 517 343 -141 -353 -138 449 304 -119 159 172 -208 462 -49 -267 -671 260 -297 -519 46
6455 46 151 248 382 -9 307 -554 29 115 -329 574 234 -25 -55 -40 -15 -211 -364 159 -178 426 286 245
6477 245 -70 -295 29 -483 -109 -354 27 -177 -141 -525 13 338 620 405 562 233 128 391 145 296
6497 296 204 113 207 36 186 -67 140 109 -59 454 157 -119 -367 -55 182 350 220 -66 -104 -37 242 -190
6519 -190 -186 304 -271 -199 -429 224 215 -22 78 -118 -66 -174 -639 98 31 -229 220 -433 69 444 88 -54
6541e4J56o16P80R8k77L7j36M11k52k53N34j166P03J38J78L5n02Q8J15L50j4j61
6563A92m65M59k13L79k21p4Kp6J82k67L41K8j50p5M56n13Q40j125L40j14M87Q5
6585D98r17P46k57L05n36J52k26K47K8o8L11p30N80l17l1k91j76P18O63n96k6
6606G7L38j53J66j28l81K9O82r63L6L36q4K23J68q77O98l63jN23p81L62n72J41
6628e24L20O86k79m02J67j4k39l0K56%K53j0m06L77m8j64M36N4M63j030N93k53
6650B06l06K22r6o7J89l89P1M14j98k28N03n27L46k42J45K0K3m1J23k19L43K1
6672C13p79O07p33P08J26k37k69M3O0j41P59j0n61M33j59n5L31k91R9l98L24P6
6694B46l03M87m2k28k94K07m78P57l45M54o95J79J68K36l9o13K04N18n26k03n1
$$ plain form
6541 -54 102 -514 266 364 87 124 -12 399 147 -106 428 -738 -35 103 281 316 -186 -98 17 367 353 192
6563 192 -273 186 -27 352 131 57 59 -17 165 -102 239 267 117 42 498 -15 825 -300 40 -74 413 498
6585 498 -419 327 70 375 -161 -9 -235 12 40 -28 283 -447 133 -184 -215 -506 -682 36 699 103 77
6606 77 415 262 428 300 -81 -52 630 -333 -297 39 -45 178 346 -531 167 -196 -197 326 -455 -93 -665 -524
6628 -524 -204 482 203 -199 -32 -46 -285 -315 -59 -59 194 184 -222 155 107 -57 379 433 896 -134 459 206
6650 206 -100 122 26 -41 148 -241 -170 244 46 -182 321 -206 140 -102 43 63 86 45 168 -51 292 313
6672 313 -466 141 -592 116 242 5 -264 -221 -161 -302 457 447 -114 319 160 105 436 145 244 -154 170 246
6694 246 -57 430 388 160 -134 73 -405 352 7 461 -234 -55 113 349 310 -303 -99 419 -107 -310 -361
6715c61Q3j32N8K28M52m40N64p50L21l12K13L82k49R5mM4m6J5k3K41k2p55K36
6738a62p29J320l47k19N14k50o45L41N16k68l09J17M78n86n2L91k95j68Q5M66
6758A98m49k12N00m23M29k90L13m34L80M45j028O12l07L66K76l88L53l34L56o95
6778c32N99J24l96l19N99kl55L48l05k43K12K71o7q9j2p12Q20n88P81n94K75p
6800Hn4J41j66J88j58L23K44p91K08L07p03q1N60k53j7M86o63O25j60L35j44l09
6822g4L08k39j22Q9O50o23M81m54L50k48J6l46K66K19j50M61m23R5n34N6L3J90
6844AJ79M4n11r4K86m2N17q05L40J28O6JK61q26M98k60P13l87Pl38R29j371N95
6867f9M30n37J67K73l71O13Q5m40m60O55p61R73q22N87J14p62L03n8p3j61M21
$$ plain form
6715 -361 -278 -410 -352 -124 328 -112 452 -298 23 -289 -76 306 57 152 148 192 146 161 138 379 357 -398 -162
6738 -162 -891 429 82 -137 377 127 -518 -177 339 71 -238 -121 357 -229 -281 110 -185 -353 -268 198
6758 198 -251 -463 37 -386 43 -247 66 -368 12 457 -571 41 -266 100 376 -12 341 7 363 -332
6778 -332 267 391 -5 -324 275 273 -82 266 -39 -282 -70 201 134 45 33 -679 141 -447 334 -260 15 8
6800 8 -46 95 -71 117 -41 282 526 -265 -57 250 -453 -534 26 -227 -244 242 -421 204 44 379 235 -74
6822 -74 234 -5 -127 -38 612 -11 470 16 366 118 134 -212 54 273 123 584 161 256 -278 -222 -189 1
6844 1 180 224 -287 -381 -95 -137 380 -425 -85 43 109 110 371 -455 43 -217 496 109 116 -222 707 -664 -69
6867 -69 361 -176 -9 264 -107 506 591 151 -309 346 -415 558 -264 323 437 -325 -22 -80 -153 -314 107
6888A07M82m18o02P98p56M11K41n20l04L45J47L07J77o98N73m84k34L26J96J7
6908A11M0q06N91l33N15n09K13K14j47J73l09j18J91m34M71j43Q71l43r42M56
6928b38o6L53j37K14j16J6L11m25J64o82J234m65M6J88r53J117j86K04q42M25
6948A62j70j67m5OJ60L54j09k15M67m97N3l05J88j23n62P50k34O36l26m29R39
6969E33l91k6J65j15k64l92O87k07k31N00j21k68q8K67J21O2K26r09P11kl69L43
6991B32l15J8N12n17K34k02j79K6K1j44j02M58r38Q97R45j644R21n5Q8j48j82
7012g4j8N64m47o6r8p17J254o92L98l18r4J92j14L86m78J28KN26k56L0K05o67
7034c54l19J12M15J84N2J02M33j92n01J46j41J31q13M63O09l85K0J34J86l18M87
$$ plain form
6888 107 589 171 -431 367 -389 22 263 -257 -561 -216 -69 238 415 -283 290 -194 -428 -102 94 111
6908 111 151 -655 -64 -397 118 -391 -178 36 -111 62 -247 -365 -174 -608 -137 -280 591 248 -694 -238
6928 -238 -304 49 -88 126 10 26 337 -88 76 -606 628 163 209 397 -556 561 375 579 -263 162
6948 162 -8 -175 -220 -214 -54 300 191 -24 443 -54 -1 -306 -118 -241 -803 -53 -287 349 23 -406 533
6969 533 142 116 281 166 -98 -490 197 -10 -241 259 138 -130 -218 49 170 232 458 -451 260 258 -111 232
6991 232 -83 -65 447 -70 164 -38 -217 -191 -170 -314 -416 42 -896 1 946 -698 223 168 256 108 -74
7012 -74 -92 472 25 -41 -139 -856 398 -294 104 -214 -308 -116 -230 156 -322 -194 -192 334 78 108 313 -354
7034 -354 -673 -561 -146 38 90 192 625 433 -68 78 -63 68 -745 -282 327 -58 -38 96 282 -36 451
7055D51o55M40K59J95p50K04k43N00m63n85Q92Oj07j53m58L29L36K57n27N0j82
7076b04k75R11r62P29K12n84k03J23J57n1j22K97M50l48l50L56K0J55m74Q8K39
7097A64k09j65J50R99p76j18K4k26L00j77K07j13N03n42J65j90j54J00j46K34
7117C0j02L1L6l60N73J57L7l16j18k9R8m25P26k37L30l37J74k8j60o35O67N75
7139F87p35j20M44j52pQ4p83j66P19J79l05J47L01k18J97K09o83M03k73N8n2j03
7161a69M94k77o67L41N63j74q6k08L13M02l96O26p56P5M13m86Q48q25j62l70K19
7182b82P21k77J42k05J32Jk23N53j159M92m09P29K8l31L55M06k45k02j41l50P89
7203E24p80J5M25N05o72j80R03o08j12K57l8l4R8q69J127n10k13L29n04N31lj32
$$ plain form
7055 451 -204 236 495 690 -60 144 -99 401 -62 -647 245 251 144 -9 -467 -138 198 455 -72 -22 -204
7076 -204 -479 432 -530 199 411 -173 -376 -253 -96 -147 -269 28 478 130 -220 136 156 311 -163 -75 164
7097 164 -45 -210 -60 939 163 45 69 -157 143 -34 173 60 563 21 186 -4 -158 -58 -204 30
7117 30 -72 -41 -5 -365 208 365 402 86 -32 -61 37 -388 338 101 431 94 268 240 80 -555 112 687
7139 687 -48 -168 276 124 117 201 -582 -748 -29 150 -155 -8 293 75 272 481 -202 201 -72 -14 -66 -169
7161 -169 325 48 -619 -278 285 111 25 -183 130 532 136 762 6 81 494 8 856 31 -131 -501 -282
7182 -282 439 162 304 99 231 232 9 562 -597 -105 -514 215 243 -88 267 673 428 226 85 -265 524
7203 524 -256 -241 184 689 17 -163 740 132 20 277 239 205 303 -566 561 51 -162 167 -337 194 191 59
7225E9L58o07j01N25n68N83n37m4M04O8j21p0n1J64L59l80k13M67j55L49k99l74
7247a84K37L1K46L2j14p64N66k90j63K37N46k57j38k60P62O4q18J091j208O98
7267C14k15l6N13l61k83J14Jj47l2M21k56l13L53n42O20P5l00K36J53l85J59q6
7289Cl66R89j074K33j73J60nm22M75j88M68q0O1m05N50k97L29n13P15j178P74
7310E6k55m6k4p1l87K26P23m94N23j83P3L32p85P07n80K45PM01l27o75J093m61
7332I8M6l55k28L49L65Nn50ML5J01m6J50m92K32L66l71P8M97n41J51L30m61K07
7355c0L11q02R40n28r1M42N58o08k32q2K19Q5L9m68Q75q92M41n33M02k35k1N32
7377C22q15K82L37k35N01J08o94N96m43M27n33Q5J74J12n23J04j28N35J29o21
$$ plain form
7225 59 417 -190 -291 234 -334 249 -288 -332 72 140 19 -51 -102 62 421 41 -172 295 140 489 190 -184
7247 -184 53 84 330 362 248 -516 50 -240 -403 -166 380 123 -15 -275 487 551 -267 824 -384 314
7267 314 99 63 576 215 -68 46 47 -100 -132 289 33 -280 73 -469 151 226 -74 162 315 -70 89 3
7289 3 -363 626 -448 -215 -388 -228 -233 -655 -180 -368 100 20 81 -324 226 -71 258 -255 460 -718 56
7310 56 -199 -245 -269 -340 -727 -501 222 -272 251 68 141 473 -312 395 -185 60 67 468 141 -534 559 98
7332 98 144 -211 -439 -90 275 280 -270 -266 -231 -130 -176 -26 -518 -286 80 -291 -213 284 -257 -106 224 -237 -30
7355 -30 281 -521 419 -109 -200 242 800 192 -40 -122 97 182 221 -247 628 -264 177 -356 46 -189 -210 322
7377 322 -493 -211 126 -109 392 500 -194 402 -41 386 -147 -62 112 224 -299 -195 -323 212 341 -280
7397b80m03Q29k38Q3K87j32N34m29n3o1j36L07l76J51J81L46n88q0LL8J21K52
7419C56m42K18R9L82q84O6l94P98m91N34O3n49Q3M69m8k39K79k81J68o63M85r2
7441h3K4J70Q4n4l23M90l64M65K73m39j39o73R3O12k85L62o92K67J35M21l74k7
7463e7O05p78R6J89L97j083L87R17o3n19p4N4L76j056N24k46L97j25K09l69N58
7484C39k23n00M08k69M32N9o6J57l02m28J27o0O48R9k28j017L34O20q6k57J096
7505H83r40K13N9n57L64K12m52q6Q60o89m88N60j13%j10L56k71K47K10j30r7k45
7527b14M59o2K25n58n6OL52l05J61l67L22o21N44L89k87j07QK09m03K70p6q1N51
7550C59l33K44m55p0L81m46M43j23j19K05l47q6M93k00K31l80K79o13L14L60J86
$$ plain form
7397 -280 -683 146 -92 -9 278 146 680 251 198 137 1 308 -68 83 264 610 22 -58 -55 -17 104 356
7419 356 -86 132 231 613 -271 -205 -599 199 -292 242 305 -244 -161 308 260 21 300 19 187 -476 9 -83
7441 -83 -59 111 195 141 -182 308 -56 409 682 243 104 -569 -476 136 -149 213 -479 -212 -77 344 -30 -57
7463 -57 548 -230 -134 55 452 -631 -244 673 610 91 17 71 447 -609 -85 -331 66 -59 150 -219 339
7484 339 116 -384 24 -245 187 246 180 337 35 -393 -266 -326 322 421 193 -824 -490 130 44 -213 883
7505 883 -57 156 215 -342 22 234 -218 -304 556 -133 -621 -61 -174 -174 -284 72 -199 48 258 128 31 -214
7527 -214 245 183 408 -150 -206 -200 152 -153 8 -359 -37 -658 -114 275 -12 -119 -111 98 -305 -35 -111 -192 359
7550 359 26 270 -185 -255 126 -320 123 0 -119 86 -261 -347 146 -54 177 -203 76 -537 -223 137 323
7571C23K5M4l45L38p72O6k17M23L52l11K01m6l89K79J14J0n59P44l66j60M95j52
7593I7Lm54M83J56j31j5K14j37m60j55N09p3o20M06K37K5j26k16N39p41Q56r77
7615e80M58l20K95M12j11j51m40P68o26N91K61o01J7o7J55l4J0L08J02p59N82
7636B70r7l65L87j85pN74m80K49m17j39J17M43O9J06n87Q6J4O92p23l03j2rO20
7659C03l35j34m77P21K34n78L95n06L23kK06o78N38k34M57j54p2J80l8j33m9m25
7681d58N46J94j06m4m14K16J11L39m14J70o17L94L3n31R94k75Q7n96j26P56j46
7702A13o18J127n74K46m24L68j74N4k89M26m80J6k94j67N88q9K24j12q0j85P74
7723D50n63L92n61L47L65K19r94N4K94N30o27m4j46J80N44r38R76l22R4k26n0
$$ plain form
7571 323 348 392 47 385 -387 -321 -538 -115 237 -74 127 81 -308 -29 85 95 -464 280 -86 -246 249 97
7593 97 100 -354 129 285 154 139 353 216 -244 -399 110 37 -583 -177 60 85 -41 -257 282 -459 397 -580
7615 -580 -122 -442 -147 265 154 3 -437 331 -295 296 557 -44 -27 -94 61 27 37 345 447 -312 270
7636 270 173 -192 195 10 3 577 97 346 -71 -210 -93 350 419 525 -62 24 38 730 7 -296 -308 -317 303
7659 303 -32 -166 -643 78 312 -266 129 -377 -54 -56 150 -528 10 -224 233 79 7 187 149 16 -33 -458
7681 -458 88 282 176 132 -282 -66 45 384 -30 140 -477 -83 -50 -581 413 138 225 -371 -497 259 113
7702 113 -505 622 48 294 -130 238 64 118 -171 255 -225 -209 -503 -670 -82 -171 53 -59 -139 -324 450
7723 450 -113 279 -282 65 430 649 -345 -291 3 533 -94 -138 -284 -104 440 -498 478 156 250 24 -26
7744b6K32m04M71rm00j91N45n18N32m25O81n22J30j12m85P35j10Q5k85J85K20
7765C29m78j04k83R0M37k29nL32m1l97J36N63j80J66q35J4Q75m87J71k36L35n85
7787d12J23J76K64l35p7j96l2M50J58N77j189M75N48q85J55j9J36M09k88M36k21
7808B53K42n62q3O05j80m96o0L71p8m64L81N90l4o64j55N30J62k56K52l61J37
7829A30j97k67M88l85j10l9J96J00j78K88j29q6j1j48J019l70j09j26k57L01M65
7850E75m11l46k6L32k60J84m86O59l0j8l37K05M10k23p59K26L58n82M70N3j39
7871a45J56K25o66N26l42J98J11M3M5M8j42j48K44k1n53M54j39j63j42L26L6P6
7893B7l12O86j043M50j24R75n85l68M78K12j23Q5m45R5l02J287p38l05O28o47
$$ plain form
7744 -26 206 -198 273 264 -136 -327 218 -300 232 -193 488 -34 96 -16 -501 234 124 209 -76 109 329
7765 329 -149 -253 -536 -446 -9 -238 -243 89 48 -349 -213 350 170 336 -499 -485 390 -97 74 -162 173 -412
7787 -412 -289 -113 151 -184 -261 -457 -489 -39 119 696 -493 -18 530 -355 -200 -219 -83 326 38 474 253
7808 253 495 -67 -150 455 275 -221 -281 90 12 -452 -71 519 485 -179 -334 196 358 102 354 -7 130
7829 130 -67 -334 154 -231 -341 -380 -184 -84 -262 26 -103 -189 -200 -348 671 301 192 66 -191 110 575
7850 575 164 -182 -208 124 -136 48 -438 221 191 173 -164 41 451 228 -531 -305 53 -529 -59 -6 -145
7871 -145 11 236 -430 96 -246 -48 63 106 151 199 57 -91 153 132 -421 33 -106 -269 -411 -85 -49 27
7893 27 -285 401 -642 -192 -316 659 74 -294 184 396 273 358 -87 8 -294 993 255 -50 578 -69
7913f9P08o08K0q9N39l31l43M16K81p27l94P34k44n26P70r5N10o51J01J12M35
7934E49k63l01N13l40p0k20O80j16l75N5L8m42L43m37k86K04pJ060m25q8l36M61
7956A97J34l53L4J08j54m20N13P1L91m73O09p32mN81k62l95l6r3O40n03L21m78
7978c04k76O35J11N9p94J130r16Q37k30l95J02J49J27k30L48k15R5n7J64k46N80
7999F74o10P4n6o97K97r1N03j82K65J10J07l73L7O2N63q16K03j70J94J35m08L84
8021B05k95l54O55n7j19J24l8J19J21m19k71l42L39J97K12k87K80j23Q6j37J30
8042B6J8Q1k21M64l52j12M51J3j16k48n5Q76o20k85mO81Kn68q4J87l12n1K48k94
8066b75M48L42q40L42k28K50M37r07J077j158N32k47j69L02J32l31R29r17L46
$$ plain form
7913 -69 639 31 51 -38 501 170 -173 243 524 -203 -597 137 -107 -633 137 42 552 -99 2 114 549
7934 549 286 -15 498 158 88 -132 548 432 57 112 150 -292 51 -386 -672 -468 -475 585 160 72 -264 197
7956 197 331 -22 12 120 -34 -454 59 130 521 48 657 -75 -79 502 240 -155 -191 -284 356 -147 174 -304
7978 -304 -580 55 166 225 -569 561 -355 482 252 -143 -41 108 235 5 353 138 233 176 340 94 674
7999 674 64 138 82 -615 -318 -409 94 -88 177 287 394 21 58 120 683 -133 70 -100 94 229 -179 205
8021 205 -90 -444 211 154 35 159 121 240 361 -58 -329 -671 -332 -135 77 -210 70 -53 33 -104 26
8042 26 44 125 -96 368 16 -96 355 368 252 4 -51 825 205 -80 -84 597 599 31 -53 134 -178 -229 19 -275
8066 -275 173 515 -325 17 -211 39 476 -431 646 -512 20 -227 -396 -94 38 -293 636 -281 65
8085F5M8o95L69p4L63k97L27j59K20L29K7m20M51o95l93M10m6L92k16K16j007
8106g85R41l43L69o33N53m2j85O4n7j51M46m41J07N56r99J113l22l93N32m15m25
8127e10M31q3J15l7J14L52m06m43K25L75k7l06J74J57n44M11j15j45o3M16K14
8148C05p28N70k88L52p05K98M32k89o6p8p6N16J38k74l81L59r30J176n42K10N8
8169E7j44K2K25J55Q3n65J81K10o16j84R26m50K01j8o49O28p58P81l99N00o1l42
$$ plain form
8085 65 113 -582 -213 -287 76 -221 106 -53 167 496 523 103 554 -141 -534 -124 -170 222 6 222 -785
8106 -785 156 -187 182 -451 102 60 -125 -61 -118 -269 177 -264 -157 399 -600 513 191 -202 330 -85 -510
8127 -510 -79 -162 -47 -84 30 382 -24 -467 -242 133 106 -200 -26 131 -413 -2 -117 -262 -325 91 305
8148 305 -423 147 -141 211 -494 -196 236 -53 -119 -197 -273 243 381 107 -274 85 -845 331 -211 -1 57
8169 57 -87 -65 160 315 398 -167 14 224 -392 -576 350 -100 101 83 -566 62 -696 85 -314 186 125 -217
8191b17
$$ Imaginary data points
##PAGE= N=2
##DATA TABLE= (X++(I..I)), XYDATA
0@%%%%%%%%%%%%%%%%%%%%%%%%%%%%JlPj3K0k8L7m6N5o5P5q4R2j00J09j24J38j48
46g7J60j74J92k17K47k74L06l45L93m45N06o00P14q61J088j426J967k934N009
65C229j1153J49665Q1821j56719j65026P5312O3151l8028j6437J7767m283k173
77b874P783m886l823N901J81N47l517r125J3097J0328k3911l552L4188j1702l6745
92b8110K9844K6657l9961q576L9547j0894k9040K3143J2792k5149L689J6774j2652
105a936l917J1009o737j310Q518r827r03J5551j2335j1709K3318L27k6973J5405
119a519J9715k6669n947K9002r067k2656K0469Q549j9630M887J0498j2049J723
132b694J0279j1794J52J2031j0362m789J5737p610j2843J9495Q24k2121J4235
$$ plain form
0 0 0 0 0 0 0 0 0 0 0 0 0 0 0 0 0 0 0 0 0 0 0 0 0 0 0 0 0 0 1 -2 5 -8 12 -16 21 -25 30 -35 40 -44 48 -52 57 -67 71 -77
46 -77 83 -91 101 -116 131 -143 163 -182 211 -234 272 -328 386 -475 613 -813 1154 -1780 3229
65 3229 -7924 141741 223562 66843 -98183 -22871 40280 2252 -14185 3582 -701 -2874
77 -2874 4909 23 -3800 2101 2282 2829 -688 -9813 3284 13612 -10299 -13851 20337 8635 -28110
92 -28110 1734 28391 -11570 -20146 19401 8507 -20533 2610 15402 -9747 -6058 10716 -1936
105 -1936 -5853 5156 -1581 -2891 5627 -4200 -5103 10448 -1887 -13596 9722 10049 -16924 -1519
119 -1519 18196 -8473 -14420 14582 5515 -17141 3328 11877 -7753 -2866 7632 -4417 -2694
132 -2694 7585 -4209 -4057 7974 -2388 -7177 8560 950 -11893 7602 8426 -13695 540
145E40J6142k7015k850K9376j2227k1064K1664O386k0743P121J2499j5441OJ3790
159H184q643n863J2659o153o984J2632m048j0334J4119R73j7602J2310J1006k0649
173h393P61K1494j3619j3239K0150J694k0766J1722J1066j8575J812J5138j0970
186a725m418J3747n491r853J2263p34j1631J0365L076j4695Q628J0936j7388L03
200f617J9062j2838j1688J8860M85j8621J0743J0898j6384Q70J3782j0043m707
213f198J3808p201q402J2738l34j2313J0565M247j4625O683J0144j4741n75J6311
227A0107j0055j1324J8315n99j7055J0699R809j6382K013J3830j2448m149J4570
240G331m951j0735J2196J033j2476Q667N705j3179M715J0265j2832j659J4510
$$ plain form
145 540 16682 -10333 -13183 16193 3966 -17098 4566 10952 -9791 -2670 9829 -5612 -5606 8184
159 8184 -459 -6322 6337 184 -6800 5832 1784 -8550 5569 6542 -11060 1250 12256 -8393
173 -8393 -7632 13862 243 -12996 7154 8848 -11918 -196 10870 -7705 -5893 9245 -1725
186 -1725 -6143 7604 2113 -7740 4523 3789 -7842 2523 5599 -9096 -468 10468 -6920 -6617
200 -6617 12445 -393 -12081 6779 7264 -11357 -614 10284 -6100 -5230 8552 -1491 -6198
213 -6198 7610 409 -7993 4745 4411 -7902 2663 6910 -7715 -1032 9112 -5629 -6204 10107
227 10107 52 -11272 7043 6444 -10611 88 9897 -6485 -4472 9358 -3090 -7239 7331
240 7331 2380 -8355 3841 4874 -7602 1065 6770 -6409 -1694 8571 -4261 -5920 8590
253H590p310j0114J4029M00j4926J0813O135j4438M603J0412j2014j994J4765
266H951r707q402J5532j380j4115J0665P027j5502L049J2862j0959m891J4279
279G409n544j0762J2875J961j3130P060P384j1807J816R588r248k507J1762p541
293f84o798J2260j389j1592J0882N377j5668L919J2549j2300l024J4292p371r367
307h914J4611l84j3332Q015P855j3368J532J1913r893m424J2689m551q985J1604
321D368l05j1551Q067O317j2413K997R289r192k150J1142o358p632J2584r15j2304
336h056Q509O846j3128K356J1153j0039l596J2878n277r139J1095P98j2252Q478
350F26O409j3006K756J0630r538l899J2113n092q577J1845N80j2148P830O382
$$ plain form
253 8590 1280 -8834 5195 5595 -9331 1482 7617 -6821 -2218 8194 -3820 -5814 8951
266 8951 -756 -9158 6374 4994 -9121 1544 8571 -6931 -3882 8980 -1979 -6870 7409
279 7409 1865 -8897 3978 5939 -7191 -131 7253 -4554 -2738 6850 -2398 -4905 6857 -684
293 -684 -7482 4778 3389 -8203 2679 8056 -7612 -3693 8856 -3444 -6468 7824 453 -8914
307 -8914 5697 5313 -8019 -4 7851 -5517 -3985 7928 -1965 -6389 6300 1749 -7236 4368
321 4368 4063 -7488 579 6896 -5517 -2520 6769 -2423 -4573 6569 211 -7421 5163 4248 -8056
336 -8056 453 7299 -5829 -3473 7680 -2359 -5955 6923 1646 -7493 3602 4400 -7852 626
350 626 7035 -5971 -3215 7415 -2123 -6022 6091 999 -7578 4267 4847 -7301 529 6911
364F911j2333K467J0227q955m579J1829l965q133J0347K42j0741P808M629j0992
378e238K813R012q919k493J1206o213o881J1912j108j2051R477N635j2700K569
392b979J1217j0005n598J3445l578r746R884K219j1087N357P547j0136O6Q737
406E343o081k900P928m189m619Q134j600q553R202L194j2267M169J0577j1165
420b827m235J4522n829r800J1045K594j1996N271Q003r576j284R895o252m603
434e072R049k908m880O617p3p413O345K261j0088M691Q019r729k764J2438m774
449A719q819J0660J617j1996N661P746r911q7Q361n068m341P431j825n299O961
464B810j175o892P372J889r806M924Q016j0722j885J2399n770q849J0746K681
$$ plain form
364 6911 -5422 -2955 7272 -1683 -6262 5567 1602 -6531 3816 4058 -6683 1125 5754 -5238
378 -5238 -2425 6587 -2332 -4825 6381 168 -6713 5199 4091 -7960 1517 7152 -5548 -2979
392 -2979 8238 -1767 -7365 6080 2502 -7244 2640 4859 -6228 -871 6676 -3460 -3394 5343
406 5343 -738 -3638 4290 101 -4518 3616 2016 -6537 2665 5859 -6408 -2239 8338 -2827
420 -2827 -7062 7460 1631 -8169 2876 5470 -6526 -1255 6748 -2828 -4112 5783 -469 -5072
434 -5072 3977 1069 -3811 2806 2733 -4680 1665 3926 -6162 -1471 6548 -3181 -5945 6493 1719
449 1719 -7100 3560 5177 -6819 -1158 6588 -3323 -3410 4951 -117 -4458 2973 1148 -4151 2810
464 2810 1635 -5257 2115 4004 -5802 -878 7138 -3584 -5469 6930 1160 -7689 3057 5738
478E738j2308N110Q266r224k433R834m259m807O042j053l958N654o68o028N881
493A787J560q268M231O546r856k96J0650n267q159J0788J953j2173M806Q453r444
508b689j882J0646o219n030P520k47o476N514J215n674L661L368p128L111M491
523D181p089l58R063n710o696J0881j49j0263O390O659j0739k52R481n494m766
538d861Q265j466n683M540J785o102L049M456o816J905N177o868n59Q444n665
553c99n343R515K49j0177O267N722r292K97Q810n847m842Q636r59p513O097K827
569D048p147K355M563o100J031M929n395m37O599m083m891P655l27q786O559N242
585E815r429P12Q682n906m473Q294j533o916N636L310p952L225M158n275K44N496
$$ plain form
478 5738 -6570 -1460 6806 -2418 -4851 4983 724 -4083 1959 906 -3052 2602 1934 -4094 1787
493 1787 3347 -4921 -690 5856 -4000 -4296 6354 1087 -7072 3716 5669 -6504 -1698 6755 -2689
508 -2689 -4571 6075 -144 -5174 2346 2099 -4377 1137 2352 -3322 339 3707 -3421 -310 4181
523 4181 -2908 -3266 5797 87 -6609 4272 4123 -6140 250 6909 -3830 -4082 5399 -95 -4861
538 -4861 3404 1938 -3745 795 2580 -3522 -473 3983 -2833 -928 4249 -2619 -3178 5266 -399
553 -399 -5742 3773 4022 -6155 112 5834 -3458 -3161 5649 -198 -5040 3596 2637 -4876 1221 4048
569 4048 -3099 -744 3819 -2281 -1250 3679 -1716 -2153 4446 363 -4528 3127 2800 -5986 573 5815
585 5815 -3614 -2902 5780 -126 -4599 3695 2162 -4754 882 4192 -3760 -535 3623 -1652 -1408 4088
601D088n220k235O996l058n464P879j34p379M872M496q160P32P482n405l516P115
617C089j281o120N688J722o495K707M330o065J012N406m773k010O206k804m893
632d281O425J098p684M622M435q112J198O938m820l465O299p84n837N062J593
647B687n612K744L476n497M93N257n015j804O997k983m315N790K01o778M601L796
663D038o617l55O536m147k808O533j259n446M790J641o079L245L813n834M73N060
679C584m277k133N237j421m239M672J348o401M274K694o650J365O172m773k979
694c527O528k250m099N312Q04o367L150M407p081J897N839n610j931N989k033
709A028m348N024P04o026L463L938o302M43O252m822k823O842j865n869N488J943
$$ plain form
601 4088 -1132 -3367 3629 571 -4893 2986 2852 -4527 345 4841 -3319 -2587 4895 -510 -4026 3089
617 3089 1808 -4312 1376 3098 -3397 -690 3640 -2425 -1413 3993 -780 -2790 3416 612 -4281
632 -4281 2144 3242 -4442 180 4615 -3497 -2299 4639 -181 -3646 2653 1869 -3968 1094 2687
647 2687 -2925 -181 3295 -2202 -1709 3548 -1467 -3271 3726 743 -3572 2218 2419 -4359 242 4038
663 4038 -2579 -2934 3602 -545 -3353 3180 1921 -3525 1265 2906 -3173 72 3885 -1949 -1476 3584
679 3584 -693 -2826 2411 990 -3249 1423 2771 -3630 644 3338 -3312 -1947 4225 -548 -3527
694 -3527 3001 751 -3348 1964 2768 -3599 -449 3958 -3123 -1226 4613 -997 -2928 3061 1028
709 1028 -3320 1704 2408 -3618 -155 3783 -2519 -2076 4176 -646 -3469 3373 1508 -4361 1127 3070
725C070o102K373L870m402m67N140m564p69M182j502m023M946P03n904L906K877
741C334o400Q00N980m975k253O665j451n991N324K068o043J919M197m426p71M404
757B381l031j640M289j404l323M011N33n371L741K626n344J084M205l815k465
772c523O726j266n229M152K211o024K678L498m624q93N311k731l213M895o79m273
788b984M723r4m243K519K599m610M23M622l613j961N667j504n029M208K217o131
804c191J858M478m379j002M897k698k381M140p69l516L181P97m484L536K271m588
820a850M60L977l715j279N096j741m872N466P33n210K900L386n098l66N171l327
836b69k795M873o95l414K160K117m556K627K452l763P13K947l100j764M675j843
$$ plain form
725 3070 -3032 -659 3211 -1191 -1658 3482 -1082 -1851 2331 829 -3194 1752 2455 -3449 457 3334
741 3334 -3066 -2266 3714 -1261 -3514 3151 1700 -4291 1033 3101 -2942 -1023 3174 -1252 -2023 2381
757 2381 -650 -2290 1999 595 -2728 1283 1816 -3555 186 2812 -2532 -1448 2757 -1058 -3523
772 -3523 3203 1937 -3292 860 3071 -2953 -275 3223 -1401 -2294 3017 286 -2927 1968 1289 -2984
788 -2984 1739 1645 -2598 -79 2520 -2090 -1667 2955 -658 -2619 3048 1544 -3485 723 2940 -3191
804 -3191 -1333 3145 -1234 -2236 2661 -37 -2418 1722 953 -2563 618 1415 -3069 467 2738 -1850
820 -1850 -1390 2587 -1128 -2407 2689 948 -3924 1542 2275 -2935 -35 3351 -1747 -2113 3058 -269
836 -269 -3064 1809 1114 -2300 -140 1977 -2579 48 2500 -1263 -550 2397 -703 -2467 2208 365
852C65l554N044O74n349K542L583m925j98N258l608k330M599j51m257L059J327
868B079l561R02K447l146M63K838k896j193M106j973k884M359L65n139L140L111
884C018m743n97M881k344l034M124P50m252K530J700l534J045K613l059n7K844
900A885k556m94L151j560k629L465O24n026L494L036n374K36M768l207k348M597
916B062p65m234L016K035l766P61L463l579O6L554l147j307M198j987k917L500
932I53K76m060L155K658m710m4L899k652k406N020q68l514L072Q43l829J287K916
949A996l263l92L631j883k017L221q80k258K804P24l691K065J948l694P12L549
965B572l475j815N157j568l786L495J420m014J388L170l389j016K871o85j705
$$ plain form
852 365 -3189 1855 2529 -2820 -278 3305 -1620 -1818 3440 -168 -2498 2101 1950 -2307 752 2079
868 2079 -1482 -580 1867 -1279 -816 2022 -874 -2067 2039 66 -2818 1541 1906 -3233 -93 3018
884 3018 -1725 -2322 2559 215 -2819 1305 2055 -2197 333 2033 -1501 -456 2157 -902 -959 1885
900 1885 -671 -1165 1986 426 -2203 1262 1886 -3140 354 3390 -1984 -1748 3020 -187 -2535 2062
916 2062 1297 -2937 79 2114 -1652 -891 2572 -1007 -941 2613 -534 -1841 2357 370 -2547 953
932 953 1229 -2831 324 2982 -1728 -1772 2127 -525 -2931 2089 1221 -2293 779 1622 -2207 -920 1996
949 1996 -1267 -1659 1972 89 -1928 1293 413 -1845 959 1683 -2008 57 2005 -1689 -977 2572
965 2572 -903 -2718 2439 871 -2915 580 2000 -2014 -626 2544 -845 -1861 1010 325 -1380
980a380K635p68k220K401N78l257J649L124m730P58L678k783k295M993j172m175
996b964L130J970m398J131L500k864r38L161j489j914L322j279k508K569J015
1011A444l667J972J716l439L63M535l573k008M079l30l101K587J378l865O43L293
1027B027l043p45L866j448k059K741m08k862K789P83l397J717K224l030j87K821
1043A789k428j551M293j499k979K784J182l808K113K145k734r29L162j773j807
1058b040L511l28l092L068O87l892J510K406l568N10K819k043j239K553J70k924
1074a892K215J081l183K144J336k750j56L608k739j152K415k32k183J938J169
1089A619k777N04K082k219l91K520j733r72K820j307k377L236R03l527J233K005
$$ plain form
980 -1380 1255 487 -1733 668 1246 -2011 -362 2762 -1968 -1210 2468 -315 -2610 2383 1211 -2964
996 -2964 166 2136 -2262 -1131 2369 -495 -1433 1728 239 -1675 1647 368 -2140 429 1444
1011 1444 -2223 -251 1465 -1974 -1611 2924 -649 -2657 1422 1092 -2009 578 1956 -1909 -1266 2027
1027 2027 -1016 -1761 2105 657 -1402 1339 931 -1931 858 1641 -1756 -39 2185 -845 -1032 1789
1043 1789 -639 -2190 2103 604 -2375 409 1591 -2217 -104 2041 -693 -1622 1540 -233 -2040
1058 -2040 1471 1143 -1949 1119 1806 -2086 -576 1830 -1738 -1228 1591 -452 -1691 862 1032 -1892
1074 -1892 323 1404 -1779 365 1701 -1049 -1205 2403 -336 -1488 927 695 -1488 450 1619
1089 1619 -1158 -654 1428 -791 -1182 1338 -395 -1367 1453 146 -2231 1005 1908 -1619 -386 1619
1105A619k704Q2K592j314j877K869p05k261J992P37j473N55J707k643l67K926
1121A735k104q91K083Nl376L524L72k954P72K794k738m78K522j893j275K693O93
1138A484k468J056J004k548J446J730k202l23K474k290j087L308j627j533K626
1153A050K67k803J238K682k934n49K333j015j845K453l1k565J586J437k457k01
1169a354K563j619n95K253j899j177K815o74j701J872J789l877Q20K608k088j266
1185a530L470j723k249K717p11j833K311Q86k673P82J693j982O8K405j769j485
1201a623K827r08j570J780J013k761J379J479k210m89K450j231j715K787k65k108
1217a165J918N14k565N46K773k781R3K152j287j247J503Kj892K196K17k378R15
$$ plain form
1105 1619 -1085 -1003 1589 275 -1602 1267 562 -1699 293 1030 -443 112 1819 -824 -1191 1735
1121 1735 -369 -1260 823 828 -2548 976 1348 -1606 -834 1960 -778 -1256 1266 -627 -1902 791 1484
1138 1484 -984 72 1076 -1472 -26 1704 -498 -821 1653 -637 -1724 1584 -43 -1576 1050
1153 1050 1317 -1486 -248 2434 -500 -1049 1284 269 -1576 877 846 -1719 -133 1304 -1153 -1354
1169 -1354 1209 -410 -1005 1248 -651 -1828 987 313 -1388 484 2273 -1604 -784 1824 -264 -1530
1185 -1530 1940 217 -2032 685 -26 -1859 452 1338 -1335 -553 1140 -842 -774 1631 -138 -1623
1201 -1623 1204 296 -1274 506 1519 -1242 137 1616 -594 -1083 1367 136 -1579 1208 943 -1165
1217 -1165 753 1267 -1298 -752 2021 -760 -667 1485 198 -1049 454 456 -1436 760 977 -1401 -486
1234d86K273k725k88K065n75k023K796n02k226J265J469j774l04K204j405j156
1250a392J947n07j027K190o15q99P33K24k200J824M65j734K86K762j915k178L022
1267I86j66k053Q82K363l098L16K017k058j90J958n45j506J493Rj212J266L86
1284H48j849Q68J678l036Q90J634j121j412K625m37k758K267J218k591r6K574
1300A302j616n58J565p47j109J881m62r69J194Q83k196N49J295j910J83J935j621
1317d01j060K475k60k485J694J766k457p6K172j508j140K068q23j052J379K0j723
1334a411J697K21j019M00J030j118r1J768j582j045K488o00j899J377R65k074
1350h93J24J882j385p54K143j098j079J707j08j767J318L25j232P41J029j397
$$ plain form
1234 -486 1787 -938 -1226 839 264 -1759 1037 535 -1691 -426 1043 -731 -1035 1169 -236 -1392
1250 -1392 555 48 -979 1211 596 -303 430 654 -1546 278 743 -991 -705 2057 142 -2036 986
1267 986 820 -1233 -351 2012 -1086 -770 1247 -811 -1001 957 412 -1094 399 408 -804 462 848
1284 848 -1001 -133 1545 -1491 -601 1033 -88 -1500 1125 688 -2070 197 1415 -1176 -1272 1302
1300 1302 -314 -872 693 -54 -1163 718 256 -713 481 1364 -832 -283 1012 -898 -715 1220 -401
1317 -401 -1461 1014 754 -1731 -37 1729 -728 -804 1368 -140 -1280 788 -35 -1087 292 312 -1411
1334 -1411 286 507 -512 -112 918 -200 -291 1477 -105 -1150 1338 738 -1161 216 1181 -893
1350 -893 -769 1113 -272 -1026 1117 19 -1060 647 539 -1228 90 415 -817 -76 953 -444
1366d44l20J444r57o95K361j039j764J643P13k087O27J489j694K05J578r07j710
1383a557K553o26j277J080Q39j417jJ456j320j93Q08l9j459K209j70j862J130
1400A54J227k384J61J924j597O8J190l18j173Q84M00j162N74M41n94l36J040r94
1418d95j34J956j764n35J558l56r58J353l14j470Q79J151j135j75R72l32j171
1435i70R51Q62j941P79J145j127J6O79r83j59R62l16n97J477j75k479J717J126
1453I67k030J290J160j872q48K155n04j809K450r3j619R92P89j572K20J799j792
1470c17J60J284j085j258K345n43j061N67Q14j758P22J415j291q06J413o31q97
1487i27J907m60j316Q93M10j404R83O58j001n06J574n97j473J411M70j555J137
$$ plain form
1366 -444 -764 680 -277 -972 1389 350 -1414 229 942 -1145 -518 971 -723 -518 1060 153 -1557
1383 -1557 996 370 -907 173 1012 -405 -406 1050 -270 -463 345 306 -1153 1056 886 -976 154
1400 154 1381 -1003 -842 1082 -515 -447 743 425 -748 136 536 -626 -52 389 -205 -541 499 -495
1418 -495 -629 1327 -437 -972 586 230 -728 625 311 -1159 -280 871 -264 -439 533 201 -970
1435 -970 -19 843 -1098 -319 826 -301 -285 394 -589 -748 214 -102 -699 778 603 -1876 -159 967
1453 967 -1063 227 1387 -485 -1333 822 318 -1491 959 866 -753 239 1028 -544 -324 1475 -317
1470 -317 -157 1127 42 -1216 1129 586 -475 92 906 -852 -130 1285 -6 -812 601 -30 -927
1487 -927 980 520 -796 97 507 -897 86 744 -257 -763 811 214 -1259 152 622 -933 204
1504B04L05j374r5J402r26k52J897j477o65J426j33j331J798o8j306K98J224j583
1522f56j75J686j361k18J452l65j264P59J239k043J234mn62l69J531j043o59J129
1540C11N81j493R50K59j057J51J280j077q33J264m5j229J492L41j937J601r09
1557c50m63O61R83j363k5J260k69q69Q69k24j578J275J362j828L80J281j227p82
1575i07R39J35q98O62J39r17J020O27j412P38P04j026j041J907q37j056J552j71
1593A58p14J049m00o79L35J179j379K34O53l91r61J425Jj217P71L14r06j45J237
1612E64j600O38J842j665l19J224j65j495J463R12j732m99J362r91o66K095j354
1629c86l74J603o26o19L48P39j585J408M33r14l60N29R2j155J000J64j461R24
$$ plain form
1504 204 509 -865 -960 442 -484 -736 1161 -316 -981 445 312 -1019 779 711 -595 -297 927 -656
1522 -656 -831 855 -506 -724 728 363 -901 -142 1097 -946 288 284 -278 -647 884 -159 -818 311
1540 311 892 -601 349 608 -449 -298 982 -95 -928 336 291 -938 554 895 -1042 559 -350
1557 -350 -813 -152 831 -532 -557 703 434 -435 434 210 -1368 -93 1269 -559 -179 1102 -125 -907
1575 -907 32 167 -731 -69 70 -847 173 800 -612 126 830 -196 -1237 670 -167 -1223 329 158
1593 158 -556 493 93 -586 -251 928 -451 -217 436 45 -916 509 510 -707 64 378 -528 -673 564
1612 564 -1036 -398 1444 -221 -540 684 519 -976 487 1399 -333 -832 530 -461 -1127 968 -386
1629 -386 -760 843 217 -402 -54 685 -900 508 941 27 -333 196 288 -867 133 297 -1164 -240
1647b40P40j678R42J216q25p44Q39n8j800K018K3r90M18Q49n76l79Q02l39m12
1666a94P58q58q50J800p75o08P73O79p55j70J169j219j08P22J86p57L96R15k171
1685a067J059M40l32pP23j155n3O72k14l34J294p62j089J023N24j648P74Q58j196
1704d90J5R34l05p12R79M30j117r0J168j058j98J091o11n25N21l2m80Q01K95p37
1724a21L91Q33j536KJ272r88k85J056j97p02P96n1p15L72J52o15M14O47q78l48
1744e01Q11j01r03R60J70j345Q53M07r01L35J212j661M96N79l54p01R94L00j389
1763g39Q03O14r28l38J669j308k96J311j221o0M07M34m38K91O45j673J71J079
1781D23p71O94J62l54r53Q05R40j147L80J01j97k94O48r88J5O99n50k53L79N10
$$ plain form
1647 -240 500 -1178 -236 980 155 -589 250 192 -1608 410 433 -557 -139 710 134 -245 557 218 -194
1666 -194 564 -294 -1144 656 -119 -727 46 725 -30 -200 969 -250 -358 364 550 -207 189 1104 -1067
1685 -1067 -8 432 100 93 816 -339 -392 280 66 -268 1026 264 -825 198 722 -926 -152 706 -490
1704 -490 -475 459 154 -558 421 851 -266 -356 812 -246 -444 647 36 -489 32 0 -480 321 616 -121
1724 -121 270 1103 -433 -431 841 -147 -432 624 427 -275 521 470 -245 127 279 -336 78 725 -153 -501
1744 -501 310 209 -694 266 436 -909 -56 351 -550 -215 997 -664 -168 411 57 -644 350 650 -739
1763 -739 64 678 -250 -588 1081 -227 -523 788 -433 -493 -86 348 -90 201 846 -827 -656 423
1781 423 -348 346 508 154 -799 6 946 -201 179 280 83 -211 437 -551 -536 163 -387 -640 -261 249
1801B49p53N68K63m35n39J121m12n79J129n02n89J086J06j673R27P46j010M30
1819A33O79j216o0J053p19q53J743l30l19l80N28j75m1J117j041p49J092n20m67
1838e25R68q40k56P06N25j105Q69l51j50j37J033r23m23O60J63n81P25pq05L56
1858i8O66j083j79R12P2j163J901K06j423L52N57j055L2O56q78J11N37O31j113
1877c59P06l4j036M86O05m96j54Q19p60k02N48J68l76L12M33j366J56O75k0j099
1897i94Q54Q05q60K99m8o04O29k02L08m21J151j066k20J371j003l86O71n12j95
1916d23N96k66p46N43Q63j121k94J388p28o98J185M34j345L42K97p96O18P18j026
1935d59J93M98q14N89L13j62p53P15K97j148P39L83j026J11K90m85P66J65K71
$$ plain form
1801 249 -504 64 327 -108 -647 474 62 -517 612 110 -479 607 713 -960 -33 713 -297 133
1819 133 812 -404 -464 589 -130 -983 760 430 111 -269 259 84 43 1160 119 -630 462 -58 -525
1838 -525 443 -397 -653 53 578 -527 342 -9 -159 -296 737 -186 -609 51 214 -367 358 351 -454 -98
1858 -98 568 -515 -694 218 290 -873 1028 1234 -189 163 720 -335 -303 353 -525 -414 123 754 -359
1877 -359 347 313 -723 -237 368 -128 -282 537 -223 -425 123 291 -85 227 660 -706 -550 125 105 -994
1897 -994 -140 665 -195 104 56 -548 81 -121 187 -234 917 -149 -369 1002 -1 -387 284 -228 -423
1916 -423 173 -93 -839 -296 567 -554 -848 540 -188 -886 299 733 -612 -270 27 -769 -151 567 -459
1935 -459 -266 232 -582 7 320 158 -595 120 417 -731 8 391 -635 -524 -234 -719 47 212 483
1954D83j091J071l74m41K45N01r08M26K53o0j40J134j177l43N97L34j052N89K99
1973C46q85L20Q80q77J41M05j24q21O78L45m74l95P09l01k9L21j3j128J160o9
1993A89o11N84K24j027O56O34q85j75Q49j132N75N68k4p37P1N05k64m41J72j59
2013d28J64Q82o80k09N57J87j255J143L14j281O14O90j378M30M58J20j120J518
2031G26m94j15J56N97j278L70lk45L88L1p80M77K23N37j293N77J03l01N64kJ5
2052B53j4m57N19l13j89P32j115N32J58j32k07P51m99m63J42N29n30Q99j74o66
2072b44J05J11k60J89Q6j48o19J092p06K6O12l86l41O38R0l91J63M16o78p9O32
2093C08l04m3K59nj17k41R36k16l61j24o24K92P0K09l80O79j16o92N06l07J31
$$ plain form
1954 483 -608 463 89 -352 -107 394 -514 -88 165 105 -35 1099 -78 -421 176 510 -542 47 346
1973 346 -539 -219 661 -216 -75 330 206 -615 63 408 -66 -461 248 -53 -82 239 226 -902 258 189
1993 189 -422 162 386 -641 15 649 -236 -411 438 -694 -119 449 425 -312 -241 264 0 -441 -269 -428
2013 -428 -264 618 -62 -271 286 473 -782 361 675 -606 8 698 -680 -250 208 328 -792 726
2031 726 232 117 273 870 -408 -38 -41 -286 102 133 -647 -170 53 590 -703 -126 -23 -324 240 238 253
2052 253 239 -218 301 -12 -201 531 -584 -52 106 -26 -233 518 19 -444 -302 227 -303 596 422 -244
2072 -244 -139 -28 -288 -99 -13 -161 -780 312 -394 -368 244 -142 -483 155 245 -146 17 433 -245 -324 308
2093 308 4 -39 220 215 98 -143 793 577 216 92 -532 -240 -170 39 -341 338 222 -470 36 -271 -140
2114a40r1J041r91k57J131r47O53n40O93p53KN65o07P0P62l74q21P62m0l14O75
2135D79l23J5m05M99q81Q04L24n64k80L40k47n6P11l98k30l7J35P57o50M08m03
2156bj37L39n26qL95m04k5O06J19p01j76P75l00m34O02l48l98Q82k21k50j30J178
2178H36j147J30J24n1M10O81r99P8O37p89o03M46J126j956J091Q72r55L7N91m98
2198F1n72N78M21p79k49O71o26L90J47j54K09k75k61M48K86J82o17M19o1k32m66
2219d80R20o02m21R01l98j3M78o11K29L81m11P8j39L21q50P19j63l35O16k54p05
2240g39O91Q5K62q6m79P57l31n51Q98k46j229R22O34j378P48K93o92K01P74j136
2260f02P73L74j141P30L0j61k99N34q4l73L52L72m22l0l71K41MJ30K20q5m9l69
$$ plain form
2114 -140 -231 810 -181 -438 693 -254 399 -141 552 -201 -199 366 -241 -171 591 217 -604 158 118 -196 479
2135 479 156 171 -234 265 -616 188 512 -52 -332 8 -239 -295 416 18 -212 -249 -114 643 -7 401 -2
2156 -2 -139 200 -326 -334 61 -343 -368 238 357 -344 -520 255 -45 -479 123 -225 -623 259 38 -212 -342 836
2178 836 -311 -181 -57 -108 302 983 -16 62 699 -90 -693 -247 879 -1077 14 886 -69 -32 559 61
2198 61 -511 67 488 -291 -540 131 -495 -105 42 -112 97 -178 -439 9 295 477 -140 279 218 -14 -480
2219 -480 440 -162 -583 318 -80 -93 385 -226 3 384 -27 51 -88 233 -617 102 -61 -396 220 -34 -739
2240 -739 -48 37 299 213 -266 491 160 -391 507 261 -968 -46 588 -790 -42 251 -441 -240 534 -602
2260 -602 171 545 -596 134 164 3 -296 238 154 -219 133 505 83 53 -318 -77 -73 57 277 192 143 -226
2282b26Q1K95M05j293O88L30o36J7N20M88n44j30Q8j20j4M4o3j67M97K32n38M9
2304CK68j37P17m95j113K74J190q86m04O67P8n2p7J3j54k0L74q29M24l46j39M88
2326a56k5J68J40j54J02k22L01K98p63r0R15n08K33k04O72q75L35j40n72M33N35
2347D23m93j72M90n93k34J164p45m08Q65n54J64J66M75q17L15K69k06n52L44N44
2367D45j78L2M09j130L13L39q03P59K12J24q47J212q35l48N3K62o11j77J760r78
2387A3N1K06m23l2M86m54J82M22l64o6l60P27p87O22Q7o78q2O61k37j45K42j01
2409c0N2L01N3j14p2L94o66O56o41k5L1n41R14q06N36J9n1M1p2J46m56Q42o26
2432a15m80L26p8L30m62l87K52P62j94o3jN34o30l71L68m33Q11k1L07o37K91j85
$$ plain form
2282 -226 -145 150 555 -738 -50 280 -356 -339 181 669 125 -5 83 -37 -51 -7 -70 -237 260 492 -46 3
2304 3 271 134 851 356 -757 -483 707 -179 -583 84 162 110 33 46 -108 -128 246 -583 -159 -505 -644 -156
2326 -156 -181 -13 127 -27 75 -147 154 452 -311 -401 514 6 239 35 707 -168 167 27 -545 -112 423
2347 423 -70 -242 248 -345 -579 585 -160 -568 297 -257 -93 73 548 -269 46 315 109 -443 -99 445
2367 445 267 299 708 -422 -109 230 -573 186 398 522 -325 887 52 -296 -243 19 -592 -769 991 13
2387 13 64 270 -153 -185 301 -153 29 451 87 21 -339 388 -399 223 310 -368 -450 211 -26 -171 71 -30
2409 -30 22 323 376 262 190 584 -82 574 -67 -92 -61 -602 312 -494 42 61 10 51 -21 125 -331 511 -115
2432 -115 -595 -269 -347 -17 -479 -866 -614 148 -46 -109 -110 424 -206 -577 -209 -642 169 148 455 -182 109 -76
2454g6n4l53P02j4j67L00K2n41O7k40O65k71L54n92k65P29Ll51N49n23Q9J77k48
2477c8K74n49M45J91l97L29nl6j58K60l51J80j31k64O1k26k43K50K25L8K17j9
2499E3l5K57m31O33l38m76O56j8l22J68o1k94J26K70o81R52j36p46K82j83K76
2520d8m08Q27p96k60Q45m8k25J50K03j254O91j68L26N26k51J87m16M26M50p22
2540C5l82J90L95j092P25l3n8L74N31p89L80m76m2K84Q4N1j52N19o48K06r0K27
2562B39k00K61k92j48K97n67K79k39N87K23k58J020j592L3L98Q5j129Q91Q59l30
2582D17j50l46q3M83L9PJ23j28j82J11l60K49M8J67n40k0K19P1J08o19P34m33
2604h5K40m98O65j140K65N69k18K82j37k47K31K38K58r55R88k44j08n48P49l52
$$ plain form
2454 -76 -130 -483 219 205 38 338 360 -181 -114 -354 311 40 394 -198 -463 266 269 -82 467 -56 33 210 -38
2477 -38 236 -313 132 323 -74 255 250 214 56 316 -35 145 14 -250 -189 -415 -658 -408 -183 -145 72 53
2499 53 18 275 -156 477 139 -337 319 301 -21 147 86 -208 -82 188 -493 459 323 -423 -141 -324 -48
2520 -48 -456 371 -425 -685 160 112 -113 37 240 -1014 -323 -491 -165 361 110 297 -119 307 757 35
2540 35 -347 -157 238 -854 -129 -162 -220 154 685 -104 276 -200 -242 42 126 177 25 544 -104 102 12 239
2562 239 39 300 8 -140 157 -410 -131 -370 217 440 182 1202 -390 -357 41 126 -1003 -112 747 417
2582 417 267 -79 -162 321 360 367 490 362 180 291 -69 180 228 395 -145 -165 54 125 233 -386 348 -85
2604 -85 155 -343 322 -818 -553 16 -202 80 -57 -304 -73 165 423 -532 456 212 104 -444 305 -47
2624d7n4O2Pm2l93L86Q11q97K07p57N59k88L19j25M92j50l9M06j87r11M50K60
2646F9m66l29N33L82r76N23O67r30O49K93l64J15L99l47l88j87L58K6J76r2m32
2667c21L18K49p73R3L61K13o41J55j4Q41q82R03l82J46N5p92L92k7K05m62O00
2688B37j04J37m20M98l65k83Q5j1P08L22r66M90J90k69l61K28Q6ml40L72K03o68
2710b35L87L6K96k21L11r35P31l49k70J83j03L96m53j64J51O4j58J22k60l03M20
2731c54O34l44O28r41J77j07O44j42q4k16m59J024n44k3p7J94K36m05O79O8j77
2752D11m94J43R4r8k02K93q8P51q34M66r0o29k13Q80k2n3J42n68K52p78P97l25
2774a65M05J21o67J96J46o3K07j44O50q25J65M24o64L63M70o48m4N58j039M76
$$ plain form
2624 -47 -101 -39 -32 -74 -467 -81 730 -167 40 -717 -158 -446 -127 -252 240 90 51 457 270 -641 -191 69
2646 69 -397 -726 -193 189 -787 -264 403 -527 122 415 51 166 565 218 -170 -357 1 27 203 111 -321
2667 -321 -3 246 -527 -434 -73 140 -501 -346 -360 481 -401 502 120 266 321 -471 -79 -106 99 -363 237
2688 237 133 270 -150 348 -17 -300 -215 -226 482 804 -162 328 518 249 -112 116 202 198 -142 230 433 -235
2710 -235 152 188 484 263 574 -361 370 21 -249 -66 -169 227 -226 -390 -239 -175 -333 -211 -471 -774 -354
2731 -354 280 -64 564 -377 -200 -307 337 195 111 -105 -564 460 -84 -107 -184 10 246 -159 520 588 411
2752 411 -83 60 154 56 -146 147 59 810 -24 442 352 -277 -490 390 368 315 457 -111 141 -637 160 -165
2774 -165 240 361 -306 -110 36 -27 180 36 686 -139 26 450 -214 149 619 -29 -73 485 -554 -78
2794g8o7K9K91l10J20l73O85j0K12M5o83L86k42k91P07j041J295r55M52J85o92
2815c35L66M07n87M03q1l12L91l15n6J02l99NjR84q98L69l15K53j36M19l69K67
2837A62N96j166Q3M69j70K16R1l52N2j82M99n74K02J29m54J83Kj23M90RK05j86
2859A81j13k48q36O30L73j46j10K05m9O25p04j16L01K83m37O3M59j25m45J98J53
2880A42k89J38k04L62m22J91R0l27M66l28L6l9M93N5j47k25j20q5L09P4p50Q85
2902C05l87q5j13M7L45j38k1N54o21K61k24J18K73k01p21K12O54n22L77QP3j69
2924B5RJ23l23K59M1r58R10n59M62J82o43J60M80l9r1j79K64K09n5K94j057N82
2946I6o27R82q33J16R40q39j74K93L96l57l75O2O29m38lM33K7J07l93j61jk92
$$ plain form
2794 -78 -145 -116 175 -135 -15 -388 297 287 499 544 -139 247 5 -286 421 -620 675 -280 172 357 -335
2815 -335 31 438 -149 254 173 -139 252 -63 -119 -17 -416 -411 -412 572 -326 43 -272 -19 -155 264 -105 162
2837 162 758 -408 -325 144 -26 190 281 -71 -19 -201 298 -276 -74 55 -399 -216 -214 -337 153 162 367 181
2859 181 68 -180 -1016 -386 -13 -159 -269 -64 -113 512 -192 -308 -7 276 -161 -98 361 236 -209 -11 142
2880 142 -147 -9 -213 149 -273 -82 8 -319 147 -181 -145 -184 309 364 217 -8 -128 -213 96 170 -580 305
2902 305 -82 -167 -280 -233 112 -26 -47 507 -114 147 -77 41 314 113 -608 -396 258 -264 113 121 194 25
2924 25 34 157 -166 93 134 -824 86 -473 -11 171 -472 -312 168 129 38 -141 123 332 277 571 -486 96
2946 96 -531 451 -382 -266 674 -165 -339 -46 350 -7 -382 -320 309 -129 -132 301 328 435 42 -119 -120 -412
2968d12M74k9o0K95J56o1p6l36r1P05n98J56n1O6n0n57O63K00q7o60l13N03J26
2991c7l62P79o26K19M69n22Q2J11n57O69m29O77n19K51O8j048R00o2n32P7N74
3012A82R3n04J32L88L6n30R3P06p00j96N88p6n31L11k4J84j91j67l76N60L46m62
3034a38J87N0k31l59L38M04p04K02J64L26j58Q7j52k11Q14o89j05J48N06J72r99
3055c48M48l97J12j29N43N81m23j27o90R4L99K99n02M96l60n2J168j258K75k40
3075a11k89M35j50R2L00l86K6M72m49l67O38p73O41N48l28n13k07O61j56J63J4
3096B61J37q50L59k57o1n6L53j52J33K06M96j83l09J83k18PJl84N93l62j69L51
3118G9J74L09o54j03J36O4m2j24K73j17n66Q01o3j20r1K89n4o5l19K09n98J260
$$ plain form
2968 -412 62 33 -27 268 424 363 287 -49 -140 565 -33 123 72 138 88 -469 194 394 307 -353 -666 -163 -37
2991 -37 -399 380 -246 -27 442 -80 2 113 -444 225 -204 473 -46 205 273 -775 125 63 -469 -392 182
3012 182 275 -229 -97 291 327 -203 -110 596 -104 -300 288 212 -319 -8 -32 152 -39 -206 -582 -22 324 -138
3034 -138 49 99 -132 -491 -153 251 -453 -251 -87 239 81 168 16 -195 619 -70 -175 -27 479 651 -348
3055 -348 100 -297 -185 -314 229 810 387 260 -430 -336 63 362 -140 356 -4 -56 1112 -146 129 -111
3075 -111 -400 35 -115 -23 277 -109 -83 389 -60 -427 211 -562 79 627 299 -214 -421 240 84 247 261
3096 261 398 -452 -93 -350 -411 -467 -114 -266 -133 73 569 386 77 260 42 49 50 -334 259 -103 -272 79
3118 79 253 562 -92 -195 -59 5 -37 -161 112 -5 -571 230 167 47 -44 245 191 126 -193 16 -582 678
3140F78j029O53l33N52j52k51L89p31J60k32N31r81K90O24J96k68M8J25m1J01
3160C29k04P9k10K17K34r29L15P1k3J5k70L79Q7j37l35M02K93l18L14j69k51M00
3182B89m31j83R54n21k41K9P2R4j21j62j59M39M23o42N10j128J068n62N02Mj30
3203A04l02N17k66l48L48N35p43O63n17j63J5J04J96m92K35r1p1L70M00n12M78
3224D60m38m12J30J48L80k23J7k37J11k46P33j302J087j99L92l76J32q76L27N41
3244A49m0r2K62o16J00k13O85l40j23M87J47l62p70Q62l44N12o64J4M48J68p64
3265d94N96J24N42j094J84k25N61j15k95M95k18M17n90L9qj05R7P30m23K80j7
3286D81p02N45l77J19R0j88N58o81M9M14l52K56KJ25k15L05m03R6L53o26M12j02
$$ plain form
3140 678 -351 302 -31 521 369 118 507 -224 -64 -296 235 -746 -456 168 364 96 144 269 228 329
3160 329 125 204 -6 211 445 -484 -169 -98 -121 -106 -376 3 90 -47 -382 20 313 -5 309 140 -111 289
3182 289 -142 -325 629 108 -133 -104 -32 62 -59 -221 -380 59 482 -160 350 -778 290 -272 230 234 104
3203 104 -198 319 53 -295 53 588 -155 508 -9 -172 -157 -53 143 -349 -114 -205 -276 94 494 -18 460
3224 460 22 -390 -260 -112 268 45 62 -175 -64 -310 423 -879 208 9 401 25 157 -719 -392 149
3244 149 109 17 279 -337 -237 -450 235 -105 -228 259 406 44 -726 136 -208 304 -360 -346 102 270 -494
3265 -494 102 226 768 -326 -142 -367 194 79 -216 279 61 478 -112 -73 -81 -186 -89 641 218 498 481
3286 481 -221 324 -53 66 156 -32 526 -155 -106 308 -44 212 214 339 124 429 26 122 475 -151 261 159
3308A59m7K06j59J32J33l91L63l74l74N22l75L15M87p65R1J21k82M72o10M98l98
3329b76N22n3j21R3r48R75k98J52k47M38l96KJ22m14J67p9K56j5m0k51N93l37
3351a55K15j17K87j32O4M39q38n26R60N02m84j23Q3L39m64r1j23Pn1K03j53J14
3373d4k06L80r3j89J54j46j27m58J14K68q7k0J26O80n19j36J29L42k81j00O34
3394D21p4n78j44K81j51k54Q20l33m52N16k18l44Q11l85M94K7q53L61M32k35R9
3415B41k7m63J99L8M66k48N9j6n43J35P80j93k04k03J72J1m85L23J21j75M07j040
3437f45P59p75J003l97Q60n23j51K3o30L82o4k1P0oM02n85L29P4m09R43n76n45
3459d82j47M66K01K2m7l97Q28o00O11q36n52Q03K40k20K02P06p75j00M8p1M22
$$ plain form
3308 159 112 318 159 291 424 33 396 22 -352 170 -205 110 597 -168 -77 44 -238 234 -376 122 -276
3329 -276 246 193 72 165 -783 192 -106 46 -201 237 -159 -157 -35 -449 -282 -361 -105 -120 -160 -411 182 -155
3351 -155 60 -57 230 98 162 601 -237 -763 197 699 215 92 175 514 50 -41 -164 -157 -208 -5 -158 -44
3373 -44 -250 130 37 -152 2 -144 -271 -729 -615 -347 -434 -454 -328 352 -167 -303 -174 168 -113 -213 421
3394 421 347 -231 -375 -94 -245 -499 321 -12 -464 52 -166 -510 301 -84 410 437 -416 -55 377 142 241
3415 241 214 -249 -50 -12 454 206 265 249 -294 -159 621 428 224 21 193 204 -281 42 163 -12 395 -645
3437 -645 114 -661 342 -55 805 282 131 154 -476 -94 -158 -179 -109 -115 287 -298 31 105 -304 639 63 -482
3459 -482 -629 -163 38 60 13 -384 444 -156 455 -381 -933 -130 110 -110 92 798 23 -77 -29 -100 322
3480C22r39J247o95k16N20m34M53m10o3j47O07k97M69k51k38O03q32R84j180M06
3500i1j92J4K14j8%M44O58q70l35P51q6n37k46Q46j27q69N97k52J70l19K16p51
3522g83O61m46N61j80M43k81K04K82m83O8N3k82K75J96n68L91O6M04n59j87j06
3543b71nR1L92o74K52L86j85L20m62K76M1j72R0m17J088n17q0j43k48K73l88M48
3565I5Q7m58L47N5l46L18J76M0PJ56n59J41L73l96K50j53l33K16j93n31P22O7
3587H1j71J52k90M83L05o52J57k9Q06q83M3M15o93Q44m20l39L47L7j56J55m01
3608b09j43M89l5K93q80N21N17m55J13k43j05N06l10N0K55m95K29l07R8R3l37
3629c55L15k50Q59p83K9Q1K24J70o10j7O82l29P5J82m64N69n6p79J28N82m07K25
$$ plain form
3480 322 -617 630 -65 -281 239 -195 258 -152 -215 -362 245 -52 417 166 -72 531 -301 683 -497 -91
3500 -91 -283 -269 -55 -73 -73 371 1029 159 -176 575 489 -48 -294 552 425 -444 153 -99 71 -248 -32 -783
3522 -783 -122 -568 -7 -187 256 -25 179 461 -22 46 99 -183 92 288 -280 111 177 581 22 -165 -271
3543 -271 -276 -185 207 -467 -215 171 -14 306 -156 120 161 -11 79 -338 750 233 153 10 -238 35 -353 95
3565 95 182 -276 71 126 -220 98 274 314 321 477 -82 59 432 36 286 133 -200 16 -177 -708 14 81
3587 81 -90 62 -228 255 560 -92 65 36 842 -41 2 417 -276 568 148 -191 156 193 37 192 -209
3608 -209 -352 137 102 395 -485 36 553 98 211 -32 -137 369 59 109 364 -131 98 -209 -111 -18 -355
3629 -355 -40 -290 569 -214 -185 -104 120 290 -320 -337 345 16 91 273 -191 378 322 -457 -329 253 -154 71
3651G1k19N74l42l76j01M35M1q35N06Q3L57l80M89k75K53j11m14K4J14nJ39J54
3673A82k29M4l15M12l41M8O9k9M77o58N68r9Q2r34N96N25m4k16J26p4k11j63N93
3696D09l15K24o32N65n97K30K58k47L24J18Q6j14l83K66j48o53M43N44l83k14
3716b19l62P75J26l31P65k12k90o13M77L0R5j1m37M78l91L02k84K21l40L15q71
3737g77P47L97n24j80J74N16n00O2N0j39L9J87n04J84L2M96m07m8J35M22l36O83
3759G09q55O71j68o47J36J88k9N34n19k53J97J66l43Q5K49m33L36L16k94m65L35
3780h4J4J16N8J87j08o68P63k53j48K92k09L35o51K87J38P9m77L43k13K14m7j59
3802a91R2K96n33N0L70J1l77J33o3P5N29j2p18J41O92p68J97J51N1L14n91J3J78
$$ plain form
3651 71 -148 426 84 -292 -393 42 83 -752 -246 -163 194 -186 303 28 281 170 -244 -220 -106 -111 28 182
3673 182 -47 -3 -318 94 -247 -199 -130 -159 318 -340 228 129 211 -723 -127 398 354 138 264 190 -21 -184 409
3696 409 94 318 -314 251 -346 -116 142 -105 219 337 423 309 -74 192 44 -609 -166 378 -5 -219
3716 -219 -581 194 320 -11 754 542 252 -361 116 146 241 230 -207 271 -120 182 -102 119 -221 94 -777
3737 -777 -30 367 -157 -337 -163 353 -147 -85 -35 -174 -135 52 -452 -268 -236 260 -147 -195 -60 362 26 709
3759 709 -146 525 357 -290 -154 34 5 539 20 -233 -36 130 -213 -128 121 -312 24 340 46 -419 -84
3780 -84 -70 46 104 291 183 -485 278 25 -123 169 -40 295 -356 -69 69 148 -329 14 -199 15 -32 -191
3802 -191 -99 197 -336 -286 84 95 -282 -149 -212 -137 392 380 -338 -197 495 -273 -76 75 126 440 -151 -138 40
3825D0k00R3j74O50k61n31O35J44k99J08j54m71N48j99k38j6M19J51O5J07j118
3846g01K43J27L80M33j53r1M0J69k40k64J39q6o04Q29m50K99j49L28j86q8q7k40
3868c52P41J81n37k64K46j02J46K45n02j60L88o72O92l08O17l41J70K12n89M01
3888B12k67L79l99J19K06o78j00P72j67Q3n25M30k93J32j94k30K07M24lK12m95
3909a75J27l43O32n85P69m77K46N26p76N55n76J34l08L54L16j14m69j30L62n57
3929d89M63J41k49L60l82O2O95n73k8n3o63J85P82k70M7J38m93K7r5L75P7l93
3951c36L64j35L85r3l3J30l1j53M74j31L61k34j46n57J68l12pL75J13q6k42ll7
3974a66N2M58j63l26l67O68n4P6J51L0k55k36M62n13J53J83J23m15K29J0k38L24
$$ plain form
3825 40 -160 -67 -241 409 148 -383 252 396 97 205 51 -420 128 -71 -309 -325 94 245 310 417 -701
3846 -701 -458 -331 49 482 329 238 278 447 207 -57 82 -4 -608 221 -229 70 -79 249 63 -25 -112 -352
3868 -352 389 570 33 -231 15 -87 59 304 -198 -358 30 -642 50 -258 359 18 188 400 -189 212
3888 212 -55 324 -75 44 250 -428 -528 244 77 160 -365 65 -228 -96 -290 -520 -313 111 108 320 -175
3909 -175 -48 -391 241 -344 425 -52 194 720 -56 499 -77 57 -251 103 419 305 -164 -294 68 -489
3929 -489 -26 115 -134 226 -156 -94 601 28 0 -53 -716 -531 251 -19 28 166 -327 -300 -395 -20 57 -336
3951 -336 28 -107 278 185 152 282 251 98 572 441 802 568 422 -135 33 -279 -286 89 202 116 -126 -129 -166
3974 -166 -114 344 181 -145 -512 156 102 178 329 359 104 -132 330 -183 -30 153 276 -139 90 100 -138 186
3996A86j82l04O18o15J83k01M57N9r65R44j87K00m6p97P00J15L53p50p1L25M47
4017D69m02m25J193j024N0p5L64K09n57N98k67j87k54n8l09J170m83N23o35L71
4037B71J17o96L39l5J01k80K87k07m34P23l06o2L5O10q68M33j71L57k23mJ83r3
4059G7k8m58L04M89k28L99j101N51M42k32j22N1n4j57Q10r96j20M37l5m39Q93
4080D83k02n72P47n30K20M21l99n12P04j38k21m0j58K14N3k87L62O7l36L61J92
4101D29l43n7L45k83J75l33J97k71MJ43m14K91J18k4k66N42p2o1J04p10L85J85
4123H4m80O13j40P16n93Mj22m84K45l09J45L60l23M61n46M02j09K75l48l46K15
4144b80K07M1J03k61M05m80P19j97q8k39K7n7J07K06j35k35K42L92l72L2l88O36
$$ plain form
3996 186 4 -300 318 -297 -114 -315 142 201 -764 180 -7 193 147 -650 50 165 518 -232 -303 22 469
4017 469 67 -358 835 -189 -139 -214 150 359 -198 400 133 -54 -308 -366 -675 495 12 535 -100 271
4037 271 388 -308 31 -4 97 -183 104 -103 -537 186 -120 -182 -147 463 -405 28 -143 214 -9 -13 170 77
4059 77 49 -409 -105 384 156 555 -546 5 447 215 93 144 90 -67 743 -253 -373 64 29 -410 483
4080 483 281 -291 456 -74 146 567 168 -344 360 222 1 -39 -197 17 70 -217 145 212 -124 237 429
4101 429 86 29 374 91 266 -67 130 -141 -137 6 -408 -117 1 -23 -289 253 181 120 224 -486 -101 84
4123 84 -396 217 77 793 200 204 82 -402 -157 -466 -321 39 -284 177 -369 33 -76 199 -149 -495 -280
4144 -280 -73 -32 71 -190 215 -265 454 257 169 -70 -43 -100 7 213 78 -157 85 477 105 137 -251 385
4166C85K0l39Nj89J60L4l34k98P08q37R74l94k52O10n9l5k25k2J73p13N63j63
4188b28R97p86m7O19j035J265q37L21o24N8L96M4p7k97o5L46L30k00j91j01l25
4209d37P02M4J18n47L51k3n87p1N84K93m16j54J17N08n87m28K36K08M87l88n91
4230e81K41K12j37M73l50q1M31O5Nm58K74m87j74J130n91Q7m28J09K63L34m33
4251i6j84L84O24m99l19j37%L17J84k42m75O10l71P5M77n14j04L81o48l8J3P95
4273B33j8R4j81k27j59M82P7j31O01j037L53j72J45L43n85O2J52j89k98M31L1
4294GQ0k85l59P27K26m01k0l21J12l16P15l20j48N65n98M25m38L7Q53k09m65J00
4316c3M63l54L0N5p84L11O71L2m57J65J86r7k98L22j13m9M89q05M45J7j04j70
$$ plain form
4166 385 405 66 71 -118 42 76 -258 -556 152 -685 289 -105 -357 253 194 159 -66 -88 85 -628 -65 -228
4188 -228 769 -17 -64 555 -480 785 -52 269 -355 -297 99 143 66 -231 -296 50 380 180 -11 -112 -437
4209 -437 265 309 427 -120 231 208 -379 -450 134 427 11 -143 -26 482 -105 -533 -297 -89 398 10 -581
4230 -581 -340 -128 -265 208 -142 -223 208 273 278 -180 94 -393 -567 563 -28 59 -369 -260 3 337 -96
4251 -96 -280 104 728 229 -90 -227 -227 90 274 32 -443 167 -204 -129 348 -166 -270 111 -537 -575 -562 233
4273 233 215 309 128 -99 -258 224 301 170 771 -266 87 -85 60 403 -182 -120 32 -157 -455 -24 7
4294 7 87 -198 -557 170 396 -5 -25 -346 -234 -550 165 -155 -303 262 -336 89 -349 -312 541 332 -133 -33
4316 -33 430 76 106 161 -623 -312 359 391 -66 99 285 188 -110 212 99 50 539 -266 179 196 92 -78
4338g8k4J16L19l34k08J34O56M1n69K95j77l16J78l46L11L13l05M74j036M49M40
4359C33j05r3k75j5L74p2l0q3n17L35m83R93J18n69l53R68j55l53J42p04Q33m17
4381a28K29k20n5R8K63p20L73p3K79M1M07j260R92k90K47m96J6M86j70j7j55l06
4403d59J142l01k92j86l7M5R1j28n03K49M29K58N4m35K56j3k02j2L37n81k3O28
4425C17j11Q2j44p47O59k19Q50o56J41N5l03L14j56M87l69L8j116Q64J00j20K82
4446B48J61J81k50m96j21m2K72n3k0L05l37l1O2J57j31r3J67J95n6n02N60R6p35
4469d63O53j16j93l5k51P13kk41l92oJ2K92O00p7q71L01k57P30p63L47q1o5L93
4492B28k27q4l9j02L47l40L72L25l01M4m52K32j49P26n16J28l36p2P74m96K96
$$ plain form
4338 -78 -102 14 333 -1 -209 -75 581 622 53 348 171 -145 33 -313 -2 311 6 480 -556 -107 333
4359 333 228 135 -140 -155 219 147 117 34 -483 -148 -631 362 480 -89 -442 526 371 18 160 -544 289 -128
4381 -128 101 -119 -174 -76 187 -533 -160 -233 46 87 494 -766 226 -64 183 -313 -297 189 19 2 -153 -459
4403 -459 683 382 90 -96 -133 -88 3 -125 -628 -379 50 308 362 -73 183 170 -32 -44 293 -288 -311 317
4425 317 206 288 144 -603 56 -163 687 31 172 227 -76 238 82 569 200 238 -878 -14 86 -34 248
4446 248 409 590 340 -156 -277 -319 -47 -100 -120 185 -152 -183 -121 36 -95 -188 -21 174 118 -384 176 272 -463
4469 -463 190 74 -119 -154 -405 308 306 65 -327 -333 -321 -29 571 494 -377 -76 -333 397 -366 -19 -100 -165 228
4492 228 1 -83 -122 -224 123 -217 155 480 179 223 -229 3 -146 580 64 192 -144 -216 558 62 358
4513C58j25l00p60Q66j83K18J50l59M45k25n03M13J14j6j74L12r02M68N0L17l52
4534a88L19k76M24k6r9J68j92K40n90J73L14j65l36L13kj24J21m40L78j54P48
4555F06o50K27k46K12K76l95L41l55R9o22J63K23M66l28J19m4l37L63j64l98l09
4576g53N71O1j8L84k57k23J08n3L67J9J56m96j67M95J05j00j62K3L95q50l46J024
4598B83p13Q43k75p43N61N1k62N59M4m7o56K78L45l96Q7M11m11J41p3l37j25J19
4620c16M52j55J19K40k56l40M31j99J2l02O52n14O95l80j67k54L48M01m46j31
4640a10j87N10o19R72j074N56j28k35N28M7l35J38l70M16k36n8O1P71m94k14P60
4661F99j013K50l51K99P2J19J07M95n91k60M02n43J34J74k45L69m54k03K16j55
$$ plain form
4513 358 233 -67 -827 39 -144 74 224 -135 310 85 -418 -5 109 93 -81 231 -671 -203 -153 164 -188
4534 -188 131 -145 279 253 154 322 130 370 -220 -47 267 102 -234 79 77 -47 74 -366 12 -142 606
4555 606 -44 183 -63 149 425 30 371 16 115 -507 -344 -121 345 17 136 92 -245 118 -46 -444 -753
4576 -753 -182 -121 -139 245 -12 -235 -127 -180 187 206 362 -134 -301 194 299 199 37 60 455 -395 -741 283
4598 283 -430 413 138 -605 -44 7 -255 304 348 301 -355 -77 268 -128 -41 370 -41 100 27 -310 -435 -316
4620 -316 136 -19 100 340 84 -256 175 -24 -12 -314 338 -176 519 139 -28 -282 66 467 21 -110
4640 -110 -297 213 -406 566 -508 48 -80 -315 213 260 -75 63 -307 109 -127 -185 -124 647 153 -61 699
4661 699 -314 -64 -415 -116 -44 75 182 677 86 -174 228 -315 -181 -7 -252 117 -337 -540 -324 -479
4681d79N41l33J75lM28M81j055N46o64M78l07M23k48q6P2K47R0l15k2k25N68m99
4703a87L39l08R5L52l85K35n25N21K86l26K10j90j47l5Q8r9M94k24k31k11R8N77
4725D27J38n11J4k49J48m59P48j50k72p1K64j83L15l3l09J48l99L19K54k28K0
4746f9L10L19n06J05n65Q0P27m7K4o37M10m06J016k4q11L09n10j5Q24n35J81J3
4768A93k62N3k6M78k87J91l07m19J153m36n92k26K2J93L6R71j133K86O1j49N32
4789C32n93r0P10j84P9K4j23p01N6K34K41r6J86k75Q38j176J38L47M08o20L91
4810A26o6q9j6K75j67l63M14j18R2L41k75j17j89R78p84R9l9J35p26N18l65K25
4832a11L81j22l90N24j54j95j97N41o27M62l46k1j9MJ00O43n49j93M90j66K30
$$ plain form
4681 -479 62 -271 -96 -99 329 810 -245 301 -363 115 -192 231 -17 -103 -31 216 306 -9 -31 -256 312 -187
4703 -187 152 -156 -61 291 -94 141 -384 137 423 97 307 117 -30 -65 23 -76 418 194 -37 -248 -150 427
4725 427 565 54 68 -181 -33 -492 256 106 -166 -237 27 -156 159 126 -183 -35 -434 -115 139 -89 -69
4746 -69 241 560 54 159 -406 -326 401 354 378 -259 151 -255 761 737 -74 235 -275 -290 534 -1 180 193
4768 193 -69 -16 -42 436 149 340 33 -386 767 331 -261 -487 -465 -272 -236 735 -398 -112 -51 -200 332
4789 332 -261 -351 359 175 254 278 155 -546 -490 -256 -15 -111 75 -200 638 -538 -400 -53 355 -265 126
4810 126 60 -29 -45 230 63 -300 114 -4 88 429 154 37 -152 826 42 141 102 237 -489 29 -336 -111
4832 -111 270 148 -242 282 128 -67 -264 277 -350 112 -234 -255 -274 -270 -170 473 -76 -269 221 55 285
4853B85K74n89l46M11K96K55n73k10L66k62k26O17k76M66r0k72j38R4l88K11N66
4874D71n27K25N69m61k61K04J21n85K99L9K12k28k22j12j71O59m58L16k61J39
4894c2N24o17J19k86K88N17k30l68k86R3P81l14j02M56n17l14L26p3o4M96M40
4915H37m13m75K10l3j89L89p09K13M82l92K21m69l1P37l03j85l03P93m78p5J68
4936ej74J36J13l8r8Q7J44N12p34L7m06L44j71L88j47L21m08L32k83K5O39n01
4958A13J41l43k60k25M17l79O15l52P6l22l3K34M61l64J48L10k71L4n19P24Q3
4979B88l79J20k0m89O10k80l45Q78k09P21j055l7N95n29k46N29k95J96M1j64R4
5000B4J07n27J27j7j30m1N40O4p72K68O22k34k66M25k50O06m33n51K70L4M35k60
$$ plain form
4853 285 559 -30 -376 35 331 586 13 -197 169 -93 -319 298 22 488 398 126 -12 82 -306 -95 471
4874 471 -56 169 738 277 16 220 341 -244 55 94 306 78 -144 -256 -427 232 -226 90 -171 -32
4894 -32 492 -125 -6 -292 -4 513 283 -85 -371 -278 503 189 87 543 26 -288 38 -35 -99 397 837
4915 837 424 -51 159 126 -63 326 -383 -170 312 -80 141 -328 -359 378 75 -110 -413 380 -98 -173 -5
4936 -5 -179 -43 70 32 -66 21 165 677 -57 -20 -426 -82 -253 135 -12 309 -99 233 -50 -25 614 113
4958 113 254 -89 -349 -574 -157 -536 79 -273 -197 -519 -552 -318 143 -221 -73 237 -34 0 -519 205 288
4979 288 -91 29 9 -480 130 -150 -495 383 174 895 -160 -197 398 -131 -377 152 -143 53 94 -70 24
5000 24 131 -396 -269 -286 -416 -457 83 147 -625 -357 265 31 -235 190 -60 546 113 -438 -168 -134 301 41
5022D1l47m28Q35j43p29N68O05N05j171O51m77k12M86L34n64jk61l91M60Q65l01
5043C25j40L84n14j20J74K74l21J59O2j81j85j39K23l64O98m87k31M96J42J97
5063D52p65J85p8K9J07n57N92l90K36K28k07k90l1K28k87M42J27j46O37l11J38
5084C39J9j014K10P53m61j29M49Q6k21P4j0n3j55K14p0l77M59k21J52j99N23j24
5106B44n07J82j47Oj25P37p05N83r30Q5P16o90P15N1N07l66n09M10l33l78K68
5127a86L21n18L87j12k39K89O5N6o7M34p81O46km63M29j96L67m5r0p30N97n95
5149d33P23j61N21p69K0L0j58R7N73l13j98J95J69Q6l16m22L89j08m1p98P40M49
5171B75j01n76L61J04j50l9P91o16n68M70M71o24N14O82r70K06k35N28L2l94k46
$$ plain form
5022 41 -306 -734 101 -42 -771 -203 402 907 -264 387 -90 -302 184 518 -46 -47 -308 -699 -239 626 325
5043 325 185 569 55 -65 109 383 62 221 283 102 -83 -222 1 -363 335 -152 -383 113 255 452
5063 452 -313 -128 -206 -177 -70 -627 -35 -425 -189 39 -168 -458 -489 -261 -548 -106 21 -125 512 201 339
5084 339 358 -656 -446 307 -154 -283 166 252 31 105 95 42 -113 101 31 -346 113 -108 44 -155 368 244
5106 244 -263 -81 -228 -222 -347 390 -315 268 -662 -577 139 -551 164 215 722 356 -153 257 -76 -454 -186
5127 -186 135 -383 4 -108 -347 -58 7 63 -4 430 -351 295 293 -170 259 63 430 385 295 -435 162 -433
5149 -433 290 129 650 -119 -99 -69 -227 -130 443 130 -68 127 296 382 66 -356 33 -75 -116 -914 -174 275
5171 275 174 -402 -41 63 -87 -126 665 49 -519 -49 422 -202 312 994 24 230 -5 523 555 161 -85
5192h5l2J82k53K04j68K65l0l16K95M33n2J71j72j29r6n80M48k4M54r06M7l1J89
5215a86J34M19m09K8K47nn46q8M70K56q22N74n8N0k99j81R6O21l14j11M14n23
5237b33L72p30K59M05k15O72m18m43J002n86q57L95L32m36N80K55j38o05J00l81
5257f70K76K66J57l35Q9j24J51l0N79r33Q62q38R83l24m23r7N68J39l66O67n85
5278A2o6J50M33j117R71R2n46P0K24k23K30n48K05o65P65n76K90K70k0J70n53
5299d32M48L39l27p6J05l76M96k19k91K37o8J75K72l78N33n27L34j70o06R54n8
5320C65k86q5P90p71n8l4j50k38O44k89N18k66l29o6N58j1l83m22M06L7O47n50
5342B7N58o70n49n3Q01k34J06L12k67M0Qj30O5Mo2K86m51J95J34Jk57N05k02l08
$$ plain form
5192 -85 -117 65 -188 16 -152 113 83 -233 62 495 443 614 442 313 217 -363 85 61 515 -391 -344 -375 -186
5215 -186 -52 367 -42 -14 233 228 -318 -406 64 320 -502 72 14 64 -235 -416 -320 301 -13 -124 290 -233
5237 -233 139 -591 -332 73 -142 530 112 -331 671 85 -772 -377 -45 -481 99 354 216 -389 -289 -670
5257 -670 -394 -128 29 -306 -217 -341 -190 -220 359 -574 288 -550 433 109 -314 -411 157 296 -70 597 12
5278 12 -54 96 529 -588 383 475 -71 -1 223 0 230 -318 -113 -778 -13 -589 -299 -29 -49 121 -432
5299 -432 16 355 28 -48 57 -319 177 -42 -333 -96 -164 11 283 -95 438 -89 245 75 -531 423 365
5320 365 79 -6 784 13 -45 -79 -229 -467 177 -112 406 140 -189 -255 303 292 -91 -513 -107 -70 577 27
5342 27 585 -85 -634 -687 114 -120 -14 298 31 71 79 -51 14 18 -44 242 -209 -14 120 121 -136 369 167 -141
5366a41m2K06o8L51l89N5L31r17K49N19r6j14K24L95m46n04J45l07L38l95N04
5387a02M49Jk04l47m0J15J07M65m96N0L31k25J21l85LL91o06P32o91l59Q23r9
5409C4j4n92N15j39J00M82k58k14J58q76M38m88P03J94o9j85O0M0M68k50L07l63
5431E1k21K74o11J160j98n53L06p75J006p70R95o15l39N47j29Ok56M38n88j31
5451d03N65k08O15p53n82Q31n29J81L74K87j193M49P66O0j41p6j82m68N67l38
5471a78l13L11k00L37K40O03j630R91J18k12K78m57JM82l86n16O3M25q09J284
5491D32J8l59j71j89L56O17j362L78L3K44L68n39K50l19P22q69K08k3k55J94O25
5512C59j75m42j19M60m0m7L1K98j80O53j148M57l40K79k34K73m10l38R05N0k21
$$ plain form
5366 -141 -183 23 -45 306 -83 -28 303 -614 -365 154 58 -56 168 563 117 -387 -242 -549 -211 -606 -102
5387 -102 347 348 144 -203 -243 -128 -21 444 -52 -2 329 104 225 -160 -157 234 -372 360 -331 -690 133 34
5409 34 20 -572 -57 -196 -96 386 128 -86 72 -804 -366 -854 -151 43 -26 -211 -151 -111 357 107 414 51
5431 51 -170 104 -507 653 455 -98 208 -567 439 -331 664 49 -290 257 128 134 -122 316 -272 -403
5451 -403 162 -46 569 -184 -766 65 -464 -283 91 378 -815 -366 400 460 319 243 61 -407 160 -178
5471 -178 -491 -180 -380 -43 197 800 -830 161 279 67 345 -112 -111 371 -15 -531 -468 -43 -852 432
5491 432 450 91 -80 -269 87 704 -658 -280 -247 -3 365 -174 76 -243 479 -390 -182 -205 -460 -266 359
5512 359 184 -258 -377 83 43 -4 27 325 145 798 -350 107 -233 46 -188 85 -325 -663 242 292 71
5533G1j84R4J08k28L35j13l09N25n23j23j73K68L81Mo65K97J96l29M14l31L25
5554D0K03j67k63N2L08p6j17P67j249O55j1J84q12Q19n05R7j99K83j69K52L49
5575D41m96K2J50k83L91j8m51O20l60j36O7j64M41L3n17K44N3k39jm0O32M3q6
$$ plain form
5533 71 -113 -19 89 -139 196 83 -226 299 -224 -347 -520 -252 129 133 -532 -235 -39 -368 46 -285 40
5554 40 243 76 -187 -135 173 97 -20 747 -502 153 142 326 -486 333 -172 -75 -274 9 -160 92 441
5575 441 -55 -33 117 -166 225 207 -244 376 16 -120 -53 -217 224 257 -260 -16 37 -202 -203 -243 389 432 346
$$ [...]
8191C43
##END NTUPLES=NMR FID
##END=
