##TITLE=1H_SAM_23.173'
 CDcl3/DMSO-d6,108 sc, 
 19.12.2019
##JCAMPDX= 6.0         $$ Bruker NMR JCAMP-DX V2.0
##DATA TYPE= NMR FID
##DATA CLASS= NTUPLES
##ORIGIN= UXNMR, Bruker Analytische Messtechnik GmbH
##OWNER= root
$$ XWIN-NMR		Version 3.5
$$ Thu Dec 19 14:33:32 2019 Russian Standard Time (UT+4h)  she@DPX200
##.OBSERVE FREQUENCY= 200.122
##.OBSERVE NUCLEUS= ^1H
##.DELAY= (6, 6)
##.ACQUISITION MODE= SIMULTANEOUS
##.ACQUISITION SCHEME= undefined
##.AVERAGES= 108
##.DIGITISER RES= 17
##SPECTROMETER/DATA SYSTEM= spect
##.PULSE SEQUENCE= zg30
##.SOLVENT NAME= CDCl3
##.SHIFT REFERENCE= (INTERNAL, CDCl3, 0, 15.7039)
##AUDIT TRAIL= $$ (NUMBER, WHEN, WHO, WHERE, WHAT)
$$ ##TITLE= Audit trail, XWIN-NMR		Version 3.5
$$ ##JCAMPDX= 5.01
$$ ##ORIGIN= Bruker BioSpin GmbH
$$ ##OWNER= she
$$ F:/spectra/data/she/nmr/H-F/1/audita.txt
$$ ##AUDIT TRAIL=  $$ (NUMBER, WHEN, WHO, WHERE, WHAT)
(   1,<2019-12-19 14:30:31.54 +0400>,<she>,<DPX200>,
      <continue with go, POWCHK disabled, PULCHK disabled
       configuration hash MD5:
       00 E9 B6 7A A2 85 ED C7 34 08 36 98 17 FE 4E 26
       data hash MD5: 16K
       6F A8 1D 14 20 D0 F3 29 85 B4 FC D1 CA 3F AB F1>)
$$ ##END=
$$ 
$$ hash MD5
$$ 77 EA D9 41 1C 96 0E 51 E9 04 B9 79 0B 28 FE 82
##$RELAX= 
##$RELAX= 
##$RELAX= 
##$RELAX= 
##$RELAX= 
##$RELAX= 
$$ Bruker specific parameters
$$ --------------------------
##$DU= <F:/spectra>
##$EXPNO= 1
##$NAME= <H-F>
##$PROCNO= 1
##$TYPE= <nmr>
##$USER= <she>
##$AMP= (0..31)
100 100 100 100 100 100 100 100 100 100 100 100 100 100 100 100 100 100 
100 100 100 100 100 100 100 100 100 100 100 100 100 100 
##$AQSEQ= 0
##$AQ_mod= 1
##$AUNM= <au_zg>
##$AUTOPOS= <>
##$BF1= 200.13
##$BF2= 200.13
##$BF3= 200.13
##$BF4= 200.13
##$BF5= 200.13
##$BF6= 200.13
##$BF7= 200.13
##$BF8= 200.13
##$BYTORDA= 1
##$CFDGTYP= 0
##$CFRGTYP= 5
##$CHEMSTR= <none>
##$CNST= (0..31)
1 1 145 1 1 1 1 1 1 1 1 1 1 1 1 1 1 1 1 1 1 1 1 1 1 1 1 1 1 1 1 1 
##$CPDPRG= <>
##$CPDPRG1= <>
##$CPDPRG2= <>
##$CPDPRG3= <>
##$CPDPRG4= <mlev>
##$CPDPRG5= <mlev>
##$CPDPRG6= <mlev>
##$CPDPRG7= <mlev>
##$CPDPRG8= <mlev>
##$CPDPRGB= <>
##$CPDPRGT= <>
##$D= (0..31)
0 1.2 0 0 0 0 0 0 0 0.06 0 0.03 0 0 0 0 0.0002 0 0 0 0 0 0 0 0 0 0 0 0 
0 0 0 
##$DATE= 1576751228
##$DBL= (0..7)
120 120 120 120 120 120 120 120 
##$DBP= (0..7)
150 150 150 150 150 150 150 150 
##$DBP07= 0
##$DBPNAM0= <>
##$DBPNAM1= <>
##$DBPNAM2= <>
##$DBPNAM3= <>
##$DBPNAM4= <>
##$DBPNAM5= <>
##$DBPNAM6= <>
##$DBPNAM7= <>
##$DBPOAL= (0..7)
0.5 0.5 0.5 0.5 0.5 0.5 0.5 0.5 
##$DBPOFFS= (0..7)
0 0 0 0 0 0 0 0 
##$DE= 6
##$DECBNUC= <off>
##$DECIM= 4
##$DECNUC= <off>
##$DECSTAT= 4
##$DIGMOD= 1
##$DIGTYP= 9
##$DL= (0..7)
0 120 120 120 120 120 120 120 
##$DP= (0..7)
150 150 150 150 150 150 150 150 
##$DP07= 0
##$DPNAME0= <>
##$DPNAME1= <>
##$DPNAME2= <>
##$DPNAME3= <>
##$DPNAME4= <>
##$DPNAME5= <>
##$DPNAME6= <>
##$DPNAME7= <>
##$DPOAL= (0..7)
0.5 0.5 0.5 0.5 0.5 0.5 0.5 0.5 
##$DPOFFS= (0..7)
0 0 0 0 0 0 0 0 
##$DQDMODE= 0
##$DR= 17
##$DS= 0
$$ [...]
##$SUBNAM2= <"">
##$SUBNAM3= <"">
##$SUBNAM4= <"">
##$SUBNAM5= <"">
##$SUBNAM6= <"">
##$SUBNAM7= <"">
##$SUBNAM8= <"">
##$SUBNAM9= <"">
##$SW= 160.158713441211
##$SWIBOX= (0..15)
0 0 2 0 0 0 0 0 0 0 0 0 0 0 0 0 
##$SW_h= 32051.282051282
##$TD= 16384
##$TD0= 1
##$TE= 0
##$TE2= 300
##$TE3= 300
##$TEG= 300
##$TL= (0..7)
0 120 120 120 120 120 120 120 
##$TP= (0..7)
150 150 150 150 150 150 150 150 
##$TP07= 0
##$TPNAME0= <>
##$TPNAME1= <>
##$TPNAME2= <>
##$TPNAME3= <>
##$TPNAME4= <>
##$TPNAME5= <>
##$TPNAME6= <>
##$TPNAME7= <>
##$TPOAL= (0..7)
0.5 0.5 0.5 0.5 0.5 0.5 0.5 0.5 
##$TPOFFS= (0..7)
0 0 0 0 0 0 0 0 
##$TUNHIN= 0
##$TUNHOUT= 0
##$TUNXOUT= 0
##$USERA1= <user>
##$USERA2= <user>
##$USERA3= <user>
##$USERA4= <user>
##$USERA5= <user>
##$V9= 5
##$VALIST= <valist>
##$VCLIST= <CCCCCCCCCCCCCCC>
##$VD= 0
##$VDLIST= <DDDDDDDDDDDDDDD>
##$VPLIST= <PPPPPPPPPPPPPPP>
##$VTLIST= <TTTTTTTTTTTTTTT>
##$WBST= 1024
##$WBSW= 4
##$XGAIN= (0..3)
0 0 0 0 
##$XL= 0
##$YL= 0
##$YMAX_a= 466757
##$YMIN_a= -652764
##$ZGOPTNS= <>
##$ZL1= 120
##$ZL2= 120
##$ZL3= 120
##$ZL4= 120
##$ABSF1= 10
##$ABSF2= 0
##$ABSG= 5
##$ABSL= 3
##$ALPHA= 0
##$AQORDER= 0
##$ASSFAC= 0
##$ASSFACI= 0
##$ASSFACX= 0
##$ASSWID= 0
##$AUNMP= <proc_1d>
##$AZFE= 0.1
##$AZFW= 0.1
##$BCFW= 1
##$BC_mod= 2
##$BYTORDP= 1
##$COROFFS= 0
##$CY= 11.3945322036743
##$DATMOD= 1
##$DC= 2
##$DFILT= <>
##$DTYPP= 0
##$F1P= 16.9975609425685
##$F2P= -3.02152046262296
##$FCOR= 0.5
##$FTSIZE= 0
##$FT_mod= 4
##$GAMMA= 1
##$GB= 0.15
##$INTBC= 1
##$INTSCL= 1
##$ISEN= 128
##$LB= 0.24
##$LEV0= 0
##$LPBIN= 0
##$MAXI= 10000
##$MC2= 0
##$MEAN= 0
##$ME_mod= 0
##$MI= 1.114404
##$NCOEF= 0
##$NC_proc= 0
##$NLEV= 6
##$NOISF1= 3.799351
##$NOISF2= 2.8
##$NSP= 1
##$NTH_PI= 0
##$NZP= 0
##$OFFSET= 15.70392
##$PC= 1
##$PHC0= -10113.76
##$PHC1= 121.0008
##$PH_mod= 1
##$PKNL= yes
##$PPARMOD= 0
##$PSCAL= 0
##$PSIGN= 0
##$REVERSE= no
##$SF= 200.130013532006
##$SI= 16384
##$SIGF1= 3
##$SIGF2= 2
##$SINO= 400
##$SIOLD= 16384
##$SREGLST= <1H.CDCl3>
##$SSB= 0
##$STSI= 0
##$STSR= 0
##$SW_p= 3612.71676300578
##$SYMM= 0
##$S_DEV= 0
##$TDeff= 0
##$TDoff= 0
##$TI= <>
##$TILT= no
##$TM1= 0
##$TM2= 0
##$TOPLEV= 0
##$USERP1= <user>
##$USERP2= <user>
##$USERP3= <user>
##$USERP4= <user>
##$USERP5= <user>
##$WDW= 1
##$XDIM= 8192
##$YMAX_p= 0
##$YMIN_p= 0
$$ End of Bruker specific parameters
$$ ---------------------------------
##NTUPLES= NMR FID
##VAR_NAME=  TIME,          FID/REAL,        FID/IMAG
##SYMBOL=    X,             R,               I
##VAR_TYPE=  INDEPENDENT,   DEPENDENT,       DEPENDENT
##VAR_FORM=  AFFN,          ASDF,            ASDF
##VAR_DIM=   8192,          8192,            8192
##UNITS=     SECONDS,       ARBITRARY UNITS, ARBITRARY UNITS
##FACTOR=    3.12e-05,      1,               1
##FIRST=     0,             0,               0
##LAST=      0.2555592,     0,               0
##MIN=       0,             -652764,         0
##MAX=       0.2555592,     466757,          0
$$ Real data points
##PAGE= N=1
##DATA TABLE= (X++(R..R)), XYDATA
0@%%%%%%%%%%%%%%r6K04k16K16k16K16l07M15m32M69n77O58p62Q82r96J148j282
$$ 0 0 0 0 0 0 0 0 0 0 0 0 0 0 0 -96 108 -108 108 -108 108 -199 216 -216 253 -324 334 -428 454 -542 606 -676
31f76J450j652J858k072K315k584K875l202L553l934M357m815N319n862O457p119
$$ -676 774 -878 980 -1092 1223 -1361 1514 -1688 1865 -2069 2288 -2527 2792 -3070 3387 -3732
47c732P847q649R528j0506J1607j2841J4242j5841J7689j9867K2466k5630K9577
$$ -3732 4115 -4534 4994 -5512 6095 -6746 7496 -8345 9344 -10523 11943 -13687 15890
60A5890l4673M1543n1348O6542r3569J56010p53159J07174J012347k09445n17533
$$ 15890 -18783 22760 -28588 37954 -55615 100395 -652764 -545590 466757 257312 -260221
71b60221O2822M28843j58273k13630J06069J61331j56245o6524J23449Q1470j59136
$$ -260221 -197399 231444 73171 -140459 -34390 126941 -29304 -95828 27621 109091 -50045
82e0045n9556J55961R0375k03758p5647K30784P4276k89229l2764L09774j878
$$ -50045 -109601 46360 136735 -67023 -142670 88114 162390 -126839 -159603 150171 148293
93A48293l24832N8701K98575r2104k58274J16830J89791j10826j26261R3192O8856
$$ 148293 -176539 -117838 180737 88633 -169641 -52811 136980 26154 -100107 -6915 61941
104F1941n9540l6478K8667K2786m429l4486J406N3194j0619p4205L8453P8391
$$ 61941 2401 -34077 -5410 17376 12947 -21539 -20133 33061 22442 -51763 -13310 65081
116F5081p0877o6855J00349M0773j20411o239J20429k3189r8424M4035N8533m5665
$$ 65081 -5796 -72651 27698 68471 -51940 -58179 62250 39061 -59363 -15328 43205 -2460
128b460j9382K7372r906O694K7398n0811k4196R0917K319j13064K8353J12382
$$ -2460 -21842 5530 -4376 2318 29716 -21095 -45291 45626 47945 -65119 -36766 75616
140G5616n9846r1162P9023N8158p8682k0698O2692q644l6624K0859P168j5441
$$ 75616 15770 -75392 3631 61789 -16893 -37591 25101 16457 -20167 692 7860 -7581
152g581J3752o226j7057L4522n0n5273L4163O3252p3954n9123J12056L3437j32734
$$ -7581 6171 -55 -17112 17410 17360 -37913 -3750 59502 -14452 -73575 38481 71918 -60816
165f0816J54J38597l6244j22352O1709R3041p2642n7926O4879K7122m4082r312
$$ -60816 -60662 77935 41691 -80661 -18952 74089 1447 -56479 8400 35522 -8560 -17872
177a7872J8588N455M085j7981j1356L6425K578n2940K0096O2919n3172n4725Q1835
$$ -17872 716 6171 10256 -7725 -19081 17344 19922 -33018 -12922 49997 -3175 -57900 23935
190B3935L3742j05122N0J10362l3724r8257O2536O8335p5869l3118P2635J941
$$ 23935 57677 -47445 -47395 62967 29243 -69014 -6478 61857 -14012 -47130 25505 27446
202B7446n6274K2009L0169l2746j545K5168j5222r373K0554q539j2375K1025q823
$$ 27446 -28828 -6819 23350 -9396 -10941 14227 -995 -10368 10186 1647 -10728 10297 1474
215A474j9568L0363Q576n1592J7220N7103m3768m7866O8575K4015q3666J0359
$$ 1474 -18094 12269 20845 -30747 -13527 43576 -192 -48058 20517 44532 -39134 -28775
227b8775P9015m1513n9914O4143L0546p4102J356O8822k6749n2560M0551K8916
$$ -28775 50240 8727 -51187 12956 43502 -30600 -29244 39578 12829 -39731 820 29736
239B9736l6831r584K1959R25m308j778j4346J8396K2451m0789j7153N9999K771
$$ 29736 -7095 -16679 5280 6205 1897 119 -14227 4169 26620 -14169 -31322 28677 31448
252C1448p3733K1475P2715m7466n6097O4244L1479p1418n807P0598k2390m9507
$$ 31448 -42285 -20810 51905 4439 -51658 12586 44065 -27353 -33160 37438 15048 -34459
264c4459L3486K7192l7171k861K6150j2743m653J2502j4792k813L3165j9418l5414
$$ -34459 -973 26219 -10952 -13813 12337 -406 -5059 7443 -7349 -10162 23003 3585 -31829
277c1829M0085K6607n6301p892O1691j2953n7362L4092L7167m2249j4323L8797
$$ -31829 8256 34863 -21438 -29330 32361 19408 -37954 -3862 33305 -8944 -23267 15530
289A5530m019k6066J7525O144k2719J8197J1371l4214Q320L4995k6834k7423M5656
$$ 15530 11511 -14555 2970 9114 -13605 4592 15963 -18251 -9931 25064 -1770 -29193 16463
302A6463R049n5085J4751N0956l4422l8162M5811J8315m4550J047L2986j4571
$$ 16463 25512 -29573 -14822 36134 1712 -36450 9361 27676 -16874 -15827 17159 2588
314B588j5647J8411m379o546J5809r872j9892K8970J3078m7178N892N2981k6945
$$ 2588 -13059 5352 973 -5573 10236 364 -19528 9442 22520 -24658 -18766 34215 7270
327G270m7637M8423L1352n9983j0926N9661r210m9312K3989L2582k9400j3811
$$ 7270 -40367 8056 39408 -20575 -31501 28160 18950 -30362 -6373 26209 -3191 -17002
339a7002K3213Q44r974M669o847J934J9581j5509k7260L3884K1084m9529n331
$$ -17002 6211 7055 -2919 1750 -5097 -3163 16418 909 -26351 7533 28617 -20912 -26243
352b6243N7796j3642n6659L3680M4913m7423k5718N1031O129m4277R064L0386
$$ -26243 31553 17911 -38748 -5068 39845 -7578 -33296 17735 23864 -20413 -11349 19037
364A9037j7727j2818J5823l428k815Q706j0277r220K5236l223l1665J7384L3650
$$ 19037 1310 -11508 4315 887 -1928 6778 -3499 -12719 12517 9294 -22371 -4987 28663
377B8663l4027k2871M2919Q350m4448R040L7811k3363k5355L1776M740k4870J0295
$$ 28663 -5364 -28235 14684 23034 -21414 -12374 25437 2074 -23281 8495 13235 -11635 -1340
390a340J2387j8373K534J8196k0213o803K8810q510k8952K7267J9064l7127p045
$$ -1340 11047 -7326 -4792 13404 -6809 -13612 15198 6688 -22264 5003 24067 -13060 -20105
403b0105M1271j0137l6584K5728K2421l0373r234L0102o358j9177J2650M517j1230
$$ -20105 21166 11029 -25555 173 22594 -7779 -17013 13089 6731 -12446 204 4721 -6509
416f509R293M756j8316Q513K0327k4667j1940L4534l031l5329J6906L0460l1525
$$ -6509 2784 7540 -10776 -2263 18064 -6603 -18543 15991 12960 -22369 -5463 24997 -6528
429f528j5787L7722J059l6660J4640K5853k4477r983K4988n072j8518J6353M228
$$ -6528 -22315 15407 16466 -20194 -5554 20299 -4178 -14161 10827 5755 -12763 3590 7818
442G818j7310R081J4833k3904m98K5881j1611k2386K3446J2296l1592K855K7827
$$ 7818 -9492 -411 14422 -9482 -9980 15901 4290 -18096 5350 17646 -13946 -11091 16736
455A6736j5604j7232K2851K885k2207J0156J3706j7434q74J9016j3101j3740K4285
$$ 16736 1132 -16100 6751 9636 -12571 -2415 11291 -6143 -7017 11999 -1102 -14842 9443
468I443L101k8973J2630K4290k4778j4130L1265K67l1365J4677K0062k0357r496
$$ 9443 12544 -16429 -3799 20491 -4287 -18417 12848 13115 -18250 -3573 16489 -3868 -13364
481a3364K3397n085j6184J3443N566j5579P031J0765j5623j799K0264j0909j7288
$$ -13364 10033 4948 -11236 2207 7773 -7806 -775 9990 -5633 -7432 12832 1923 -15365
494a5365K1114P544k7681P980K6040j9239j9168K6547O956k9180O949K1459j4873
$$ -15365 5749 13293 -14388 -6408 19632 393 -18775 7772 14728 -14452 -7503 13956 -917
507i17j1038J9647k302j4361J0019O842j5840O115J2598j6807l358K2592p517
$$ -917 -11955 7692 5390 -8971 1048 7890 -7950 -1835 10763 -6044 -9402 13190 5673
520E673k2193J9348J2956k4879l643K8483j0273k2794J9882J0046k0704J701J7999
$$ 5673 -16520 2828 15784 -9095 -12738 15745 5472 -17322 2560 12606 -8098 -6397 11602
533A1602j1848r633J6960j991j5090J2730P234j9365M313J9071j5529j2257K2449
$$ 11602 -246 -9879 7081 5090 -10000 2730 9964 -9401 -5088 13983 -1546 -13803 8646
546H646K381k5618J0874J6611j6538q952K0662l300j6584J1976Q323j5353K584
$$ 8646 11027 -14591 -3717 12894 -3644 -12596 8066 4766 -11818 158 8481 -6872 -4288
559d288J6052j3473q167J9043m037j6632J3259J2194k2389k148K6112j0266k1568
$$ -4288 11764 -1709 -9876 9167 5130 -11502 1757 13951 -8438 -10586 15526 5260 -16308
572a6308J8741J2118k2401p83K0498j0433j1759J3854J535j2977Q093O197j2880
$$ -16308 2433 14551 -7850 -8633 11865 1432 -10327 3527 5062 -7915 178 6375 -6505
585f505L798J2348j3482m856J7334k730k0327J5144J5091k1191o766K3924l814
$$ -6505 -2707 9641 -3841 -8697 8637 5907 -14420 724 15815 -5376 -12142 11782 7968
598G968k3836J7842J1809j9676m234J9443n367j4085J3145M379j4210O069P640
$$ 7968 -15868 1974 13783 -5893 -10127 9316 3949 -10136 3009 7388 -6822 -753 6887
611F887j1148o55J3809p514j0154J3459L418j8517O619J7081j6702q246K0432
$$ 6887 -4261 -4916 8893 1379 -8775 4684 8102 -10415 -3796 13285 -3417 -11663 8769
624H769r02j9912J0798J2532j4693n162J5903o040j1741J4057L245j5329N054
$$ 8769 7867 -12045 -1247 11285 -3408 -8570 7333 1293 -10448 3609 6854 -8475 -3421
637c421J2266j3483l168J7756n812j4871J1475R669j7509q82J9460r403j3109
$$ -3421 8845 -4638 -7806 9950 4138 -10733 742 10411 -7098 -7980 11480 2077 -11032
650a1032J6024K279j6271P754R968j1565l560J3472m256j2063J2529M744j7323
$$ -11032 4992 7271 -9000 -1246 8722 -2843 -6403 7069 2813 -9250 3279 8023 -9300
663i300N905J4559j4261p536J9163j703j6838Q159J3032j4748n602J6142k493
$$ -9300 -3395 11164 -3097 -10633 8530 6827 -10011 -1852 11180 -3568 -9170 6972 4479
676D479j3601R393O676j2274K706J0531j0075m543J3572l757j1323J1830M495
$$ 4479 -9122 271 6947 -5327 -2621 7910 -2165 -6708 6864 3107 -8216 3614 8109
689H109j6589K250J6998q785j3080J5592L580j6649N041J4126j0677q707J4130
$$ 8109 -8480 -6230 10768 1983 -11097 4495 8075 -8574 -3533 10593 -84 -8791 5339
702E339k72j1339N476Q141j3222K450R943q345m054J1744j718j2694Q182Q465
$$ 5339 5067 -6272 -796 7345 -5877 -3427 6516 -1829 -5883 5861 4143 -8551 -369 8096
716H096j3211j476J5778p670j1752J1351Q052j3108k73J2525q715q765J1980J919
$$ 8096 -5115 -6591 9187 1517 -10235 1116 9168 -3940 -4213 8312 -403 -9168 2812 4731
730D731j0032M790P587j0916O05R643m471q680R896K995j4930N923J2713j0789
$$ 4731 -5301 -511 7076 -3840 -3235 6408 1937 -6743 3153 6148 -8782 -2859 9854 -935
744i35p760J4005j506j1804P193Q372j0926j840J0488m219p892J0195J092r991
$$ -935 -8695 5310 3804 -8000 -807 7565 -3361 -5201 5287 1068 -6824 3371 4463 -5528
758e528O385O147j0651j191J1989n371j1246J2387M559j3390M58J4363q298r399
$$ -5528 857 7004 -3647 -4838 7151 1780 -9466 2921 7480 -5910 -5452 8911 613 -8786
772h786J1995K503j1714M921Q567r384m534R996l51p732O396J279q715M209Q099
$$ -8786 3209 5712 -6002 -1081 7486 -1898 -6432 3564 3213 -4519 1877 3156 -5559 -1350 6749
787F749j0880j257J0629j607j2173R499P368j3562n7J3007o596q203Q174M976
$$ 6749 -4131 -5388 5241 3634 -8539 960 8328 -5234 -5291 7716 1120 -7083 1091 6067
801F067j1030K667Q376p526l098O835K87q408N893M645r402L236R209r294n609
$$ 6067 -4963 -2296 6080 -1446 -4544 2291 2578 -5830 63 4708 -4694 -1458 7751 -1543 -7152
816g152J1416j0j0372N259R390j1323k427J0123k391r097O236N696p374o04Q458
$$ -7152 4264 4254 -6118 -859 8531 -2792 -5219 4904 2513 -6584 -348 5348 -2026 -2630 5828
831E828n199m457O845N15q829O140L607q522q88J1432n610p484R351L915j1263
$$ 5828 629 -3828 3017 3532 -5297 843 4450 -4072 -4960 6472 862 -6622 2729 6644 -4619
846d619J559J1117r598l853R305M92j0478M908N953q210k52P449l314m127N926
$$ -4619 -3060 8057 -1541 -5394 3911 4403 -6075 -1167 4786 -3424 -3676 3773 459 -3668 2258
861B258K511j0371M405P132p709k436Q440j893p284O387M003r319K72Q937l923
$$ 2258 4769 -5602 -1197 5935 -1774 -4210 4230 2337 -4947 1440 5443 -3876 -3604 5333 1410
876A410o446P889O39q817N500L322n199j478O799k377o918P258K488p392K239
$$ 1410 -5036 2853 3492 -5325 175 3497 -1702 -3180 3619 1242 -5676 1582 4070 -3322 -1083
891a083O451n193m848P979P08q555N242N437j0794m32R619k111q254Q043K048
$$ -1083 5368 175 -4673 3306 4014 -4541 701 6138 -4656 -5088 4531 2420 -5834 2209 4257
906D257j0165L724P125n994l600Q824j290q184M870N609r322r42R473k826o746
$$ 4257 -5908 -2184 4941 -1053 -4653 4171 2881 -5303 -433 5176 -4146 -5088 4385 1559 -5187
921e187P603J172p895L573O219n521l934P332q68p478O024L241q577J626O729
$$ -5187 2416 3588 -4307 -734 5485 -36 -3970 3362 2494 -4984 1040 4281 -4296 -2670 4059
936D059l875n790R114M4p284L743N951q782r19Q231n949l540N738L425q371J912
$$ 4059 184 -5606 3508 3552 -3732 11 5962 -2820 -3739 4492 -1457 -4997 741 4166 -4205 -2293
952b293P381n973k671O034j101o257N865L456p439j72P475m081m836O389J286
$$ -2293 5088 -885 -3556 2478 1377 -4880 985 4441 -2998 -3170 4305 224 -4612 1777 3063
967C063p371K790O666o471l337P462N87p479M185M974p955n05P792m453m682P903
$$ 3063 -4308 -1518 5148 -1323 -4660 2802 3389 -4090 95 5069 -2886 -3391 4401 -52 -4734 3169
983C169o13o421L924N651p435o34O286k038n221M373L523o536Q87M389l408l525
$$ 3169 2556 -3865 59 5710 -1725 -2359 3927 1889 -3332 1041 4564 -1972 -1085 3304 -104 -3629
999c629O888j891m808L005M100p204M83O398k738n909O807K348p517J561O613
$$ -3629 3259 1368 -3440 -435 3665 -3539 -3056 3342 604 -5305 1502 3850 -3667 -2106 4507
1014D507p328j079P076m00o520M210K745n667L64M733j776l425L618J635n533
$$ 4507 -2821 -3900 3176 2776 -3744 466 3211 -2456 -2092 2641 865 -2560 1058 2693 -2840
1029b840K211N192n712j690O888k976n961M700M196o081l53O876l731m002L935
$$ -2840 -629 4563 -1149 -2839 4049 1073 -4888 -188 4008 -2073 -2426 4450 719 -3283 652
1044F52J488m291K509M334n569j773M932j210n721O932N89o325K396N284m617
$$ 652 2140 -2151 358 4692 -877 -2650 2282 1072 -4649 2283 2872 -3453 -1057 4227 -390
1059c90m026P882m41n637J483N315n869j444O109m25n748M092K409n444L49M741
$$ -390 -4416 3466 3025 -2612 -1129 4186 -1683 -3127 2982 2557 -3191 901 3310 -2134 -1785 2956
1075B956l157k399M594j120n050M633L519o225R66N698m999l024M278J852n578
$$ 2956 -201 -2600 1994 874 -4176 457 3976 -2249 -1283 4415 -584 -3608 670 2522 -3056
1090c056J924K745l008k354M070J012m225M016J550m904J277M945m733j825L440
$$ -3056 -1132 1613 -1395 -3749 321 1333 -2892 1124 2674 -2230 -953 3992 -741 -2566 874
1105H74P28m360J936M348m996j271N463k223l803M123N53m504J487M897j838m403
$$ 874 1602 -2758 -822 3526 -1470 -2741 2722 499 -3304 819 1372 -3132 -1645 3252 1414 -2989
1121b989L502l14j575K244J927m331K15L462j591m649N052J058m833K593L149
$$ -2989 513 199 -1376 868 2795 -1536 -1321 2141 550 -4099 953 2011 -2822 -229 2920
1136B920m023q46L099P06m109L112K855m522j929N738k970l054L606O86m595L758
$$ 2920 -1103 -1949 1150 1856 -2253 859 3714 -808 -2737 3001 31 -3023 583 1269 -3326 432
1152D32K941n052l37M576k449l417L887L74j477q28M626l577j507L099Q44n156
$$ 432 3373 -1679 -2016 2560 111 -3306 581 955 -522 -1350 3276 -301 -1808 1291 2135 -3021
1168c021K655K240l593l23N209k797k839K883K076m962P09M557l109k224M721
$$ -3021 -366 1874 -1719 -2042 3167 370 -2469 414 2490 -2472 -1763 2794 -315 -2539 2182
1183B182r1m016K030J730l362o71M357j829l168K970K522l357N9J937k789k50
$$ 2182 2091 -1925 105 1835 -1527 -2198 2159 330 -2838 132 2654 -703 -644 1293 -1496 -1746
1199a746M238j420l433K396J745k979R8M687l293k187L256M67m221J839K276j468
$$ -1746 2492 1072 -2361 35 1780 -1199 -1101 3586 293 -1894 1362 1829 -2392 -553 1723 255
1215B55k940M342N03l345J074J416l054J661K396k858j061K329L00m052K094L125
$$ 255 -2685 1657 2160 -1185 -111 1305 -1749 -88 2308 -550 -1611 718 1018 -3034 -940 2185
1231B185l626n94M306j092l256K477K006m121J65L985k940r14K358o28k168J644
$$ 2185 -1441 -2035 2271 1179 -2077 400 2406 -1715 -1550 2435 -505 -1419 939 311 -1857 -213
1247b13K088j399m95Q02l36k969L704R17m112J273L037l924L81L045o6l433J349
$$ -213 1875 476 -19 783 447 -2522 1182 2099 -2013 -740 2297 -1627 -1246 1799 1733 -1700 -351
1264c51K454l959N96L165o28k166J823j025o76Q97J865k843o11M126j819l164
$$ -351 2103 -1856 -1260 1905 1277 -889 934 -91 -767 130 1995 -848 -1459 2667 848 -2316
1280b316L657M52m970J444K882p76j029N91J243k311J586J010j213r59N83L48
$$ -2316 1341 1793 -3177 -1733 1149 373 -656 -65 1178 -1133 453 1463 250 -709 -126 222
1296B22k210L428m20k631P09J805j641r19K275j58l241L234J920l748M50L288
$$ 222 -1988 1440 1020 -1611 -902 903 -738 -1657 618 460 -2781 453 2373 -1375 -925 2363
1312B363j950k457K542j99j743P21R73j213j689L981j160N2P08M57l649R50L323
$$ 2363 413 -2044 498 299 -1444 -723 250 -963 -2652 1329 169 221 929 1386 -2263 -1313 2010
1329B010j213k449J715N73q66p42L700m197J417J290j772l84K392R99l103M8K765
$$ 2010 797 -1652 63 636 -230 -972 2728 -1469 -52 1238 -534 -918 1474 2473 -630 -582 2183
1346B183j975k136L832m73k963J131L530l510j468L168n37l509K026K255j854
$$ 2183 208 -1928 1904 1431 -1532 -401 3129 -381 -1849 1319 782 -2727 -701 1554 -300
1361c00j324K750k266O0J719m55j009O16K465m059J337R99m47j287Q77rj825R42
$$ -300 -1624 1126 -1140 -1080 639 184 -825 -209 2256 -1803 -466 533 86 -1201 -324 -333 -2158 -1216
1379a216K371j164j168K064o02j691K070k52o1l23J010r97q92K905m23k208R48
$$ -1216 1155 -9 -1177 887 285 -1406 664 412 351 28 1038 41 -851 2054 1631 -577 371
1396C71J737l273P02J042n0j323M35J818l202J502J497j351k479K677J929k661
$$ 371 2108 -1165 -463 579 529 -794 -359 1459 -1743 -241 1256 -95 -2574 103 2032 -629
1412f29J283O85j353n54L45k91j158K217J335k108n71K734j740j70J521k052j034
$$ -629 654 1339 -14 -568 -223 -514 -1672 545 1880 -228 -799 1935 195 25 1546 -506 -1540
1429a540K961j305p40P9J137r4k085K649l95q1j676J109j364P73J264K02k767
$$ -1540 1421 116 -624 -545 592 498 -1587 1062 667 586 -1090 19 -1345 -572 692 894 -1873
1446a873J955K119l538Q12N65L1k32Q44J800m577K342M03j416K47J676j65j734
$$ -1873 82 2201 -1337 -525 40 71 -161 683 2483 -2094 248 651 -765 -518 1158 993 -741
1463g41L25J066k530O10J862Q2j456J662L83l225J915J459k509q35M049k316r95
$$ -741 -416 650 -1880 -1270 592 674 -782 880 1263 -1962 -47 1412 -1097 -1932 2117 -199 -1194
1480a194K097m1p87L74J760k190n69J717N94k176J159J076j911p11J620O3j762
$$ -1194 903 862 75 449 2209 19 -550 1167 1761 -415 744 1820 -91 -802 818 881 -881
1497h81L11K000j231q93J109j046M58J030j341q8r14K363k182K87K114j260k00
$$ -881 -570 1430 199 -694 415 -631 -173 857 -484 -572 -1486 877 -1305 -1018 1096 -164 -364
1514c64J528p11j207J916k77j075qJ599k67k175Q28P59o69m39J272n61j396K184
$$ -364 1164 453 -754 1162 885 -190 -198 1401 1134 -1041 -213 546 -123 -562 710 149 -1247 937
1532I37K28j182o38K972m111J844O54M70j610J788j120k103O71L233l664J126
$$ 937 1165 -17 -655 2317 -1794 50 704 1174 -436 1352 232 -1871 -1200 2033 -1631 -505
1548e05R07m61q83J930P31l282J027R00Q13j642m1J984l778P76K707n91j700J275
$$ -505 402 -59 -942 988 1719 -1563 -536 364 1177 -465 -506 1478 -2300 -1524 1183 592 -1108 167
1566A67J358k514J245J77j412J543Q39n45k771J509m57j326J352J861p60j416
$$ 167 1525 -989 256 433 -979 564 1403 858 -1913 -404 -861 -2187 -835 1026 266 -1150
1582a150K394n99r36M76K0j33n18R13n91L0P15m28o00J743n5j632k06j08N08J85
$$ -1150 1244 645 -291 185 205 72 -446 467 -124 -94 621 193 -407 1336 1281 -351 -557 -665 -157 28
1602B8N91o5j076Q16J74j030Q41Q09j918m3Q94P55j701L96N30n40q44J821J884
$$ 28 619 554 -522 294 468 -562 279 1088 -830 -873 21 776 -925 -529 1 -539 -1383 438 2322
1621B322k332j560J569N17j162P95M4j914J672j43O5l70J737j077p3L31K44m90
$$ 2322 -10 -1570 -1 516 -646 149 193 -1721 -49 -192 -127 -497 1240 163 90 421 665 175
1639A75l52J787j367j743K801j272j891K196n10k36j22K586l132Q94n01J920l186
$$ 175 -177 1610 243 -1500 1301 29 -1862 334 -176 -412 -534 2052 -1080 -186 -687 1233 -1953
1656a953J763R04q66p79K010j871O51K2k5R02k051K590l278J842K82%o05l3J53
$$ -1953 -190 714 -152 -931 1079 -792 -141 -119 -144 758 -1293 1297 -1981 -139 143 143 -462 -495 -342
1675c42O66L33J96Q2k438K307q02k05Q59j85r21P36J619k014o28J392J51k85j210
$$ -342 324 657 853 935 -1503 804 2 -203 656 471 -450 286 1905 -109 -737 655 806 521 -689
1694f89J254m40m62l11N51q01M06N49m42L26P95p62r75R47r77N9M25J849j533
$$ -689 565 125 -337 -648 -97 -898 -492 57 -385 -59 736 -26 -1001 -54 -1031 -972 -547 1302 -231
1713b31j309J181P63L25j900K704j664p41J520J006j337n27J62n54J29O65o12
$$ -231 -1540 -359 404 729 -1171 1533 -131 -872 648 1654 317 -210 -48 -602 -473 192 -420
1730d20n94J445Q55j640J532p53nj67J215j163j377J104Q4j275J10J613r05o54
$$ -420 -1014 431 1286 -354 1178 425 420 253 1468 305 -1072 32 116 -1159 -1049 564 -341 -995
1748i95J191M70k221N96J903r36p60J059M41j548R80J350l019J141J925j545J97
$$ -995 196 666 -1555 -959 944 8 -752 307 748 -800 180 1530 -1489 -348 1577 32 229
1765B29M41r68o04J965J6M61j534J80r77j62R49J401k01j377M86M0j94P53j053
$$ 229 670 -298 -902 1063 1079 1540 6 186 -791 -953 -4 1397 1196 -181 305 345 151 904 -149
1784a49R83n12j84q51L06N9M04K37K07J167j942K24J217n29JJ43j643j50J459
$$ -149 834 322 138 -713 -407 -348 56 293 500 1667 -275 -51 1166 637 638 781 -862 -1012 447
1803D47k98j689K79K061K98j454R88Q67j583N80p55q48K79J264r22Q90q00L96
$$ 447 149 -1540 -1261 800 1098 -356 632 1499 -84 496 -259 -1107 -828 436 -486 404 -396 0
1821@n20k61J340k92J01l39N02m36K78k45r23O71M85q53k42R28N04p08R2l15l44
$$ 0 -520 -781 559 267 368 29 531 95 373 128 -795 -124 361 -492 -734 194 698 -10 82 -233 -577
1842e77N46L89R63k322L2M30j574J898K29M17Q0j76N47j356m35O42p67J177N86
$$ -577 -31 358 1321 -1001 -969 -539 -2113 -215 14 431 511 335 882 -474 -909 -267 -1034 143 729
1861G29k58k98o37J476j379N01l7O95j385R11M0q23m98M19M25j444J311M38j283
$$ 729 471 173 -464 1012 -367 134 97 792 -593 318 358 -465 -963 -544 -119 -1563 -252 186 -1097
1880a097N46M66m56N06J306p44n35Q16m20j173J345j622J336j094J115p81p91
$$ -1097 -551 -85 -541 -35 1271 527 -8 808 388 -785 560 -1062 274 -820 295 -486 -1277
1897a277K277j286M64k36N42r2j485J664j575K30P82J073m45j37l83O94o10n11
$$ -1277 1000 -286 178 -58 484 392 -1093 571 -1004 -774 8 1081 636 499 116 810 200 -311
1915c11J3q8M9J345j586K75O95R62j502J169q59j243J736j244L63K95J788j897
$$ -311 -298 -386 -337 1008 -578 -303 392 1354 -148 1021 162 -1081 655 -589 -226 69 1857 -40
1933d0L04p69L58Q92j620J784j11j239N59O9q44K343j190L55k322K608j55j550
$$ -40 264 -505 -147 745 -875 909 798 -441 118 187 -657 1686 496 851 -1471 1137 982 -568
1951e68j043J474O42n58k50J349k103K353m47r72o92m70O34p17J716j728M41K23
$$ -568 -1611 -137 505 -53 -303 1046 -1057 1296 849 -123 -815 -1285 -651 -1368 348 -1380 -939 -716
1969g16R20L40k29J141n81j447K341j542K89m71O31n23j175K065j228p7l54R36
$$ -716 204 544 315 1456 875 -572 1769 227 516 45 676 153 -1022 1043 -185 -262 -616 320
1987C20r96P03mL6K20N42q39L55j049L60J080l72J94p45k065L388J37o63j333
$$ 320 -676 27 23 59 279 821 -18 337 -712 -352 728 356 550 -195 -2260 1128 1265 602 -731
2006g31J535j055P55l54k45P59r23J437k359J704m02j70n35R8M40j88J123r47
$$ -731 804 -251 504 150 -95 664 -259 1178 -1181 523 121 -49 -584 -486 -46 -234 889 -58
2024e8j83N45j212J22R52J32q34l23K100j525k91J430j226K91M20p03q1M99m14
$$ -58 -241 304 -908 -786 166 298 -536 -859 1241 -284 -575 855 -371 -80 340 -363 -444 55 -359
2043c59N72l21O40o52M62n80N0r4j69J502p93J052j460r89K415j067q60J329l93
$$ -359 213 -108 532 -120 342 -238 -188 -282 -451 1051 258 1310 -150 -1139 1276 209 -651 678 285
2062B85j806K298M77r24r29K084j535P54j432L38J742j082q6k86r01M54J92l55
$$ 285 -1521 777 1254 330 -599 1485 -50 704 -728 -390 1352 270 184 -102 -1003 -549 -357 -712
2080g12R56l8J030k304M15J076k053R59O35N37K61M47o16l39j335K070j074O00
$$ -712 244 206 1236 -1068 -653 423 -1630 -671 -36 501 762 1209 593 254 -1081 989 -85 515
2098E15p25L2K77j068L87M28j02J524j5j226N14p64O28k4j05k15p8m01J66J149
$$ 515 -210 -178 99 -969 -582 -154 -256 1268 1253 27 541 -223 405 381 276 61 -17 -418 -252 897
2118H97j47n0j059O50l93O63j125M58k62J33m89K709j207o11N66j325L62r8Q06
$$ 897 750 700 -359 291 -102 561 -564 -106 -368 -235 -724 1985 778 167 733 -592 -230 -328 478
2137D78q86Q23N85o94L58l2j231j30J164m33n8K08l6m05P5J262j023o23J101l96
$$ 478 -408 415 1000 306 664 632 -599 -729 435 2 -56 152 116 -289 -214 1048 25 -598 503 107
2157A07r98K84j59K98j217P67M30o66K035K96j551O79p44p6J697p14q61o33J605
$$ 107 -891 -607 -766 -468 -1685 -918 -488 -1154 881 1177 -374 305 -439 -515 1182 468 -393 -1026 579
2176E79n05n39o1N15l68j211J850m71K80M30R22j264J30p71N64J70Q03K65k109
$$ 579 74 -465 -526 -11 -379 -1590 260 -211 69 499 1421 157 287 -484 80 250 1053 1318 -791
2195g91O15R98j311K061q53O78q87O38o18r0L95j385J180k221J159P67n27n70
$$ -791 -176 822 -489 1572 719 1397 510 1148 530 440 835 -550 630 -1591 -432 335 -192 -762
2213g62N80L60R33j469O06Q61r8q95j88r11N07J351j373Q45l57n40K96J241k76
$$ -762 -182 178 1111 -358 248 1109 1011 116 -72 -983 -476 875 -498 347 -10 -550 -254 987 711
2232G11j203P59P7M57j472M0J108k22l42j052j04R20N79m75Q08lk180R69P99j077
$$ 711 -492 267 344 801 -671 -631 477 255 -87 -1139 -1243 -323 256 -219 589 586 -1594 -625 174 -903
2252i03K92J021O6l68n2J58k3o54J123j89R87n79M33j391J2P27j476R00j232J633
$$ -903 -611 410 476 108 56 214 191 -463 660 471 1458 879 1312 -79 -67 660 -816 84 -1148 485
2272D85k165J065J511j510J05Q68j511J561J85q24j57L0K91r66J752o6M94j464
$$ 485 -1680 -615 896 -614 -509 359 -1152 409 594 -230 -387 -357 -66 -1032 720 654 1148 -316
2290c16M23J525r74j170P42K0j175P83J691l164J328P90Q38j991O23j82o64J713
$$ -316 107 1632 658 -512 230 250 -925 -142 1549 -1615 -287 503 1341 -650 -27 -209 -873 840
2308H40j086r65K044q40o37J530p21k71r24J002Q80m64j104M2p26k72J147J921
$$ 840 -246 -1211 833 -7 -644 886 165 -106 -1030 -28 852 388 -716 -674 -1400 -1672 -525 1396
2326A396j015l93q25N73M08L39r21L53J739k246L10j100J738J075j010k020P97
$$ 1396 381 -12 -837 -264 144 483 -438 -85 1654 -592 -282 -1382 356 1431 421 -1599 -802
2343h02Q61L09K64o26j116J162Q60r75q35R21J059j395l8P89k319L040j568R0
$$ -802 59 368 632 6 -1110 52 912 -63 -898 23 1082 -313 -351 438 -1881 1159 -409 -319
2361c19J71R25k25K28j524J036J14J248m51q71l7n29J97l79J726k275n01J639
$$ -319 -148 777 552 780 -744 292 406 1654 1203 332 295 -234 -37 -416 1310 -965 -1466 173
2379A73M0q4N76Q23j970M82j35M52j90J09Q2p28R0l11O72K71L81j36j505Q74J65
$$ 173 213 129 705 1528 -442 40 -95 357 167 276 358 -370 -280 -591 81 352 733 597 -908 -34 131
2400A31L20k195J503j50P26l38p31J804j246Q08l47M12k066R82L75q60R77n58
$$ 131 451 -1744 -241 -391 335 -3 -734 1070 -176 632 285 697 -1369 -387 -12 -872 105 -453
2418d53o59P20P81p42o0k16N04J074k129J131J99J46r91K032k972R08J753j324
$$ -453 -1112 -392 389 -353 -413 -629 -125 949 -1180 -49 150 296 -695 1337 -1635 -727 1026 -298
2436b98J332m50M05r34j130J135K1O62r63l34M68O47j090J294j204P51J437j636
$$ -298 1034 584 989 55 -1075 60 81 743 -220 -554 -86 561 -529 765 -439 312 1749 113
2454A13qk42l36O4r11N80K786j708O73j447o30J455l39L78NK87m70P09q50k7m63
$$ 113 105 -137 -473 -409 -1320 -740 2046 338 1011 -436 -1066 389 50 428 433 720 250 959 109 82 -381
2475c81K39Q48j167J260j45m60n59j60j4Q2J141l68J593j826n64R22n94K74P68
$$ -381 -142 706 -461 799 654 194 -365 -525 -539 -457 684 316 1909 83 -481 441 -153 121 889
2494H89j259m12J718m83r17k27N93K023k803J508k82o39R84m75J000k371J126
$$ 889 -370 -782 936 453 -464 -691 -98 1925 -878 630 348 -291 693 218 1218 -1153 -27
2511b7o67Q63l61m06J262j55j758J505K02o95L54q88k74L60J295K02j602O23N60
$$ -27 -694 169 -192 -598 664 509 -1249 256 458 -237 117 -771 -1045 -685 610 812 -790 -167 393
2530C93o2j005J550p06j028P91m16N84J412k451J696M80j086l45l24K032l044
$$ 393 331 -674 876 170 -858 -67 -483 101 1513 -938 758 1238 152 -193 -517 1515 -1529
2547a529J692J26j529J687q58n93Q31L33k55o61O06j91P91q26J68J253m84K4L41
$$ -1529 163 289 -1240 447 -411 -1004 -173 160 -95 -756 -150 -341 450 -376 -208 1045 561 585 926
2566I26j768j094J499M08K9j817J179R76m77J806j950q7J160k2J26r59k22j097
$$ 926 -842 -1936 -437 -29 0 -1817 -638 338 -139 1667 -283 -370 790 768 894 -65 -287 -1384
2584a384j13J844J538j376j255L015k965P38n11K39k61J306n92l33l58J205j122
$$ -1384 -1497 347 1885 509 -746 2269 -696 42 -469 -230 -491 815 223 -110 -468 737 -385
2601c85k4j4K97J061j131j454J705M8j344J690m7n63K49M90p22R80r38P80j37
$$ -385 -409 -423 -126 935 -196 -1650 55 103 -1241 449 402 -161 88 578 -144 836 -102 678 541
2620E41n29K81l61k35P24j237N55j653L216j033L40j394J194j384J240o26k88
$$ 541 12 293 -68 -303 421 -816 -261 -1914 1302 269 609 -785 409 -975 265 -361 -649
2637f49R95j04l46m32J424j288J059J55o16R4N09r42K76k31L50l44p56J042q94
$$ -649 346 242 -104 -536 888 -400 659 814 198 292 801 -141 135 -96 254 -90 -846 196 -698
2656f98p48M02O43J115o70N30L69j827J169j121r81P80J22j79J566M97j682O59
$$ -698 -1446 -1044 -401 714 44 574 943 -884 285 -836 -1817 -1037 -915 -1094 472 969 -713 -54
2674e4m22J117P41r62j698K293k067J52Q2l38J488M93j045ql73M40k78j180K723
$$ -54 -476 641 1382 420 -1278 1015 -1052 -900 -818 -1156 332 825 -220 -228 -601 -161 -439 -1619 1104
2693A104l115J895r81K92m78N13O0J158l47j249J22P01o06O7J985q28j288K300
$$ 1104 -2011 -116 -1097 -805 -1283 -770 -710 448 101 -1148 -1026 -325 -931 -864 1121 293 -995 1305
2711A305K97j120O74o07N40j924Q52M64p95N89L87O27j121J02R0J09j474j73J621
$$ 1305 1602 482 1156 549 1089 -835 17 481 -314 275 662 1289 168 270 360 469 -1005 -1178 443
2730D43j47M26p98m1m98P76m47o42K26M66r19J635j433J100p2j67q2R44N48j941
$$ 443 296 722 -76 -117 -615 161 -286 -928 -702 -236 -1155 480 -953 147 75 -92 -174 770 1318 -623
2750f23J379j396J072m58j47J041o9j805l13J090Q78J8k22j66l11r0N13j78N11
$$ -623 756 -640 432 -26 -173 868 799 -1006 -1319 -229 649 667 445 279 -32 -122 391 213 724
2769G24n56k431K687n38J200N89j634K21M07o44N30J11q73J003m22j170M33J42
$$ 724 168 -2263 424 -114 1086 1675 41 262 669 25 555 666 -207 796 374 -796 -363 -221
2787b21M16m46N49j8l70J20O36j506P49j8J14J245j055r84j64K17J223n19q39
$$ -221 195 -251 298 280 -90 30 666 -840 -91 -109 5 1250 195 -789 -953 -736 487 -32 -871
2806h71J387o17o22n34J217J052q04Q7p34K089j204k33m98N54O60k220K147n03
$$ -871 516 -101 -723 -1257 -40 1012 208 295 -439 1650 446 213 -285 269 929 -1291 856 353
2824C53j129K97K12Q61k82Q4j067J299k445J906N97j133K16M61n60r45K367k607
$$ 353 -776 -479 -267 594 312 396 -671 628 -1817 89 686 -447 -231 230 -330 -1275 1092 -1515
2842a515J095J028k15n36J364j430j773J583J147N68p28r25J709j530j21j90J40
$$ -1515 -420 608 393 -143 1221 -209 -1982 -399 748 1316 588 -337 1372 -158 -279 -469 -329
2859c29n95m73L89j636M970j298j95j080Q42j223k62J545j398m53J138j83l59
$$ -329 -924 -1397 -1008 -2644 2326 1028 833 -247 595 -628 -890 655 -743 -1196 -58 -241 -600
2876f00J211k74j403q9J718j163n32J219K17o96k51J044k120J702q81J272j571
$$ -600 611 337 -1066 -1155 563 -600 -1132 87 304 -392 -643 401 -1719 -17 -898 374 -1197
2893a197p67K894j324J064m21j292N89P93k29J112k145K064j109j17p77P94p50
$$ -1197 -1964 930 -394 670 249 -1043 -454 339 110 1222 -923 1141 32 -85 -862 -68 -818
2910h18J26P65o76J604k68k14j468K407P94k775o34K77O14M52m1j133O78l53R71
$$ -818 -692 73 -603 1001 733 519 -949 1458 2252 -523 -1157 -880 -266 186 145 -988 -310 -663 308
2929C08k47m94l86J104j69r71R55j466J48N75j18M38N66q8J9p31K29O75o59J352
$$ 308 61 -433 -819 285 116 -855 100 -1366 -1218 -643 -761 -323 243 155 174 -557 -328 347 -312 1040
2949A040k053K192p46q68K47k12M67j85j69L02M02n44J95M15j101N29M74n70k38
$$ 1040 -1013 1179 433 -435 -188 -400 67 -118 -287 15 417 -127 68 483 -618 -89 385 -185 -423
2968d23O83o77j170O91j017K345q75L1J415k339L9J207K43m7L64k20j89K76n90
$$ -423 260 -417 -1587 -896 -1913 432 -443 -412 1003 -1336 -1297 -90 153 106 470 250 61 337 -253
2987b53J033j485M56o78Q2J047o19M11k45L86j206J31J526m95J65%L1l44n46r1
$$ -253 780 -705 -249 -927 -845 202 -417 -6 -251 135 -1071 -940 586 91 256 256 287 -57 -603 -694
3007f94J38J514j073Q21j210J460J397k953MP81q5K49j74L60r27K29J030l09o00
$$ -694 -556 958 -115 706 -504 956 2353 -600 -596 185 100 349 175 535 -392 -163 867 558 -42
3026d2J022j407M58r1q2J772j591K82L33j658J191K93O52j060J397j157j470J730
$$ -42 980 -427 31 -60 -142 1630 39 321 654 -1004 187 480 1132 72 1469 312 -1158 572
3044E72K37m98o89Q79p25M49o40j476P30N67M83R09q76l9j4K43p86n79J977j051
$$ 572 809 311 -378 501 -224 225 -415 -1891 -1161 -594 -111 798 -78 -117 -131 112 -674 -1253 724 -327
3064c27J445m74O5n82N65R5p74N09o51j265O98J194P56k089O22N62k78J228k039
$$ -327 1118 644 709 127 692 787 13 522 -129 -1394 -696 498 1254 -835 -213 349 71 1299 -740
3083g40J259j145K156j126o43o4J020n14N45J090j964J129j053O71o41Q36K41
$$ -740 519 -626 1530 404 -239 -303 717 203 748 1838 -126 1003 -50 621 -20 816 1057
3100A057j700J183k042J369J309q57J003J02j195j72j17M31k26K72j58k70q4j55
$$ 1057 -643 540 -1502 -133 1176 319 1322 1424 229 57 -60 371 145 417 259 -11 -95 -250
3118b50j14p22J410j992R16J394j181Q83o27P29o36Q20K32j00k215K426o62l19
$$ -250 -364 -1086 324 -1668 -752 642 -539 344 -283 446 -190 630 862 762 -1453 973 311 -8
3136hn44m14N06P24o8Q83q69j703J922J169k443P58n2l1K67p56R00K26L55J6j620
$$ -8 -552 -966 -460 264 196 1079 210 -1493 429 1598 -845 -87 -139 -170 97 -659 241 467 822 838 -782
3157g82M09k18L54J64L05L05j052J267J21q2p39O55k176K891k194O74J437p95
$$ -782 -373 -591 -237 -73 232 537 -515 752 873 791 52 707 -1469 1422 -772 -98 1339 544
3175E44p85M26q42O19J6J442j098n48O91r17N63O95o02J712j809P1l67m92J344
$$ 544 -241 185 -657 -38 -22 1420 322 -226 465 -452 111 806 204 1916 107 178 -189 -681 663
3194F63r24J03J341k791K637M3j060K54p62Q11L14M19o06j017r8J259L77k27o85
$$ 663 -261 -158 1183 -1608 1029 1072 12 266 -496 315 629 1048 442 -575 -673 586 963 736 51
3213E1M30j200K066j854j12p5J776j021L83j653J001K46l86L19Q7J452k472M74
$$ 51 481 -719 1347 -507 -619 -694 1082 61 444 -1209 -208 38 -348 -29 58 1510 -962 -488
3231d88Q55o66m59Q41J67J973k066k25n25J798j260L39o37L75P36j270o47K154
$$ -488 367 -299 -758 83 250 2223 157 -68 -593 1205 -55 284 -353 22 758 -512 -1159 995
3249I95o18j34K55J018m85p78o92p72J260n2j239P84J47P9K46J026n97r33K94
$$ 995 377 243 498 1516 1031 253 -439 -1211 49 -3 -1242 -458 -311 -232 14 1040 443 -490 -196
3268a96J54m09k4m23R71j612J511j047J705r4j103ML60o6K53M03k62J722j555
$$ -196 -42 -451 -475 -898 73 -1539 -28 -1075 630 536 -567 -563 -203 -269 -16 387 125 1847 292
3287B92k059J588N80m50j87k47k1m4r90J437j019J301j50j125N49L4J790k002
$$ 292 -1767 -179 401 -49 -236 -483 -504 -548 -1538 -101 -1120 181 31 -1094 -545 -511 1279 -723
3305g23N06j73O61P35l31K09j016l93J309j636J698m99K29m48k7m66O5J5k09K061
$$ -723 -217 -390 271 1006 675 884 -132 -525 784 -852 846 347 576 128 101 -365 -300 -285 -494 1567
3325A567j745P11k93j138R13q46n06J364O88k316J319o47J282M27j312Q50r02
$$ 1567 -178 533 240 -898 15 -831 -1337 27 715 -1601 -282 -929 353 780 -532 318 -584
3342e84J514r12K96k07j004L82K82N81J663k446k95J377m95n57K8m3L30N48j372
$$ -584 930 18 314 107 -897 -515 -233 348 2011 -435 -730 647 152 -405 -377 -420 -90 458 -914
3361i14M10N50P6l54J032q78j213J704j42m02n2L61o54J443j344M99j309P69j084
$$ -914 -504 46 122 -232 800 -78 -1291 413 271 -131 -183 178 -476 967 -377 122 -1187 -418 -1502
3380a502K016q81l72R24j156J936l05j802Q77J363q53P19n61k78j280J057M02
$$ -1502 514 -367 -739 185 -971 965 660 -1142 -265 1098 245 964 403 125 -1155 -98 304
3397C04q22P08n73N22m20Q23j217k02K222j336j61J137j164K64l57M58j5q92O42
$$ 304 -518 190 -383 139 -281 542 -675 -877 1345 9 -152 985 -179 85 -272 186 171 -721 -79
3416g9J11Q4k87P08n48P78k25J304j617J4k9j670O50J742j185J457k416K23J304
$$ -79 32 116 -171 537 -11 767 542 1846 229 243 214 -1456 -806 936 -249 1208 -1208 -985 319
3435C19N84J429k185q35k02J243p69M9O47p38R69p74M59o54m99L82k17Q54J33
$$ 319 903 2332 147 -688 -890 353 -416 -367 280 -458 511 -263 196 -458 -957 -575 -792 62 195
3454A95j479Q02M59L09k27N40o4j057O32l37J002N7q23J391J53j606J091q59m22
$$ 195 -1284 -482 -23 286 59 599 535 -522 110 -227 775 832 9 1400 1553 -53 1038 179 -243
3473b43L78L12Q97j540j60J165l45j424J642r24J507J55j286j84l10O93o9l70
$$ -243 135 447 1344 -196 -356 809 464 -960 682 -242 1265 1420 134 -50 -360 333 264 -106
3491a06k90J468j797J430k0K19j505p12J690j47J15j089J301O06n58r41Q28j307
$$ -106 -396 1072 -725 705 685 904 -601 -1313 377 230 345 -744 557 1163 605 -336 492 -815
3509h15K91p04J75J060j8j47l68J095m66j273K362j311N79j007J79J233r94m23
$$ -815 -524 -1228 -1053 7 -11 -158 -526 569 103 -1170 1192 -119 460 -547 -368 865 -129 -552
3527e52O8Q53Q7m01J03l12K55J160r82p7o99N12N05j513J365O74j580J35l32J631
$$ -552 -484 369 456 55 158 -154 101 1261 279 202 -497 15 520 -993 372 1046 -534 -399 -731 900
3547I00j248P39p78M78r38J288m22J359m86p54j146J679K06j124J391n00q02J291
$$ 900 -348 391 -387 91 -847 441 19 1378 892 138 -1008 671 877 -247 1144 644 -158 1133
3565A133j522J051J271j029p27l82K157m92j582J264j877M91M50j41N38k33n21
$$ 1133 -389 662 1933 904 177 -205 1952 1460 -122 1142 -735 -244 206 65 603 370 -151
3582a51QP11n15R02j820L09N98p26p63J619j473J606N82O90k131Q44l9R05k260
$$ -151 -143 568 53 955 -865 -556 42 -684 -1447 172 -1301 305 887 1577 -554 290 251 1156 -1104
3601a104J259o06j44J85l42J020nO4j031Q77m80L07j163Q94k27L43L14k27m2j35
$$ -1104 155 -451 -595 -410 -752 268 263 327 -704 173 -307 0 -1163 -269 -496 -153 161 -66 -108 -243
3621b43p98J598K19l39j683K055q59J514j004j676K245j299P02o24K481j830k219
$$ -243 -1041 557 776 437 -1246 809 -50 1464 460 -1216 1029 -270 432 -192 2289 459 -1760
3638a760J868O34M16k681K279P36r45K61m93j025J379j948J467M60k41J75K13
$$ -1760 108 742 1158 -1523 756 1492 547 808 315 -710 669 -1279 188 648 407 582 795
3655G95q24m87J833j415J098j633J442j936K326j626O86j04O86j133P06k493J714
$$ 795 -29 -516 1317 -98 1000 -633 809 -1127 1199 -427 259 155 841 -292 414 -2079 -365
3672c65N58m87K90o50R07M64k40J81q25L89o15k03L62K066k699P81J221j126K76
$$ -365 193 -294 -4 -654 253 717 477 658 -167 222 -393 -596 -234 1832 -867 -86 1135 9 285
3691B85r77Q10N43j34j389J34Q13r57K071j511P86l38m78l1K58q13J313m99J03
$$ 285 -692 118 661 527 -862 -728 85 -872 1199 -312 474 136 -342 -373 -115 -928 385 -114 -11
3710a1l81p86K80N75Q97N07M03O48k889n77J874p76jp53J628j027j180J572q45
$$ -11 -392 -1178 -898 -323 574 1081 1484 2132 -757 -1334 540 -236 -237 -990 638 -389 -1569 3 -842
3729h42Q22j89J41O09p15P67p81k27j12O88j287R79l48Q58j35j25P11o79o0k46
$$ -842 -20 -209 -68 541 -174 593 -188 -415 -527 161 -1126 -147 -495 363 228 103 814 135 75 -171
3749a71J02O36j015R46M69m35j052L83P6J101j356J143j900R30Q29q78m75N96
$$ -171 -69 567 -448 498 967 532 -520 -137 -61 1040 -316 827 -1073 -143 686 -192 -667 -71
3767g1Q44j86j224L0J366p96P52n85mj37J72m71n00j73J342k75l10K94P7j76j450
$$ -71 773 587 -637 -607 759 -37 715 130 126 -11 161 -310 -810 -983 359 84 -226 68 145 -31 -1481
3788a481J313n79L97l97K133j372K0Q81j187Q76l32L26j106K3J271J4J86o99r7
$$ -1481 -168 -747 -350 -747 1386 14 34 915 -272 604 272 598 -508 -485 786 800 986 287 190
3807A90j54j82M36N67l48O70n73m89J433j204r34J009j008Q42O6m75J18m48J429
$$ 190 36 -146 290 857 509 1179 606 117 1550 346 -588 421 -587 255 321 -154 -36 -484 945
3826I45r88J45M56l89J338j066j73j98m62M35n35N25r3N55k305K552r25j420K728
$$ 945 -43 102 558 169 1507 441 268 70 -392 43 -492 33 -60 495 -1810 742 -183 -1603 1125
3845A125j677J031L59k150J678m95R73j377r21J636k88N46p02q50M18K77Q6N9
$$ 1125 -552 479 838 -1312 366 -129 844 -533 -1454 182 -106 440 -262 -1112 -694 -417 -331 -272
3863b72P80n09L01j885J623M59n3j148R54j81p38J124o21m32O01J003r37J481
$$ -272 508 -1 300 -1585 38 497 444 -704 250 69 -669 455 -166 -598 3 1006 69 1550
3881A550r63q09n34M28N64r63P03L97n40j76k03M3J322r41J221k287O34J007p04
$$ 1550 587 -222 -756 -328 236 -727 -24 373 -167 -343 -546 -503 819 -122 1099 -1188 -554 453 -251
3900b51j499j54J061J841j452k17J277l15j139J449m92J131k119L39r7J289j25
$$ -251 -1750 -1904 -843 998 -454 -671 606 291 -848 601 109 1240 -879 -540 -637 652 527
3917E27p43L78k42P43J54m84m36O58j505Q03o08P92J51j987K331r80N63Q65k125
$$ 527 -216 162 -80 663 817 333 -103 555 -950 -147 -755 37 188 -1799 532 -448 115 980 -1145
3936a145K185j544J101J38p74l48L78O80m74L3RJ284m37j206K315j053M61j150
$$ -1145 1040 -504 597 735 -39 -387 -9 671 197 230 239 1523 1086 -120 2195 1142 1603 453
3954D53Q37l11j330O42k95k75K32J219j151K33j037l98J391m41n9K00J147r9j758
$$ 453 1290 979 -351 291 -4 -279 -47 1172 21 254 -783 -1181 210 -231 -290 -90 1057 958 -800
3973h00J767j483J93J112o87Q47j754J670k19p73p35K379k244P78J78p06M41Q98
$$ -800 967 -516 -323 789 102 949 -805 865 646 -127 -862 1517 -727 51 229 -477 -36 862
3991H62o46q76L10l29J972k224L09p2J203k07p71J55P92o03l3N46r8m6P9k83L20
$$ 862 216 -660 -350 -679 1293 -931 -622 -694 509 302 -469 -314 478 -125 -158 388 290 244 323 40 360
4012C60m3L31j136J184L64m13J69o81K42O5l15O55j404j099Q99l16K06N80J254
$$ 360 317 648 -488 696 1060 647 816 135 377 442 127 782 -622 -1721 -822 -1138 -932 -352 902
4031I02m63o54O67j147n93R31m21R85q96R90o87J775j834N12L40j474J228P66
$$ 902 439 -215 452 -695 -1288 -357 -778 207 -689 301 -386 1389 -445 67 407 -1067 161 927
4049I27j256k58J10O28j243M81J759j939N89p05J265j33L58o55J24J6Q23j80j103
$$ 927 -329 -587 -477 151 -1092 -611 1148 -791 -202 -907 358 225 583 -72 52 68 891 711 -392
4068c92M82L60j479J118J205k758Q26J448r10l98J60O89Q8J184j910J029j360
$$ -392 90 450 -1029 89 1294 -1464 -638 810 -100 -498 -338 351 439 1623 -287 742 -618
4085f18N50L7p8J177j948M96j118R78J610j714q81J394J67K04l18K84j19j991
$$ -618 -68 -31 -109 1068 -880 -384 -1502 -524 1086 -628 -1509 -115 52 256 -62 222 103 -1888
4103a888J489K12R91r03M83p36j57J563J92o96M4j621J689K3q70K2K15J295j121
$$ -1888 -399 -187 804 -99 384 -352 -509 1054 1246 550 594 -1027 662 685 -185 -163 52 1347 226
4122B26n20o21O88R89j578J063k062J542l68Q07q30P13J266j398J35J318j591
$$ 226 -294 -915 -227 762 -816 247 -1815 -273 -641 166 -664 49 1315 -83 52 1370 -221
4139b21k97J111p41n36O10K230k315M75J87P70j46r14l75n72M50J027m35P8n58
$$ -221 -518 593 -148 -684 -74 2156 -159 316 503 1273 1127 213 -162 -734 -284 743 308 386 -172
4158a72j49J44P98j335J016j546O83P7L25P5L3p57O33J482k006J136o12L63L34
$$ -172 -321 -177 621 -714 302 -1244 -561 -484 -159 -84 -51 -808 -175 1307 -699 437 -175 188 522
4177E22j487m72J179J024o61j773J701pJ2K35K2L63r02Q20%k53j458K19R70l59
$$ 522 -965 -1437 -258 766 105 -1668 33 26 38 273 295 658 -244 576 576 323 -1135 -916 54 -305
4197c05k58O48p87J041J537j621o35M12J014j144j7j865J448R21O3n17r85J955
$$ -305 -563 85 -702 339 1876 255 -380 32 1046 -98 -115 -1980 -532 389 452 -65 -1050 905
4215I05K03j278j35M79K21p21K53N31l77n92J352j179K73J28p42n14P94L67j604
$$ 905 1108 -170 -305 174 395 -326 -73 458 81 -511 841 -338 -65 63 -679 -1193 -399 -32 -1636
4234a636J461k2K56J014j405o1j207J877m41P2J20j211O59R57o88J299j690M06
$$ -1636 -175 -197 59 1073 -332 -393 -1600 277 -164 -92 28 -1183 -524 433 -255 1044 -646 -240
4252b40P05n18J296k291K045j550O68j14Q53j952k55J657j030M15J068n99N94
$$ -240 465 -53 1243 -1048 997 -553 115 1 854 -1098 -1353 304 -726 -311 757 158 752
4269G52k56O7l73l04L84R61p80j270J782j081j40R12n66J21O66j338Q01N84l77
$$ 752 496 563 190 -114 270 1231 451 -819 963 -118 -258 654 88 209 875 -463 338 922 545
4288E45l93J117k227l62K87L00J099J26j382j22Q31k2r2K01K19N5l73J7q09M48
$$ 545 152 1269 -958 -1320 -1033 -733 366 492 -890 -1012 -181 -203 -295 -94 125 180 -193 -176 -985 -537
4308e37J848j193J848j208N59k449L88N07P02o84r70J278n92N46n71M26p14O88
$$ -537 1311 118 1966 758 1317 -1132 -744 -237 465 -219 -1189 89 -503 43 -528 -102 -816 -128
4326a28k09M58J92m79P8j795J441Q98j205K74J438L2p60K5j603J070n91J112o68
$$ -128 -337 121 313 -166 -88 -1883 -442 456 -749 -475 963 995 235 260 -1343 -273 -864 248 -420
4345d20J09L28r80L50R11l45Q22q72J574j415o00j21O38P0j99J23o74R23P35O42
$$ -420 -311 17 -963 -613 298 -47 775 -97 1477 62 -538 -659 -21 49 -150 -27 -701 222 957 1599
4365A599k126J032n66o77L24P9n97q1K129j820O05P92n30m22j62Q70M56K98o84
$$ 1599 -527 505 -61 -738 -414 -335 -932 -1013 1116 -704 -99 693 163 -259 -421 449 905 1203 519
4384E19J45j210J419j077O03j325R96o52J68Q79j337R75J38k51M56n90m94M65
$$ 519 664 -546 873 -204 399 -926 70 -582 -414 465 -872 103 241 -10 446 -144 -638 -173
4402a73k08r71J150N22l99L12l11o06o95N55J664l10j493O37O70l18o70p0O89
$$ -173 -381 -1352 -202 320 -79 233 -78 -684 -1379 -824 840 530 -963 -326 344 26 -644 -714 -25
4421b5K90j856K785j188M43O80j328p34J317p76Q94j1K09r70L29L6m31J88l77
$$ -25 265 -1591 1194 6 449 1129 -199 -933 384 -392 502 491 700 -270 59 95 -336 -148 -525
4440e25p29J584j024J88O05m52P96J623k047q86M85J233K51k90q00p61P0m0J402
$$ -525 -1254 330 -694 -506 99 -353 443 2066 19 -867 -382 851 1102 812 12 -749 -679 -719 683
4459F83J237j879N39j420J715L72j547l32J579q85j70J013q77K53p98q33Q70k45
$$ 683 1920 41 580 -840 875 1247 -300 -632 947 62 -108 905 28 281 -517 -1350 -480 -725
4477g25J365k64L24n50o17R44o43k77J311j021m3J40m18M2J092J22l55j032O8
$$ -725 640 376 700 150 -467 477 -166 -443 868 -153 -196 -56 -474 -432 660 782 427 -605 -537
4496e37J79N24j126K315q56Q72j185j19o69m93J73P52J631k430R52j39J0N22n6
$$ -537 -358 166 -960 1355 499 1371 186 67 -602 -1095 -922 -170 1461 -969 -17 -156 -146 376 320
4515C20j463J050J115j15k10k035L062j880K73l55O74m47J210j062J26P5r53K06
$$ 320 -1143 -93 1022 907 697 -1338 1724 -156 117 -238 436 -11 1199 137 263 338 -615 -409
4533d09J89L58l41J095o34r58Q69M29K35j486J008l26o68J426q98N66J92K01M08
$$ -409 -220 138 -203 892 258 -700 169 598 833 -653 355 29 -639 787 -111 455 647 848 1256
4552A256l025R65N32P73l11M87j185P80l97J015n86N60r59l75m27K479j675O53
$$ 1256 -1769 -804 -272 501 190 677 -508 272 -125 890 304 864 -95 -470 -897 1582 -93 560
4570E60j866O75K225j067J99j240O19M74j417n13J596k2q22l25K173m40j636O4
$$ 560 -1306 -631 1594 527 726 -514 105 579 -838 -1351 245 223 -599 -924 1249 809 -827 -763
4588g63J41O54K77j39L67j286Q64q79Q17M47p3j99k19J315j553j09j82P45k8n14
$$ -763 -622 32 309 170 537 -749 115 -764 53 500 427 228 9 1324 -229 -338 -520 225 197 -317
4608c17k33j28P41P87j865J20J1J183j324M86J257j137R37J41j259J107l38J14
$$ -317 -550 -678 63 850 -1015 -895 -884 299 -1025 -539 718 -419 518 659 -600 507 169 283
4626B83m48K48J374o4k317N77m30M54K40M63j646K170k029m30lJ020J158r27K96
$$ 283 -165 83 1457 1393 -924 -347 -777 -323 -83 380 -1266 904 -1125 -1555 -1558 -538 620 -307 -11
4645a1m4q85P36M28n00R7J832j441n21l66O38n33J369oj020M02M41j87j592J060
$$ -11 -55 -940 -204 224 -276 -179 1653 212 -309 -675 -37 -570 799 793 -227 175 616 429 -1163 -103
4665a03mo15P76j17l85O11r38J678r37j92J365k394N32J161k42l36p1Q58k72j71
$$ -103 -107 -722 54 -63 -448 163 -775 903 -34 -226 1139 -1255 -723 438 196 -140 -211 647 375 204
4685B04k44P73P5j654K264J09r01l68j05p3j34p90Q36Q27m76j516l9M88N54j0
$$ 204 -40 733 808 -846 1418 1527 626 258 153 80 -54 -844 -8 819 343 -1173 -1212 -724 -170 -180
4705a80J074j091j3M1l68J43K425k317N15n25Q16K43m92P74p88k12k54O09J476
$$ -180 894 -197 -210 -169 -537 -394 2031 -286 229 -296 520 763 271 1045 257 45 -209 400 1876
4724A876k395Q1K70K85M20n61l59j631L97K560j445J348k91k893K683q15p14K09
$$ 1876 -519 -438 -168 117 537 -24 -383 -2014 -1617 943 -502 846 555 -2338 345 -470 -1184 -975
4742i75j484K340M31p26Q96m50N66j109J686j913J15L68L8n55Q67j236Q40K93
$$ -975 -2459 -119 312 -414 482 32 598 -511 1175 -738 -623 -255 -217 -772 95 -1141 -301 -8
4760hm97Q5r89J885j46N97j185J143J58j212q11L11Q65M95m7p72P1n72M64l06
$$ -8 -505 -420 -1409 476 330 927 -258 885 1043 -169 -980 -669 196 691 644 -128 -57 -629 -165 -471
4780d71K49q07Q01N44j040J098n0l55J47K7Q78j634M63j52O61j378J859j084N06
$$ -471 -222 -1029 -228 316 -724 374 324 -31 116 143 1021 -613 -150 -302 359 -1019 840 -244 262
4799B62m08J17J250j869J105k60k89r69R55R58o72l72J155m58k46K2q73R25q5
$$ 262 -146 -29 1221 -648 457 197 -92 -1061 -106 852 180 -192 963 505 259 281 -592 333 248
4818B48p6j76r14Q13O6M39p90J434j967k79Q41N17j22j267J25J736P7m1l01L21
$$ 248 172 -4 -918 -105 -39 400 -390 1044 -923 -1202 -361 156 34 -1233 -1108 628 705 664 363 684
4838F84k32q94R28l11q3R22n3o81j054J024k82K44l26J01j026J936j173l98J553
$$ 684 452 -442 486 175 92 1014 961 280 -774 250 -32 212 -114 -13 -1039 897 -276 -674 879
4857H79p87q23J018m62j316N50J467o65Q84j115k80J149Q34J23j428j226J563
$$ 879 92 -731 287 -175 -1491 -941 526 -139 745 -370 -650 499 1333 1456 28 -1198 365
4874C65J160k357J716j109p88R92J55k35K99l87p30J592m88K03j33q72K92L96
$$ 365 1525 -832 884 -225 -1013 -21 134 -101 198 -189 -919 673 185 388 255 -617 -325 71
4892G1K96k201P72Q41L38o79R19n42J20r47K642k227K12n72R64k84r48J197P90
$$ 71 367 -1834 -1062 -221 117 -562 357 -185 -65 -1012 1630 -597 -385 -957 7 -277 -1225 -28 762
4911G62j545k30J136o77j51J321N92j894R00l78j021J245K00J8m80j132J896m32
$$ 762 -783 -1013 123 -554 -705 616 1208 -686 214 -164 -1185 60 260 278 -202 -1334 562 130
4929A30J422k086J821n99k77o43j0J63k32l39O57j119J222j865K663j203Q29o17
$$ 130 1552 -534 1287 688 411 -232 -242 -79 -311 -650 7 -1112 110 -1755 908 -295 534 -83
4947h3j135J992j043J96J159j777j38O13O94O94j313l52J293q92p98J822j420
$$ -83 -1218 774 -269 -73 1086 -691 -829 -216 478 1172 -141 -493 800 -92 -890 932 -488
4964d88k24J274K97o96Q03j016J044j041K96Q86k208K541n88j850K094j208o05
$$ -488 -712 562 859 163 966 -50 994 -47 249 1135 -1073 1468 880 -970 1124 -84 -689
4981f89Q09O3R64j668P69o85R28n82r50P43j21K39p5P00m30P43j016p60Q39m30
$$ -689 120 183 1147 -521 248 -437 491 -91 -1041 -298 -419 -180 -255 445 15 758 -258 -1018 -179 -609
5001f09Q7J507o54k8j57o16P75N50J94j006j240Q80n48J683j135N35J751p95j195
$$ -609 -522 985 331 303 146 -470 305 855 1049 43 -1197 -317 -865 818 -317 218 1969 1174 -21
5020b1n55j35j14J602j874K92J640j065q87N88J813j064L24j3L70k07Q52k122
$$ -21 -576 -711 -825 777 -1097 -805 835 -230 -1117 -529 1284 220 544 531 901 694 1546 -576
5038e76k3P46L86r13J095j41j045J423l86j199N75o6J84N69j218J689m29j059
$$ -576 -599 147 533 -380 715 574 -471 952 566 -633 -58 -124 60 629 -589 1100 671 -388
5056c88L19j64P27m9p58j609J741mm09Q25j505J237o2N33N06O59j114k57p42n39
$$ -388 -69 -233 494 445 -313 -1922 -181 -185 -594 231 -1274 -37 -99 434 940 1599 485 228 -514 -1053
5076a053K376k920J97J021J537j308J375r15p50M29k79R64j509J25Q05j44k81
$$ -1053 1323 -1597 -1400 -379 1158 -150 1225 310 -440 -11 -290 674 -835 -710 95 -49 -330
5093c30l7o72K010p85L44p51j535J604M07p92J128l91p91J434j16k97j403J674
$$ -330 -367 -1039 971 186 530 -221 -1756 -152 255 -537 591 200 -591 843 727 430 -973 701
5111G01j179J612j539O85n80m68L131l384J399L45p83l05M82j56J122L19k317
$$ 701 -478 1134 -405 280 -300 -768 2363 -1021 378 723 -60 -365 117 -39 1083 1402 -915
5128i15P51L87p8j24j306K719k37n11l77K65m9j318J161j121J509m16m0l13L05
$$ -915 -164 223 145 21 -1285 1434 1197 686 309 574 525 -793 368 -753 756 340 300 -13 292
5147B92n82J176L72L56k531J686o57j534n39K237m62R47j450R09M39n72m39R01
$$ 292 -290 886 1258 1614 -917 769 112 -1422 -1961 276 -186 761 -689 220 659 87 -352 549
5165E49n70k53P54j039O69r58P30k3N92o18M65N52j200J84J109l04K30j274j12
$$ 549 -21 -274 480 -559 110 -848 -118 -141 451 -167 298 850 -350 -166 943 639 869 -405 -517
5184e17j31J040l95J11P3P83j685M46P42N14j078m92j156J195J086j056M20N59
$$ -517 -648 392 -3 108 181 964 -721 -275 467 981 -97 -589 -1745 -550 536 -520 -100 459
5202D59p16P77r15J242m75J82q33k38l93J230o11o48J231O16j398N17k098L034
$$ 459 -257 520 -395 847 372 554 -279 -517 -910 320 -291 -939 292 908 -490 27 -2071 963
5220I63k21k1k02k048K096m51o78N32j060N03N14M35j416J948j80j757P78k01
$$ 963 742 721 519 -1529 567 116 -562 -30 -1090 -587 -73 362 -1054 894 714 -1043 -265 -466
5238d66J26J122N21k253N5P74R30J00j196P87j606J285J68j756J830L52n90r06
$$ -466 -340 782 1303 -950 -895 -121 809 909 -287 500 -1106 179 347 -1409 421 773 183 -723
5256g23k21P84m00R50q03O59J51n9l52O9K40l95J030j267L87o27J385r26o90N45
$$ -723 -944 -160 -560 390 -413 246 397 338 -14 55 295 -100 930 -337 50 -577 808 -118 -808 -263
5276b63J79P39l72j030N0J738p82R97k839K049N7j464k56J214o04J048N67p49
$$ -263 -84 655 283 -747 -697 1041 259 1256 -1583 466 523 -941 -1197 17 -587 461 1028 279
5294B79l55J310o9j512k72Q18M23o69k64R44k22q12O27r08N74r3k02J11O29k06
$$ 279 -76 1234 1165 -347 -619 199 622 -47 -311 633 411 -401 226 -682 -108 -201 -403 -292 337 131
5314A31j618J701M78j084O87j147K47J286r50J107qj99j59j35r5j461J045P4J19
$$ 131 -1487 214 692 -392 295 -852 -605 681 -269 838 830 631 472 337 242 -1219 -174 -100 19
5333A9n19R39K30l66k04m74J210j853J790j708J384N4k160J325J071l57N84n90
$$ 19 -500 439 669 303 99 -375 835 -1018 772 -936 448 502 -1658 -333 738 381 965 375
5351C75N58j209K08j308K397r70L59l47M1L0m61l56K78q61j8R53R31k55q6k4j373
$$ 375 933 -276 -68 -1376 1021 51 410 63 104 134 -327 -683 -405 -1266 -1284 -331 600 345 259 235 -1138
5372a138M80J517L55j400n70j91J006P78j821O03j10K33j67N01l27R70O74r07
$$ -1138 -658 859 1214 -186 -756 -947 59 837 -984 -381 -491 -258 -425 76 -251 719 1393 486
5390D86j750K014M50j679M07J6M49k91r09L93K78J725k383N15j095J337M74q22
$$ 486 -1264 750 1200 -479 -72 -56 393 102 -807 -414 -136 1589 -794 -279 -1374 -37 437 -385
5408c85p70J926j292lJ234j055K18J57J678k084K69l43L24J31p95P29q61K154
$$ -385 -1155 771 -521 -524 710 -345 -127 30 1708 -376 -107 -450 -126 5 -790 -61 -922 1232
5426A232j400J79m16n9J114p49J631k492J352j100j178K015l38L32L55r48R34
$$ 1232 -168 11 -405 -464 650 -99 1532 -960 392 -708 -1886 129 -209 123 478 -470 464
5443D64M44j213j03J162J91j154J312Qo92o59N88j382K223j395P37m85j56j265
$$ 464 908 -305 -408 754 945 -209 1103 1111 419 -240 348 -1034 1189 -206 531 46 -110 -1375
5461a375R18R96M58j641J298m27k23R87j292K19r2p68K119j489K23M83j95R70
$$ -1375 -457 539 997 -644 654 227 4 991 -301 -82 -174 -942 1177 -312 -89 394 199 1169
5479A169j950J103m6o50n75M42J313p75L0k01M25l42k38k44P88K48k11m67O22
$$ 1169 -781 322 276 -374 -949 -507 806 31 61 -140 285 -57 -295 -539 249 497 286 -181 441
5498D41J9o63O1O60o88K00j086L13N33M0l74Q39J221j651Q20j240J037n9o03k70
$$ 441 460 -203 -142 518 -170 30 -1056 -743 -210 -170 -544 295 1516 -135 685 -555 482 423 -180 -450
5518d50k24q13J421n47J030m00n05Q09qk11N75j774M67o01M50L07O90o21R43m69
$$ -450 -674 -1487 -66 -613 417 17 -488 321 313 102 677 -1097 -630 -1231 -781 -474 216 -405 538 69
5538F9M52n91j205K62J526N12n00J20l78p9R09N28k159L04l38P24K004j823j184
$$ 69 521 -70 -1275 -1013 513 1025 525 645 267 188 1097 1625 -534 -230 -568 156 2160 337 -847
5557h47J344n02P0n44M39J59k80M90j189N46O54o35J517j360R0Q13k36m86m79
$$ -847 497 -5 65 -479 -40 119 -161 329 -860 -314 340 -295 1222 -138 -48 765 529 43 -436
5576d36M15J232q03J24m45J372r95j648L23J541M18j354P36l08m14j368J776J49
$$ -436 -21 1211 408 532 87 1459 464 -1184 -861 680 1098 -256 480 172 -242 -1610 166 315
5594C15n37N45N1k09j28O1J102r52j654J087J462j121J36j7Q24j638Q2L93q5O52
$$ 315 -222 323 374 165 37 98 1200 248 -1406 -319 1143 22 158 141 965 -673 -591 -198 -283 369
5614C69N6M61j126J20M93r49J973k476J655m74N35j469Q6J75M10P25q11m77J365
$$ 369 425 886 -240 -120 373 -576 1397 -1079 576 102 637 -832 -746 -571 -161 564 -247 -724 641
5633F41o23j425J953j482J007l10J201k449J185P07p31L26J6J8K68p36P60n7p84
$$ 641 18 -1407 546 -936 71 -239 962 -1487 -302 405 -326 0 16 34 302 -434 326 269 -515
5652e15O79p03K07q65K476k518M90P08J27Rp95J355j263J682j371M99j77L34N34
$$ -515 164 -539 -332 -1197 1279 -1239 -749 -41 86 95 -700 655 -608 1074 -297 202 25 359 893
5671H93j501J73K86j636J902j511J752j65j460Q87L26M13r34P41J359j639l41
$$ 893 -608 -435 -149 -1785 117 -1394 358 193 -1267 -380 -54 359 -575 166 1525 -114 -455
5688d55O73m2J847k621R4M34k58P6P22j505J982O15j830j80K34P60N24j010l43
$$ -455 218 176 2023 -598 -504 -70 -328 -252 470 -1035 947 1562 -268 -448 -214 546 1070 60 -283
5707b83M40j66o37K95P6j294J913J087j861P61j091J420p25j83K37O00j149o8
$$ -283 157 -9 -646 -351 -275 -1569 344 1431 -430 331 -760 660 -65 -248 -11 589 -560 -628
5725f28R0n70j33K44K036j204J23M0J228j195J350j416p91J507k486K64K304p0
$$ -628 -538 -1108 -1241 -997 1039 -165 -42 -2 1226 31 1381 -35 -826 681 -1805 -1541 763 693
5743F93j34k51N22l29j021j44J588j77p38m29J22J512j847N72M79j68m51L46K229
$$ 693 559 308 830 501 -520 -664 924 747 9 -420 -298 1214 -633 -61 418 250 -201 145 2374
5762B374l355N09k75Q00J93j90O19p55M84M9q45J204l10j253R93o56k03J506j75
$$ 2374 -981 -472 -747 53 246 56 675 -80 404 453 -392 812 502 -751 242 -414 -617 889 714
5781G14n01N9j16J65n20P41q53K27k76M07N32j14j942J023N16O70Q10j82j022
$$ 714 213 272 156 321 -199 542 -311 -84 -360 47 579 465 -1477 -454 62 732 1542 1360 338
5800C38r17O20L66R81j513l35M37J534j185n00q64J955j404P83M00p2j415R24
$$ 338 -579 41 407 1388 -125 -460 -23 1511 326 -174 -1038 917 -487 296 696 624 -791 133
5818A33RN57n58j045j81J4l7J070p11L80N66N68N70j773R91o40J431j034l36N72
$$ 133 142 699 141 -904 -1085 -1071 -1108 -38 -749 -369 197 765 1335 -438 553 -87 1344 310 -26 546
5838E46r29O63K27r63mM21J100k524J836j461J278J196j214P28j066Q22o00J325
$$ 546 -383 280 507 -456 -460 -39 1061 -1463 373 -1088 190 1386 172 900 -166 656 56 1381
5856A381j437J14Q2K65j199O80L15j36J224j796Q59o03j187J607J235q03j473
$$ 1381 -56 58 140 405 -794 -114 201 65 1289 -507 352 -251 -1438 169 1404 601 -872
5873h72n72K920j990L72k62r9P80R6j98j267l92J826k72j98k5K41m82K04O57K75
$$ -872 -1444 1476 -514 -142 -404 -503 277 373 175 -1092 -1484 342 70 -128 -153 88 -394 -190 467 742
5893G42j730J92j4J136q42Q56R66o59q88O95r94J587p36L8o70n61J01O0J457k64
$$ 742 -988 -796 -810 326 -516 340 1306 647 -241 454 -540 1047 311 349 -321 -882 -781 -721 736 472
5913D72j75p11l61O07l45R65M38k49j368J225K14J94p48p99L77L56L2j02k34l04
$$ 472 297 -414 -775 -168 -513 452 890 641 -727 498 712 906 158 -641 -264 92 124 22 -212 -516
5933e16K01J449j525L52j80N52r79k36J341r61J84q96Q57J82m79K086r59k50R09
$$ -516 -315 1134 -391 -39 -219 333 -646 -882 459 -502 -318 -1214 -357 -175 -654 1432 473 223 1132
5952A132j036o21N60k21l23N76J18q47M81Q01j271O81p91K80L70J228j815J328
$$ 1132 96 -525 35 -186 -509 67 185 -662 -181 620 -651 30 -761 -481 -111 1117 -698 630
5970F30j513J917J03j110l56L61l14O24j587J950j017P71j275J155k85J0J36O47
$$ 630 -883 1034 1137 27 -329 32 -282 342 -1245 705 -312 459 -816 339 54 64 200 847
5988H47j071J20p42j319K524o20J229k547K097p88N36J190k080L79o20M52J166
$$ 847 -224 -104 -846 -2165 359 -261 968 -1579 518 -270 266 1456 -624 -245 -865 -413 753
6005G53J94j310l46N47j013K167j409j49J92L70P77n45m19L17j091M70N05N43
$$ 753 947 -363 -709 -162 -1175 992 -417 -566 -374 -4 773 228 -191 126 -965 -495 10 553
6023E53p53k08Q12j280M53J957R4j406P91j272K26q54l24J826r96l85J277J81
$$ 553 -200 -408 404 -876 -423 1534 1628 222 1013 -259 -33 -887 -1211 615 -381 -766 511 692
6041F92q38M25j385J187O91r30O96l74j24o34Q97L81n63O48l84j369P40L9N12
$$ 692 -146 279 -1106 81 772 -158 538 164 40 -594 303 684 121 769 385 -984 -244 -205 307
6060C07m16N87j758J093P73j84j507K177j203r99P78m87O41L31P15o55o25J471
$$ 307 -109 478 -1280 -187 586 402 -1105 1072 -131 -1130 -352 -839 -198 133 848 193 -432 1039
6078A039j852R48n97L82J559o58l07j392m01J835n82Q08p81K415k357j79j353
$$ 1039 -813 135 -462 -80 1479 821 514 -878 -1279 556 -26 782 1 2416 59 -120 -1473
6095a473O95N68J214j401k31m30J327K99j802J956K93j499J264R88k496j70J327
$$ -1473 -778 -210 1004 -397 -628 -1058 269 568 -1234 722 1015 -484 780 1768 -728 -898 429
6112D29L06j132J39J366k821J221J086j747P68K409k173N25L38m47o08J07K013
$$ 429 735 -397 -258 1108 -1713 -492 594 -1153 -385 2024 -149 376 714 267 -341 -234 1779
6129A779l267K270k561K040J28j386M63J5m17K472l473K503j1K07j786M13J100
$$ 1779 -1488 782 -1779 261 389 -997 -534 -519 -936 1536 -1937 566 555 762 -1024 -611 489
6146D89m00l26J297N24j271p24l9J635j675k06K016j466K11L49p05J316p03J4
$$ 489 89 -237 1060 1584 313 -411 -450 1185 -490 -696 1320 -146 65 414 -291 1025 322 336
6164C36K13m5m67O57j702J147j6l70n1J75k5Q16L60q46p9k50j27J48O03j348J383
$$ 336 549 504 37 694 -1008 139 123 -247 -298 -123 -148 668 1028 182 103 -147 -274 -126 477 -871 512
6185E12j293L00Q20Q84k489K073J945j123j432p21J265O34k828J781N52j910J527
$$ 512 -781 -481 339 1223 -1266 807 2752 1629 197 -524 741 1375 -1453 328 880 -1030 497
6202D97l53o49j132J316O61q59N98M98O80j424J18j490J095n31J042N14P9j554
$$ 497 144 -505 -1637 -321 340 -519 79 577 1257 -167 -49 -1539 -444 -975 67 581 660 -894
6220h94N45J098j681L81j62L46N71O77o51q31L41J8M60K85j357J765o64n0j258
$$ -894 -349 749 -932 -551 -713 -367 204 881 230 -601 -260 -242 218 503 -854 911 247 197 -1061
6239a061J159j77j006J296l79l02R00q73N10p4p14O06J000j45n65k12K85m1KM90
$$ -1061 98 -79 -1085 211 -168 -470 430 -443 67 -7 -721 -115 885 740 175 -37 248 207 209 699
6259F99J63j584J454k380O17J026M39p45P89P1n84N55l73l86j277J037K776l383
$$ 699 862 -722 732 -1648 -1031 -5 434 -311 478 549 -35 520 147 -239 -1516 -479 2297 -1086
6277a086L37k46O90P85l25j74k6J483j419l43R89J00j771R71J0r76N88O20l63
$$ -1086 -749 -995 -305 480 155 -19 -45 1438 19 -324 665 765 -1006 -35 -25 -1001 -413 207 -156
6296a56L71J90qj53K96j113Q15m04L5j333J488k11p25N77P6M04p4L59r65J788
$$ -156 215 405 397 244 540 -573 242 -162 -127 -1460 28 -183 -908 -331 -255 149 75 434 -531 1257
6316A257j629Q0n73K017j594J272j452L22m6O7M32j35Q74j809P20J382j476Q79
$$ 1257 -372 -292 -865 1152 -442 830 -622 -300 -346 -279 153 18 892 -917 -197 1185 -291 588
6334E88m78j95P9K26j15K50j00p61R87k93K77m34l01O03r67P38J89K94j032m52
$$ 588 110 -85 -6 220 105 355 255 -506 481 188 465 31 -270 333 -634 104 293 587 -445 -897
6354h97k60k47K292j029Q00q35O79K1l10R10j199j22K00P98p69L55o47m39J239
$$ -897 -1157 -1404 888 -141 659 -176 503 524 214 1124 -75 -197 3 801 32 387 -260 -699 540
6373E40q91J024k003R78l71L13j55J628q39J29m47K38J172j172Q04j563N03K59
$$ 540 -351 673 -1330 -352 -723 -410 -565 1063 224 353 -94 144 1316 144 948 -615 -112 147
6391A47J014j430J066Q4K2n64j242J897q91O29j062P12j426J291M97j135N79P08
$$ 147 1161 -269 797 881 903 339 -903 994 103 732 -330 382 -1044 247 744 -391 188 896
6409H96k270J70K65O04J081j147J574j227J26J58L33n69o18K51k66J368o78p26
$$ 896 -1374 -1204 -939 -335 746 -401 1173 -54 72 230 563 -6 -624 -373 -639 729 51 -675
6427f75Q62O21q07n99J060N0K40j23j027n03R91p83N51N47j263J357l22q67K31
$$ -675 187 808 1 -598 462 512 752 629 -398 -901 90 -693 -142 405 -858 499 177 -690 -459
6446d59J547o30k8l58R54j452J07n58j13Q25Q68p30K81q82j41O81j461J415p2
$$ -459 1088 458 430 72 1026 -426 -319 -877 -990 -165 703 -27 254 -628 -769 -88 -1549 -134 -206
6465b06l84L38P17j63j065J338j27J24j096O74P20j27K92j027J039j624K85L37
$$ -206 -590 -252 465 302 -763 575 448 572 -524 150 870 743 1035 8 1047 -577 -292 45
6483D5j077L91Q45m35O67J61j222J173j547J900j050n43R89J41j736K024l74M49
$$ 45 -1032 -641 204 -231 436 597 -625 548 -999 901 -149 -692 297 438 -1298 726 352 801
6501H01j182m58Q76o43J340j431J441o68L6p29j73Q68L62n78M23N14j456m24J630
$$ 801 -381 -839 37 -606 734 -697 744 76 112 -617 -790 78 440 -138 285 799 -657 -1081 549
6520E49j245r3J160M03j034J223r77M03p92J8O96o2n49J002m27k96n85N46P22
$$ 549 -696 -789 371 774 -260 963 -14 389 -403 -385 311 249 -300 702 275 -21 -606 -60 662
6539F62M77j493N17p53N95Rr41J557r21J779o27k0j235k76Q66K05O34j908R97
$$ 662 1139 -354 163 -590 5 14 -927 630 -291 1488 861 841 -394 -670 196 401 1035 -873 124
6558A24j182J052k19K7M7J8l44J08M81j133J066N01n50o65O10l70m0m94M94J391
$$ 124 -1058 -6 -225 -198 -151 -133 -477 -369 112 -1021 45 546 -4 -669 -59 -429 -469 -963 -469 922
6578I22o12J2J81n35Q3P54n91p63P27K23N16j678p94J191o66r9R32J358j775J279
$$ 922 310 322 503 -32 51 805 214 -549 178 401 917 -761 -1555 -364 -1030 -1129 -197 1161 -614 665
6598F65q63N9J64l22Q09O3j57j897N63O54N24j099P76n60O8J440K40M56j953l13
$$ 665 -198 -139 25 -297 512 575 418 -1479 -916 -262 262 -837 -61 -621 -553 887 1127 1583 -370 -683
6618f83K030j124%j55N65l50J413j108j145J281N40n61j351O37k08J76j40l33
$$ -683 1347 223 223 68 633 283 1696 588 -557 724 1264 703 -648 -11 -219 -43 -183 -516
6636e16p32J777r14N21K04p19N44L11j482J459n95J338j921J422k86N19j415M58
$$ -516 -1248 529 -385 136 340 -379 165 476 -1006 453 -142 1196 -725 697 411 930 -485 -27
6654b7j82j99k46J297P50j485j05m1j059P66O38m54J151j825M47p11J452r34l9
$$ -27 -209 -408 -654 643 1393 -92 -197 -238 -1297 -531 107 -347 804 -1021 -574 -1285 167 -767 -806
6673h06K815j362m84R20r14m77j056J719r28N6J335j425R86j4k75J108j263L45
$$ -806 2009 647 163 1083 169 -308 -1364 355 -573 -517 818 -607 379 365 90 1198 -65 280
6691B80O73N55j384j35J275n04j015M14r75o35J734n66j75N18R5pP25j761M2K83
$$ 280 953 1508 124 -11 1264 760 -255 159 -816 -1451 283 -283 -458 60 155 148 873 -888 -846 -563
6711e63m53O11p21J716m87o02O5J611q81q04N83o65N63P21j133J465l20j017N9
$$ -563 -1016 -405 -1126 590 103 -499 -434 1177 296 -508 75 -590 -27 694 -439 1026 706 -311 -252
6730b52p74J967j763J581p64j39J172j047j60Q01j235J378N5Qm68K19n69q47K77
$$ -252 -1026 941 -822 759 -5 -144 1028 -19 -179 622 -613 765 820 828 360 579 10 -837 -560
6749e60q0Q0J156k76N2L33K45j184Q5L57L70r95r23K26O72K001j833l30P95J436
$$ -560 -640 -560 596 320 372 705 950 -234 -149 208 578 -417 -1340 -1114 -442 1559 -274 -604 191 1627
6769A627j624m69J300j522o55J885p86m34J260q12k01J827j626j71PK8k52J109
$$ 1627 3 -466 834 -688 -1343 542 -244 -678 582 -230 -431 1396 -230 -401 -394 -366 -618 491
6787D91r7n18N66j542J145J064j78m00l92R10j450l28k78J517j096P55J37j088
$$ 491 394 -124 442 -1100 45 1109 931 531 139 1049 -401 -729 -1007 510 -586 169 306 -782
6805g82k99J102j550L6L80J810j708R06O41K92l0j201L93L96p13K85K29m38j318
$$ -782 -1081 21 -1529 -1493 -1113 697 -1011 -105 536 828 798 -403 -10 386 -327 -42 187 -251 -1569
6824a569J625r32J01l39N5K224j635J15j35J00R69r45J65j488J666Q28r89O26
$$ -1569 56 -876 -775 -1114 -1059 1165 -470 -355 -490 -390 579 -366 -201 -1689 -23 805 -184 442
6842D42n02J044j039p6R75p58N8J95o52Q25Q8j140J540r05k69L31r45L74k39J041
$$ 442 -60 984 -55 -131 844 86 144 339 -313 512 600 -540 1000 95 -174 157 -788 -414 -653 388
6862C88J21j001j51N79j211P80J436j94q38L17j617J758O1Q8m8j381j579L113
$$ 388 509 -492 -643 -64 -1275 -495 941 747 -91 226 -1391 367 428 516 468 -913 -2492 621
6880F21j519P35J70P25m99m56J261q40q11K07m17O53J53J155k646J179m57M91
$$ 621 -898 -163 7 732 233 -223 1038 198 -613 -406 -823 -170 -17 1138 -1508 -329 -786 -295
6898b95L43m8P89o19l87p84K174n26k10P9K76j785J977k163o18N07K873j583j557
$$ -295 48 0 789 170 -217 -1001 1173 647 437 516 792 -993 984 -1179 -1797 -1290 1583 0 -1557
6917a557J763n86k85Q90K61l67J7l07l28k5J562k613J827p02j39j76J564r56M55
$$ -1557 206 -380 -665 225 486 119 136 -171 -499 -524 1038 -1575 252 -450 -589 -765 799 -157 298
6936B98k5k39J683l668K575j383O25k33K77m92R41j231K628j709q97Q91r78M90
$$ 298 273 34 1717 -1951 624 -759 -134 -367 -90 -582 359 -872 1756 47 -850 41 -937 -447
6954d47j56J169q21O22m14P38j959J156K48J518j917L38O07m18K4m74J29l63O30
$$ -447 -603 566 -255 367 -47 691 -1268 -112 136 1654 -263 75 682 264 288 -186 -57 -420 210
6973B10j66p74J377j071K24M28l01N23j363O72M17O89j442J228l62o94Q29J73
$$ 210 44 -730 647 -424 -200 228 -73 450 -913 -241 176 865 -577 651 289 -405 424 597
6991E97j268R23l27J56k09J63N83q79J191k247J161K20N18o91L8K20L04p71r2
$$ 597 -671 252 -75 81 -128 35 618 -261 930 -1317 -156 64 582 -109 -71 149 453 -318 -410
7010d10o55J60O84M38r80P09j55j93J082l75p4K62j283J268j665P42J708j051
$$ -410 -1065 -905 -221 217 -763 -54 -209 -402 680 305 231 493 -790 478 -1187 -445 1263 212
7028B12n56l86M07K80l20J005p96K45Q03j459J226N85j283j4l66R70q5q16L0J36
$$ 212 -344 -730 -323 -43 -363 642 -154 91 894 -565 661 1246 -37 -51 -417 553 468 -348 -318 -182
7048a82r69N28O62Q04q16p1q4J009j476J236o29J598k594J551k71K37Q49k965
$$ -182 -1151 -623 39 843 27 -44 -128 881 -595 641 12 1610 -984 567 296 533 1382 -1583
7066a583J681O56j527K013o13j985K443n87L45m62j480n2J418n45J593j413k00
$$ -1583 98 754 -773 1240 627 -1358 1085 498 843 381 -1099 -1151 267 -278 1315 -98 -298
7083b98L66J85j138J087j58K09m35m76L89M75R2j40J87J42N94j689k42J368r76
$$ -298 68 253 -885 202 44 253 -182 -658 -269 206 298 158 345 487 1081 -608 -850 518 -458
7102d58k96N55K0P11j419O12mQ87j028J82Q2n95K56J586m50n31j27l17L20m65
$$ -458 -754 -199 -179 532 -887 -275 -279 608 -420 -238 -156 -751 -495 1091 641 110 -17 -334 -14 -479
7122d79L19m80J514l273L41L969k374k27M70j345J231M02M17j361l0O85m20K05
$$ -479 -160 -640 874 -2399 -2058 1911 -463 -690 -220 -1565 -334 68 485 -876 -906 -221 -641 -436
7140d36k21K451r85j158P48l51L68M5O19q13M01L91j007K71k9J39j526J414o40
$$ -436 -657 1794 809 -349 399 48 416 461 1080 267 668 1059 52 323 294 433 -1093 321 -319
7159c19j95J68J375j237R70k45k37k59p28J781j584L20O16N59j434R60K45j451
$$ -319 -514 -346 1029 -208 762 517 280 21 -707 1074 -510 -190 426 985 -449 511 756 -695
7177f95J480q38k21K21M68q70N13J556k304N99K73L75J69K72j426P80j146K48
$$ -695 785 -53 -274 -53 415 -455 58 1614 -690 -91 182 557 726 998 -428 352 -794 -546
7195e46O05J71o5M32l66j53p86l80Q46j35j61J018Q10j514J20N9j34M7j201J427
$$ -546 59 230 165 597 231 78 -708 -1088 -242 -377 -538 480 1290 -224 -104 -45 -179 -132 -1333 94
7215I4J50k4q38N35q24P44J201p67P38j46Q70j706m64k70J149q77m33J897k435
$$ 94 244 220 -618 -83 -907 -163 1038 271 1009 863 1733 27 -437 -707 442 -435 -868 1029 -1406
7234a406K019p90M3K29q9j585N32J645r42M24m58l8l98p13K358k487J489m49O53
$$ -1406 613 -177 -134 95 6 -1579 -1047 598 -344 80 -378 -416 -814 -1527 831 -1656 -167 -616 37
7253C7p96N69O04J4n22o13M42J146k054J517N74j322J421o76m03p62Q96p62J363
$$ 37 -759 -190 414 428 -94 -707 -265 881 -1173 344 918 -404 1017 341 -62 -824 72 -690 673
7272F73k52P53q56P62j506J689m29j21o26o98N78n59J196O9j13j204J863j371
$$ 673 421 1174 318 1080 -426 1263 834 713 87 -611 -33 -592 604 673 560 -644 1219 -152
7290a52m12K498k421M72K45n3P95Q51j626j034N7O55O62m19l04M7M37k10l6o55
$$ -152 -564 1934 -487 -15 230 177 972 1823 197 -837 -780 -125 537 118 -186 -139 298 88 52 -603
7310f03J040r04J308j029rKl3p33M46L49K00J078k41q50j234N42J04m11J283j56
$$ -603 437 -467 841 -188 -197 -195 -228 -961 -515 -166 34 1112 871 21 -1213 -671 -567 -978 305 149
7330A49n15L62p97j049J820j36L97j86r47P34L79Q40k250J743k057J379j456J108
$$ 149 -366 -4 -801 -1850 -30 -166 231 45 -902 -168 211 1051 -1199 544 -1513 -134 -1590 -482
7348d82J315q44k34J141k411J975j467J710j26m25q40J180J90r27o03j74O91R26
$$ -482 833 -11 -245 896 -1515 460 -1007 703 577 152 -688 492 682 -245 -848 -1022 -331 595
7366E95L00j018J040j409q6j5R49j493J723j489Q62k63l23Q10m66j077l45L792
$$ 595 895 -123 917 -492 -578 -593 356 -1137 586 -903 -41 -304 -627 183 -283 -1360 -1705 2087
7384B087k171K4K55q10N11q47J247m53K72j222O18P94m78m36N00J212j722Q54
$$ 2087 -84 -60 195 -615 -104 -951 296 -157 115 -1107 -489 305 -173 -609 -109 1103 -619 235
7402B35k42N94j240P33j131J397K3K8P51j464L64j61m95j078J683Q20l109L077
$$ 235 -7 587 -653 80 -1051 346 369 397 1148 -316 48 -113 -608 -1686 -3 817 -2292 785
7420G85r44M37m84J074o29m99P17n61m3Q1l18J340j481R76O9r7m3p03J548j573
$$ 785 -159 278 -206 868 239 -260 457 -104 -147 -66 -384 956 -525 451 520 423 380 -323 1225 -348
7440c48o32l07J427L91p02j42l36J815j334J78K577k957P83j897Q36J188k72J63
$$ -348 -980 -1287 140 531 -171 -313 -649 1166 -168 10 2587 -370 413 -1484 -648 540 268 431
7458D31q73l5q61K360j287J296p05j354J261p99R10l75m50J126l16q96J369j39
$$ 431 -442 -477 -1338 1022 -265 1031 326 -1028 233 -566 344 -31 -481 645 329 -567 802 663
7476F63Q5j042Q5k17m0J230j261M63J43Q51l09r60J33j46K39O61j929J631j224
$$ 663 748 -294 -209 -426 -466 764 -497 -34 109 960 651 -309 -176 -322 -83 578 -1351 280 -944
7495i44K36N32k83N1O66j003q56J701N51o44J144n45J271j887J219j756J002j182
$$ -944 -708 -176 -459 -408 258 -745 -1601 100 651 7 1151 606 1877 -10 1209 -547 455 -727
7513g27J044J531j712J4M13N10o62L29k360K432j94j212o4q88NJ174J396j666
$$ -727 317 1848 136 150 563 1073 411 740 -1620 812 618 -594 -658 -1546 -1541 -367 1029 -637
7531f37J208l06n26j93m33J212q37J155r0j401J5p13K292r31j257J586N51k081
$$ -637 571 265 -261 -454 -887 325 -512 643 553 -848 -833 -1546 746 -185 -1442 144 695 -1386
7549a386N77J669m77j095P54O1N61n59r6M29m50l20J228k117J768P89j793j405
$$ -1386 -809 860 383 -712 42 103 664 105 9 438 -12 -332 896 -1221 547 1336 -457 -1862
7567a862K482M01Q62j480p59O51k68L3J05n70j079J712J209k804M48J269q64j021
$$ -1862 620 1021 1883 403 -356 295 27 60 165 -405 -1484 228 1437 -1367 -919 350 -514 -1535
7585a535P73l36MQ31L22J82N08k366J700o85Q90q68K084j117p33P41k336L232
$$ -1535 -762 -1098 -1094 -263 59 241 749 -1617 83 -602 288 -580 1504 387 -346 395 -1941 1291
7603A291j323L97m04J396r72m86j20n7L44r30J178Q20j460R41j011M54J30L86
$$ 1291 -32 365 -39 1357 385 -101 -221 -278 66 -864 314 1134 -326 615 -396 58 188 574
7621E74m02j492M88J203l47k69J036m91k52P52k59j511J092l34J335j722j56O92
$$ 574 172 -1320 -832 371 24 -245 791 300 48 800 541 -970 122 -212 1123 -599 -755 -63
7639f3N42m5p21j37J101r2j833J984R04k424Q2J025j504K329q96J15O83p45m08
$$ -63 479 434 -287 -424 677 585 -1248 736 1640 -784 -702 323 -1181 1148 252 367 1050 305 -103
7658a03q31L62J030N78j785J75J981n54o30j466R25J36j166J571j69K1j261J466
$$ -103 -934 -572 458 1036 -749 -574 1407 853 223 -1243 -318 -182 -1348 223 54 75 -1186 280
7676B80l4K7R86j177j116J234L76l88n32N78L48q23M11m73J83L80m40M28O47j023
$$ 280 246 273 1259 82 -1034 200 576 188 -344 234 582 -241 170 -303 -120 260 -180 248 895 -128
7696a28N36l75N43O4m00L25o9j96l37k82K93K80J173j615M87j143J66K11M9N32
$$ -128 408 33 576 640 240 565 496 300 -37 -319 -26 254 1427 -188 299 -844 -678 -467 -418 114
7716A14J078j260L41k591K423j59j194k87K325j52q28N87l11j726K566k92K67
$$ 114 1192 -68 273 -2318 105 -54 -1248 -1535 790 638 -190 397 86 -1640 926 634 901
7733I01Q8k841L289j571Q34k235K615j984J097M03j395R58j001Q89Q13j025J42
$$ 901 989 -1852 1437 -134 700 -1535 1080 -904 193 596 -799 159 -842 47 860 -165 -23
7750b3j143K91J833l24j379M86l17J074l58j78p70J084N05j294m31R95r35J441
$$ -23 -1166 -875 958 634 -745 -259 -576 498 140 -38 -808 276 781 -513 -944 51 -884 557
7768E57j600J69N05n76J253O24O92k471J157M12n38O95j869L150k059q83J986
$$ 557 -1043 -874 -369 -945 308 932 1624 -847 310 722 184 879 -990 2160 101 -782 1204
7785A204j982J53J271j485J085P75j69j042P12n80J527N4j926J659q52n13j655
$$ 1204 -778 -625 646 -839 246 1021 852 -190 522 -58 1469 1523 -403 1256 404 -109 -1764
7802a764J888N74j449Q38k82N47L74p73l10p08k0J790N02j898J95o16J514l2q99
$$ -1764 124 698 -751 87 -195 352 726 -47 -357 -1065 -1085 705 1207 -691 -496 -1112 402 370 -529
7821e29J031R73j677J405k279J894k211J387Q20m79q30k020J929j157J411J31
$$ -529 502 1475 -202 1203 -1076 818 -1393 -6 814 335 -495 -2515 -586 -1743 -332 -201
7837b01K90J28l1j001q2N22j283K196m5r48L36L28j023J567l79L0R11k493Q17
$$ -201 89 217 186 -815 -897 -375 -1658 538 493 -455 -119 209 -814 753 374 404 1315 -1178 -361
7856c61L09J141k008J153j34o55J60q63J116J07q6n44K3Q15o65O02j50n24k69
$$ -361 -52 1089 -919 234 100 -555 -395 -1258 -142 -35 -121 -665 -642 173 -492 110 -40 -564 -833
7875h33P01j31k14r22J736J9o52J272j631J529l70j281J44Q87m72M2o37j79K026
$$ -833 -132 -263 -477 -1399 337 356 -296 976 -655 874 504 -777 -633 254 -218 -176 -813 -992 1034
7894A034j435J89k52q6P54k76j9k3j535J818K18m67r71R62j147J634k916K437
$$ 1034 -401 -212 -464 -550 204 -72 -91 -114 -1649 169 387 -80 -1051 -89 -1236 398 -2518 -81
7912h1J87j97k40R68q03J62p77j45J625p90N04j80J202j470o56K44J409o47o4
$$ -81 106 -91 -331 637 -166 -4 -781 -926 699 -91 413 233 1435 -35 -691 -447 962 315 251
7931B51j030N02J108j371j28K09L45N43j471K97J150o38j12k2J096o04j219P33
$$ 251 -779 -277 831 -540 -668 -459 -114 429 -1042 -745 405 -233 -345 -367 729 125 -1094 -361
7949c61p13J199Q67j687j08J835o01r94Q80J96q98M42K67k29o8J9L7M22r14R1
$$ -361 -1074 125 992 -695 -803 1032 431 -563 317 513 -385 57 324 95 27 46 83 505 -409 -318
7969c18k05P90j298J569j145J257m76N18N34j070j099J534l39j194J353j182R79
$$ -318 -523 267 -1031 538 -607 650 174 692 1226 156 -943 591 252 -942 411 -771 208
7986B08r04J417n53m6m7j873J943j334O67L85O52om34o22l39L77j172O23R19n70
$$ 208 -696 721 168 122 75 -1798 145 -1189 -522 -137 515 509 75 -547 -886 -509 -1681 -1058 -139 -709
8006g09K48J840j607L96q33R48j84R37j284J808j236r55O90M32mM2O47j961J053
$$ -709 -461 1379 -228 168 -665 283 99 1036 -248 1560 324 -631 59 491 487 529 1176 -785 268
8025B68j251M30J663r84K70m9j227J327l25m79R42o00N80J240k096R59J56j229
$$ 268 -983 -553 1110 126 396 347 -880 447 122 -357 585 -15 565 1805 -291 668 824 -405
8043d05n46P36M56j51l39n43J429j430k98n86J385N71n06J674j340N80j064p0
$$ -405 -951 -215 241 90 -249 -792 637 -793 -1091 -1677 -292 279 -227 1447 107 687 -377 -447
8061d47p11J106p48k97J004l52J162j064R32p2p2j33j200M00o2J212k051J214
$$ -447 -1158 -52 -800 -1097 -93 -445 717 -347 585 513 441 308 -892 -492 -554 658 -1393 -179
8079a79p97J102N21O42k162l68N36R96M2r38J231p42M77j50m08p62J17J881k163
$$ -179 -976 126 647 1289 -873 -1241 -705 291 333 -605 626 -116 361 211 -197 -959 -842 1039 -1124
8098a124P61J23n37R0P86l95O71j033J56K10O77k55j11o59K75k66r41L8J131P33
$$ -1124 -363 -240 -777 -687 99 -296 375 -658 -502 -292 385 130 19 -640 -365 -631 -1572 -1534 -403 330
8118C30r54K65k39n90N30J172j151L02k84m2j62J659j373l89J7P49J27J60j300
$$ 330 -624 -359 -598 -1188 -658 514 -637 -335 -619 -661 -823 836 -537 -926 -909 -160 -33 127 -1173
8137a173M14K802j897J172q23l7O66j748Q50M75j537M16Q12N34o00k5r55J577
$$ -1173 -759 2043 146 1318 495 458 1124 -624 226 701 -836 -420 392 926 326 301 -654 923
8155I23j434P58N72j321Q68p2O47o30j060J263m78o31J025k12n94M53R16m04m77
$$ 923 -511 247 819 -502 366 294 941 311 -749 514 36 -595 430 218 -376 77 993 589 112
8174A12L91j64q35K38P62j060P84k45P26k188K869k165Q70K75q66l51J021
$$ 112 503 339 -496 -258 504 -556 228 -17 709 -1479 1390 -775 95 370 -496 -847 174
8191A74
$$ Imaginary data points
##PAGE= N=2
##DATA TABLE= (X++(I..I)), XYDATA
0@%%%%%%%%%%%%%%%%%mR5j99K16k16K16k16K38l30M16m33M77n75O46p26Q28r34
$$ 0 0 0 0 0 0 0 0 0 0 0 0 0 0 0 0 0 0 -4 91 -108 108 -108 108 -108 130 -200 216 -217 260 -315 331 -395 433 -501
34e01J050j174J319j464J630j816K015k227K464k723L005l322L659m023M433m885
$$ -501 549 -625 694 -770 860 -956 1059 -1168 1296 -1427 1578 -1744 1915 -2108 2325 -2560
50b560N389n945O570p269Q062q974J0033j1286J2780j4603J6883j9848K3884k9717
$$ -2560 2829 -3116 3454 -3815 4247 -4727 5306 -5980 6800 -7803 9080 -10768 13116 -16601
64a6601L8971n6361O4737m75897M1267P68176j54379m44115R2741L30398j42947
$$ -16601 22370 -33991 30746 -445151 -403884 364292 209913 -234202 -141461 188937 45990
75D5990j68782J18687J16553j47229o2102J31921P7223j62217p1852J72073R1922
$$ 45990 -122792 -4105 112448 -34781 -96883 35038 112261 -49956 -121808 50265 142187
86A42187k17640p5119K56470N8387l05339j3843L18125k8652l15725P8239K81179
$$ 142187 -75453 -150572 105898 164285 -141054 -154897 163228 134576 -181149 -102910 178269
97A78269j06090k27550J17336J57218j03719r8184Q0321M7789m4135k5501J6809
$$ 178269 72179 -155371 -38035 119183 15464 -82720 -2399 45390 1255 -24246 -7437
108g437K5963j072m4777M713O3538k2714p5337N2265P6100q7099n7237J13015
$$ -7437 18526 17454 -27323 -22610 40928 18214 -57123 -4858 71242 -15857 -73094 39921
120C9921K5853j25190J0434J11704l4343q0242M7534L7574l9963k610J3227k1411
$$ 39921 65774 -59416 -48982 62722 28379 -51863 -4329 33245 -6718 -9328 3899 -17512
132a7512K9233K7415p1414j6097J04253j1778j16102M5436J03317p0795p4868
$$ -17512 11721 39136 -32278 -48375 55878 44100 -72002 -26566 76751 5956 -68912
143f8912Q1092L7441p2131m545N0413j5935k1726J9561l151p524J6466j8006j1457
$$ -68912 12180 49621 -22510 -27055 23358 7423 -14303 5258 2107 -5417 11049 -6957 -18414
156a8414M6266j5112o3218N4940O2602r2068m8291J23472J7205j39462K0296J33209
$$ -18414 27852 12740 -50478 4462 67064 -25004 -73295 50177 67382 -72080 -51784 81425
168H1425n1492j10051P1483P4813p1797m2016N7705J5130l0489n482O407J1161
$$ 81425 29933 -80118 -8635 66178 -5619 -47635 10070 25200 -5289 -10771 -4364 6797
180F797P569k6413q536M4839p137n8483L5573O0472o8915m4563R5917J7533j09534
$$ 6797 14366 -12047 -20583 24256 17119 -41364 -5791 54681 -14234 -58797 37120 54653 -54881
193e4881J7069J05483m9492q4074P0324N2795p7898j8514O6857j1076m3505K9961
$$ -54881 -37812 67671 18179 -65895 4429 57224 -20674 -39188 27669 16593 -26912 3049
205C049J4186l0785Q560J8007k0168J537J6625j4703m349K3970k1088j6218M3659
$$ 3049 17235 -13550 -4990 13017 -7151 -5614 11011 -3692 -8041 15929 -5159 -21377 22282
218B2282n284n4360L1322N1426n5640l6261P6572P419q3006K7110O9403n4482
$$ 22282 16998 -37362 -6040 45386 -10254 -46515 30057 37476 -45530 -18420 50983 -3499
230c499m5082P1722J4181p3361J4380O1554l4645m0777L9795J9610l1847m081
$$ -3499 -48581 23141 37322 -36039 -21659 39895 5250 -35527 4268 23878 -7969 -12050
242a2050J4145L92N722q491k0426K7713K2931n1042j2076O9383j0142p4007L2982
$$ -12050 2095 2487 8209 -282 -20708 7005 29936 -21106 -33182 36201 26059 -47948 -14966
255a4966O8726n6796m7657P1672J9156p3593Q937O0684l0408l6331L6249J4637
$$ -14966 53760 -3036 -50693 20979 40135 -33458 -24521 36163 5755 -30576 5673 20310
267B0310l2238M665J6641j3085M483P059k2904Q388L4738l0339l2041M9395J8694
$$ 20310 -11928 -7263 9378 -3707 776 7835 -15069 -6681 28057 -2282 -34323 15072 33766
280C3766o1878L596O1302k3757n0756M1055K7073m2819n391L4442j3925j5021
$$ 33766 -28112 -24516 36786 13029 -37727 3328 30401 -12418 -17809 16633 2708 -12313
292a2313K1915m882k1145K7394M640l7938J7987L3649l8814j9032N1752l794n3851
$$ -12313 9602 4720 -16425 10969 15609 -22329 -4342 29307 -9507 -28539 23213 19419 -34432
305c4432K8229M3144m1393k7737M6432P031l9732R699K4244j7871o238J5087j1335
$$ -34432 -6203 36941 -4452 -32189 14243 21274 -18458 -8759 15485 -2386 -8624 6463 -4872
318d872J789J8700k1432j6181M0559L028n1053J5373N4206m0200m0305N5127K1046
$$ -4872 -3083 15617 -5815 -21996 18563 21591 -29462 -14089 40117 -83 -40388 14739 35785
331C5785o1448l1N5325j7214m1548K8675K3189k6977q149J7828l910k077M015
$$ 35785 -25663 -25694 29631 12417 -29131 -456 22733 -4244 -12393 5435 1525 -552 3463
344C463j3742O609K5625k6312k3104M2486J4483n5091K079N9995k4377n2014M0968
$$ 3463 -10279 -3670 21955 -4357 -27461 15025 29508 -25583 -23504 36491 12114 -39900 1068
357A068L5848m8164j7823M9403l261l8906J7513J9953j7904n287J1671p050J545
$$ 1068 36916 -11248 -29071 20332 17071 -21835 -4322 15631 -2273 -7560 4111 -2939 -1394
370a394J2284j6958q392L2089r474l3374K5509K9454m0464j6524M8123k82m6400
$$ -1394 10890 -6068 -14460 17629 8155 -25219 290 29744 -10720 -27244 20879 20597 -25803
383b5803J7852L1863k6838j4396K7328k003j9979J4805M708j8790J3704J1552
$$ -25803 -7951 23912 -2926 -17322 10006 8003 -11976 2829 7537 -11253 2451 14003
395A4003k5816l11L3051j8878k7084L4339J2993l9765K048M0063j9217l2225L0673
$$ 14003 -11813 -12124 20927 2049 -25035 9304 22297 -17468 -15420 24643 5426 -26799 3874
408C874J6722l3318O37K5649j0940j0531J2153m778p130J4200j265j8949J5062
$$ 3874 20596 -12722 -12085 13564 2624 -7907 4246 -532 -7662 6538 5273 -13676 1386
421A386J7050l0027n357L7598j0588l5608K5107K3699l4746p345L5531p915k8455
$$ 1386 18436 -11591 -16948 20650 10062 -25546 -439 23260 -11486 -18831 16700 8785 -19670
434a9670J9268J7288k6013m73K1560j0321j2406J7304j262j8238J7729O441k3694
$$ -19670 -402 16886 -9127 -9600 11960 1639 -10767 6537 5275 -12963 4766 11207 -12487
447a2487N623K5621j9456j9229L0026N042l0330P542K3541j8488j1354K3355l908
$$ -12487 -6864 18757 -699 -19928 10098 15140 -15190 -7648 15893 -2595 -13949 9406 5498
460E498j8697J5454P749j9787N883J7759j8920p253K5343l736k9961K0791J9369
$$ 5498 -13199 2255 10004 -9783 -3900 13859 -5061 -12314 13029 9293 -20668 123 19492
473A9492k6641p679L1312q902k5197J7084J5170k1437k630K0289r730j1516J6701
$$ 19492 -7149 -14828 16484 7582 -17615 -531 14639 -6798 -9428 10861 1131 -10385 6316
486F316j898j4929J3410O617j9712N485J9646j7122j3087K6647Q09k9941J4476
$$ 6316 4418 -10511 2899 9516 -10196 -4711 14935 -2187 -15274 11373 12182 -17759 -3283
499c283K1960k3376j0436K5990p9k4736J1334J5168j7602n302J9463p519j1527
$$ -3283 18677 -4699 -15135 10855 10776 -13960 -2626 12542 -5060 -10362 9101 1582 -9945
512i945J5222K01j4863J0618J0896k1050R31K2763j2498k0087K3836Q500k7372
$$ -9945 5277 5478 -9385 1233 12129 -8921 -7990 14773 2275 -17812 6024 14524 -12848
525a2848N464K3984j4786j8782K3242M696k1746O999J4638j4943m014J7157q114
$$ -12848 -7384 16600 1814 -16968 6274 10970 -10776 -3777 10861 -4082 -8096 9061 947
538I47j1070J5896K022j8132P939J6591j8251q170K3883m450k2165J5903J3117
$$ 947 -10123 5773 7795 -10337 -2398 14193 -4058 -12228 11655 7205 -14960 943 14060
551A4060k1602j341J8023o007j4282J5502K945j7493P536J3498j6441j804J8449
$$ 14060 -7542 -8883 9140 3133 -11149 4353 7298 -10195 -2659 10839 -5602 -7406 11043
564A1043r611j4861J8831Q830k6649M508K3206j4733j6530K1215P393k2984L990
$$ 11043 1432 -13429 5402 14232 -12417 -7909 15297 564 -15966 5249 12642 -10342 -6352
577f352J8016j2377q422J4677k038r357Q762J953j3876R849R156j6885j668J9702
$$ -6352 11664 -713 -9135 5542 3504 -5853 2909 4862 -9014 835 9991 -6894 -8562 11140
591A1140p801j9383J9593J0494k3857r90K4953j0615j8263J7438J0205k2122K006
$$ 11140 3339 -16044 3549 14043 -9814 -10804 14149 3534 -14729 2709 12914 -9208 -7202
604g202J6775p758r871J2367R81j2511Q286N441j1606L040R933r805p223J7319
$$ -7202 9573 1815 -8056 4311 5292 -7219 1067 6508 -5098 -2058 7875 -1930 -9153 8166
618H166j841j8146J1789J3119j8809m342J9468m413j7944J4603Q714j7122j197
$$ 8166 6325 -11821 -32 13087 -5722 -10064 9404 4991 -12953 1650 10364 -6758 -7955
631g955J7127r575r157J5482j61j5236J0035Q733j5401q61J6152o651j3228J4906
$$ -7955 9172 -403 -9560 5922 5761 -9475 560 9293 -6108 -6969 9183 2532 -10696 4210
645D210N320j8039L464J6099j3089o703J5378k108j2951Q902O315j2608J234J3160
$$ 4210 9530 -8509 -5045 11054 -2035 -8738 6640 4532 -8419 483 6798 -5810 -4576 8584
659H584q687q735J3545J618j6387Q763J1526j3561o455J7896l864j6115J3391
$$ 8584 -103 -8838 4707 6325 -10062 -1299 10227 -3334 -9789 8107 4243 -11872 1519
672A519P519j5435Q1J4855p880q214J1703N50j0734O119P574j2350l2J2272q044
$$ 1519 9038 -6397 -6316 8539 659 -7555 4148 4698 -6036 83 7657 -4693 -4725 7547 -497
687d97r054J4897K926j7120M963J5875j3290r404J6824n4j5485P506J0598j2141
$$ -497 -9551 5346 8272 -8848 -3885 11990 -1300 -10704 6120 6066 -9419 -1913 8685 -3456
701c456m177J3401l879q028J0236Q43j1223O426O157q665k729J3034o220j1245
$$ -3456 -7633 5768 1889 -6139 4097 4940 -6283 143 6300 -2365 -5094 7940 1720 -9525
715i525J1699N922j5192K521J5037r320j0805J2984L808j5313M483J1342r534
$$ -9525 2174 8096 -7096 -4575 10462 1142 -9663 3321 7129 -8184 -3701 7641 -1893
728a893m085J2057k769j0483R992K704j0608K025J0429q492o959J4235m38j2794
$$ -1893 -5978 6079 3310 -7173 2819 5523 -5085 -3060 7369 -1123 -8082 6153 5715 -7079
742g079O658Q723j2807k567J4535l297j1401Q182N346j0730J792Q964p926j934
$$ -7079 -421 8302 -4505 -7072 7463 4166 -7235 947 6293 -4437 -2645 6319 -1607 -3541
756c541P110k055p862Q589M294j1655J187J2010r675p437J4157P15j3846N694
$$ -3541 3569 1514 -6348 2241 6535 -5120 -3933 8077 -1598 -9035 5122 5837 -8009 -2315
770b315J0445j0327n396J2539j732j0092O675O271j0981K642O595n296m045Q334
$$ -2315 8130 -2197 -7593 4946 3214 -6878 -203 6068 -4913 -2271 4324 -972 -5017 3317
784C317p50r176O818O840j1990O47J1681o345q357R615N274j2465J278J1201p729
$$ 3317 2567 -6609 209 7049 -4941 -4294 7387 1042 -7315 2300 7574 -4891 -3613 7588 -141
799a41o688R581J318q544K276R437j0495j122Q211l445n845Q358O81r809P137
$$ -141 -6829 2752 4070 -4474 -2198 7239 -3256 -4378 3833 388 -5457 2901 3582 -6227 910
814I10M949p675m289J2216m509r113R084N346j0467K30J0383n508q013R367J524
$$ 910 5859 -1816 -6105 6111 1602 -7511 1573 6919 -3548 -3318 7065 1557 -6456 2911 4435
829D435q440K850N152n078j758P946n381m649Q560J873j1187L706Q261q354m183
$$ 4435 -4005 -1155 3997 -1081 -2839 5107 -274 -4923 3637 5510 -5677 -1971 6290 -2064 -6247
844f247J0802M73j3222P419P815r311k717Q289j646p636P304M443r470J691O668
$$ -6247 4555 5028 -8194 -775 7040 -2271 -4988 3301 1655 -5981 1323 5766 -3704 -2013 4655
859D655n345l482P601n3p855N757L819p213o23R028o230o944J0262P58r567L496
$$ 4655 -690 -4172 3429 3376 -4479 1278 5097 -2116 -2739 6289 59 -6885 3377 4135 -5432 -1936
875a936Q893p508m209Q714k0r881O818L044p404J422P084p100k926Q917j796q597
$$ -1936 6957 -551 -4760 3954 3934 -5947 871 3915 -3489 -2067 5017 -2083 -5009 3908 2112 -6485
891f485O392O572q603k521R753j771r519P987M047j0061J407P453n262l253O202
$$ -6485 -93 6479 -2124 -4645 5108 3337 -6182 1805 5852 -4209 -2802 4651 -611 -3864 2338
906B338N99p685L650P402r277q83Q619k430p972Q472J86o289J934O061p429k231
$$ 2338 2937 -4748 -1098 6304 -2973 -3856 4763 2333 -5639 2833 3019 -3270 -1336 4725 -2704 -4935
922d935Q668j590q150P824J684p035P49P143l576n204N658L996q798K168P016
$$ -4935 3733 2143 -6007 1817 3501 -3534 -2785 4358 782 -4422 1236 5232 -3566 -1398 5618
937E618p558k597Q672k474p442N670M710p601o24P962m697l910O226J216n908
$$ 5618 -1940 -4537 4135 1661 -5781 -111 4599 -3002 -3626 4336 -361 -4271 1955 3171 -2737
952b737K054L837m543j868N846j319p451Q314J596q098K146P397m685l333N390
$$ -2737 -683 3154 -1389 -3257 2589 1270 -6181 2133 3729 -4369 -2223 5174 489 -2844 2546
967B546n76o791L343N861o583k60P204l575o354N875L216o826K191N168o618j741
$$ 2546 1970 -4821 -1478 4383 -2200 -2460 4744 1169 -5185 690 3906 -2920 -729 4439 -2179 -3920
983c920P758k833m873M711K492o279J484M868k757n103N252K422p734M995M046
$$ -3920 3838 1005 -3868 843 3335 -2944 -1460 3408 651 -4452 800 3222 -4512 483 4529
998D529n901k662O537l24o575N083K073o930K163O956p097j396O491N70o226K148
$$ 4529 -1372 -4034 2503 2179 -4396 687 2760 -4170 -2007 4949 -2148 -3544 2947 3517 -2709 -561
1014e61N307o597q11N841j001n361M352L63l832O72N611m093j786M053k179m064
$$ -561 4746 -1851 -2662 3179 2178 -3183 1169 1532 -2300 -1628 3983 -110 -1896 2157 -22 -4086
1030d086M371L552o178n16P199k229o342O330l16n238K228M900m392k695O129
$$ -4086 285 3837 -2341 -2857 4342 2113 -4229 2101 1785 -3453 -1225 3675 -717 -3412 2717
1045B717j284m831L277L708n552j363O197k568k998M889J079o477K982M079n330
$$ 2717 1433 -3398 -121 3587 -1965 -3328 2869 301 -2697 2192 3271 -3206 -224 3855 -1475
1060a475j182N664k882l271M529K721m868q49M018k190j932L063J71l664J090
$$ -1475 -2657 3007 125 -3146 1383 4104 -764 -1613 2405 215 -1717 1346 1517 -2147 -1057
1075a057L544m563K24M917k252l699K919K100n270J933M616m387j666N251P8o868
$$ -1057 2487 -2076 -1852 3065 813 -2886 33 2133 -3137 -1204 3412 -975 -2641 2610 2688 -4180
1091d180L063K678l217K37M368k672l842M946O85n518L389L828n934q30O351k426
$$ -4180 -1117 1561 -1656 -1419 2949 277 -3565 1381 2066 -3452 -63 3765 -2169 -2999 3352 926
1107I26m382N328J50l420m08M881k904m022N049j33k142K85K327l502j297N860
$$ 926 -3456 1872 2022 -1398 -1806 3075 171 -3851 1198 1065 -1077 -792 1535 -1967 -3264 2596
1123B596j675l502M067M12l586q31M690k445j833L902k74m269L222K474m829j118
$$ 2596 921 -2581 1486 1898 -1688 -2519 2171 -274 -2107 1795 1521 -2748 474 2948 -1881 -2999
1139b999M979j267l253L499J600m446J292K842l062n32L450j204n146L983J926
$$ -2999 1980 713 -2540 959 2559 -1887 -595 2247 -815 -1347 2103 899 -4247 -264 1662
1154A662k818K98L502k286k645J990L271n784K381K873l145j350L409J88l070
$$ 1662 -1156 -858 2644 358 -2287 -297 2974 -2810 -429 2444 -701 -2051 1358 1546 -1524
1169a524J001K352l800J869K904k744j799L468J419o227M462L54k461j495M964
$$ -1524 -523 1829 -1971 -102 2802 58 -1741 1727 3146 -3081 1381 1735 -726 -2221 2743
1184B743l003j391K589J610l489M15K959k850n48K092M00k279L53K218l435R36
$$ 2743 -260 -1651 938 2548 -941 -526 2433 -417 -965 1127 1527 -752 -399 1819 -1616 -680
1200f80J179n72j894L507K12l700K198J412j697l116M865J0m318L354K011n772
$$ -680 499 -73 -1967 1540 1752 -1948 250 1662 -35 -3151 1714 1724 -2594 760 2771 -3001
1216c001J624K385j350j874K655P96k280K45K495k614q03L496k042k378J964L687
$$ -3001 -1377 1008 -342 -2216 439 1235 -1045 -800 1695 -919 -1722 1774 -268 -2646 -682 3005
1232C005m017N8K553k416j586L403j421j171L87M278j554k679K131L70m100L166
$$ 3005 -1012 -954 1599 -817 -2403 1000 -421 -1592 -1205 3073 1519 -1160 971 1341 -2759 407
1248D07J670l644M41M035k801l535N193o38l391K468K034l009J4K656k251j752
$$ 407 2077 -1567 -1126 2909 108 -3427 1766 1128 -2263 205 2239 -770 -756 1900 -351 -2103
1264b103K970Q93l793J090K463j857j462M330j664k586J555J756k276j882L874
$$ -2103 867 1760 -2033 -943 1520 -337 -1799 2531 867 -1719 -164 1592 -684 -2566 1308
1279A308k073j35K275M44m165K655J335k650j487M074r19l607K627J466k312O57
$$ 1308 -765 -900 1375 1819 -2346 309 1644 -1006 -2493 1581 662 -2945 -318 1148 -1164 -507
1295e07J925j160k080K969M48l202J084J701l852K005M041l761j541J570J958
$$ -507 1418 258 -1822 1147 1595 -1607 -523 1178 -2674 -669 3372 -389 -1930 -360 1598
1310A598k820m68K448j256m06J740n48l507L806P13k819M56K182q04j517J566
$$ 1598 -1222 -1690 758 -498 -904 836 288 -3219 587 1300 -1519 -1063 1119 315 -1202 364
1326C64J043l064J75L596k466j742K686J4j483K59L645l557M00L306l597j090
$$ 364 1407 -1657 -1482 2114 -352 -2094 592 606 -877 -618 3027 -530 -130 3176 -421 -1511
1342a511K846o01k527P53K552j947M72M26J99k528K184J642l921J032L397j867
$$ -1511 1335 734 -1793 -1040 1512 -435 37 463 662 -1866 318 1960 -1961 -929 2468 601
1358F01l678K844K271l592J641J636k370J96J448j187j102R52K289l572Q39J567
$$ 601 -3077 -233 2038 -1554 87 1723 -647 -451 997 -190 -1292 -340 1949 -1623 -784 783
1374G83j38j588J299l82j499K863m40j577N99J408m87k073L050P96m335J554K848
$$ 783 645 -943 356 -26 -1525 1338 898 -679 -80 1328 841 -1232 1818 2614 -1721 -167 2681
1391B681l219m40K234j211k853K692O30n36L94j85j05r94J418l36r54J20K461
$$ 2681 -538 -978 1256 45 -2808 -116 514 -22 372 187 82 -912 506 170 -784 -664 1797
1408A797k048k172L423j87m28j078L226k724L59P63q52j759L327r69j626R38J615
$$ 1797 -251 -2423 1000 813 385 -693 2533 -191 168 931 79 -1680 1647 678 -948 -10 1605
1425A605j159j105K084j104k420K628n62j085P54K542l102q79J537J125k678L255
$$ 1605 446 -659 1425 321 -2099 529 -33 -1118 -364 2178 -924 -1803 -266 859 -1819 1436
1441A436K45l356L3K925j080k100K046J170k106J87J752j880O50L93Jj641K759
$$ 1436 1681 -1675 -1642 1283 203 -1897 149 1319 -787 -600 1152 -728 -78 315 316 -1325 1434
1458A434j368j481K84K558j938n41J910o41j223J229J523k788K41O17Q13j518
$$ 1434 66 -1415 -1131 1427 -511 -1052 858 217 -1006 223 1746 -1042 -801 -184 629 -889
1474h89J350K66j943J627j156J026k76J324M0j533J89J33p8k37J708j538m35j26
$$ -889 461 727 -1216 411 -745 281 5 1329 1369 -164 25 158 80 -157 1551 13 -422 -548
1492e48K290k063r6J143q95q66J924k75j935K102j358R20j126K670j881K89M65
$$ -548 1742 -321 -417 726 -169 -1035 889 614 -1321 781 -577 343 -783 1887 6 295 760
1509G60r37p32K002q2n99k155L518p47j961J335K72j895J216J746j403l11J242
$$ 760 -177 -909 1093 1011 412 -1743 1775 1028 -933 402 674 -1221 -5 1741 338 27 1269
1526A269n75m58L24J339l364J197J545r60q38J21P36k040K172K174k634q43K109
$$ 1269 694 236 560 1899 -1465 -268 1277 317 -521 -400 336 -1704 468 2642 8 -835 1274
1543A274q89j847R42K188k328O55L8J79m21P08K09j905J503P97m08j508K084j482
$$ 1274 385 -1462 -520 1668 -660 -5 33 212 -209 499 708 -1197 306 1103 695 -813 1271 -211
1561b11q63J590N76k248J261R68M27j963O05N49j621K03J575p22j133J368Q48
$$ -211 -1074 516 1092 -1156 105 1073 1500 -463 142 691 -930 -727 848 126 -1007 361 1209
1578A209j287P8J290k009K91J185p94j145J692L47j595K062M18k586N99Rj7j268
$$ 1209 -78 0 1290 -719 -428 757 -37 -1182 510 857 -738 1324 1742 -844 -245 -236 -253 -1521
1596a521J465L26o94o46K569k554q98K878k29j464J091p74M21j284J481N1j153
$$ -1521 -56 270 -424 -1070 1499 -1055 -1953 925 696 -768 323 -451 -30 -1314 167 218 -935
1613i35J501Q95k101J058J108k316L34J790r89j678O52L41O33m46R35j657n49
$$ -935 566 1461 -640 418 1526 -790 -456 1334 345 -1333 -681 -340 293 -153 782 -875 -1424
1630a424R71K076k026l72J402j350j95M04l32j97K480q90j333R28J70j54j275
$$ -1424 -453 1623 -403 -775 627 -723 -918 -514 -846 -1043 1437 547 -786 142 312 158 -1117
1647a117J268k30p71K3J996j142k96J222j187P60j831J991O23k040J096O68j719
$$ -1117 151 -79 -850 -827 1169 27 -269 953 -234 526 -1305 686 1309 -731 365 1033 -686
1664f86n17J410l93j70J137j074m06J128l43p35m39J038r35N12K077j769m3M19
$$ -686 -1203 207 -186 -356 781 -293 -699 429 86 -649 -1088 -50 -985 -473 1604 -165 -208 211
1682B11R56j376N24L08j267J370j05m16j132J082J122r95j154N70R15j162K597
$$ 211 1167 -209 315 623 -644 726 621 205 -927 155 1277 282 -872 -302 613 -549 2048
1699B048k897q47K918j002o79J74K49L03k250K036r79p62J603k26Q65j300J386
$$ 2048 -849 -1696 1222 220 -459 -285 -36 267 -1983 53 -926 -1688 -85 -311 554 -746 640
1716F40j238j250J273O80o58M94l58N38n38k1J695j722k76J549j646M85J314l018
$$ 640 -598 -1848 -575 105 -553 -59 -417 121 -417 -438 1257 -465 -741 808 -838 -353 961 -2057
1734b057J025P07N59j25M95O51j501k94P44k22l37l04P09l93N35O86q05q90J506
$$ -2057 -1032 -325 234 109 604 1255 -246 -540 204 -18 -355 -659 50 -343 192 878 73 -817 689
1753F89k031O33k74Q70n09n59K458m79j890J723m18J09J47J853j702r84J001J9
$$ 689 -1342 -709 -983 -113 -622 -1181 1277 798 -1092 631 213 322 469 2322 620 -364 637 656
$$ [...]
8191H6
##END NTUPLES=NMR FID
##END=
