##TITLE=1H_SAM_22.BBSX1_pyr
 CDCl3, 8 sc, 
 6.5.2019
##JCAMPDX= 6.0         $$ Bruker NMR JCAMP-DX V2.0
##DATA TYPE= NMR FID
##DATA CLASS= NTUPLES
##ORIGIN= UXNMR, Bruker Analytische Messtechnik GmbH
##OWNER= root
$$ XWIN-NMR		Version 3.5
$$ Mon May  6 14:28:52 2019 Russian Standard Time (UT+4h)  she@DPX200
##.OBSERVE FREQUENCY= 200.1315
##.OBSERVE NUCLEUS= ^1H
##.DELAY= (6, 6)
##.ACQUISITION MODE= SIMULTANEOUS
##.ACQUISITION SCHEME= undefined
##.AVERAGES= 8
##.DIGITISER RES= 18
##SPECTROMETER/DATA SYSTEM= spect
##.PULSE SEQUENCE= zg30
##.SOLVENT NAME= CDCl3
##.SHIFT REFERENCE= (INTERNAL, CDCl3, 0, 15.7039)
##AUDIT TRAIL= $$ (NUMBER, WHEN, WHO, WHERE, WHAT)
$$ ##TITLE= Audit trail, XWIN-NMR		Version 3.5
$$ ##JCAMPDX= 5.01
$$ ##ORIGIN= Bruker BioSpin GmbH
$$ ##OWNER= she
$$ F:/spectra/data/she/nmr/H-F/1/audita.txt
$$ ##AUDIT TRAIL=  $$ (NUMBER, WHEN, WHO, WHERE, WHAT)
(   1,<2019-05-06 14:27:35.84 +0400>,<she>,<DPX200>,
      <created by zg, POWCHK disabled, PULCHK disabled
       configuration hash MD5:
       00 E9 B6 7A A2 85 ED C7 34 08 36 98 17 FE 4E 26
       data hash MD5: 16K
       86 11 66 CB 93 34 8D E5 49 D6 A4 67 1A 86 2E 8B>)
$$ ##END=
$$ 
$$ hash MD5
$$ 44 31 73 0F D1 72 29 A5 BE 68 41 04 A5 DF C4 CF
##$RELAX= 
##$RELAX= 
##$RELAX= 
##$RELAX= 
##$RELAX= 
##$RELAX= 
$$ Bruker specific parameters
$$ --------------------------
##$DU= <F:/spectra>
##$EXPNO= 1
##$NAME= <H-F>
##$PROCNO= 1
##$TYPE= <nmr>
##$USER= <she>
##$AMP= (0..31)
100 100 100 100 100 100 100 100 100 100 100 100 100 100 100 100 100 100 
100 100 100 100 100 100 100 100 100 100 100 100 100 100 
##$AQSEQ= 0
##$AQ_mod= 1
##$AUNM= <au_zg>
##$AUTOPOS= <>
##$BF1= 200.13
##$BF2= 200.13
##$BF3= 200.13
##$BF4= 200.13
##$BF5= 200.13
##$BF6= 200.13
##$BF7= 200.13
##$BF8= 200.13
##$BYTORDA= 1
##$CFDGTYP= 0
##$CFRGTYP= 5
##$CHEMSTR= <none>
##$CNST= (0..31)
1 1 145 1 1 1 1 1 1 1 1 1 1 1 1 1 1 1 1 1 1 1 1 1 1 1 1 1 1 1 1 1 
##$CPDPRG= <>
##$CPDPRG1= <>
##$CPDPRG2= <>
##$CPDPRG3= <>
##$CPDPRG4= <mlev>
##$CPDPRG5= <mlev>
##$CPDPRG6= <mlev>
##$CPDPRG7= <mlev>
##$CPDPRG8= <mlev>
##$CPDPRGB= <>
##$CPDPRGT= <>
##$D= (0..31)
0 1.2 0 0 0 0 0 0 0 0 0 0.03 0 0 0 0 0 0 0 0 0 0 0 0 0 0 0 0 0 0 0 0 
##$DATE= 1557138455
##$DBL= (0..7)
120 120 120 120 120 120 120 120 
##$DBP= (0..7)
150 150 150 150 150 150 150 150 
##$DBP07= 0
##$DBPNAM0= <>
##$DBPNAM1= <>
##$DBPNAM2= <>
##$DBPNAM3= <>
##$DBPNAM4= <>
##$DBPNAM5= <>
##$DBPNAM6= <>
##$DBPNAM7= <>
##$DBPOAL= (0..7)
0.5 0.5 0.5 0.5 0.5 0.5 0.5 0.5 
##$DBPOFFS= (0..7)
0 0 0 0 0 0 0 0 
##$DE= 6
##$DECBNUC= <off>
##$DECIM= 24
##$DECNUC= <off>
##$DECSTAT= 4
##$DIGMOD= 1
##$DIGTYP= 9
##$DL= (0..7)
0 120 120 120 120 120 120 120 
##$DP= (0..7)
150 150 150 150 150 150 150 150 
##$DP07= 0
##$DPNAME0= <>
##$DPNAME1= <>
##$DPNAME2= <>
##$DPNAME3= <>
##$DPNAME4= <>
##$DPNAME5= <>
##$DPNAME6= <>
##$DPNAME7= <>
##$DPOAL= (0..7)
0.5 0.5 0.5 0.5 0.5 0.5 0.5 0.5 
##$DPOFFS= (0..7)
0 0 0 0 0 0 0 0 
##$DQDMODE= 0
##$DR= 18
##$DS= 0
##$DSLIST= <SSSSSSSSSSSSSSS>
$$ [...]
##$SUBNAM2= <"">
##$SUBNAM3= <"">
##$SUBNAM4= <"">
##$SUBNAM5= <"">
##$SUBNAM6= <"">
##$SUBNAM7= <"">
##$SUBNAM8= <"">
##$SUBNAM9= <"">
##$SW= 24.9337058887773
##$SWIBOX= (0..15)
0 0 2 0 0 0 0 0 0 0 0 0 0 0 0 0 
##$SW_h= 4990.01996007984
##$TD= 16384
##$TD0= 1
##$TE= 0
##$TE2= 300
##$TE3= 300
##$TEG= 300
##$TL= (0..7)
0 120 120 120 120 120 120 120 
##$TP= (0..7)
150 150 150 150 150 150 150 150 
##$TP07= 0
##$TPNAME0= <>
##$TPNAME1= <>
##$TPNAME2= <>
##$TPNAME3= <>
##$TPNAME4= <>
##$TPNAME5= <>
##$TPNAME6= <>
##$TPNAME7= <>
##$TPOAL= (0..7)
0.5 0.5 0.5 0.5 0.5 0.5 0.5 0.5 
##$TPOFFS= (0..7)
0 0 0 0 0 0 0 0 
##$TUNHIN= 0
##$TUNHOUT= 0
##$TUNXOUT= 0
##$USERA1= <user>
##$USERA2= <user>
##$USERA3= <user>
##$USERA4= <user>
##$USERA5= <user>
##$V9= 5
##$VALIST= <valist>
##$VCLIST= <CCCCCCCCCCCCCCC>
##$VD= 0
##$VDLIST= <DDDDDDDDDDDDDDD>
##$VPLIST= <PPPPPPPPPPPPPPP>
##$VTLIST= <TTTTTTTTTTTTTTT>
##$WBST= 1024
##$WBSW= 4
##$XGAIN= (0..3)
0 0 0 0 
##$XL= 0
##$YL= 0
##$YMAX_a= 182728
##$YMIN_a= -207866
##$ZGOPTNS= <>
##$ZL1= 120
##$ZL2= 120
##$ZL3= 120
##$ZL4= 120
##$ABSF1= 10
##$ABSF2= 0
##$ABSG= 5
##$ABSL= 3
##$ALPHA= 0
##$AQORDER= 0
##$ASSFAC= 0
##$ASSFACI= 0
##$ASSFACX= 0
##$ASSWID= 0
##$AUNMP= <proc_1d>
##$AZFE= 0.1
##$AZFW= 0.1
##$BCFW= 1
##$BC_mod= 2
##$BYTORDP= 1
##$COROFFS= 0
##$CY= 11.3945322036743
##$DATMOD= 1
##$DC= 2
##$DFILT= <>
##$DTYPP= 0
##$F1P= 18.9103706918063
##$F2P= -1.10871071338519
##$FCOR= 0.5
##$FTSIZE= 0
##$FT_mod= 4
##$GAMMA= 1
##$GB= 0.15
##$INTBC= 1
##$INTSCL= 1
##$ISEN= 128
##$LB= 0.24
##$LEV0= 0
##$LPBIN= 0
##$MAXI= 10000
##$MC2= 0
##$MEAN= 0
##$ME_mod= 0
##$MI= 1.114404
##$NCOEF= 0
##$NC_proc= 0
##$NLEV= 6
##$NOISF1= 3.799351
##$NOISF2= 2.8
##$NSP= 1
##$NTH_PI= 0
##$NZP= 0
##$OFFSET= 15.70392
##$PC= 1
##$PHC0= -8859.461
##$PHC1= 21.60026
##$PH_mod= 1
##$PKNL= yes
##$PPARMOD= 0
##$PSCAL= 0
##$PSIGN= 0
##$REVERSE= no
##$SF= 200.130013532006
##$SI= 16384
##$SIGF1= 3
##$SIGF2= 2
##$SINO= 400
##$SIOLD= 16384
##$SREGLST= <1H.CDCl3>
##$SSB= 0
##$STSI= 0
##$STSR= 0
##$SW_p= 3612.71676300578
##$SYMM= 0
##$S_DEV= 0
##$TDeff= 0
##$TDoff= 0
##$TI= <>
##$TILT= no
##$TM1= 0
##$TM2= 0
##$TOPLEV= 0
##$USERP1= <user>
##$USERP2= <user>
##$USERP3= <user>
##$USERP4= <user>
##$USERP5= <user>
##$WDW= 1
##$XDIM= 8192
##$YMAX_p= 0
##$YMIN_p= 0
$$ End of Bruker specific parameters
$$ ---------------------------------
##NTUPLES= NMR FID
##VAR_NAME=  TIME,          FID/REAL,        FID/IMAG
##SYMBOL=    X,             R,               I
##VAR_TYPE=  INDEPENDENT,   DEPENDENT,       DEPENDENT
##VAR_FORM=  AFFN,          ASDF,            ASDF
##VAR_DIM=   8192,          8192,            8192
##UNITS=     SECONDS,       ARBITRARY UNITS, ARBITRARY UNITS
##FACTOR=    0.0002004,     1,               1
##FIRST=     0,             0,               0
##LAST=      1.6414764,     0,               0
##MIN=       0,             -207866,         0
##MAX=       1.6414764,     182728,          0
$$ Real data points
##PAGE= N=1
##DATA TABLE= (X++(R..R)), XYDATA
$$ [...]
2339A318J75l964L72L655n61l103p5L600o9l260j13L295K7k980l16K983M61l040
$$ 1318 1493 -2471 -2099 1556 995 -2108 -2183 1417 1348 -1912 -2025 1270 1297 -1683 -1999 984 1445 -1595
2357a595n09L018Q92k974r58K886J230k917j242K834J452k769j293K590J792l242
$$ -1595 -2104 914 1806 -1168 -2126 760 1990 -927 -2169 665 2117 -652 -1945 645 2437 -805
2373h05j401L066J753l061j561L151J457k912j849L067J914l362j849K984K540
$$ -805 -2206 860 2613 -448 -2009 1142 2599 -313 -2162 905 2819 -543 -2392 592 3132
2388C132l338k238L514K201l342k282L455K124l130k491L457K179l453j885K945
$$ 3132 -206 -2444 1070 3271 -71 -2353 1102 3226 96 -2395 1062 3241 -212 -2097 848
2403H48K201k882k365L231J789l049j639K460K335k703k187K687J730k217k231
$$ 848 3049 167 -2198 1033 2822 -227 -1866 594 2929 226 -1961 726 2456 239 -1992
2418a992K321K172k281k328K196K072j335k449J515K318j758k441J543K585j817
$$ -1992 329 2501 220 -2108 88 2160 825 -1624 -109 2209 451 -1990 -447 2138 321
2433C21k367J387K574j324k692J116L004j717k619J178L010j128l542J416L271
$$ 321 -2046 -659 1915 591 -2101 -985 2019 302 -2317 -1139 1871 743 -2799 -1383 1888
2448A888j215l299J462L251j761l001J421L129j173l723J314L358j285l078J444
$$ 1888 673 -2626 -1164 2087 326 -2675 -1254 1875 702 -3021 -1707 1651 366 -2712 -1268
2463a268L241j419l356J175L404j183l347J146L080r18k789Q44K693p01k819R89
$$ -1268 1973 554 -2802 -1627 1777 594 -2753 -1607 1473 555 -2234 -1390 1303 602 -2217 -1228
2479a228K672r46k765P95K998n20k845K78L078n01k767L65K506K41k769J67K544
$$ -1228 1444 498 -2267 -1472 1526 1006 -1839 -1561 1517 1016 -1751 -1386 1120 1361 -1408 -1241 1303
2496A303P5k512l87L151N3k736n47L343L19k909r30K857J217l074r46L025Q80
$$ 1303 1378 -1134 -1521 1630 1683 -1053 -1600 1743 2062 -847 -1777 1080 2297 -777 -1723 1302 2182
2513B182l203m55L060O45l148j158L383J016l422o89L096J328l512r13L347J070
$$ 2182 -1021 -1476 1584 2229 -919 -2077 1306 2322 -1100 -1789 1307 2635 -877 -1790 1557 2627
2529B627l240r22K844R79k893j044L236O28k700j123L054Q11k952j043K618J274
$$ 2627 -613 -1535 1309 2288 -605 -1649 1587 2215 -485 -1608 1446 2257 -695 -1738 880 2154
2545B154k392j497K819J001k521j250K490J031k214j210K089J559k223j629K204
$$ 2154 -238 -1735 1084 2085 -436 -1686 804 1835 -379 -1589 500 2059 -164 -1793 411
2560D11J496k080j694K003J731k052j924J926J939j980j776J696K068j780k092
$$ 411 1907 -173 -1867 136 1867 -185 -2109 -183 1756 -224 -2000 -304 1764 -16 -2108
2575b108J409K245j666k072J774K247j988k289K024K098j467k505J627K112j374
$$ -2108 -699 1546 -120 -2192 -418 1829 -159 -2448 -424 1674 207 -2298 -671 1441 67
2590F7k451K023K227k004k107J491K373j568k186J185K856j872k688J876K560
$$ 67 -2384 -361 1866 -138 -2245 -754 1619 51 -2135 -950 1906 34 -2654 -778 1782
2605A782j783k326J575K377j649k093J221K445j354k287J483J997j230k051J259
$$ 1782 -1 -2327 -752 1625 -24 -2117 -896 1549 195 -2092 -609 1388 158 -1893 -634
2620f34J889m97k607J071K273j082j915Q15J888q6k278M38K324k41k695M03K513
$$ -634 1255 758 -1849 -778 1495 413 -1502 -687 1201 1115 -1163 -725 1599 1358 -1337 -934 1579
2637A579j87k687M95K432k11k636nK448L34k629j86L036k18k638J97K476K83k993
$$ 1579 1392 -1295 -800 1632 1421 -1215 -1220 1228 1562 -1067 -1253 1783 1565 -1073 -876 1600 1883 -1110
2655a110J10K656r1k556O1K510L96k757l11K854J54k621o91K981m3k113o54K645
$$ -1110 -1000 1656 1565 -991 -930 1580 1976 -781 -1092 1762 1916 -705 -1396 1585 1542 -571 -1225 1420
2673A420L06k726N9K436J14k161q55K506N78k731l06K490M60k263j031K340P65
$$ 1420 1726 -1000 -941 1495 1609 -552 -1407 1099 1677 -1054 -1360 1130 1590 -673 -1704 636 1401
2690A401k195m59J950N01j970o98K149O14k050j188K158J280j936j375K015J274
$$ 1401 -794 -1253 697 1198 -772 -1470 679 1293 -757 -1945 213 1493 -443 -1818 197 1471
2706A471j879j384J788J606k147j233J660J714k110j535J859J860k257j399K032
$$ 1471 -408 -1792 -4 1602 -545 -1778 -118 1596 -514 -2049 -190 1670 -587 -1986 46
2721D6J419j935j991K239J839j948j805K232J405j909k032K318J610j645j893
$$ 46 1465 -470 -2461 -222 1617 -331 -2136 96 1501 -408 -2440 -122 1488 -157 -2050
2736b050J984J605j889j701J825J854j729j893J640J624j673j579J876J673j298
$$ -2050 -66 1539 -350 -2051 -226 1628 -101 -1994 -354 1270 -403 -1982 -106 1567 269
2751B69j754J464J575j507j951J862J283r70j516R14J664p05k064R38K153j108
$$ 269 -1485 -21 1554 47 -1904 -42 1241 271 -1245 -331 1333 628 -1436 -498 1655 547
2767E47j736Q27K036r51j847O41K084r00j785O89K228q15k410O90K347o87j944
$$ 547 -1189 -362 1674 723 -1124 -483 1601 701 -1084 -395 1833 1018 -1392 -702 1645 958 -986
2784i86L26K046n11j976M57K447m60k509P36K311n76k518R52J887n05k188M91
$$ -986 -660 1386 875 -1101 -644 1803 1343 -1166 -430 1881 1305 -1213 -261 1626 1121 -1067 -576
2801e76K124p94j832M10K493m78k430O02K268p36k226J90K251k45k012j80K213
$$ -576 1548 754 -1078 -668 1825 1347 -1083 -481 1787 1051 -1175 -985 1266 1021 -991 -1171 1042
2818A042J21k055p5J902p5j887k40J963M41k055j81J837J24j752j43J382Q38j990
$$ 1042 1163 -892 -967 935 860 -1027 -1267 696 1137 -918 -1099 738 862 -890 -1033 349 1187 -803
2836h03o59J887M63j459q88J826P91k290o84K074R07k084o07J609P94j543j056
$$ -803 -1462 425 888 -571 -1459 367 1158 -1132 -1816 258 1165 -919 -1526 83 877 -666 -1722
2853a722K059Q10j974j465K369J225k059j328K510N39j963r75K144J258k129p74
$$ -1722 337 1147 -827 -2292 77 1302 -757 -2085 425 964 -999 -1974 170 1428 -701 -1475
2869a475J716Q46j630j127J765J261j674j357J712J346j594r59R68J533j720j263
$$ -1475 241 1087 -543 -1670 95 1356 -318 -1675 37 1383 -211 -1170 -202 1331 -389 -1652
2885a652J963R38j586q17J440Q73q18j460J298J051j071j249J099J267q27j464
$$ -1652 311 1249 -337 -1154 286 1159 341 -1119 179 1230 159 -1090 9 1276 449 -1015
2901a015J331R22q71r24L47K014j290j622J131J917j290j784J136J476o43j821
$$ -1015 316 1238 367 -557 -210 1804 514 -1108 23 1940 650 -1134 2 1478 835 -986
2917i86Q48J909q81k175J038J845q56j715O52K023j028j967J008J679o46j735
$$ -986 -138 1771 890 -1285 -247 1598 742 -973 -321 1702 674 -1293 -285 1394 748 -987
2933i87Q83J782j199j657P23K003q04j785K59K199o99j796P26J438m29j899Q21
$$ -987 -104 1678 479 -1178 -455 1548 744 -1041 -782 1417 718 -1078 -352 1086 657 -1242 -421
2950d21J529p25j593Q57J562p79j550M26J449p1j808M3J873l3k068J62J456K65
$$ -421 1108 383 -1210 -353 1209 430 -1120 -694 755 684 -1124 -1081 792 759 -1309 -1147 309 574
2968E74j648l66K113q4j688j04J405N12j759k26K090J40j932n12K060N4j564k98
$$ 574 -1074 -1440 673 589 -1099 -1203 202 714 -1045 -1271 819 959 -973 -1485 575 629 -935 -1233
2986a233J581M83k039l92K259J31k014n55K425M6j570m11J862K49j790l99J852
$$ -1233 348 831 -1208 -1600 659 790 -1224 -1779 646 692 -878 -1289 573 822 -968 -1367 485
3003D85M33j730m08J791M48j887m95J842N46j757j99J529L14j427p21J718L47
$$ 485 918 -812 -1220 571 1019 -868 -1363 479 1025 -732 -931 598 912 -515 -1236 482 829
3020H29j188r31J434J195j583o05J465N99j438n83J054Q79j013j081R88J258j202
$$ 829 -359 -1290 144 1339 -244 -849 616 1215 -223 -806 248 1127 114 -967 21 1279 77
3037G7q27J043J142j647q88J494J148j116j442J536Q83j231j131J114J213j011
$$ 77 -750 293 1435 -212 -1100 394 1542 426 -1016 520 1403 172 -959 155 1368 357
3053C57j247Q21J448j399j180J028J601j240j191J183J473j187j298R63J158r18
$$ 357 -890 -69 1379 -20 -1200 -172 1429 189 -1002 181 1654 467 -831 132 1290 372
3069C72j589J446J073p85j535J060J197j028j388Q22J627j002j116N04J531j185
$$ 372 -1217 229 1302 517 -1018 42 1239 211 -1177 -355 1272 270 -846 -342 1189 4
3085Dj108Q59J154q68j154O68J240m84j659N97J354m08j532N88J558o28j381L95
$$ 4 -1104 -245 909 41 -1113 -445 795 311 -1348 -751 603 195 -1337 -749 809 181 -1200 -805
3103h05J349j33j616L18J541R0j758K28J384o9j488r8J508j93j110O5J501k69
$$ -805 544 411 -1205 -887 654 744 -1014 -786 598 529 -959 -1057 451 258 -852 -787 714 445
3121D45j697j7J985O0j939Q1J669k71j586N46J399K64j909K8J648k44j307k10
$$ 445 -1252 -1269 716 776 -1163 -1082 587 316 -1270 -724 675 939 -970 -942 706 462 -845 -1055
3139a055J877k64j365n9J562J21j543N0J448K54j503m62J785J88j566k8J147N34
$$ -1055 822 558 -807 -866 696 817 -726 -676 772 1026 -477 -939 846 1034 -532 -560 587 1121
3157A121j543j90J164M89j410k04J310N47j571n08J570K92q93q03J261Q45j586
$$ 1121 -422 -612 552 1041 -369 -573 737 1284 -287 -795 775 1067 174 -629 632 1477 -109
3174a09o30J413N55j199n88R18P92r37r94J126Q60j254q41J433O74j373r15J645
$$ -109 -739 674 1229 30 -558 360 1152 215 -779 347 1207 -47 -888 545 1219 -154 -1069 576
3192E76P32j302j176J292J190j633m14J052J257j851p31J458R65j706o75J270
$$ 576 1308 6 -1170 122 1312 -321 -735 317 1574 -277 -1008 450 1415 -291 -966 304
3208C04Q94j544o19J137J060j370o07Q94N14o11p54M86R96j072q94J126R57r87
$$ 304 1198 -346 -965 172 1232 -138 -745 149 663 52 -702 -216 780 -292 -1186 -60 897 -90
3226i0r26O77J238j022q37M05J445n61q81j26J313m19j202M60R10m31j171R10
$$ -90 -1016 -339 899 -123 -960 -555 890 329 -552 -678 635 216 -986 -526 384 -47 -1218 -308
3244c08J197o68j280L55J629p93j447Q20J095l33j288M76J527m13j537J73J386
$$ -308 889 221 -1059 -704 925 132 -1315 -495 600 267 -1021 -545 982 569 -968 -795 591
3261E91k54j359M99J062j83j459N87J335o40j296N49J032j78j101J39J376K2j431
$$ 591 337 -1022 -523 539 356 -1103 -516 819 179 -1117 -568 464 286 -815 -676 700 722 -709
3279g09K12R44O5j286O14R86l36j134L43R34J8j206J29J472k90j028k99J342J46
$$ -709 -497 447 512 -774 -160 826 490 -644 -301 633 651 -555 -426 1046 756 -272 -571 771 917
3298I17j017k27J194j41j141q1J130L93j452q8J084P89j654l60J298L61j222o95
$$ 917 -100 -327 867 726 -415 -496 634 1027 -425 -513 571 1360 -294 -654 644 1005 -217 -912
3316i12J504M53j266m59J409M8r12o40J421O00j752l71J643L33j716l03J485K70
$$ -912 592 1045 -221 -680 729 777 -135 -775 646 1246 -506 -877 766 1099 -617 -920 565 835
3334H35j096p27J294M69r43r47J363M75j118q95J508O24j114p03Q82M35q29o38
$$ 835 -261 -988 306 775 -168 -1115 248 723 -395 -1290 218 842 -272 -975 -93 342 -487 -1125
3352a125J069Q73j374m04R40P20j026m63P60O05j005l82O82O78p33q79Q45Q07
$$ -1125 -56 817 -557 -961 -21 699 -327 -790 -30 575 -430 -812 -130 548 -185 -1064 -219 588
3370E88p77j102Q21J053p38j020R81Q44r62o82Q01O66m61q88L29J004o36p46M36
$$ 588 -189 -1291 -470 583 -155 -1175 -194 650 -312 -994 -193 473 12 -876 -547 457 -179 -925 -489
3389d89J152q07j066J175R94j219q58R06Q62o22j026O98J111p57r84P80J080n16
$$ -489 663 -144 -1210 -35 959 -260 -1118 -212 650 28 -998 -300 811 54 -930 -150 930 414
3407D14j176N23J102o14j260M70J537n11j141M78J100l20j148L20J129l16j001
$$ 414 -762 -239 863 249 -1011 -541 996 485 -656 -178 922 602 -546 -226 903 587 -414
3424d14K23J052l12r74J02J375m87q48J79O98M67j369r8J459k86j144J53Q08J62
$$ -414 -191 861 549 -425 -323 1052 565 -283 -104 594 1061 -308 -406 1053 767 -377 -224 584 746
3443G46j406N38J008j11r33K8J083j72r85m60J402j02j251O4J222M56j451k17
$$ 746 -660 -122 886 775 -158 -130 953 781 -204 -664 738 636 -615 -551 671 1127 -324 -541
3461e41J243n7j035j59R15L78j350K28J010j81r48J34P87K54j091m49J176n2q66
$$ -541 702 645 -390 -549 366 744 -606 -378 632 451 -497 -363 424 678 -413 -862 314 262 -604
3480f04j5R08J21q50l90J201J65j057m74J146L59j038k40R16O9r94p5Q26K87p63
$$ -604 -619 289 410 -440 -830 371 536 -521 -995 151 510 -528 -768 148 217 -777 -852 -26 261 -502
3500e02m05Q34N48r70n03J177L08q00n02L81Q48q35o57R77N32l98j052Q35P25
$$ -502 -907 -73 475 -495 -998 179 487 -313 -815 -434 414 -421 -1078 -101 431 33 -1019 -184 541
3519E41j018n92R77J152j305q14J050P57q81p24J181L59p11q10O95R42j101k18
$$ 541 -477 -1069 -92 1060 -245 -1059 -9 748 -133 -857 324 683 -28 -838 -143 799 -302 -520
3537e20P81L69l40r20O88P93q60p80J049M47q14k85Q58L60q71l75O10O81n07r46
$$ -520 261 630 290 -630 58 851 -9 -789 260 707 -107 -392 466 826 -45 -420 190 871 364 -582
3557e82O98N31j73n49Q8Q43k17j156O34M66j27p24J34R60l93m87J17M58q7q39
$$ -582 116 647 474 -75 13 856 639 -517 117 583 456 -268 -134 826 433 -54 63 521 434 -405
3577d05L48P64l49q09R4J119l74j119M49Q24n7j022M34O89k47p72j03J291j90
$$ -405 -57 707 358 -451 -357 762 388 -731 -282 542 485 -537 -103 586 339 -433 -536 755 565
3596E65j384O52O64j32j091M23O96N8j019J62J282m01j147M8R05j05j061J19J157
$$ 565 -819 -167 497 365 -726 -303 393 451 -568 -406 876 475 -672 -624 281 176 -885 -766 391
3615C91k04j012O68O59l59r06M39M77m1q24R7P14K8q70P2J211m12q44Q3Q59J83
$$ 391 187 -825 -157 502 143 -763 -324 153 112 -712 -615 99 127 -743 -671 540 128 -716 -633 226 409
3636D09q57k14R83P9j037J8O43M52p61k90Q06K39m80n44O24K35q88KN08P84r51
$$ 409 -448 -662 321 400 -637 -619 24 476 -285 -575 231 470 -10 -554 70 305 -583 -581 -73 711 -240
3657b40k47O66M42p97k20Q00J49r19l61J026N02j100m35J313J72p79q06J037L58
$$ -240 -487 179 621 -176 -396 404 553 -366 -727 299 801 -299 -734 579 751 -28 -834 203 561
3676E61o20k30N14K10j01n65N24P35j105m16O03P61p75j23K42Q11o81o59N63P17
$$ 561 -59 -289 225 435 334 -231 293 1028 -77 -493 110 871 96 -27 215 1026 345 -314 249 966
3696I66q02l43K42M82j28j230J274J37n87k84J89P60k45r80N18O34l20o93K54
$$ 966 164 -179 63 545 417 -813 461 598 11 -273 -84 676 431 -549 -31 603 283 -410 -156
3715a56J009l76j117M87R63n53q86P93N35n16n78L85O99n60p84L56R84n90q51
$$ -156 853 477 -640 -153 810 257 -629 164 699 183 -395 -10 689 129 -655 -299 685 95 -756
3734g56O80Q16m13r91L88P80l76q34L33Q26l88q45N32Q11m75q49M82O84k85j022
$$ -756 -76 740 327 -664 -276 504 128 -706 -373 453 65 -780 -248 563 88 -761 -279 405 120 -902
3754i02L99P49l70m20L0P40j56r25K55M51N6m79K7P57j77n21q3O21K45p35m23
$$ -902 -503 246 -124 -544 -514 226 70 -855 -600 -149 -93 -572 -545 212 35 -486 -569 52 297 -438 -861
3775h61Q99n8n93j65J140j5q45l11R54M32p57l50Q27K9r14N0Q78N7q39k56R62
$$ -861 38 -20 -613 -778 362 347 -498 -809 145 577 -180 -530 297 326 -588 -538 340 397 -442 -698 264
3796B64K2n84q1P36J53q44j93N32L50l73l35L13N93j007O0R33j79l63m91J031
$$ 264 286 -298 -379 357 510 -334 -527 5 355 -18 -353 -40 553 -454 -394 539 360 -3 -494 537
3816E37J05p98m13P41O12p34n24J182j78m60p7L27L51k12o60N69K33l27p16O52
$$ 537 642 -156 -569 172 784 50 -474 708 530 70 -7 320 671 459 -201 368 601 274 -442 210
3836B10N45p13k01N08N18r40m19O24P07o22p70N67N50m00o09L40O66n73o85P72
$$ 210 755 42 -159 349 867 -73 -492 132 839 217 -553 14 564 164 -445 -105 561 -12 -697 75
3856G5M60l32q16O92O17o54p80P79N85q78m22P13L22n07n88N52Q00o14p96O00
$$ 75 535 203 -613 79 696 42 -738 41 626 -252 -674 39 361 -146 -734 -182 618 4 -792 -192
3876a92P39o98m81O72J62n22l68K58O71m02n14J04Q21j55j136Q91L78m23n20N36
$$ -192 547 -151 -632 40 202 -320 -688 -430 241 -161 -675 -571 250 95 -1041 -150 228 -195 -715 -179
3896a79K73k69n11O48J5j80m55L65R59o26o52K29O20j50n99K37O76l24l86l81
$$ -179 94 -175 -686 -38 -23 -203 -658 -293 666 40 -612 -383 237 87 -512 -275 401 77 -309 -690
3916f90J086k22m65Q3Q53l37p29K45O09k58m68p3Q50l26q59M63R43j27r74O3P86
$$ -690 396 174 -291 -208 645 308 -421 -176 433 175 -293 -366 484 158 -701 -238 705 578 -396 -333 453
3937D53J16p01j3L56K38r31K85R32l68n86K08K92L27r75J34O60M0o33j60N14L48
$$ 453 569 -132 -145 211 449 -482 -197 735 367 -219 -11 281 608 -367 -233 427 467 -166 -326 188 536
3958E36q18L2M26J11l41k21M90N5k88m64M58L53l62k53Q60k77k99j30Q12m28k57
$$ 536 -282 -250 176 287 -54 -275 215 270 -18 -482 -24 329 -33 -286 574 297 -2 -132 680 252 -5
3979el84M93L84m01n63O92L98p11n30P73M08q18k46P79J46o37j67M57N24r72l48
$$ -5 -389 104 488 87 -476 216 614 -97 -627 146 554 -264 -510 269 415 -222 -389 68 592 -380 -728
4000g28P92Q6n30k60N86L65p33N5N46J19o32n62R70M27r34k67O60M08o10l64O23
$$ -728 64 150 -380 -640 -54 311 -422 -367 179 298 -334 -896 74 501 -433 -700 -40 368 -242 -606 17
4021A7L93r83J49J59N51p94j08K97M52J1p27M54M28k86o58K12P42l16o32K29O16
$$ 17 410 -573 -424 -265 286 -508 -616 -319 133 144 -583 -129 299 13 -645 -433 309 -7 -639 -410 206
4042B06j23m34k5J017n22o18J57P63n10j75k02P23l5o17m8N86J95r07M79Q11n97
$$ 206 83 -351 -376 641 119 -499 -342 421 -89 -264 -466 257 222 -395 -443 143 338 -569 -90 721 124
4063A24n06K82L22L0q36M08O73l05r16R37J39J08j008N01N45l27n1l38Q60k62
$$ 124 -382 -100 222 252 -584 -176 497 192 -724 213 352 460 -548 -47 498 171 120 -218 642 380
4083C80n90K5R15n36j66k82Q63n55j05j64P87O9q97K03L86J53o35K06M44k4o86
$$ 380 -210 -185 730 194 28 -254 609 54 -51 -215 572 641 -256 -53 333 486 -149 57 501 477 -209
4104b09K0M10L5o42L6Q86l28m17K17J86K80o41l57P76L34p99j92Q21P0j220J73
$$ -209 -189 221 256 -386 -350 536 208 -209 8 194 474 -167 -524 252 586 -213 -405 416 486 -734 -561
4125e61L44N76n92k75N56J45l77k98N77M10q36rK33L07n18n09J001Mo07j30N93
$$ -561 -217 359 -233 -508 48 193 -184 -482 95 505 -331 -340 -107 200 -318 -827 174 178 -429 -559 34
4146C4K89q95O8M75J62l90n6Q8M47n49k44M37L26l72k27L95K25m47n65R43J36
$$ 34 323 -572 -504 -29 133 -257 -313 -225 222 -327 -571 -134 192 -180 -407 -12 213 -234 -799 144 280
4167B80m06m68M90L73l29l48p1N91j88n29L00N84l13k86L53M33m75m48L10M01
$$ 280 -126 -594 -104 269 -60 -408 -479 112 -76 -605 -305 279 -34 -320 33 466 -9 -457 -147 254
4187B54l27l28L53M09l29l75J83N49j54m83M58N50o53l70M09L31n23k05M22N54
$$ 254 -73 -401 -48 361 32 -343 -160 389 235 -248 210 760 107 -263 146 477 -46 -251 171 725
4207G25m52n50K34O88l24o04Q4M78j62n62N18L06j29m26kO53l43k77J79M51k40
$$ 725 273 -277 -43 645 321 -283 -199 279 117 -445 73 379 250 -176 -178 475 132 -145 34 485 245
4228B45k34r6K36p7l39J13L12K09m43J73J88k21l91K95M59j71n77J65M61J49p78
$$ 245 11 -85 151 74 -265 -152 160 369 -74 99 287 66 -325 -30 429 258 -319 -154 307 456 -322
4249c22K97M33P7p48J34K33m0m70J45N56p9m91l90Q88j9o95lQ23l42m34r6P72
$$ -322 -25 408 485 -263 -129 104 64 -406 -261 295 216 -275 -665 223 204 -491 -494 329 -13 -447 -543 229
4271B29k83l59J57M00j30n70j10O41Qo76J04O08J49n71J06M40Lr39M65J99L12
$$ 229 -54 -413 -256 144 14 -556 -666 -25 -17 -693 -589 19 168 -403 -297 143 146 -793 -328 -129 183
4292A83o18J27M76o1l72n1K47M41o17K59L8M7m40k27O56J48j35p08N57K23n85
$$ 183 -435 -308 168 107 -265 -316 -69 372 -245 14 52 99 -341 -568 88 236 101 -607 -50 173 -412
4313d12j16O72Q5l19o37Q52Q1m28j89N86M04m44n96O29J88n30K4O33R2n14k73
$$ -412 -528 144 229 -90 -727 125 206 -222 -411 175 579 135 -461 168 356 -174 -150 483 575 61 -212
4334b12P27Q2p21j62M34K56n18m3L00L97o36J09K28O9j86k47L16J50m17n5M47
$$ -212 515 597 -124 -286 148 404 -114 -157 143 540 -96 13 241 310 124 -123 193 343 -74 -129 318
4355C18L48n68m88M71M75n7p78K64K22q4k86K99R4J04o53K37N06o50j87M14M93
$$ 318 666 98 -390 81 556 499 -279 -15 207 123 -163 136 230 334 -319 -82 424 -226 -413 1 494
4376D94n62j49LP20j68o73M7P64n32m19K32N58j15r09M38O37l19n84K55N24q0
$$ 494 -68 -217 -214 506 338 -335 -288 476 -56 -475 -243 315 200 -709 -271 366 47 -537 -282 242 162
4397A62p63K08N81k91m70K78N13m40k30K16M08j78m58J87L27m5k38l1L22j66l07
$$ 162 -601 -393 188 -103 -573 -295 218 -222 -452 -236 172 -6 -464 -277 50 5 -233 -264 58 -108 -415
4418d15O0O23O0m46j35L31J83k02k75K61J61m99P0L25j32j28M6L12L39o62RK3
$$ -415 -355 268 328 -118 -253 78 261 59 -216 45 206 -293 -223 102 -30 -158 -112 200 539 -123 -114 -91
4440i1K52Ql51M52m47J5k06N25L13m31k49M42O5l11j55M30J00m02j83N88M4r26
$$ -91 161 169 -182 270 -177 -162 -368 157 470 39 -210 232 297 -14 -169 261 361 -41 -224 364 408 -518
4462e18L01M84J27k28l20M91K39l35n62M66K18l26k27N81L34n37m59O23j23j75
$$ -518 -217 267 394 166 -154 337 576 241 -321 145 363 37 -190 391 725 188 -271 352 229 54
4482E4k19J76M83n30JJ69L71k28n53L95J48n5o0k5Q4m49J1L95N3n91J60Q7O62
$$ 54 -165 11 494 -36 -35 134 505 277 -276 119 267 212 152 127 211 -238 -227 168 221 -370 -210 -123 539
4505E39m75k92J68K53Qn34J47O72o23J9j43M12k08k06K5L36m3m25K20J58m0l90
$$ 539 64 -228 -60 193 201 -333 -186 486 -137 -118 -261 151 -57 -263 -238 98 55 -370 -150 8 -32 -422
4527d22L94K51j77m03L9N45l81l01L93K81j28n92O01k53J93m14M67K65l53j02
$$ -422 -28 223 46 -357 -318 227 -154 -455 -62 219 91 -501 100 -153 40 -374 93 358 5 -97
4547i7m1K00j69l35J10N49l07k40J76L82j08l28k1M27m86J73m65P48P0p88M45
$$ -97 -138 62 -107 -442 -332 217 -90 -330 -154 228 120 -208 -229 198 -288 -115 -580 168 238 -550 -105
4568a05J55q4j56j32O72k22k93q5L60qo53L37M15N7k62l31Q62m8k80j66L8N91
$$ -105 50 -34 -190 -322 350 128 -165 -250 110 102 -551 -214 201 258 -4 -335 527 479 199 33 71 662
4590F62p35q3M75N5o06k63R73l79m0l28N26j21l32K15N14j08q15K39N33J54n96
$$ 662 -73 -156 319 374 -232 -495 478 99 59 -269 257 136 -196 19 533 425 -390 -151 382 536 -60
4611f0O8J26L81p49K04K51J45o04K11M73N1l64j82L90l22qk90N57m1r6k70J4M15
$$ -60 8 134 515 -234 -30 221 366 -238 -27 446 497 133 -49 341 19 11 -279 278 237 141 -129 -115 300
4634C00j14m07L49J72m68L5j53M82l32k70L49J57k48n8K45k77J25m35M22L20n59
$$ 300 186 -221 128 300 -168 -133 -286 196 -136 -406 -57 100 -148 -206 39 -238 -113 -548 -126 194 -365
4655c65J73L93j54Rp04N86L72n04j64K80L51k83m41J18P49n60n1p4O61n05k05
$$ -365 -192 201 47 56 -648 -62 310 -194 -358 -78 273 -10 -451 -333 416 -144 -195 -269 392 -113 -318
4676c18K70K26k45j28J1J85j09l87N02P3n9j26M4J83mn62K17J56J67l76q4L97
$$ -318 -48 178 -67 -195 -184 1 -108 -495 7 80 21 -105 -61 122 118 -444 -227 -71 96 -280 -364 33
4698C3J3j20J15J56nl28q8O42l58n48O89k2k9m33mM19j00l66J16L78l2k9KJ03
$$ 33 46 -74 41 197 192 -136 -224 418 60 -488 201 179 150 -283 -287 132 32 -334 -218 160 128 99 101 204
4722B04o5k35p8O55l51j65l4M95k48m07L20O7K96o43K55qQ3o24N10N40m50m35
$$ 204 139 -96 -174 481 130 -35 -69 426 178 -229 91 158 454 -189 66 58 141 -483 27 567 117 -318
4744c18K69L48Pn28M66O9k9l88NK89L55o04m48P47jm04j34L82po43M43M47l49
$$ -318 -49 299 306 -222 244 313 284 -104 -99 190 545 -59 -507 240 239 -165 -299 83 76 -567 -124 323 -26
4767b6j85l8J63M49j71l46M11p6l29k59M26j61j8l18O53Pm83K5K50J69j67l59
$$ -26 -211 -249 -86 363 192 -154 257 181 -148 -407 19 -142 -160 -478 175 182 -301 -276 -26 143 -24 -383
4789c83N62k12k25j09N91L6m90l71N39L29l78o8j18M19p9m99K34K63Q3m26k4O75
$$ -383 179 -33 -258 -367 224 260 -230 -601 -62 267 -111 -179 -297 122 43 -456 -222 41 124 -302 -326 349
4811C49l52j74J38P8l12J32q6M51l95k5J55p3l6j60J35N96l22k46L63k06l06k42
$$ 349 -3 -177 -39 39 -273 -141 -227 224 -171 -196 -41 -114 -150 -310 -175 421 99 -147 216 10 -296 -538
4833e38P41N9j23k48K27J70l37j80L26O31p32r0P9M29j90m9k24M88m76k24M36
$$ -538 203 262 139 -109 118 288 -49 -229 97 728 -4 -94 -15 414 224 175 -49 439 -37 -261 175
4854A75k1N0m35L09L23j81j34P6L1j12J43j31P0n2M1k46M93j42n05K13L21k07
$$ 175 154 204 -231 78 401 220 86 162 193 81 224 93 163 111 152 -94 399 257 -248 -35 286 79
4876G9k08M26k31J32l22P8K21k19L1k9N81l79k20l05P36k05l10l6L01m8l75L02
$$ 79 -129 297 66 198 -124 -46 175 -44 -13 -42 539 160 -60 -365 371 166 -144 -180 121 73 -302 0
4898@M10m78k66M89N6L28q56J47L60j64k54mJ83K89l32q2q1J33j12k19O14j29
$$ 0 410 -68 -334 155 211 539 -317 -170 190 26 -228 -232 -49 240 -92 -174 -255 -122 -234 -453 161 32
4920C2k30k75L19Q0j88L9L67l57R4j03M06k36k94J15N53m33Q6j51K06K6k92j00
$$ 32 -198 -473 -154 -74 -262 -223 144 -213 -119 -222 184 -52 -346 -231 322 -111 -25 -176 30 56 -236 -336
4942c36N49k35r1r8n3M71m13j02L59L2k69K21j23J59k48R3L16p3p9m65K99L66
$$ -336 213 -22 -113 -211 -264 207 -206 -308 51 83 -186 35 -88 71 -177 -84 232 159 80 -385 -86 280
4964B80m98j27O66J20k95l86L44lj52j7J10Q9k19K87j59J43k78J7L69K18l94k74
$$ 280 -218 -345 321 441 146 -240 104 101 -51 -68 42 131 -88 199 40 183 -95 -78 291 509 115 -159
4986a59Q2L97k02P7p1Q4l08M3L25L6k45m93Q46l26j66k6K49J12l77L4L56qk78
$$ -159 -77 320 118 195 124 208 -100 -57 268 304 59 -434 412 86 -80 -106 143 255 -122 -88 268 260 -18
5009a8n0J60L70l72k26K00lj88l06M13M51n92Lk01N89j95j53J92M27l99l03L10
$$ -18 -68 92 462 90 -136 64 61 -127 -433 -20 431 -161 -158 -359 230 35 -118 74 501 102 -201 109
5031A09J84j43m59M45m25L49m17K13M03j4p59K36K2K39k38K21L82k78j09Q3j35
$$ 109 293 150 -309 136 -289 60 -357 -144 259 245 -514 -278 -256 -17 -255 -34 348 70 -39 44 -91
5052i1l16K63K8L79l10k00jK30N2j02Q1K74k95j44j82K44N3m08J42P25l01o35
$$ -91 -407 -144 -116 263 -47 -247 -248 -18 34 -68 13 287 -8 -152 -334 -90 -37 -445 -303 422 121 -514
5074e14K68K52K00l44Q4K71l46j72J81J03Q6J57n05N58j7m32L84l12L43k32M3
$$ -514 -246 6 206 -138 -54 217 -129 -301 -120 -17 69 226 -279 279 262 -170 214 -98 245 13 56
5095E6j18L88n39K3N28k12M2j86K04J13k88j17M4K50k10l38O18J63j18l54J89
$$ 56 -62 326 -213 -190 338 126 168 -18 186 299 11 -106 -62 188 -22 -360 258 421 303 -51 138
5116A38J4n1l62O69m4m45M3K03K15n20J58J98L25l78k42J1L88m61O7N86n0m78
$$ 138 152 101 -261 408 364 -81 -38 165 380 -140 18 216 541 163 -79 -68 320 -141 -74 512 462 -16
5138a6j75L88ol69j44M25J65n17L57K01l42O4k65L28P6l76P7j36M08k15j13N9
$$ -16 -191 197 191 -178 -322 103 268 -249 108 309 -33 31 -234 94 170 -206 -129 -265 143 -72 -185 -126
5160a26J03j16L6p0K72p2m81L01J22Oj15J77k57N7n7K79nMo8j80N64m59k77L27
$$ -126 -23 -139 -103 -173 99 27 -454 -153 -31 -25 -140 37 -220 -163 -220 59 54 58 -10 -190 374 -85 -362 -35
5184c5Q9m49J65j9M94k59j47J62K49o36R3J64K55j3o00N63m6L0j38K73Q6m33k81
$$ -35 54 -395 -230 -249 245 -14 -161 1 250 -386 -293 -129 126 113 -487 76 30 60 -78 195 281 -152 -433
5207d33L24K01J29l84j38M99k07m49K47M47k95k22N09l32Qj06J34J07J9k23J08
$$ -433 -109 92 221 -163 -301 198 -9 -458 -211 236 -59 -281 228 -104 -96 -202 -68 39 58 -165 -57
5228e7L6N1m87L70L39k55Pk78M04J79k45RJ90k45M8l65M15Q2n07K30L96p7l57
$$ -57 -21 30 -457 -87 252 -3 4 -274 130 309 64 73 263 18 66 -299 116 198 -309 -79 317 240 -117
5251a17o7L20K26l29M2J60j52k71L39J62P8k84m32O51k06j62M20k96J4j38P5O7
$$ -117 -184 136 362 33 75 235 83 -188 151 313 391 107 -325 326 120 -42 378 82 96 -42 33 100
5273A00nJ76l82J47N32o16J21l1K07m08L70j28o3m25P8J02J46j26q1J84N8K68
$$ 100 95 271 -111 36 568 -48 73 42 249 -159 211 83 20 -405 -327 -225 -79 -205 -286 -102 -44 224
5295B24m77N21r9o16J35K76k52K63k82N86l02k33qJ87P4l14J9J20P30n88l31p
$$ 224 -253 268 169 -447 -312 -36 -288 -25 -307 279 -23 -256 -264 -77 -3 -317 -298 -178 552 -36 -367 -374
5317c74L63k02j41J91K05qk89L4N17k24p3j14K4L19n33L50J68m25k08P83l61K3
$$ -374 -11 -213 -354 -163 42 34 -255 -221 296 72 -1 -115 -91 228 -305 45 213 -212 -420 363 2 25
5339B5k82n1N32k02k24L50j37R2n24N7O36j41mJ55j63j21m8K38J51k85m07J83
$$ 25 -257 -308 224 22 -202 148 11 103 -421 -364 272 131 127 282 119 -2 -50 188 339 54 -353 -170
5361a70N26k91r2LL84J71j41m59L1Rk19J00K90j25n4K15J00l00l3J2J41Lj03K51
$$ -170 356 65 -27 -24 360 531 390 -69 -38 -29 -248 -148 142 17 -37 178 278 -22 -55 -43 98 101 -2 249
5385B49j0K39k42n39L23O7l29J49N00j20k27j41L12k28q8J14J21j24o4J15k5m
$$ 249 239 478 236 -303 20 87 -242 -93 407 287 60 -81 231 3 -85 29 150 26 -38 77 52 48
5407D8j03j56L25j59p5j04L91n5m55L60l1Rk57K76J02N7k32J43J67j3l77Q0J71
$$ 48 -55 -211 114 -45 -120 -224 167 112 -343 17 -14 -5 -262 14 116 173 -59 84 251 238 -139 -59 112
5430A12K25m16k04L43mk91M0L05k09k72J83O23k80j85q1k39L28rj02O3J35j40
$$ 112 337 -79 -283 60 56 -235 -195 110 -99 -371 -188 435 155 -30 -111 -350 -22 -31 -133 -70 65 -75
5452g5k67J15N05k23j18P1O3M7m09N74k55K09o33L52J78l24O8M36m34J05k02K12
$$ -75 -342 -227 278 55 -63 8 71 118 -291 283 28 237 -396 -44 134 -190 -122 314 -120 -15 -217 -5
5474eL79n38J20J32j6j96K58j0m3k05r7J25L1J0l55N24j4R2m56N44j25J03l89
$$ -5 374 -164 -44 88 72 -124 134 124 81 -124 -221 -96 -65 -55 -410 114 100 192 -264 280 155 258 -131
5497a31M82k93O0J09K2j23R2j83j09J02Ln1R5J93o6l96K45O0j55j90L94k40p4
$$ -131 351 58 118 227 249 126 218 35 -74 28 31 -20 75 268 202 -194 51 111 -44 -234 160 -80 -154
5520a54K7o7M13j80pJ69J36j65n3m2M13l58l37K90M01k69o89M95J03l4k58j67
$$ -154 -127 -194 219 39 32 201 337 172 119 77 490 132 -205 85 486 217 -472 23 126 92 -166 -333
5542c33O23k83n14L89O6K10l34J21J53l29J09L0R5Q2J4l83M70M0m14q2K95k55
$$ -333 290 7 -507 -118 -52 158 -176 -55 98 -231 -122 -92 3 85 99 -284 186 226 -188 -270 25 -230
5564b30L4rK86n1j23K58L4j62k91K98p8K14k89j37M55k89J00k23q6J89k21j86
$$ -230 -196 -205 81 30 -93 165 199 37 -254 44 -34 180 -109 -246 209 -80 20 -203 -289 -100 -321 -507
5586e07L93K99l41R5J03J14p06M39M34k03k87J1N9K96o14L23L81k74M3m10L51
$$ -507 -114 185 -156 -61 42 156 -550 -111 323 120 -167 -156 -97 199 -415 -92 289 15 58 -352 -1
5607aJ02l59M03l20L31l39K17jj07k47J05J74L49k68O3L13l32l06J56K38k23K3
$$ -1 101 -258 145 -175 156 -183 34 33 -74 -321 -216 -42 307 39 102 415 83 -223 -67 171 -52 -29
5629b9K25P9m8k08r8L75J15m01P9n8N3k3Pj35J54J05k28K87q1j93j10L45K32l02
$$ -29 196 275 227 19 -79 296 411 10 89 31 84 61 68 -67 87 192 -36 251 170 -23 -133 212 444 142
5653A42j23j96LM46j54L7K41l18l21L77J55l52r3O7O6K45m45J52J05k40K13J64
$$ 142 19 -177 -174 272 118 155 396 78 -243 134 289 -63 -156 -89 -23 222 -223 -71 34 -206 7 171
5675A71R4k9k76P9O2J9k13Q2O0n2l91N08l4l66%Q7K97k13o0K83M2p7m46J45nL67
$$ 171 265 236 -40 39 101 120 -93 -11 49 -3 -394 114 80 -286 -286 -199 98 -115 -175 108 150 73 -373 -228 -233 134
5701A34m39j56R84n24l18p9N27Q7m02K73j54J87l08l20M50J32k05P7o9O0m1k17
$$ 134 -305 -461 523 -1 -319 -398 129 216 -186 87 -67 120 -188 -508 -58 74 -131 -54 -123 -63 -104 -321
5723c21L35r2K24j07o7q7l04m1L94L50k52K65k67K02m04j76K70J76k86L24P9o4
$$ -321 14 -78 146 39 -28 -115 -419 -460 -66 284 32 297 30 232 -172 -348 -78 98 -188 136 215 151
5745A51j25P4k9j1o8o0K5J99j44J08M65l96r0j60K81K17l22j04L30k83N6j34J06
$$ 151 26 100 71 60 -8 -68 -43 156 12 120 585 189 99 -61 220 437 115 11 341 58 114 -20 86
5768H6Q7l74L9pK81n6R9k20J87k55j32M58L63m59k77K29J69j4m44M10r1J03l45
$$ 86 173 -201 -162 -169 112 56 155 -65 122 -133 -265 193 556 97 -180 49 218 204 -240 170 79 182 -163
5791a63L33k87j0J43M0K19j6n25K25M28n19L2J00K05l43K28j03Q6K8j89j61O7
$$ -163 170 -117 -127 16 56 275 259 -266 -41 387 -132 -100 0 205 -138 90 -13 73 101 -88 -249 -182
5813a82m6K65k58K48k02Q9o3j55L1K0k8J78P9o0K25j15j76J87k08K44J55k40k71
$$ -182 -228 37 -221 27 -175 -86 -149 -304 -273 -253 -281 -103 -24 -84 141 26 -150 37 -171 73 228 -12 -283
5836b83K84j19J99Q6m00J85Oo9J40m40N62k90p9M9o8K5L27m05K3M1K14m9j80L06
$$ -283 1 -118 81 167 -233 -48 -42 -111 29 -411 151 -139 -218 -169 -237 -212 115 -290 -267 -226 -12 -61 -241 65
5860F5L18j11m02l0J54J65k67J91l76J60k7M75j37L7l88R5M26j06p49L30M66j96
$$ 65 383 272 -130 -160 -6 159 -108 83 -293 -133 -160 315 178 215 -173 -78 348 242 -507 -177 289 93
5882I3l94L0K67M49o86N6K03l7k9o0P08n00PQ7j26K52l80J71P2K39l92r9O54o27
$$ 93 -301 -271 -4 445 -241 -185 18 -19 -48 -108 600 100 107 194 68 320 -60 111 183 422 30 -69 585 -42
5906d2K9jJ45P2k23k5R0o2R4j59L04l54m07N91j33P9l04J4M54L4p6l5j66O1j43
$$ -42 -13 -14 131 203 -20 -45 45 -17 77 -82 222 -132 -539 52 -81 -2 -306 -292 162 196 120 85 -81 -20 -163
5931a63k14O16o0p36L81Q8P2l02J68l1K13k83J62J25j12P0j13N3R1j14k6J62q9
$$ -163 -377 239 179 -557 -176 -88 -16 -318 -150 -181 32 -251 -89 36 -76 -6 -119 -66 25 -89 -115 47 -42
5954d2k87l04M40L00m57K36J5J81j14j37L30k81l06R8K5J83k15K95k20K08J89
$$ -42 -329 -633 -193 107 -350 -114 -99 82 -32 -169 161 -120 -426 -328 -303 -120 -335 -40 -260 -52 137
5975A37l24n1K94n7l79L05K14j01p9k13L76m6m92K34M00k5k05j52L93j76Q6J45
$$ 137 -187 -238 56 -1 -380 -75 139 38 -41 -254 122 76 -416 -182 218 193 -12 -164 229 53 139 284
5997B84m42J62j96L72p0k43l4N5L20j38k25K80J4k01O4M83n8k96j87M5J25q3j07
$$ 284 -158 4 -192 180 110 -133 -167 -112 208 70 -155 125 139 -62 2 485 427 131 -56 -11 114 31 -76
6020g6J28m1j70L18l14L18L04l44j25L65k42j20j31J29K93n49K19J40q0K94j43
$$ -76 52 11 -159 159 -155 163 467 123 -2 363 121 1 -130 -1 292 -257 -38 102 22 316 173
6041A73J47j26k25j0J66n2l01l7O17l54R4R1J07l57j95M28k62K60j40M5o8L23
$$ 173 320 194 -31 -41 125 73 -228 -265 352 -2 92 183 290 -67 -262 166 -96 164 24 69 1 324
6063C24l18k8J82m52L27q0K94j82l97P3L26Jk11J33j57P3J22M3o7r1J01n27P75
$$ 324 6 -22 160 -292 35 -45 249 67 -330 -257 69 70 -141 -8 -165 -92 30 73 6 -85 16 -511 264
6086B64m49m7l3K03J21k89j20K83o0m27J61L34J24j97l33L08P8J64k59J92M3O8
$$ 264 -185 -232 -265 -62 59 -230 -350 -67 -127 -554 -393 -59 65 -132 -465 -157 -79 85 -174 18 61 129
6108A29j24l78N41l87L18j46K16l98j17K70M04k79k14k2L55k42j66M20J09o18
$$ 129 5 -373 168 -219 99 -47 169 -229 -346 -76 328 49 -165 -187 168 -74 -240 180 289 -329
6128c29o2L49J56j64k4k78O35m12m0J10K47l70Q0k0L51k32Q3K12j3k04P7j78K22
$$ -329 -391 -42 114 -50 -74 -352 283 -129 -169 -59 188 -182 -102 -122 229 -3 80 292 279 75 152 -26 196
6151A96j53o0L6j24L1j12K60R6k90k12M25q5K14k56r5K74K61n31Q6M63l06J11
$$ 196 43 -17 19 -105 -74 -186 74 170 -120 -332 93 8 222 -34 -129 145 406 -125 -39 424 118 229
6173B29j97J45j98q8O6M22j81k69J45j41K01l34J63K04j28K01m11J38J73k17J32
$$ 229 32 177 -21 -109 -43 379 198 -71 74 -67 134 -200 -37 167 39 240 -171 -33 140 -77 55
6194E5Q2J89q54N50J5r0l28N00l02N2j86K34M58k18k51L37k37J08k69k17Oq9K46
$$ 55 137 326 -528 22 37 -53 -381 119 -183 -131 -317 -83 375 157 -94 243 6 114 -155 -372 -366 -455 -209
6217b09j58L93K6l5k7q5n1o5J84k8P9l23N9O6J46J49j86N0L12k51j49N4L71m62
$$ -209 -367 26 52 17 -10 -95 -146 -211 -27 -55 24 -299 -240 -174 -28 121 -65 -15 297 46 -103 -49 322 -140
6241a40Kk13L94q6j37K36l69J19p0L28o4K5m2m0q5R0K9K11l39NK58j6J69p0O5
$$ -140 -138 -351 43 -43 -180 56 -313 -194 -264 64 0 25 -17 -57 -142 -52 -23 188 -151 -146 112 96 265 195 260
6266B60n73L95M3k35K18kl7j21K38J36l27j76M24o3k26K21J67m46N46o38L02R8
$$ 260 -313 82 125 -110 108 106 69 -52 186 322 -5 -181 243 180 -46 175 342 -104 442 -196 106 204
6288B04J74m24j4J63K15l28K24k97L50k51K26o2J7k22L21j2j77O4j61J91Pj48
$$ 204 378 -46 -60 103 318 -10 214 -83 267 16 242 180 197 -25 296 284 107 171 10 201 208 60
6310F0NL57p5n94J94J15j12Q8k85K37J81k20L9J69j25j05K5K22k87N2Q8J60l41
$$ 60 65 422 347 -247 -53 62 -50 38 -247 -10 171 -49 -10 159 34 -71 -46 176 -111 -59 29 189 -152
6333a52J41p6K68k17l25K59K1k9o8k8J34Mm0k76M52k99K39j83J26J7K64l23l4
$$ -152 -11 -87 181 -36 -361 -102 -81 -110 -178 -206 -72 -68 -108 -384 68 -231 8 -175 -49 -32 232 -91 -125
6356a25L19j15j35Q4N3m95L82J0K19l00K89k23L30m89l4N9K31P2m42L43J21l10
$$ -125 194 79 -56 28 81 -414 -32 -22 197 -103 186 -37 293 -196 -230 -171 60 132 -310 33 154 -156
6378a56R5rM04l43k77J15L88k32p5k4K71J51k55K79l49O4J27J70j15m9o9m8l9
$$ -156 -61 -70 334 -9 -286 -171 217 -15 -90 -114 157 308 53 332 -17 47 174 344 229 180 111 63 24
6401B4r5K75k46j10J71j29L32j84j29q6M05j85R1j46N54l20l47J98k70M78k03
$$ 24 -71 204 -42 -152 19 -110 222 38 -91 -177 228 43 134 -12 542 222 -125 73 -197 281 78
6422G8j45M1L06l10j6k0L14l79l07M72J88p8k23J19K5k02J83J99o3k07P8j23L66
$$ 78 -67 -26 280 -30 -46 -66 248 -131 -438 34 222 144 -79 40 65 -137 46 245 182 -25 53 -70 296
6445B96n41K79j57R9J81m14L71R0n55J77R1O6m5M9l3RJ87l12J48J69j60o2j77
$$ 296 -245 34 -123 -24 157 -257 114 204 -351 -174 -83 -17 -62 -13 -46 -37 150 -162 -14 155 -5 -67 -244
6468b44L35j63k52K11Q5M45n44j92L68J53k65J22j21l34J95K91J49p1j29K20k35
$$ -244 91 -72 -324 -113 -28 417 -127 -319 49 202 -63 59 -62 -396 -201 90 239 168 39 259 24
6489B4o4k92L53q0M7j31j75L25p4Q4q4L99o77J77PJ77K44l08l6L05l73L84l02
$$ 24 -40 -332 21 -59 -12 -143 -318 7 -67 17 -67 332 -345 -168 -161 16 260 -48 -84 221 -152 232 -70
6512g0K46J37o92L36j61L93m25L73Q3k61j30K52j66J03j9lo6j0J71k79L54k05
$$ -70 176 313 -379 -43 -204 189 -236 137 220 -41 -171 81 -85 18 -1 -4 -70 -80 91 -188 166 -39
6534c9k0o0J71N4M4K47j36k27J4K2J96m55J98K47k12k11J79j25K54q9j13j00N6
$$ -39 -59 -119 52 106 150 397 261 34 48 70 266 -189 9 256 44 -167 12 -113 141 52 -61 -161 -105
6557a05j30pP4L32J06k54k05M34Q1m09l15M71K3j31J58L5r7l4m8J37r1j78L8J63
$$ -105 -235 -242 -168 164 270 16 -189 245 326 -83 -398 73 96 -35 123 158 61 27 -21 116 25 -153 -115 48
6581D8j47Q6L16l69J89l55q8K47r4j37J13K45P6m38K47o8k86r3N57m6p5O1j25
$$ 48 -99 -13 303 -66 123 -232 -320 -73 -167 -304 -191 54 130 -308 -61 -129 -415 -508 49 3 -72 -11 -136
6604a36K66r3j7k10L8O7k66J16K34K41l89q5L98l07M8J87k87k9K46j13K11j37
$$ -136 130 37 20 -190 -152 -85 -351 -235 -1 240 -149 -234 164 -143 -95 92 -195 -224 22 -91 120 -17
6626a7k8k35j49L72l8K26m8K0m21L43J99m38K86k13j68K34p8R5J59J70j58m92
$$ -17 -45 -280 -429 -57 -95 131 83 103 -318 25 224 -214 72 -141 -309 -75 -153 -58 101 271 113 -379
6648c79K11j3K40m38N20N6l25p1J96M18k72n3O7R8k26l39M12J22j82qN9J42j3
$$ -379 -168 -181 59 -379 141 197 -128 -199 -3 415 143 90 157 255 29 -310 102 224 42 34 93 235 222
6671B22j37J92j44J31j48k26J90o0K02j62K4j0k50J30n5J44k19M29j58O3k77M2
$$ 222 85 277 133 264 116 -110 80 20 222 60 84 74 -176 -46 -101 43 -176 253 95 158 -119 -77
6693g7K18J09k71n4m6Q6J32j54J6o5j68K89J58k76J18r3mO3j6j41L28l33o2J79
$$ -77 141 250 -21 -75 -121 -35 97 -57 -41 -106 -274 15 173 -103 15 -78 -82 -19 -35 -176 152 -181 -243 -64
6717f4LL03m5m84M46q0N3k08j90K08l7L5Q6l8j68r2J73K09Q6j42J69k88J0j72
$$ -64 -61 242 197 -287 159 79 132 -76 -266 -58 -95 -60 26 -12 -180 -272 -99 110 196 54 223 -65 -55 -227
6741b27k5J88k05Q0Q8K8k02Q2K11j43J06l54J08M53k07K5j11J32P3j93J68j67
$$ -227 -252 -64 -269 -189 -101 -73 -275 -193 18 -125 -19 -373 -265 188 -19 6 -105 27 100 -93 75 -92
6763i2l8q2J90J02m0j18j28k9M49k94J89j01k66K54R0o3K22m15o3N4J28k7k8J99
$$ -92 -130 -212 -22 80 40 -78 -206 -235 214 -80 109 8 -258 -4 86 23 245 -170 -233 -179 -51 -78 -106 93
6787I3k1n6J97j10l44K73k33N41j82l63K42K9L9k24L61j50l2o1j26K95o5j30J77
$$ 93 72 16 213 103 -241 32 -201 340 158 -205 37 66 105 -119 242 92 60 -1 -127 168 103 -27 150
6810A50l28J62p2j6L54Pj20p8mJ99o6l44M21j97J8K5k20p1L32j43j88M18k00m39
$$ 150 -178 -16 -88 -104 250 257 137 59 55 254 188 -156 265 68 86 111 -109 -180 152 9 -179 239 39 -400
6834d00M31j17J58L7k3l12J56J14J93j57n70K91J90P2k08l3J25l9o3P1R6o3K59
$$ -400 31 -86 72 109 86 -226 -70 44 237 80 -490 -199 -9 63 -145 -178 -53 -92 -155 -84 12 -51 208
6857B08k08J23k92l1M34l16j64K10O0m2j87J78j99K04L6pl64p0Q11m48J08K4k59
$$ 208 0 123 -169 -200 234 -82 -246 -36 24 -18 -205 -27 -226 -22 14 7 -357 -427 384 -64 44 68 -191
6880a91k3K53p5L24j26l68K82k30K28R2l98K43j33J51j12L4r9K0K41K06l10j12
$$ -191 -214 39 -36 288 162 -206 76 -154 74 166 -232 11 -122 29 -83 -49 -148 -128 113 319 9 -103
6902a03J27P6K3k48P9N5po0K11m8r2q5K91m01K17j95M33m16O11m03q0K17r8K3
$$ -103 24 100 123 -125 -46 9 2 -58 153 105 13 -72 219 -182 35 -160 273 -143 468 65 -15 202 104 127
6926A27J93r0l13j2qK33kl20M05K43o07N81j63j37k13j78M65j64q0j45J11L21
$$ 127 320 230 -83 -95 -103 130 128 -192 213 456 -151 430 267 130 -83 -261 204 40 -40 -185 -74 247
6948B47r3j30k23J23M8m03N16l00M17k32K25n51P4R6Q3K69k74J70j23P5l8m34
$$ 247 154 24 -199 -76 -28 -431 85 -215 202 -30 195 -356 -282 -186 -103 166 -108 62 -61 14 -24 -458
6970d58M35K12j43K5k49K55k99R5K32j04k57K34j59N26m34N6J52Rj77N4o6J69
$$ -458 -23 189 46 71 -178 77 -222 -127 105 1 -256 -22 -181 345 -89 -33 119 128 -49 5 -61 108
6992A08j9j36J43j45Q2K33k04O7l28K33j97L4J73p7J27J66j49r0J43P5k19MJ03
$$ 108 89 -47 96 -49 33 266 62 129 -199 34 -163 -129 44 -33 94 260 111 21 164 239 20 24 127
7015A27o6j91Kj32K16K71o37J96K40k57J87o5L20k05j30J9P6J4j44K39l3j23o0
$$ 127 61 -130 -128 -260 -44 227 -410 -214 26 -231 -44 -109 211 6 -124 -105 -29 -15 -159 80 47 -76 -136
7038a36J78m8J42k33J74m8J19O7l08L45l68P8J87J90o0l18L83l75J78k94J50O0
$$ -136 42 -6 136 -97 77 29 148 215 -93 252 -116 -38 149 339 279 -39 344 -31 147 -147 3 63
7060F3J95j43r0k6j46M58k42P4rk93L88k62Kk21K49j91K76K44r9j22q1k2n5L40
$$ 63 258 115 25 -1 -147 311 69 143 134 -159 229 -33 -31 -252 -3 -194 82 326 227 105 24 2 -53 287
7084B87l71j01L50k54J13j54K18k15J10l95O74k35J3j7J86m24KM91r2j12j61J54
$$ 287 -84 -185 165 -89 24 -130 88 -127 -17 -412 262 27 40 23 209 -215 -213 278 186 74 -87 67
7106F7k48J20J56l51J97J13K36m18K21m43M52l13K08o1m2J15O8m0K9p7J45NL4
$$ 67 -181 -61 95 -256 -59 54 290 -128 93 -350 102 -211 -3 -64 -106 9 77 37 66 -11 134 139 173
7129A73l07r6J67J07r5oO1OK28l56j44J67K89p3j18K36kn48N38m2k06m4r6j20
$$ 173 -134 -230 -63 44 -51 -57 4 10 238 -118 -262 -95 194 121 3 239 237 -311 227 185 -21 -65 -161 -281
7153b81J85K0Q8N0k49M05k04K22n1p8Pk21J28j38N1L16j50K8j33K0L4j06R1m3
$$ -281 -96 -76 12 62 -187 218 14 236 185 107 114 -107 21 -117 -66 250 100 128 -5 15 49 -57 34 -9
7177iJ40M4l19J23R5j80J25k01J83j56J43Q1k0m00L74m2J16Q8j84K26p4J7j21
$$ -9 131 175 -144 -21 74 -106 19 -182 1 -155 -12 69 49 -351 23 -19 97 185 1 227 153 170 49
7200D9K50j61m2l69K02n7M10m20K44J8p6p2K25n33M21K16k86L5j5o3K23k1l51
$$ 49 299 138 96 -273 -71 -128 282 -138 106 124 48 -24 201 -332 89 305 19 54 39 -24 199 178 -173
7223a73J57j78J26J1k63M78q6j0O4L8o6k67L04k22n4K8J97p2O0J76m01m3L47k42
$$ -173 -16 -194 -68 -57 -320 158 72 62 126 164 98 -169 135 -87 -141 -113 84 12 72 248 -153 -196 151 -91
7247i1L24k54P8k17k46M62j62J05k40M20j02j25KJ31K03l80J29j4k55N7L56q3
$$ -91 233 -21 57 -160 -406 56 -106 -1 -241 179 77 -48 -46 85 288 -92 37 23 -232 -175 181 98
7269I8k01k4l33N84j97mJ60k58j22M39oj84m0J1q0K15M5r4k3j92L09k11K11l74
$$ 98 -103 -127 -460 124 -73 -77 83 -175 -297 142 136 -48 -88 -77 -157 58 103 9 -14 -206 103 -108 103 -271
7293b71M79j86l34M23j87M85j88l21n8K13R4n1j02k16M11k46J00m7J34N4k62J70
$$ -271 208 22 -312 111 -76 409 221 -100 -158 55 149 98 -4 -220 191 -55 45 -2 132 186 -76 94
7315I4r5l8J9K43q4J49k60J25j32j0J08j2j29j24J56N1K03j59O0p04M85q1N70
$$ 94 -1 -39 -20 223 139 288 28 153 21 11 119 107 -22 -146 10 61 264 105 165 -539 -54 -135 435
7338D35p2l80K30k6k01j35M25k0j38o7K5j5n1L46m04j38K11J3j35r6K33j5R8R1
$$ 435 363 -17 213 187 -14 -149 276 256 118 51 76 61 10 356 -48 -186 25 38 -97 -193 40 25 123 214
7362B14k24J79j39J10j4k61j02L47j06j7r3kq6r8J50K57J43m83L22K6k43l7J13
$$ 214 -10 169 30 140 126 -135 -237 110 4 -13 -106 -108 -194 -292 -142 115 258 -225 97 123 -120 -157 -44
7385d4N68n62r0j47K39L53n23J66j05n5K63j02n6K07j19k53M50r2j78K21J84k54
$$ -44 524 -38 -128 -275 -36 317 -206 -40 -145 -200 63 -39 -95 112 -7 -260 190 98 -80 141 325 71
7407G1k91r6M15m0j61J21n0K9K71k23J2j20j03L35l2J92j70l28j55N68k66k46
$$ 71 -220 -316 99 59 -102 19 -31 -2 269 46 58 -62 -165 170 138 330 160 -168 -323 245 -21 -267
7429b67L35j29Nj9K33k12K18m48J32N7J41k27J01J58K4k76K09k5J15K1k80M49
$$ -267 68 -61 -56 -75 158 -54 164 -284 -152 -95 46 -181 -80 78 102 -174 35 10 125 146 -134 315
7451C15J02m69K51m46K27Q4k18J17J44n5K11k58o2J15J45k15K4p1j0L49l38l7
$$ 315 417 -52 199 -247 -20 64 -154 -37 107 52 263 5 -57 58 203 -12 12 -59 -69 280 -58 -95
7473i5P4L2j74M57l19pj40K11N8Jj64L38k13j35j73L33M58p18J65j17j56K30J07
$$ -95 -21 11 -163 294 -25 -32 -172 39 97 98 -66 272 59 -76 -249 84 542 -176 -11 -128 -284 -54 53
7496E3L6j97J89m42K13K8J22j03J80p4J13j0k47J32j54n6J88j39K10L1J40l36
$$ 53 89 -108 81 -361 -148 -120 2 -101 79 5 118 108 -139 -7 -161 -217 -29 -168 42 73 213 -123
7518a23J26Kk52L31j46J78k81K28j10j54L35j74k35M86k94J90k15qO4rj07J20
$$ -123 3 5 -247 84 -62 116 -165 63 -47 -201 134 -40 -275 211 -83 107 -108 -116 -52 -61 -168 -48
7540d8K95j98m8p2M9k61R1l9O27n31L09j05l89N75m66K04Q4l1n0J43l18K50J08
$$ -48 247 49 1 -71 -22 -283 -192 -231 396 -135 174 69 -320 255 -211 -7 77 46 -4 139 -179 71 179
7563A79j2K0k96L54k99J08j30L36k24k02L95n47L27k41K63J1k11K51j08K43k82
$$ 179 167 187 -109 245 -54 54 -76 260 36 -166 229 -318 9 -232 31 42 -169 82 -26 217 -65
7584f5J51k16l1L80j17k89J16L51M4k37J94r4l06K60j73j50K13Q0o6k67N26l93
$$ -65 86 -130 -161 219 102 -187 -71 280 324 87 281 187 -119 141 -32 -182 31 111 45 -222 304 -89
7606h9P4K56j41j53p5J20K92m78M58n3r1j28L6L04l35J20M9m39J61p7J72o9j3
$$ -89 -15 241 100 -53 -128 -8 284 -194 264 211 120 -8 28 332 -3 117 166 -273 -112 -189 -17 -86 -99
7629i9M0R6j82m53L48P1k6k3J34J31o1j48K99k68l0m0m3P7NK71k67J68%j82N8
$$ -99 -59 37 -145 -598 -250 -179 -205 -228 -94 37 -24 -172 127 -141 -171 -211 -254 -177 -172 99 -168 0 0 -182 -124
7654a24J96k4q3J66j00rJ45k78P9j00K35l45K58M78m13k1j62J56j46j39J41J1
$$ -124 72 48 -35 131 31 22 167 -111 -32 -132 103 -242 16 494 81 60 -102 54 -92 -231 -90 -79
7676g9nR1j15K64j46N3J82k42K86j50j2l73N08l82j04K11k6Q5K29k31k39M31n2
$$ -79 -84 7 -108 156 10 63 245 3 289 139 127 -246 262 -120 -224 -13 -39 46 275 44 -195 236 184
7699A84k02J44k28J04J67Q2l24J43L9R7j43k03N4J25j36K41j14k00L75l35K83
$$ 184 -18 126 -102 2 169 251 -73 70 109 206 63 -140 -86 39 -97 144 30 -170 205 -130 153
7720A53j66r8k2J28k2M1m1K87K0j79j05K66l92J71K44j85k02P5j1Q0J34j6n70
$$ 153 -13 -111 -133 -5 -27 14 -27 260 280 101 -4 262 -130 41 285 100 -102 -27 -38 42 176 160 -410
7743d10K86J36j75L04k09%r2N79k57O4l53K74m42K58J35j50J30k88J42j84L82
$$ -410 -124 12 -163 141 -68 -68 -160 419 162 226 -127 147 -295 -37 98 -52 78 -210 -68 -252 130
7764A30n3J03o9k57K26Ml59j22K45L05k16K33j51O1j69K95j17j92J04r7Nq9M32
$$ 130 77 180 111 -146 80 84 -275 -397 -152 153 -63 170 19 80 -89 206 89 -103 1 -96 -91 -180 252
7787B52m39K83k66J40J62k06L7P9k28J45l7o1K23J39j81j07lk3j37L96m99M08
$$ 252 -187 96 -170 -30 132 -74 -37 42 -186 -41 -78 -139 84 223 42 -65 -68 -91 -228 168 -331 77
7809G7k65J25L8N4J04q6Jl23M79k85J74j11O8o9P4P9k19M8M23n12J01j89Q3L0
$$ 77 -188 -63 -25 29 133 47 48 -275 204 -81 93 -18 50 -19 55 134 -85 -37 386 -126 -25 -214 -131 -101
7833a01L28k76k39L27lrK7M0m62J87L29L2j40pR6k51j44J31j9K35m62M31k42J76
$$ -101 227 -49 -288 39 36 27 54 94 -368 -181 148 180 40 33 129 -122 -266 -135 -154 81 -381 50 -192 -16
7857a6J43m98K37R8M8p5j46M26j85M54l83n2o6J76m90J83pM3L9l3j02j2K7M4l8
$$ -16 127 -371 -134 -36 12 -63 -209 217 32 486 103 51 -15 161 -329 -146 -153 -110 -71 -104 -206 -218 -191 -147 -185
7882a85K72j16j98J06o5n7K35k60L59j4k66P9K12pO1k45L0Q6k85M16j6m42pN11
$$ -185 87 -29 -227 -121 -186 -243 -8 -268 91 77 -189 -110 102 95 156 -89 -59 27 -258 158 142 -300 -307 204
7906B04j80j02K87J09o14N11l76n5K99k10J81Q0l47J84m7j96K87j37L64l68mJ77
$$ 204 24 -78 209 318 -296 215 -161 -216 83 -127 54 134 -213 -29 -76 -272 15 -122 242 -126 -130 47
7928D7j77Nj41J44J86L3J44k76J68m40K76J12l6j14J55ln8j30JK62n08O03j73
$$ 47 -130 -125 -266 -122 64 97 241 -35 133 -307 -31 81 45 -69 86 83 25 -105 -104 158 -350 253 80
7951H0j20J54j46m9J75o2r0N6N9J33j55j76K9K39Q3k61J8n8K98j06K3k27M11k52
$$ 80 -40 114 -32 -81 94 32 -58 -2 57 190 35 -141 -112 127 210 -51 -33 -91 207 101 124 -103 308 56
7975E6n1lJ35n2J4r5j52N8j59K94r5J1K6K7J32j34L05k83J09J20m92J54o2L66
$$ 56 5 2 137 85 99 4 -148 -90 -249 45 -50 -39 -13 14 146 12 317 34 143 263 -229 -75 -137 229
7999B29p9k92M64m43j06J92K54j34R0m52L68L9k97P5k59N59l17j00J76j9j6j58
$$ 229 150 -142 322 -121 -227 -35 219 85 175 -277 91 130 -167 -92 -351 208 -109 -209 -33 -52 -68 -226
8021b26N33m83L13p2q7l9l91O77m5j74K21k48j13L4J25l21N12j64K4L8k3M0j5
$$ -226 307 -176 137 65 -22 -61 -452 225 180 6 227 -21 -134 -100 25 -296 216 52 76 114 91 131 116
8044A16k22q2O14p29R5O4J71J42l79K54p1j03qJ75P9j35q5J23J65K0j8N5Kl15
$$ 116 -106 -188 426 -303 -208 -144 27 169 -210 44 -27 -130 -138 37 116 -19 -104 19 184 204 186 241 243 -72
8068g2j67l4M40l69n2J43n5O7Q9K08n34L05L02j74J10n62K51K39j39n9O2Q5j01
$$ -72 -239 -273 167 -202 -254 -111 -166 -99 -10 198 -336 -31 271 97 207 -355 -104 135 -4 -63 -1 84 -17
8091a7N7J81M2j20J14m73L35K18l27j3n2k60M41l17L01j96k8N1N9l3N2k34q8L44
$$ -17 40 221 263 143 257 -216 119 337 10 -3 -55 -315 126 -191 110 -86 -114 -63 -4 -37 15 -219 -307 37
8115C7j43M17k73K44j62j94J87Q5l73Q9J75O9j40K7L12n08n1K82j51Q4k08J40
$$ 37 -106 311 38 282 120 -74 113 198 -175 -86 89 158 18 45 357 -151 -202 80 -71 13 -195 -55
8137e5K7J68n1j32J20q0O7j83j57K57j50R8P7J14l13M03l44J56N2k87J77K40k23
$$ -55 -28 140 89 -43 77 -3 64 -119 -276 -19 -169 -71 6 120 -193 210 -134 22 74 -213 -36 204 -19
8160a9k7J38k47J76P6j74m27P12n97P24k50l32N28j14k88K9J23l80K05n5L82j79
$$ -19 -46 92 -155 21 97 -77 -504 208 -389 335 85 -247 281 167 -121 -92 31 -349 -144 -199 183 4
8182Dq4k91M42p5J45q5k29K69j40
$$ 4 -80 -371 71 -4 141 56 -173 96 -44
8191d4
$$ Imaginary data points
##PAGE= N=2
##DATA TABLE= (X++(I..I)), XYDATA
0@%%%%%%%%%%qJ6j6J6k0K8l2L3m1N5o3P1q3R3j06J22j40J62j84K06k32K60k90
$$ 0 0 0 0 0 0 0 0 0 0 0 -8 8 -8 8 -12 16 -16 17 -24 31 -32 39 -44 49 -57 65 -75 87 -97 109 -123 137 -153
33a53L25l64M06m52N00n54O16o82P55q35R26j027J137j265J411j576J769k000
$$ -153 172 -192 214 -238 262 -292 324 -358 397 -438 488 -539 598 -667 744 -832 937 -1063
51a063K276k615L048l616M397n542P392j0868J9546p7449j43372J99440J06337
$$ -1063 1213 -1402 1646 -1970 2427 -3115 4277 -6591 12955 -64494 -207866 -8426 97911
64I7911j76151j24581J63770J11365j47940j12853J44460J12706j18516r9522
$$ 97911 -78240 -202821 -39051 72314 -75626 -188479 -44019 68687 -49829 -149351
74a49351J19205R8738j00170q4480J05263Q6749r2099q2223Q7086Q0743p8739
$$ -149351 -30146 68592 -31578 -116058 -10795 75954 -16145 -98368 -11282 69461 -9278
85i278p9079P2228P7022o6141p7781O1354P9963n2866p8686N3606Q6991m1661
$$ -9278 -88357 -16129 60893 -5248 -83029 -21675 58288 5422 -73264 -19658 67333 25672
97B5672q2742M5463R2729l6586r0189M0549J00496l2578j02559K9447J03357k7614
$$ 25672 -57070 -11607 81122 44536 -45653 -5104 95392 62814 -39745 -10298 93059 65445
109F5445j06906K4491J05071k9978j14508K1649J10245k6091j14004K3374J07581
$$ 65445 -41461 -16970 88101 58123 -56385 -34736 75509 49418 -64586 -41212 66369
120F6369l1338j12552L3143J12754l4947j13803L4676J11441l7272j09656L9876
$$ 66369 35031 -77521 -44378 68376 33429 -80374 -45698 65743 28471 -81185 -41309
131d1309J11531l9168j12037L6334J10177l3803j06668L2379J04169l1399j01532
$$ -41309 70222 31054 -80983 -44649 65528 31725 -74943 -42564 61605 30206 -71326
142g1326K8674R9458k4785r4219K1903R1433j7666q7486J5925Q7062r852q3410
$$ -71326 -42652 56806 32021 -62198 -40295 51138 33472 -54014 -38089 48973 39121 -44289
154d4289O785Q3537N0q0423m482P9525R619p6363j1585P6353J5240p6503j8861
$$ -44289 -37504 46033 46083 -34340 -38822 40703 50322 -26041 -37626 38727 53967 -22536 -41397
167d1397P6307K2482p6266k5408P6907K5501q0141k8264Q2724L1771q6109l5669
$$ -41397 34910 57392 -18874 -44282 32625 58126 -22015 -50279 32445 64216 -21893 -57562
179e7562Q5022L5494q6700l6950Q9107L7083r1333m0500R0456M0487q9402m0165
$$ -57562 27460 62954 -23746 -60696 28411 65494 -25839 -66339 24117 64604 -24798 -64963
191f4963Q8609L8516q9884l9147Q9693L9418q8373l9369Q6210L7822q5208l8201
$$ -64963 23646 62162 -27722 -66869 22824 62242 -26131 -65500 20710 58532 -26676 -64877
203f4877Q4487L7871q1532l9333P8044L8961p4545l9766P1058M0019o7897m0540
$$ -64877 19610 57481 -24051 -63384 14660 53621 -20924 -60690 10368 50387 -17510 -58050
215e8050O4683M1318o1990m2368N9505M4515n5498m5212N2844M7097n0142m7971
$$ -58050 6633 47951 -14039 -56407 3098 47613 -7885 -53097 -253 46844 -3298 -51269
227e1269M8861N1109m5634n3182M2749N5446m0424n6863M0244N8358l9869o1529
$$ -51269 -2408 48701 3067 -50115 -7366 48080 7656 -49207 -8963 49395 9526 -52003
239e2003L8843O2644l6536o3453L6292O4148l6639o5879L7230O8309l5690o8671
$$ -52003 -13160 49484 12948 -50505 -14213 49935 13296 -52583 -15353 52956 17266 -51405
251e1405L4705O9819l4813o9121L5325P0075l4691p0966L3663O9976l2321o9493
$$ -51405 -16700 53119 18306 -50815 -15490 54585 19894 -51072 -17409 52567 20246 -49247
263d9247L2395O7780l1847o8079L1116O7252k9252o6470K8266O6009k6550o4359
$$ -49247 -16852 50928 19081 -48998 -17882 49370 20118 -46352 -18086 47923 21373 -42986
275d2986K5322O4536k4186o3450K2463O3439k0002o2697J7861O1447j6266o0457
$$ -42986 -17664 46872 22686 -40764 -18301 45138 25136 -37561 -19700 41747 25481 -34976
287c4976J3653O0170j2252o0643R500O0083p573n9191N189N9161m323o0144K423
$$ -34976 -21323 38847 26595 -34048 -24548 35535 27962 -31229 -26040 33121 28798 -31346 -28923
300b8923O0770J47o1259k089O0411L399o0722m589O1579N804o2476q209O2869
$$ -28923 31847 31994 -29265 -31354 29057 32456 -28266 -32855 28724 34528 -27948 -36157 26712
313B6712Q862o2405j0192O2034J0368o2764j1168O3486J2224o3376j2922O2470
$$ 26712 35574 -26831 -37023 25011 35379 -27385 -38553 24933 37157 -26219 -39141 23329
325B3329J3480o2214j3400O2112J4279o2013j5277O1264J6075o0138j6430N8786
$$ 23329 36809 -25405 -38805 23307 37586 -24427 -39704 21560 37635 -22503 -38933 19853
337A9853J7074n8279j7422N7847J8217n7185j9384N5121K0009n3949k0274N2447
$$ 19853 36927 -21352 -38774 19073 37290 -19895 -39279 15842 35851 -18098 -38372 14075
349A4075K1140n2005k2572N1194K4017n0122k5083M7879K6231m6987k6592M6528
$$ 14075 35215 -16790 -39362 11832 35849 -14273 -39356 8523 34754 -12233 -38825 7703
361G703K7847m5846k9623M4581L1025m2940l1333M2155L2359m1292l3845M1233
$$ 7703 35550 -10296 -39919 4662 35687 -7253 -38586 3569 35928 -5364 -39209 2024
373B024L5668m0432l6290L9384L7497l8772l7283L8796L8132l7703l9483L7267
$$ 2024 37692 -2740 -39030 354 37851 -921 -38204 592 38724 1021 -38462 -1195
385a195M0437l5907m0405L5222M1016l4102m1981L4463M2635l3211m3458L2564
$$ -1195 39242 3335 -37070 -1848 39168 5066 -36915 -2452 40183 6972 -36486 -3922
397c922M3562l1358m3663L1630M3626l1295m4080K9996M4727k8424m4864K7088
$$ -3922 39640 8282 -35381 -3751 39875 8580 -35500 -5504 39223 10799 -34065 -6977
409f977M4661k6780m4097K5429M5465k5040m5860K3482M5377k1654m5502K1214
$$ -6977 37684 10904 -33193 -7764 37701 12661 -33199 -9717 35660 14006 -31496 -10282
421a0282M4884k0803m5280J9612M5854j8101m5365J6006M5102j5422m4861J3830
$$ -10282 34602 13799 -31481 -11869 33985 15884 -29481 -13475 31627 16205 -28656 -14826
433a4826M5614j3332m6152J1356M6503j0328m6458R246M6214q936m6537P317M7137
$$ -14826 30788 17456 -28696 -17340 29163 18835 -27623 -18377 27837 18901 -27636 -20319 26818
446B6818o204m7178M387M7076m091m6639K695M7033k103m8117J732M7865k45m8190
$$ 26818 20614 -26564 -22177 24899 20808 -25831 -23136 23897 21794 -26323 -24591 23274 23029 -25161
460b5161n63M7539R13m7770j334M7958J856m7553l762M7233M530m6515m906M6346
$$ -25161 -25724 21815 22728 -25042 -26376 21582 23438 -24115 -27877 19356 23886 -22629 -27535 18811
474A8811N158m6419n672M5824P017m5191q039M4310Q622m3879q756M3764R550
$$ 18811 23969 -22450 -28122 17702 24719 -20472 -28511 15799 24421 -19458 -28214 15550 25100
487B5100m3478j0309M2215J2352m1622j2565M0754J3496m0133j4487M0396J5643
$$ 25100 -18378 -28687 13528 25880 -15742 -28307 12447 25943 -14190 -28677 11719 27362
499B7362l9411j6762L8656J7780l7746j8057L7630J8935l7293k0093L7362K1044
$$ 27362 -12049 -28811 9845 27625 -10121 -28178 9452 28387 -8906 -28999 8363 29407
511B9407l6023k2057L5758K2710l5440k3787L5691K4915l4999k5475L4254K6221
$$ 29407 -6616 -28673 7085 29795 -5645 -29432 6259 31174 -3825 -29300 4954 31175
523C1175l3541k5820L2902K6450l2901k7288L2836K8112l1944k8448L1479K8505
$$ 31175 -2366 -28186 4716 31166 -1735 -29023 3813 31925 -19 -28467 3012 31517
535C1517l0936k8443L0884K9075l0609k9632K8991L0552k7869l0396K7123L0055
$$ 31517 581 -27862 3022 32097 1488 -28144 847 31399 3530 -26866 257 30312
547C0312k6666l0442K5622L0689k3977l1329K3022L1034k2641l1078K1958L1495
$$ 30312 3646 -26796 -1174 29515 5538 -25791 -2769 28265 5624 -25454 -3496 27999
559B7999k1505l2423K0244L2603j8255l3413J7474L3211j6726l4151J5871L4079
$$ 27999 6494 -25929 -5685 26918 8663 -24750 -7276 25935 9209 -24942 -9071 25008
571B5008j4372l4672J2850L5035j2450l5512J2240L5483j1577l6475J0979L6786
$$ 25008 10636 -24036 -11186 23849 11399 -24113 -11873 23610 12033 -24442 -13463 23323
583B3323j0393l7614R517L7641q992l7766Q694L7806p937l8573O957L9121o764
$$ 23323 12930 -24684 -15167 22474 13482 -24284 -15590 22216 14279 -24294 -17337 21784 15020
596A5020l8402N648L7816o243l7261O271L7184m833l7561L903L6895l869l5816
$$ 15020 -23382 -17734 20082 13839 -23422 -17151 20033 15200 -22361 -18458 18437 14568 -21248
609b1248L513L5730k337l6431J430L5784J70l4906q49L4114J389l3740k527L3557
$$ -21248 -17735 17995 15658 -20773 -19343 16441 16611 -18295 -19144 14970 16359 -17381 -19908 13649
623A3649L907l2378n013L1881N577l1451o179L1895P720l2056r168L2132J0148
$$ 13649 17556 -14822 -19835 12046 17623 -13828 -20007 11888 19608 -12448 -21616 10516 20664
636B0664l1642j0985L2048J1727l1492j2964L1717J4004l1498j4433L1535J5026
$$ 20664 -10978 -21963 10085 21812 -9680 -22644 9073 23077 -8421 -22854 8681 23707
648B3707l1129j5317L0783J6362l1250j5755L1663J6212l2090j6621L1535J7431
$$ 23707 -7422 -22739 8044 24406 -6844 -22599 9064 25276 -6814 -23435 8100 25531
660B5531l0822j7148L0793J7068l0662j7448K9747J8673k8918j8442K7939J7928
$$ 25531 -5291 -22439 8354 25422 -5240 -22688 7059 25732 -3186 -21628 6311 24239
672B4239k7707j7796K7786J8114k6682j8520K5373J8281k4628j8465K4251J9041
$$ 24239 -3468 -21264 6522 24636 -2046 -20566 4807 23088 -1540 -20005 4246 23287
684B3287k3458k0240K2037K0746k0494k1382J9494K2136j9259k2594J7522K3447
$$ 23287 -171 -20411 1626 22372 1878 -19504 -10 22126 2867 -19727 -2205 21242
696B1242j6661k3815J5910K3794j5606k4921J5555K5174j4834k6286J4303K6865
$$ 21242 4581 -19234 -3324 20470 4864 -20057 -4502 20672 5838 -20448 -6145 20720
708B0720j4060k8277J3738K8947j3318k9150J2486K9431j3133k9842J3357K9308
$$ 20720 6660 -21617 -7879 21068 7750 -21400 -8914 20517 7384 -22458 -9101 20207
720B0207j2128k9570J1637K9515j2603k9308J2735L0038j3044k9869J1841K9459
$$ 20207 8079 -21491 -9854 19661 7058 -22250 -9515 20523 7479 -22390 -10549 18910
732A8910j1540k8946J1438K8849j1141k9143J0382K8523r022k7209Q158K6453
$$ 18910 7370 -21576 -10138 18711 7570 -21573 -11191 17332 8310 -18899 -10741 15712
744A5712q314k6160P531K5738n776k5303M903K5282m584k5377L872K5956k477
$$ 15712 7398 -18762 -11231 14507 8731 -16572 -11669 13613 9029 -16348 -12476 13480 11003
757A1003k5982J038K5663N49k5554j443K5782K881k5169m029K5164N126k5578
$$ 11003 -14979 -13941 11722 12271 -13283 -14726 11056 13937 -11232 -15261 9903 15029 -10549
770a0549n165K5870O285k6385o715K6981O817k7121o366K7738P305k8470q128
$$ -10549 -15714 10156 16441 -9944 -16659 10322 17139 -9982 -16348 11390 18695 -9775 -17903
783a7903K8689Q852k8517q326K8055Q620k8473q943K8438R278k7685q481K7028
$$ -17903 10786 19638 -8879 -17205 10850 19470 -9003 -17946 10492 19770 -7915 -16396 10632
796A0632P825k7252p439K7609P668k6910p895K5718Q028k5167q212K4810Q765
$$ 10632 18457 -8795 -16234 11375 19043 -7867 -15762 9956 17984 -7183 -15395 9415 18180
809A8180k3838j0059K2680J0190k1458j0368K0914J0641k0313j1586J9924J1630
$$ 18180 -5658 -15717 6963 17153 -4305 -14673 6241 16882 -3431 -15017 4907 16537
821A6537j8932j2349J8163J2941j7911j4098J7504J4831j6538j6209J6332J6837
$$ 16537 -2395 -14744 3419 16360 -1551 -15649 1855 16686 148 -16061 271 17108
833A7108j6382j7873J5590J8866j5215j9144J4731J8925j4857j9923J5033K0910
$$ 17108 726 -17147 -1557 17309 2094 -17050 -2319 16606 1749 -18174 -3141 17769
845A7769j5174k1186J5083K0937j5414k1202J5495K2241j5534k3011J4888K2434
$$ 17769 2595 -18591 -3508 17429 2015 -19187 -3692 18549 3015 -19996 -5108 17326
857A7326j4890k1808J4928K1712j4953k1780J4603K0965j3823k0544J3904K0182
$$ 17326 2436 -19372 -4444 17268 2315 -19465 -4862 16103 2280 -18264 -4360 15822
869A5822j4123k0041J3495K0543j2669k0057J1588J9583j1028j9613J0533J9766
$$ 15822 1699 -18342 -4847 15696 3027 -17030 -5442 14141 3113 -16500 -5967 13799
881A3799r452j9653Q669J8907p155j9200O337J9521n013j9568M380J9287l299
$$ 13799 4347 -15306 -6637 12270 5115 -14085 -7748 11773 6760 -12808 -8428 10859 7560
894G560j9952L527K0651k405k1164J716K1009n58k1772O97K2461K92k3035o82
$$ 7560 -12392 -8865 11786 9381 -11783 -10067 10942 10384 -11388 -10691 11770 12062 -10973 -11655
908a1655K2885J538k2834j306K3042J650k4266j107K4289J745k3929j621K3643
$$ -11655 11230 12768 -10066 -11372 11670 13320 -10946 -12053 12236 13981 -9948 -11569 12074
921A2074J247k3808j243K4327J420k3234k262K2841K137k2561k046K2424K404
$$ 12074 13321 -10487 -11730 12597 14017 -9217 -11479 11362 13499 -9062 -11108 11316 13720
934A3720k2407k369K1474K840k1202k707K0325L251k0026l357J9423L680j9089
$$ 13720 -8687 -11056 10418 13258 -7944 -10651 9674 12925 -7101 -10458 8965 12645 -6444
947f444m113J8599M745j7900o000J7433O483j7069p283J6791P629j6357q774J6262
$$ -6444 -10557 8042 12787 -5113 -11113 6320 12803 -4266 -11549 5242 12871 -3486 -12260 4002
961D002Q903j5678r420J5307R607j5602j0786J5638J1808j5330j2683J4994J2665
$$ 4002 12905 -2773 -12193 3114 12721 -2881 -13667 1971 13779 -1551 -14234 760 13425
974A3425j5861j2356J5542J3384j5753j4183J5771J3760j5397j3716J5154J3908
$$ 13425 -2436 -14792 750 14134 -1619 -15802 -31 13729 -1668 -15384 -230 13678
986A3678j5604j4259J5301J4473j4888j4604J5108J4194j4877j4197J4222J4672
$$ 13678 -1926 -16185 -884 13589 -1299 -15903 -795 13399 -1478 -15675 -1453 13219
998A3219j4510j3779J3708J3824j3472j3525J2741J3688j2361j3866J1979J4034
$$ 13219 -1291 -15070 -1362 12462 -1010 -14535 -1794 11894 -467 -14333 -2354 11680
1010A1680j1448j3873J1084J3898r939j4175R516J4416r219j4410Q709J4569p671
$$ 11680 232 -13641 -2557 11341 1402 -12773 -3257 11159 1940 -12470 -3761 10808 3137
1023C137j4919P680J4420o439j5009O532J5572n748j6511N522J6379m692j6404
$$ 3137 -11782 -4102 10318 3879 -11130 -4598 10974 5226 -11285 -5763 10616 5924 -10480
1036a0480M874J6626m333j7291M345J7481l489j7440L241J7825l254j7867L375
$$ -10480 -5606 11020 6687 -10604 -6259 11222 7733 -9707 -6466 11359 8105 -9762 -6387
1049f387J8270l069j8557L095J8255k928j8254L048J8351l035j8001K278J8360
$$ -6387 11883 8814 -9743 -6648 11607 8679 -9575 -6527 11824 8789 -9212 -6934 11426
1062A1426k253j7989K172J7554j882j7357J550J6940j519j6710J474J6715r28
$$ 11426 9173 -8816 -6644 10910 9028 -8329 -6779 10161 8642 -8068 -6594 10121 9193
1075I193j6810M01J6445m28j6131n1J5792P80j5847j588J5650J830j5131k274
$$ 9193 -7617 -7216 9229 8801 -7330 -7381 8411 9191 -6656 -8244 7406 9236 -5895 -8169
1089h169J4794K320j4560l457J4639L866j4873l904J4630L995j4765m319J4370
$$ -8169 6625 8945 -5615 -9072 5567 9433 -5440 -9344 5286 9281 -5484 -9803 4567
1102D567N067j4796n231J4272N954j4430o200J4207O425j4977o507J4458P388
$$ 4567 9634 -5162 -10393 3879 9833 -4597 -10797 3410 9835 -5142 -11649 2809 10197
1115A0197j4790p277J4273P555j4201p827J4513P522j4136q010J3737Q807j4062
$$ 10197 -4593 -11870 2403 9958 -4243 -12070 2443 9965 -4171 -12181 1556 10363 -3699
1128c699q456J3643Q091j3156q543J3432Q538j3017q695J2609R122j2481q842
$$ -3699 -12155 1488 9579 -3577 -12120 1312 9850 -3167 -11862 747 9869 -2612 -11454
1141a1454J1905R191j2018r042J1511R684j1059r792J0820R819j0237j0300J0513
$$ -11454 451 9642 -2376 -11418 93 9777 -1282 -11074 -254 9565 -672 -10972 -459
1154d59R884r343j0459R498J0242q580j0279Q522J0987q657j0959P843J1607p418
$$ -459 9425 82 -10377 -879 9363 783 -9496 -974 10013 1356 -9603 -1760 9847 2429
1168B429j1618O992J2139o745j2173O540J2671o568j2887O312J3146n893j3044
$$ 2429 -9189 -2197 9942 3197 -8976 -2436 10235 3667 -9220 -2908 10238 4345 -8699
1181h699N514J3585n887j3412O086J3314n427j3670N297J3796m890j4372N378
$$ -8699 -3185 10400 4513 -8899 -2813 10501 5074 -8596 -3299 10497 5607 -8765 -3387
1194c387J3860m989j3963N027J3986n047j3453M483J3368m617j3381M171J3296
$$ -3387 10473 5484 -8479 -3452 10534 5487 -7966 -3483 9885 5268 -8113 -3942 9354
1207I354l712j3306L188J3353l173j3110K999J3189k967j3326K426J3056j964
$$ 9354 5642 -7664 -4476 8877 5704 -7406 -4407 8782 5815 -7511 -5085 7971 6007
1220F007j2911J471J2553q90j2843R02J2313l55j2833j72J2752J67j2381p88J2625
$$ 6007 -6904 -5433 7120 6230 -6613 -5711 6602 6247 -6586 -6758 5994 6161 -6220 -7008 5617
1235E617O10j2494j139J2625J715j3125j905J2715K225j2695k879J2747L118j3070
$$ 5617 6227 -6267 -7406 5219 6934 -6191 -8096 4619 6844 -5851 -8730 4017 7135 -5935
1249e935l039J2603L865j3101l605J2931L418j2913l604J3336L445j3052l782
$$ -5935 -8974 3629 7494 -5607 -9212 3719 7137 -5776 -9380 3956 7401 -5651 -9433
1262i433J2721M733j3177m538J2957M443j2654m628J2365N135j2050m908J1726
$$ -9433 3288 8021 -5156 -9694 3263 7706 -4948 -9576 2789 7924 -4126 -9034 2692
1275B692M694j1680m471J1407M889j1002n104J0934N456j0818n280J0558N601
$$ 2692 7386 -4294 -8765 2642 7531 -3471 -8575 2359 7815 -3003 -8283 2275 7876
1288G876j0118o114R793O841r549o893R213P059r241o726Q813P519q290p550Q041
$$ 7876 -2242 -8356 1437 8278 -1271 -8164 1049 8108 -1133 -7859 954 8473 183 -7367 674
1303F74P691p774q116Q020Q498q208q776P916R572p842r607P608J0079p764j0016
$$ 674 8365 591 -7525 495 8993 785 -7991 -75 9497 1655 -7952 -344 9735 1971 -8045
1318h045P971R899p723j0127P668J0022p244j0287P329J0212p686r741P464J0155
$$ -8045 -74 9825 2102 -8025 -357 9665 2421 -7866 -537 9675 1989 -7752 -288 9867
1332I867p345j0809P151J0644p070j0272O949R743o833r747O323R713n576r339
$$ 9867 2522 -8287 -1136 9508 2438 -7834 -885 8858 2025 -7722 -1399 8314 2738 -6601
1346f601M781R356m961r520M577R789m238j0066L964R975m063j0150M157R431
$$ -6601 -1820 7536 2575 -6945 -2368 7421 3183 -6883 -2919 7056 2993 -7157 -3000 6431
1360F431k912j0447K579J0232j888j0699J761J0472j538j0329Q93J0395n95j1107
$$ 6431 3519 -6928 -4349 5883 3995 -6704 -4943 5529 3991 -6338 -5445 4950 4355 -6752
1374f752Q32J1034m76j1343K51J1634m38j1445J32J1908o2j2067o82J2417O72
$$ -6752 -5920 5114 4638 -6705 -6454 5180 4742 -6703 -6571 5337 5275 -6792 -7474 4943 5615
1389E615j1827r96J2178L56j1576o85J1593O02j1333o32J1238J94j0775m65J1187
$$ 5615 -6212 -7208 4970 5326 -6250 -6935 4658 5260 -6073 -6705 4533 4727 -6048 -6513 4674
1404D674P13j1211r40J0980J533j0987j292J0806J307j0109k043R958K441r481
$$ 4674 5387 -5824 -6764 4216 5749 -5238 -6530 4276 5583 -4526 -6569 3389 5830 -3651
1418c651k398R204K261q548k911Q897L475q715l597Q820M013q272m945Q652M929
$$ -3651 -6049 3155 5416 -3132 -6043 2854 6329 -2386 -5983 2837 6850 -1422 -6367 2285 7214
1433G214q358n283Q219N937q596n345P639O696q183o192P585O613p498o976Q040
$$ 7214 -1144 -6427 1792 7729 -867 -6212 1427 8123 -60 -6252 1333 7946 448 -6528 1512
1448A512O995q212p180Q208P355q533o996Q575P130q255q005Q001Q112p671p477
$$ 1512 8507 295 -6885 1323 8678 145 -6851 1724 8854 599 -7406 595 8707 1036 -6441
1463f441P421P285q016p478Q057O973o900p306P165O273o441o968P065O746o992
$$ -6441 980 8265 249 -7229 828 7801 901 -6405 760 7033 592 -6376 689 7435 443
1478D43o965O317O838n604p061N313P438n644p144M381P644m223p494M048P503
$$ 443 -6522 -205 6633 1029 -6032 -719 6719 1075 -6069 -1688 5956 1733 -5761 -1713 5790
1493E790l974p691L516P768l465p820K730Q393k638q779K273Q585j875q861J985
$$ 5790 1816 -5875 -2359 5409 1944 -5876 -3146 5247 2609 -6170 -3897 4688 2813 -6048 -4063
1508d063R200k083r761J949R338j202r318J258R579j870r696J991J0134j763j0134
$$ -4063 5137 3054 -6707 -4758 4580 3378 -5940 -4682 4897 3027 -6669 -4678 5456 3693 -6441
1523f441J223R974j400r924J873J0183j837j0129J407R532j007r306J003R292
$$ -6441 -5218 4756 3356 -6568 -4695 5488 3651 -6478 -5071 4461 3454 -5852 -4849 4443
1537D443r74r322J178Q971n52q717N44Q327m66q109N3Q444N90q703l29Q480M12
$$ 4443 3469 -5853 -4675 4296 3744 -4973 -4429 3898 3432 -4677 -4624 3820 4410 -4293 -4622 3858 4270
1554D270p877r07P735J375p280j686P517K140p779k226P420K903p414k919P149
$$ 4270 -3607 -4514 3221 4596 -2684 -4370 3147 5287 -2492 -4718 2702 5605 -1809 -4728 2421
1569B421L570p885l008P820L128p210m258P627M255p563l884P306M799q193m998
$$ 2421 5991 -1894 -4902 2918 6046 -1164 -5422 2205 6460 -1103 -4987 2319 7118 -1075 -6073
1584f073Q383M760p364n009P963M613q372m669Q587M629q153m973Q186M268q142
$$ -6073 2310 7070 -294 -5303 2660 7273 -1099 -5768 2819 7448 -705 -5678 2508 6776 -1366
1599a366m241Q052M065p153m898P065M446o899m196O879M326p041m286O422M523
$$ -1366 -5607 2445 6510 -643 -5541 1524 5970 -929 -5125 1754 6080 -961 -5247 1175 5698
1614E698o058m470N540M783n690m788M998N240n146n294M505N467m487n889M460
$$ 5698 -360 -4830 710 5493 -197 -4985 13 5253 107 -5187 -682 4785 298 -5591 -1131
1629a131N612l968n834L755O230m018o423L406P193l641o994L527O817l321p462
$$ -1131 4481 513 -5321 -1566 4664 646 -5777 -2371 4822 1181 -5813 -2286 4531 1210 -6252
1644f252L603P674l143q118L297P786l677p469L466Q074l588q158L657P877l510
$$ -6252 -2649 5025 1882 -6236 -2939 4847 1170 -6299 -2833 5241 1653 -6505 -2848 5029 1519
1659A519p754L567P380l512p645L333Q064l207p340L060P149k887p365K978P206
$$ 1519 -6235 -2668 4712 1200 -6445 -3112 4952 1745 -5595 -2535 4614 1727 -5638 -2660 4546
1674D546k552o886K136P253k367o920K294O495j523o382J381O744j523o677R35
$$ 4546 1994 -4892 -2756 4497 2130 -4790 -2496 3999 2476 -3906 -2525 4219 2696 -3981 -3046
1689c046P196q23o379M64O086l28o247R4O669N25o900p40O897J052p075j021P277
$$ -3046 4150 3327 -3052 -2588 3498 3170 -3077 -2983 3686 4211 -2689 -3429 3468 4520 -2555 -3576 3701
1706C701J455p842j139P341J625p325j710P431J526p382j753P835J763p741j593
$$ 3701 5156 -2686 -3825 3516 5141 -2184 -3894 3537 5063 -2319 -4072 3763 5526 -2215 -3808
1721c808P448J473p315j841P585K054p860k044P988J501p401j754P398J724p457
$$ -3808 3640 5113 -2202 -4043 3542 5596 -2264 -4308 3680 5181 -2220 -3974 3424 5148 -2309
1736b309k124P253J853o859k225P106K053o928k016O239K445o098k589N776K857
$$ -2309 -4433 2820 4673 -2186 -4411 2695 4748 -2180 -4196 2043 4488 -1610 -4199 1577 4434
1751D434o035k811N629K673n213l365N627K943n323l072M768L854m640m081M459
$$ 4434 -1601 -4412 1217 3890 -1323 -4688 939 3882 -1441 -4513 255 4109 -531 -4612 -153
1766a53M177m885m361M857M646m757m640M400M924m645m704M578M828m846m902
$$ -153 4024 -861 -5222 -365 4281 -476 -5116 -716 4208 -437 -5141 -563 4265 -581 -5483
1781e483M316N539m701n349M694N279m411n846N148N402m645n501M584N610m480
$$ -5483 -1167 4372 -329 -5678 -984 4295 -116 -5962 -814 4588 -57 -5558 -974 4636 156
1796A56n396M374N345m409n340M459N425m347n204L874N401l475n480L619N301
$$ 156 -5240 -866 4479 70 -5270 -811 4614 267 -4937 -1063 4338 863 -4617 -998 4303
1811D303l355n330L257N345l112n273L013N046k391n530K674N351j782n553J728
$$ 4303 948 -4382 -1125 4220 1108 -4165 -1152 3894 1503 -4027 -1353 3998 2216 -3337 -1609
1826a609N749j847n636K018N328q95o191J005O068p78n966N81O358j005o098P50
$$ -1609 4140 2293 -3343 -1325 4003 3108 -3083 -2078 3990 3212 -2754 -2173 4185 3180 -2918 -2168
1842b168N852k0o352K01O123ro290J45O558j77o963K57O639J67p111M17O339J89
$$ -2168 3684 3664 -2688 -2487 3636 3627 -2663 -2518 4040 3863 -3100 -2843 3796 3963 -3148 -2731 3608 3797
1860C797o575K5O384K50o830J54O340J58o057q47O460L40o373j56N852P05o250
$$ 3797 -2778 -2753 3631 3881 -2949 -2795 3545 3703 -2354 -3201 3259 3599 -2774 -2930 2922 3627 -2623
1877b623o53N877P18n879l54N171J227n793j366N516J344n290j780N313J779n319
$$ -2623 -3276 2601 3319 -2560 -2914 2257 3484 -2309 -3675 1841 3185 -2105 -3885 1428 3207 -2112
1893b112j778N532J623n004k167M657K302m504k820M773K961m703l456N076L068
$$ -2112 -3890 1642 3265 -1739 -3906 751 3053 -1451 -4271 502 3463 -1240 -4696 380 3448
1908C448m638l806N171L480n132l340M761L867m950l733M560M001m612l953M526
$$ 3448 -1190 -4996 175 3655 -1477 -4817 -56 3811 -1139 -4872 -312 3689 -923 -4876 -350
1923c50L928m468l945M897L749m810l743M844L916m767l675M727L559m375m004
$$ -350 3578 -890 -4835 62 3811 -999 -4742 102 4018 -749 -4424 303 3862 -513 -4517
1938d517M183M198l956l812L802M154m332l574L949L860l804l952L927L726l373
$$ -4517 -334 3864 -92 -3904 -102 4052 -280 -3854 95 3955 151 -3801 126 3852 479
1953D79l575K969M046k981m010K466M628k770m192K217M761k520m455K058M934
$$ 479 -3096 -127 3919 938 -3072 -606 4022 1252 -2940 -723 4038 1518 -2937 -879 4055
1968D055j852n066K070M330j307m979J745M889j833m987J817N225j753m888R96
$$ 4055 2203 -2863 -793 3537 2230 -2749 -1004 3885 2052 -2935 -1118 4107 2354 -2534 -1538
1983a538N684j438n729J483N551j251n750J479N438j411n521J268N385j134n238
$$ -1538 4146 2708 -3021 -1538 4013 2762 -2988 -1509 3929 2518 -3003 -1735 3650 2516 -2722
1998b722P89N416r50n329Q09N164r50n466J148N240r52n223N06N389n45n143J34
$$ -2722 -1933 3483 2533 -2796 -1987 3177 2227 -3239 -2091 3149 2197 -3026 -2520 2869 2324 -2819 -2685
2015b685N286l48m964J5N073k65m876k3M394J53m607N1M514M05m920m49M511R95
$$ -2685 2601 2253 -2711 -2696 2377 2112 -2764 -2787 1607 1760 -2847 -2796 1718 2123 -2797 -3246 1265 2260
2033B260m573j122M600J234m751j154M495J890n047j676M922J289m445j705M785
$$ 2260 -2313 -3435 1165 2399 -2352 -3506 989 2879 -2168 -3844 1078 2367 -2078 -3783 1002
2048A002J637m624j801M853J689m976j861N031K163m996k005N190J970m865k162
$$ 1002 2639 -1985 -3786 1067 2756 -2220 -4081 950 3113 -1883 -3888 1302 3272 -1593 -3755
2063c755M641K324m445k243M625J947m443j793M186K469m841j901M390K056m232
$$ -3755 886 3210 -1235 -3478 1147 3094 -1349 -3142 1044 3513 -1328 -3229 1161 3217 -1015
2078a015j925L906K464m157k662M154K899l809k637L406K604l363k453L202K907
$$ -1015 -2940 966 3430 -727 -3389 765 3664 -145 -2782 624 3228 -135 -2588 614 3521
2093C521l239k660L093K621l125k538K370L686k919l561L107L091k459l297K218
$$ 3521 282 -2378 715 3336 211 -2327 43 3729 810 -2751 356 3447 988 -2309 -91
2108i1L532k244m183K880M028k564m069K102M396k319m155K106M195k371m056
$$ -91 3441 1197 -2986 -106 3922 1358 -2711 -609 3787 1468 -2687 -581 3614 1243 -2813
2123b813K375M369k702m404K438M679k663m477K606M353k809m133K439L940j720
$$ -2813 -438 3931 1229 -3175 -737 3942 1279 -3198 -592 3761 952 -3181 -742 3198 1478
2138A478m389J869M432k279m285K052L723j657l843J540L807j660l952J433L739
$$ 1478 -2911 -1042 3390 1111 -3174 -1122 2601 944 -2899 -1359 2448 788 -3164 -1731 2008
2153B008r74m035J170L937q87m085P67M092p98m060N98L905Rm371P79L426J00
$$ 2008 1034 -3001 -1831 2106 1219 -2866 -2099 1993 1195 -2865 -2267 1638 1647 -2724 -1945 1481 1581
2170A581m106l95M270K69m332j67M616L00m587p11M712O85m354r31M953M59m679
$$ 1581 -2525 -2920 1350 1619 -2713 -2880 1736 2036 -2551 -3262 1450 2135 -2219 -3150 1803 2262 -2417
2187b417p19N135N76m986p17M805Q89m666p40M856M81m720m17M358R30m475p40
$$ -2417 -3136 1999 2575 -2411 -3128 1677 2566 -2100 -2840 2016 2497 -2223 -2640 1718 2648 -1827 -2567
2204b567M414P31m264o94M381N44l772j101L753J056l551j012L651J149l406j229
$$ -2567 1847 2578 -1686 -2380 2001 2545 -1227 -2328 1425 2481 -1070 -2082 1569 2718 -688 -1917
2220a917L295J351l414j655L563J533k944j875L071K094l170k344L198K560l068
$$ -1917 1378 2729 -685 -2340 1223 2756 -188 -2063 1008 3102 -68 -2412 786 3346 278
2235B78k394K755K697l220k625L014K792k706k764K796K571k856l292L303L330
$$ 278 -2116 639 3336 116 -2509 505 3297 591 -2173 623 3194 338 -2954 349 3679
2250C679l233l190K763L533l160l082L059L268l365l578L345L370k909l381K784
$$ 3679 446 -2744 19 3552 392 -2690 369 3637 272 -3306 39 3409 500 -2881 -97
2265i7L339l040l270K769L220k674l077K434L208k771k884K674K766k464k898
$$ -97 3242 202 -3068 -299 2921 247 -2830 -396 2812 41 -2843 -169 2597 133 -2765
2280b765K065K974k061k808K115K637j777l089J714K835j782k763J175L703j468
$$ -2765 -700 2274 213 -2595 -480 2157 380 -2709 -995 1840 58 -2705 -1530 2173 705
2295G05l153O66L331r00l333R01L563p90l446K03L781l36l595M17L949q66l719
$$ 705 -2448 -1782 1549 649 -2684 -1783 1780 990 -2456 -2253 1528 1192 -2403 -1986 1963 1097 -2622
2312b622K35M342m07m039L89L918k37m408P70M080n18l921M53L950n32l727L42
$$ -2622 -2387 1955 1548 -2491 -2102 1816 1579 -2829 -2059 2021 1503 -2418 -1965 1985 1453 -2274 -1932
2329a932M239p43l803K46M006k98l700L58L889l58l798K97L485p5l396L08L205
$$ -1932 2307 1564 -2239 -1993 2013 1715 -1985 -1627 2262 1904 -1894 -1597 1888 1813 -1583 -1275 1930
2346A930K27l424l58L613K96l499l20L050L94l037k29K930R41l191r09L171J053
$$ 1930 2157 -1267 -1625 1988 2284 -1215 -1535 1515 1909 -1128 -1357 1573 2514 -677 -1586 1585 2638
2363B638l583p05K891J586k951j531K942J414k962j398K750J843l303j480K730
$$ 2638 -945 -1650 1241 2827 -124 -1655 1287 2701 -261 -1659 1091 2934 -369 -1849 881
2378H81J859k939j727L000J682l384j706K858K239k992k307L381J864l200k146
$$ 881 2740 -199 -1926 1074 2756 -628 -2334 524 2763 -229 -2536 845 2709 -491 -2637
2393b637L237K255l327j984L457J755l096k408L342J862k962k050K610K276l189
$$ -2637 600 2855 -472 -2456 1001 2756 -340 -2748 594 2456 -506 -2556 54 2330 -859
2408h59j673K844J889k899j700K090K128k231j893J893K149j987k396K252J842
$$ -859 -2532 312 2201 -698 -2398 -308 1820 -411 -2304 -411 1738 -249 -2645 -393 1449
2423A449j700k325K014J970j545k440J402K795j722k354J356L051j649k997J762
$$ 1449 -251 -2576 -562 1408 -137 -2577 -1175 1620 -102 -2456 -1100 1951 302 -2695 -933
2438i33K477j178k718J178K914j115l288J489L212j377l286J462L213j111l350
$$ -933 1544 366 -2352 -1174 1740 625 -2663 -1174 2038 661 -2625 -1163 2050 939 -2411
2453b411J710K794j300l266J359L352j150l290J134L413j147l181R43L447j516
$$ -2411 -701 2093 793 -2473 -1114 2238 1088 -2202 -1068 2345 1198 -1983 -1040 2407 891
2468H91k978J361L213j406l037J349K981j418k523J134K638n79l319J038K727
$$ 891 -2087 -726 2487 1081 -1956 -607 2374 956 -1567 -433 2205 1626 -1693 -655 2072
2483B072p56k844O84K770j87k928M8K840J03k960r8K841m9k525j07L052L23k971
$$ 2072 1316 -1528 -844 1926 1739 -1189 -1141 1699 1802 -1158 -1256 1585 1536 -989 -1096 1956 2279 -692
2501f92p66L228L34l036n86L243N22k909q60L240M99k863q83K902P34k997j150
$$ -692 -1458 1770 2104 -932 -1518 1725 2247 -662 -1522 1718 2217 -646 -1529 1373 2107 -890 -2040
2518b040L290P98k925r97L119Q26l060j102L321Q48l215r08L203Q81l056r38K862
$$ -2040 1250 2048 -877 -1874 1245 2071 -989 -2091 1230 2078 -1137 -2045 1158 2039 -1017 -1955 907
2535I07J008l026q96K637J094k975r61K952Q68k249j377K449J084k731j068K468
$$ 907 1915 -1111 -2007 630 1724 -1251 -2212 740 1608 -641 -2018 431 1515 -1216 -2284 184
2551A84J192k392j315K425R89k002j162K016J729k431j485J950J963j817k320
$$ 184 1376 -1016 -2331 94 1083 -919 -2081 -65 1664 -767 -2252 -302 1661 -156 -2476
2566b476K411J432j771j943K131J666j636j939J654J697j745j611J748K252j949
$$ -2476 -65 1367 -404 -2347 -216 1450 -186 -2125 -471 1226 -519 -2130 -382 1870 -79
2581g9k336J943K477j839k560K002K430k089k147J606K335j284k915K222K412
$$ -79 -2415 -472 2005 166 -2394 -392 2038 -51 -2198 -592 1743 459 -2456 -234 2178
2596B178j851j979J101K729j582k491J847K476j940k253J228K595j422k363J586
$$ 2178 327 -1652 -551 2178 596 -1895 -48 2428 488 -1765 -537 2058 636 -1727 -141
2611a41K378j097k684J362K113j006k265R38K542j191k389J271K267j013k296
$$ -141 2237 1140 -1544 -182 1931 925 -1340 -402 2140 949 -1440 -169 2098 1085 -1211
2626a211O92K501p28k133N58K336q00k207N95K159k85k403M2K645l03k340P3K650
$$ -1211 -519 1982 1254 -879 -321 2015 1215 -992 -397 1762 1477 -926 -884 1761 1458 -882 -809 1841
2644A841k83k459l43K903l26k441J22K873k93k920q7K626K18l029L7K849J64l033
$$ 1841 1558 -901 -1244 1659 1333 -1108 -986 1887 1594 -1326 -1413 1213 1431 -1598 -1561 1288 1452 -1581
2662a581r8K790K24k664m54L024r9k464l72K556M02k473m20K257N97k415n39K626
$$ -1581 -1679 1111 1335 -1329 -1783 1241 1142 -1322 -1694 862 1264 -1209 -1629 628 1225 -1190 -1729 897
2680H97N3j888q16K356N86k519m52K199Q30k107r15J904R16k100q59K207J034
$$ 897 950 -938 -1754 602 1188 -1331 -1783 416 1246 -861 -1776 128 1044 -1056 -1915 292 1326
2697A326j940j185J843J146k282p88J915J407k162j315K209J498k032j432J802
$$ 1326 -614 -1799 44 1190 -1092 -1880 35 1442 -720 -2035 174 1672 -360 -1792 10
2712A0J332j857j340J730J661j632j786K093J455j907j740K476J261j953j696
$$ 10 1342 -515 -1855 -125 1536 -96 -1882 211 1666 -241 -1981 495 1756 -197 -1893
2727a893K058J828j860j861K087J714j986j684J667K045k120j429J430J948j796
$$ -1893 165 1993 133 -1728 359 2073 87 -1597 70 2115 -5 -1434 -4 1944 148
2742A48j773J849J694j490j688J601J350j269j570J423J501j297j756J515J727
$$ 148 -1625 224 1918 428 -1260 341 1691 422 -1148 275 1776 479 -1277 238 1965
2757A965j268j988J169J987r63k212J548J461q96j974J205J849j143j841Q55J929
$$ 1965 697 -1291 -122 1865 902 -1310 238 1699 803 -1171 34 1883 740 -1101 -246 1683
2773A683n79k155K74K444l51k537L94K291q20j773L97J850m03j961M53K186p32
$$ 1683 1104 -1051 -777 1667 1316 -1221 -827 1464 644 -1129 -732 1118 715 -1246 -793 1393 661
2790F61j875J82K138l46k229J96K319m83j963M04K348n24j889l35K721l70k369
$$ 661 -1214 -1032 1106 760 -1469 -1273 1046 563 -1400 -996 1352 828 -1061 -1396 1325 955 -1414
2807a414J49K064l16j893L73J696k81j779p3K310j43k102P9J897M8j719j10J973
$$ -1414 -1265 799 483 -1410 -1037 659 378 -1401 -1474 836 693 -1409 -1330 567 615 -1104 -1214 759
2825G59j2j867k17J921J46j892m62K180N62j955p60K079M26j736o72J841O71j737
$$ 759 747 -1120 -1337 584 730 -1162 -1624 556 1118 -837 -1597 482 908 -828 -1500 341 1012 -725
2843g25p35J784Q50k022q81K212R31k155p90K143O24j676r51K061N70j741r29
$$ -725 -1460 324 1174 -848 -1729 483 1414 -741 -1531 612 1236 -440 -1391 670 1240 -501 -1430
2860a430J884J243j914p77J509J035j983p23J866J047k097p53J726Q47j702p87
$$ -1430 454 1697 -217 -994 515 1550 -433 -1156 710 1757 -340 -1093 633 1480 -222 -1009
2876a009J543J430j888j029J398J249j502j395J870P63j329j535K162Q45j531
$$ -1009 534 1964 76 -953 445 1694 192 -1203 667 1430 101 -1434 728 1573 42
2891D2r07J038J306j209j303J216J388r26j432Q97J528j196j260O25J725j249
$$ 42 -865 173 1479 270 -1033 183 1571 645 -787 110 1638 442 -818 -193 1532 283
2907B83j298Q55J530p05k212J182J693r70j663Q67J805o90j980P02J595n88j877
$$ 283 -1015 -160 1370 665 -1547 -365 1328 358 -1305 -438 1367 677 -1303 -601 994 406 -1471
2924a471Q86K093j074j820Q53J582o27k003J066J707r52j610O12J739q78j360
$$ -1471 -585 1508 434 -1386 -533 1049 422 -1581 -515 1192 240 -1370 -758 981 103 -1257
2940a257N05J453p59j094J98J931p57j802P27J634l77j799Q48J245j91j682M12
$$ -1257 -752 701 -58 -1152 -954 977 220 -1582 -855 779 402 -1397 -549 696 505 -1177 -765
2957g65J602n71j441M46J275l11j183o4J541M38k141K82J813j33j799j84J795
$$ -765 837 266 -1175 -729 546 235 -948 -1012 529 967 -1174 -892 921 788 -1011 -1195 600
2974F00J98j874p4J662M81k072k80K030L78j822n15K450k05j949R3J745M04j736
$$ 600 798 -1076 -1150 512 993 -1079 -1359 671 1049 -773 -1288 1162 957 -992 -899 846 1250 -486
2992d86l02J476P25j810n06K113l3j783k82J784P09j938l81J913P3j839j77J586
$$ -486 -788 688 1413 -397 -903 1210 1177 -606 -888 896 1605 -333 -714 1199 1272 -567 -744 842
3010H42L12j877o0J571K93j354l76J495P43j445j060J584P64j396j005J410Q80
$$ 842 1154 -723 -783 788 1081 -273 -649 846 1589 144 -916 668 1432 36 -969 441 1321
3027A321j024j159J082Q59p87j267J347R44j070j156Q20J395j094j306J093J282
$$ 1321 297 -862 220 1079 292 -975 372 1316 246 -910 -90 1305 211 -1095 -2 1280
3043A280j316j008P92J381j238j090J349J289j393j210J160J576j687j188J419
$$ 1280 -36 -1044 -252 1129 -109 -1199 150 1439 46 -1164 -4 1572 -115 -1303 116
3058A16J038j397j480J427J347j176j328R05J572j115j587J366J330j008j500
$$ 116 1154 -243 -1723 -296 1051 -125 -1453 -548 1024 -91 -1678 -312 1018 10 -1490
3073a490J069R34p52j287J099J288j043j072P00J506j049j335Q68J223p82j045
$$ -1490 -421 513 -239 -1526 -427 861 -182 -1254 -554 952 -97 -1432 -564 659 -123 -1168
3089a168Q28P13k39j359O22J038j49j144L35J201k94j396N69J205l27j546K34
$$ -1168 -340 373 134 -1225 -603 435 286 -858 -523 678 384 -1012 -443 762 435 -1111 -877
3106h77J674k62j479M16J211M3j351m30J903J14j727k07K051p0k146M76J651r3
$$ -877 797 535 -944 -528 683 726 -625 -1055 848 962 -765 -972 1079 1009 -1137 -661 990 897
3124H97j766J81J655m3j632L07J379J9j705J87J430j12j313q5J778j32j530P4
$$ 897 -869 -688 967 924 -708 -401 978 997 -708 -521 909 797 -516 -601 1177 1045 -485 -411
3142d11J810m68j254k42J437P3j370m9J313P0j247l05J354L24j462k63J392K28
$$ -411 1399 931 -323 -565 872 945 -425 -474 839 909 -338 -643 711 1035 -427 -690 702 930
3160I30j227l36J342J61r54m42J121M92j111j030J063R21j128n47J037P96r68
$$ 930 -297 -633 709 870 -84 -526 595 1087 -24 -1054 9 930 -198 -745 292 1088 120
3177A20j135J820J80j414p67J587M62j092r36J477N38j246q05J215O99q78r41
$$ 120 -1015 805 985 -429 -1196 391 853 -239 -1175 302 840 -406 -1211 4 703 -175 -1116
3194a116J227O86j201q51J375Q94j523p20Q28J303j323q42J220Q17j243n80R23
$$ -1116 111 797 -404 -1255 120 1014 -509 -1229 -401 902 -421 -1263 -43 774 -469 -1049 -126
3211a26R11p26q96P42Q37j009r25Q14J042r05r01Q61P76p43q25R44Q75p44j483
$$ -126 785 59 -837 -95 742 -267 -1192 -378 664 -241 -1142 -281 495 -248 -1073 -129 746 2 -1481
3230a481R38J296p45p98J81J115k67j139J10J442m47j177N71J229m37j063L04
$$ -1481 -543 753 8 -790 -609 506 239 -900 -790 652 205 -972 -401 828 391 -672 -368
3247c68J264m58j379M96J563p15j473N78J506k78j704O32J300k26j615O82J237
$$ -368 896 438 -941 -445 1118 403 -1070 -492 1014 736 -968 -336 964 738 -877 -195 1042
3264A042m41j264K11J508m24j569M50J346j49j424P80Q39j36j432L95J399m40
$$ 1042 601 -663 -452 1056 632 -937 -487 859 710 -714 66 905 769 -663 -268 1131 691
3281F91r06n0J594p56j022J58J135j25j033J58Q98Lj031j51R28N64j281m37J382
$$ 691 -215 -265 1329 573 -449 -291 844 719 -314 -156 742 745 -286 -437 491 1055 -226 -663 719
3300G19O1j216o1J010K93j236r9Q97M61j536l24J457L58j138m90J099N48j326
$$ 719 780 -436 -497 513 806 -430 -529 368 829 -707 -1031 426 784 -354 -844 255 803 -523
3318e23m25J280O44j717k50J338K53j294k88J329M18j566r1J185M20j248p75J583
$$ -523 -948 332 976 -741 -991 347 600 -694 -982 347 765 -801 -892 293 713 -535 -1310 273
3336B73J72j026n04R04P81j230k81R77M69j002l73Q65M81q73o43R32N16q67q10
$$ 273 445 -581 -1085 -181 600 -630 -911 66 535 -467 -840 25 506 -367 -1010 -78 438 -429 -1239
3355a239J280O17r87m80Q37P06r52n12N67P45o18r74J006N81l59j058R87O91p93
$$ -1239 41 658 -329 -809 28 734 -218 -730 -163 582 -36 -1010 -4 577 218 -840 147 838 45
3374D5r31Q38R95p10j131Q05R04n55r67N32J166o78j010Q19J297j012j270J060
$$ 45 -886 -48 947 237 -894 -89 815 260 -707 -175 991 313 -697 122 1419 407 -863 197
3392A97P64m04j346Q03P77n19j056Q29R55k94j471R83J084p85o47J14Q70m20q27
$$ 197 961 557 -789 14 791 272 -784 45 1000 706 -765 218 1302 517 -130 -16 854 434 -393
3411c93N38Q71m87j155P13P90n27o68pJ297n24q89L89R30p41o07L87Q37l73p33
$$ -393 145 1016 529 -626 87 877 350 -318 -325 972 448 -441 -52 878 137 -470 -83 754 381 -352
3431c52J41J173n07j200O40R81k54j070m3O47J76j002L5R91j75r60P8J105m2j047
$$ -352 -211 962 455 -745 -105 876 622 -448 -491 156 332 -670 -635 356 181 -779 -701 404 362 -685
3451f85p5J115J66j344J80P59L37j269N3J129o2j084k09J408j32j198k23J689
$$ -685 -760 355 521 -823 -643 116 453 -816 -763 366 304 -780 -989 419 287 -911 -1134 555
3469E55n4j019k99J070k8j074J89J099O0j262K88N54M28r77l27J030L30j082j07
$$ 555 501 -518 -817 253 225 -849 -660 439 499 -763 -475 79 507 -470 -797 233 563 -519 -626
3488f26P97M14j107j60Q41M91p65o44Q51L68q50k53P67M86o92p63J310Q1n40n36
$$ -626 171 585 -522 -682 159 650 -115 -759 92 460 -390 -643 124 610 -82 -845 465 546 6 -530
3508e30P63L92l74p89P00L78q22k66N62O89o99p62J021N74o88r76J318N52r82
$$ -530 233 625 251 -538 162 540 -282 -548 14 703 4 -758 263 837 149 -827 491 1043 61
3527F1n57J223J90q15n93J038O17r19q33P82P62j051r9M10P34j009p36Q49J042
$$ 61 -496 727 917 102 -491 547 1164 245 -588 194 956 -95 -194 216 950 -59 -795 54 1096
3546A096r40o53O81Q25r19m87K89Q57p20n63L74R13n26p55M58Q04n34r94P91N41
$$ 1096 156 -497 184 1009 90 -397 -108 749 29 -534 -160 753 227 -528 -70 734 200 -794 -3 538
3566E38q4r64M81O50m28p20L12R11o41m97j3J225o32j091M66J000l86p95K30Q67
$$ 538 454 -510 -29 621 193 -527 -215 696 55 -442 -455 770 138 -953 -487 513 127 -668 -438 429
3586D29l12q78L26O83k18j024N36R29j32j018l5R61J47j540N32Q27k13q51M47
$$ 429 117 -761 -435 248 30 -994 -458 471 339 -679 -714 247 394 -1146 -614 213 0 -851 -404
3605d04R15l80p60K40P13k38m07n17J179j93p34j20J303o26o08L66L00R6n31l
$$ -404 511 131 -629 -389 324 86 -321 -838 341 148 -586 -706 597 -29 -637 -271 29 125 -406 -409
3625d09Q86j24q51J15L70N46r24j35Q87k20o53J39Q50k2p83k36R57K16n19m99
$$ -409 477 353 -498 -383 -13 533 -391 -526 361 141 -512 -373 477 455 -328 -564 393 609 90 -409
3645d09P08P09j064m09Q62L61q30k67J059K5p31l54P90M75j163l52R98L70j035
$$ -409 299 1008 -56 -465 397 758 -72 -339 720 745 14 -340 450 925 -238 -590 408 778 -257
3664b57k35R49P41j327l47R69M50j037m50Q57O57j013l21P09K56p05m97R53N53
$$ -257 -492 457 1198 -129 -476 493 943 -94 -544 313 970 -43 -364 345 601 -104 -601 352 905
3683I05j097k11O08O10j123k09O61K52n83k05N53L49n70l64L93O46o15o94O84
$$ 905 -192 -403 205 815 -308 -517 144 396 -187 -392 161 510 -60 -424 -31 615 0 -694 -10
3702a0M96p23n50O67M15j01q10L13R71p84m65L59M54R0j156M05J079q00p40O87
$$ -10 486 -237 -787 -120 295 194 -616 -303 668 -116 -581 -222 232 322 -834 -429 650 -150 -890 -203
3722b03J158j290m76M51P82k90j224Q28O04n46r39J079L21l02l82K03Q58r62l56
$$ -203 955 -335 -811 -360 422 132 -1092 -264 340 -206 -1145 -66 255 -47 -429 -226 632 -330 -686
3741f86M63O33l34o94O72L16j35j134P87M23l21n28M26L08Mn95K56P12l12o53
$$ -686 -223 410 76 -618 54 370 235 -899 -112 311 -10 -538 -112 196 200 -395 -139 573 261 -392
3761c92k11J360j72p92j23O91O1r45L53L97M07q86Q5O81J37r13OP56q0j032J48
$$ -392 -603 757 585 -207 -330 361 422 -523 -170 227 634 -252 -167 514 651 -262 -256 500 420 -612 -464
3782d64R54j3o82j85J063j3r01k8R28J06p43l03N66N04q64j60R57Nj022L0R63
$$ -464 490 477 -205 -390 673 660 -241 -269 659 765 22 -281 285 789 -75 -235 722 727 -295 -265 698
3803F98N6r86L0P71J05j162J02J060m03o34j30Q84K22q82P9M87N54j119l39P30
$$ 698 754 -232 -202 569 674 -488 -386 674 271 -363 -493 391 613 -269 -190 297 851 -268 -607 123
3823A23Q7j48p08P79l4l21nN71J01n56j91K40O35l10o70R6Q96j042l01Q46J59
$$ 123 210 62 -646 133 99 -222 -227 344 445 -111 -302 -62 573 263 -407 -311 585 -457 -758 88 247
3844B47m36p48R84L05n63l32M66O40n22q10O07L22j0r16N68M93l23o53K38M93
$$ 247 -189 -937 47 352 -211 -543 -77 563 41 -769 -162 160 150 -766 -198 295 -28 -681 -443 50
3864E0k70m46N98L45j55q94M49Q53p44k51L23O82j98j066N28P37o65n76P20Q1
$$ 50 -220 -666 -68 277 122 -772 -323 530 -214 -465 -142 540 342 -724 -196 541 -124 -700 20 101
3884A01K2r70Q10L25l58n62L53O16k13n65L46O98n62m02J30L93m5j35k06P10l50
$$ 101 123 -847 -37 288 -70 -632 -279 337 124 -441 -95 603 41 -361 -231 162 117 -18 -224 486 136
3905A36o07N02O18k14r02J56R99j04q96J9R34Kr60L07Q22l51o64j88J145j46p63
$$ 136 -471 31 649 435 -467 -311 688 584 -312 -293 641 643 -317 -10 812 461 -203 -391 754 608 -155
3926a55o3Q56k78q23JP59K41q36L61L06j28n72J54Q33l59r76P63M47j42o71o7
$$ -155 -218 638 360 -463 -462 297 538 -298 63 369 241 -331 -177 656 297 -679 84 531 389 -282 -349
3947c49O85j22j98k40O35L32j071K57M29J67r90J57O05Q7q34J84O55m2k78o23
$$ -349 336 214 16 -224 411 743 -328 -71 358 525 -465 -308 297 384 -450 -266 389 347 69 -554
3967e54R28k89k59n50O94J43m01m20R59j90k45l07M94M70q01l09O82K14p81LL25
$$ -554 374 85 -174 -724 -30 113 -288 -708 251 61 -184 -491 3 473 -328 -637 45 259 -522 -519 -194
3988a94M20k41l88N44J77r57M2M95K82l97k43K32O56o63m28P00L36q73l22R89
$$ -194 226 -15 -403 141 318 -639 -597 -102 180 -217 -460 -228 428 -235 -663 37 373 -500 -822 167
4008A67K25n52j90J93O85n86n53P93j8k99l65L91N66m13k14M54J18l26o17O01
$$ 167 392 -160 -350 -157 528 -58 -611 182 164 -135 -500 -109 457 44 -170 284 402 76 -541 60
4028F0J87k91k31J92N95j73p18M64M12m95m43M05N40m01l67M19M91l42p09M91
$$ 60 247 -44 -275 -83 512 339 -379 85 497 2 -441 -36 504 103 -264 155 646 304 -405 86
4048H6M65J54j030K13M47o7m28K3P79j82p53J32P95m07n42K04P33l97q66L16O85
$$ 86 551 705 -325 -112 335 268 -160 -137 642 460 -293 -161 634 227 -315 -111 622 225 -641 -325 360
4069C60j41p68K67P98k31o02J83N12k06l36K5P07k81q36K89O35j33m93O9M61j71
$$ 360 219 -549 -282 516 285 -317 -134 378 172 -164 -139 568 287 -549 -260 375 242 -251 -182 279 108
4090A08n94J58O56l58l94J28M83P9o17q7N59J16l71j64N59L2p70j15P52j45k42
$$ 108 -486 -328 328 -30 -424 -296 187 266 -351 -438 121 237 -134 -298 261 293 -477 -592 160 15 -227
4111b27l00O14L69o49l15N46J67n23j72N95J87r01J53P12J6n57k10O32J15o17
$$ -227 -527 87 456 -193 -508 38 205 -318 -490 105 292 -609 -456 256 272 -285 -495 137 252 -365
4131c65m42Q57L53n74m00P93J74r37K11P73j79l73n19M85Q18p78k09O57R4m70
$$ -365 -807 50 403 -171 -571 222 396 -541 -330 443 264 -109 -628 -143 675 -103 -312 345 439 -31
4151c1p7J91j89j23N7R3K68j31l49M69K40p88j14O83K13n17k16P22o9J1n70M06
$$ -31 -108 83 -106 -229 -172 -79 189 58 -291 178 418 -370 -484 199 412 -105 -321 401 332 343 -227 179
4173A79N81q46q3L15L85J7j194Q73K80j79m70K00M19m33m00N00N49n49k41K57
$$ 179 760 -86 -169 146 531 548 -646 227 507 328 -142 58 477 44 -356 144 693 144 -97 160
4193A60L09k04n20O02K48l89l41N4L11l42j56L65K85l51k95L72M71m84k43J87
$$ 160 469 265 -255 347 595 206 -135 -81 230 -112 -268 97 382 31 -264 108 579 95 -148 39
4213C9J35k07k70K44M56l41k79j71O31k51p03P27K79k60m97K36L14j94K5k70M06
$$ 39 174 -33 -303 -59 397 56 -223 -394 237 -14 -717 10 289 29 -468 -232 82 -112 -87 -357 49
4234D9m5l53j49K78N08l16k49K98n1j96l67Q72l88j59l39M89L14n55n5M18K43
$$ 49 4 -349 -498 -220 288 -28 -277 21 -30 -226 -593 279 -109 -268 -607 -118 196 -359 -414 4 247
4255B47p25J62P22m34m18%M73L4m72o4O54j54l63J52K61O3r26N32N42j12l78j88
$$ 247 -478 -316 406 -28 -446 -446 27 61 -411 -475 179 25 -338 -186 75 138 -788 -256 286 174 -204 -392
4277c92O92l21n71L08L01J19m21m7O42K24n85J06q9L21p91K18M79K26n71N0M17
$$ -392 300 -21 -592 -284 17 136 -285 -332 310 534 -51 55 -34 287 -504 -286 193 419 -152 -102 315
4298C15J84p03J67K54J67l04l31O15Jl54JL47k17j28k19M07M55r19M0M07K12m32
$$ 315 499 -204 -37 217 384 80 -251 364 365 11 12 359 142 14 -205 202 657 -262 -222 185 397 -35
4320c5l53N47J70n21k41N97L16j26p54K64P14l42l98J90O43m65r72Q97M37p19
$$ -35 -388 159 329 -192 -433 164 480 354 -400 -136 578 236 -162 28 671 206 -766 131 568 -151
4340a51k68N00O76r72k66M80L69m4p47K86L76o27o9K15R68p43m36L68N62l90m92
$$ -151 -419 81 757 -215 -481 -1 368 324 -423 -137 239 -388 -457 -242 726 -17 -453 -85 477 87 -405
4361d05K81J58j26l68L77J60j3m81K29N82l29p07J91P57m89N9l23Q47m23m99K93
$$ -405 -124 34 -92 -460 -83 77 64 -417 -188 394 65 -642 -451 306 -183 -124 -447 400 -23 -522 -229
4382b29L25K60p43J76N20l89l11m6Q77l29m84L10J79K74p31o7N38l17k56K20O66
$$ -229 96 356 -387 -211 309 -80 -391 -437 440 111 -373 -63 116 390 -341 -408 130 -187 -443 -223 443
4403D43k92l47j6M72n1n44K55M16k44l65K39K59R7o30k0Q20j37o44J30M56j46
$$ 443 151 -196 -212 260 209 -335 -80 336 92 -273 -34 225 322 -308 -328 492 355 -289 -159 297 151
4424A51m33K3P46j88l28J22P5j00j46K41K39l09j93M99q2K33m71RO1M07q11N4
$$ 151 -282 -259 487 299 -29 93 168 68 -78 163 402 93 -100 399 317 550 79 88 149 556 -255 -201
4446b01N57O4k85j44L03K54n07m24N62j04j46m19O67K36l07l01K67M13n65j06
$$ -201 356 420 135 -9 294 548 41 -383 179 75 -71 -490 177 413 106 -195 72 485 -80 -186
4466a86J78M98m22m70P53K54n53n05O69j30j46m12Q61n8o83NN61m1m91N7L23M34
$$ -186 -8 490 68 -402 351 605 52 -453 216 86 -60 -472 389 331 -352 -347 214 173 -318 -261 62 496
4488D96q71P1L66O4R9n59L52O9m39O1M01M21p51k26J88K12p8j32M2K81j00l73
$$ 496 -375 -304 62 126 225 -334 18 87 -352 -291 110 531 -220 -446 -258 -46 -124 -256 -214 67 -33 -406
4510d06K12K51j42k48rN66N2n74J5K52K7l85K2Q12l62n30J75P71n83j40L84J47
$$ -406 -194 57 -85 -333 -342 224 276 -298 -283 -31 -4 -389 -367 445 83 -447 -272 499 -84 -224 160 307
4532C07o78k75O51m3j76l2K13L15n58p4L09P4K99p19M25M28m29k37J44L61j50
$$ 307 -371 -646 5 -38 -214 -246 -33 282 -276 -350 -41 33 332 -387 38 466 37 -200 -56 305 155
4553A55m29J46N10k7n22PM96j48m31L59K17p5n44J59L35J1j30k56L64L4p10M14
$$ 155 -274 -128 382 355 -167 -160 336 188 -243 116 333 258 -286 -127 208 219 89 -167 197 231 -479 -65
4575f5N18p9K8n96K18L62n65L5K14N1m25K06O34j81m61R5L81k16m99N83j26M0
$$ -65 453 374 402 -194 24 386 -179 -144 70 121 -304 -98 536 355 -106 -11 370 154 -345 238 112 152
4597A52q4j46J87J23l53l97L73M26l29K56J44j52j39l03K93J24n26K14L71q7l79
$$ 152 68 -78 109 232 -121 -518 -145 281 -48 208 352 200 61 -242 51 175 -351 -137 234 147 -232
4618b32m7J76K44m17k4L15K2m14J47L31J09n06J34K11o1m23K61L86j55j03l40
$$ -232 -279 -103 141 -276 -300 15 37 -377 -230 101 210 -296 -162 49 -12 -435 -174 212 57 -46 -386
4639c86L51K05m31MJ64K03m64R5K11J55l90k10M20R4qk75K09K85k16m10M94q8
$$ -386 -35 170 -261 -257 -93 110 -354 -259 -48 107 -283 -493 -73 21 13 -262 -53 232 16 -394 100 12
4661A2l07m6L41L54l75l70K67K85m25j91K37M90j98j60p4N47m93l55O85J48k95
$$ 12 -295 -341 0 354 -21 -391 -124 161 -264 -455 -218 272 74 -86 -160 387 -106 -461 224 372 77
$$ [...]
8191B66
##END NTUPLES=NMR FID
##END=
