##TITLE=1H_SAM_22.BBSX1_THF 2.4
 CDCl3, 8 sc, 
 6.5.2019
##JCAMPDX= 6.0         $$ Bruker NMR JCAMP-DX V2.0
##DATA TYPE= NMR FID
##DATA CLASS= NTUPLES
##ORIGIN= UXNMR, Bruker Analytische Messtechnik GmbH
##OWNER= root
$$ XWIN-NMR		Version 3.5
$$ Mon May  6 14:23:18 2019 Russian Standard Time (UT+4h)  she@DPX200
##.OBSERVE FREQUENCY= 200.1315
##.OBSERVE NUCLEUS= ^1H
##.DELAY= (6, 6)
##.ACQUISITION MODE= SIMULTANEOUS
##.ACQUISITION SCHEME= undefined
##.AVERAGES= 8
##.DIGITISER RES= 18
##SPECTROMETER/DATA SYSTEM= spect
##.PULSE SEQUENCE= zg30
##.SOLVENT NAME= CDCl3
##.SHIFT REFERENCE= (INTERNAL, CDCl3, 0, 15.7039)
##AUDIT TRAIL= $$ (NUMBER, WHEN, WHO, WHERE, WHAT)
$$ ##TITLE= Audit trail, XWIN-NMR		Version 3.5
$$ ##JCAMPDX= 5.01
$$ ##ORIGIN= Bruker BioSpin GmbH
$$ ##OWNER= she
$$ F:/spectra/data/she/nmr/H-F/1/audita.txt
$$ ##AUDIT TRAIL=  $$ (NUMBER, WHEN, WHO, WHERE, WHAT)
(   1,<2019-05-06 14:22:06.45 +0400>,<she>,<DPX200>,
      <created by zg, POWCHK disabled, PULCHK disabled
       configuration hash MD5:
       00 E9 B6 7A A2 85 ED C7 34 08 36 98 17 FE 4E 26
       data hash MD5: 16K
       1B 63 5E DD B7 93 10 85 42 EC A4 F1 33 2F B0 82>)
$$ ##END=
$$ 
$$ hash MD5
$$ A4 65 62 31 EE F5 90 96 FA EE 29 3B 20 28 C6 1A
##$RELAX= 
##$RELAX= 
##$RELAX= 
##$RELAX= 
##$RELAX= 
##$RELAX= 
$$ Bruker specific parameters
$$ --------------------------
##$DU= <F:/spectra>
##$EXPNO= 1
##$NAME= <H-F>
##$PROCNO= 1
##$TYPE= <nmr>
##$USER= <she>
##$AMP= (0..31)
100 100 100 100 100 100 100 100 100 100 100 100 100 100 100 100 100 100 
100 100 100 100 100 100 100 100 100 100 100 100 100 100 
##$AQSEQ= 0
##$AQ_mod= 1
##$AUNM= <au_zg>
##$AUTOPOS= <>
##$BF1= 200.13
##$BF2= 200.13
##$BF3= 200.13
##$BF4= 200.13
##$BF5= 200.13
##$BF6= 200.13
##$BF7= 200.13
##$BF8= 200.13
##$BYTORDA= 1
##$CFDGTYP= 0
##$CFRGTYP= 5
##$CHEMSTR= <none>
##$CNST= (0..31)
1 1 145 1 1 1 1 1 1 1 1 1 1 1 1 1 1 1 1 1 1 1 1 1 1 1 1 1 1 1 1 1 
##$CPDPRG= <>
##$CPDPRG1= <>
##$CPDPRG2= <>
##$CPDPRG3= <>
##$CPDPRG4= <mlev>
##$CPDPRG5= <mlev>
##$CPDPRG6= <mlev>
##$CPDPRG7= <mlev>
##$CPDPRG8= <mlev>
##$CPDPRGB= <>
##$CPDPRGT= <>
##$D= (0..31)
0 1.2 0 0 0 0 0 0 0 0 0 0.03 0 0 0 0 0 0 0 0 0 0 0 0 0 0 0 0 0 0 0 0 
##$DATE= 1557138125
##$DBL= (0..7)
120 120 120 120 120 120 120 120 
##$DBP= (0..7)
150 150 150 150 150 150 150 150 
##$DBP07= 0
##$DBPNAM0= <>
##$DBPNAM1= <>
##$DBPNAM2= <>
##$DBPNAM3= <>
##$DBPNAM4= <>
##$DBPNAM5= <>
##$DBPNAM6= <>
##$DBPNAM7= <>
##$DBPOAL= (0..7)
0.5 0.5 0.5 0.5 0.5 0.5 0.5 0.5 
##$DBPOFFS= (0..7)
0 0 0 0 0 0 0 0 
##$DE= 6
##$DECBNUC= <off>
##$DECIM= 24
##$DECNUC= <off>
##$DECSTAT= 4
##$DIGMOD= 1
##$DIGTYP= 9
##$DL= (0..7)
0 120 120 120 120 120 120 120 
##$DP= (0..7)
150 150 150 150 150 150 150 150 
##$DP07= 0
##$DPNAME0= <>
##$DPNAME1= <>
##$DPNAME2= <>
##$DPNAME3= <>
##$DPNAME4= <>
##$DPNAME5= <>
##$DPNAME6= <>
##$DPNAME7= <>
##$DPOAL= (0..7)
0.5 0.5 0.5 0.5 0.5 0.5 0.5 0.5 
##$DPOFFS= (0..7)
0 0 0 0 0 0 0 0 
##$DQDMODE= 0
##$DR= 18
##$DS= 0
##$DSLIST= <SSSSSSSSSSSSSSS>
$$ [...]
##$SUBNAM2= <"">
##$SUBNAM3= <"">
##$SUBNAM4= <"">
##$SUBNAM5= <"">
##$SUBNAM6= <"">
##$SUBNAM7= <"">
##$SUBNAM8= <"">
##$SUBNAM9= <"">
##$SW= 24.9337058887773
##$SWIBOX= (0..15)
0 0 2 0 0 0 0 0 0 0 0 0 0 0 0 0 
##$SW_h= 4990.01996007984
##$TD= 16384
##$TD0= 1
##$TE= 0
##$TE2= 300
##$TE3= 300
##$TEG= 300
##$TL= (0..7)
0 120 120 120 120 120 120 120 
##$TP= (0..7)
150 150 150 150 150 150 150 150 
##$TP07= 0
##$TPNAME0= <>
##$TPNAME1= <>
##$TPNAME2= <>
##$TPNAME3= <>
##$TPNAME4= <>
##$TPNAME5= <>
##$TPNAME6= <>
##$TPNAME7= <>
##$TPOAL= (0..7)
0.5 0.5 0.5 0.5 0.5 0.5 0.5 0.5 
##$TPOFFS= (0..7)
0 0 0 0 0 0 0 0 
##$TUNHIN= 0
##$TUNHOUT= 0
##$TUNXOUT= 0
##$USERA1= <user>
##$USERA2= <user>
##$USERA3= <user>
##$USERA4= <user>
##$USERA5= <user>
##$V9= 5
##$VALIST= <valist>
##$VCLIST= <CCCCCCCCCCCCCCC>
##$VD= 0
##$VDLIST= <DDDDDDDDDDDDDDD>
##$VPLIST= <PPPPPPPPPPPPPPP>
##$VTLIST= <TTTTTTTTTTTTTTT>
##$WBST= 1024
##$WBSW= 4
##$XGAIN= (0..3)
0 0 0 0 
##$XL= 0
##$YL= 0
##$YMAX_a= 376716
##$YMIN_a= -549978
##$ZGOPTNS= <>
##$ZL1= 120
##$ZL2= 120
##$ZL3= 120
##$ZL4= 120
##$ABSF1= 10
##$ABSF2= 0
##$ABSG= 5
##$ABSL= 3
##$ALPHA= 0
##$AQORDER= 0
##$ASSFAC= 0
##$ASSFACI= 0
##$ASSFACX= 0
##$ASSWID= 0
##$AUNMP= <proc_1d>
##$AZFE= 0.1
##$AZFW= 0.1
##$BCFW= 1
##$BC_mod= 2
##$BYTORDP= 1
##$COROFFS= 0
##$CY= 11.3945322036743
##$DATMOD= 1
##$DC= 2
##$DFILT= <>
##$DTYPP= 0
##$F1P= 18.9103706918063
##$F2P= -1.10871071338519
##$FCOR= 0.5
##$FTSIZE= 0
##$FT_mod= 4
##$GAMMA= 1
##$GB= 0.15
##$INTBC= 1
##$INTSCL= 1
##$ISEN= 128
##$LB= 0.24
##$LEV0= 0
##$LPBIN= 0
##$MAXI= 10000
##$MC2= 0
##$MEAN= 0
##$ME_mod= 0
##$MI= 1.114404
##$NCOEF= 0
##$NC_proc= 0
##$NLEV= 6
##$NOISF1= 3.799351
##$NOISF2= 2.8
##$NSP= 1
##$NTH_PI= 0
##$NZP= 0
##$OFFSET= 15.70392
##$PC= 1
##$PHC0= -8856.837
##$PHC1= 18.60026
##$PH_mod= 1
##$PKNL= yes
##$PPARMOD= 0
##$PSCAL= 0
##$PSIGN= 0
##$REVERSE= no
##$SF= 200.130013532006
##$SI= 16384
##$SIGF1= 3
##$SIGF2= 2
##$SINO= 400
##$SIOLD= 16384
##$SREGLST= <1H.CDCl3>
##$SSB= 0
##$STSI= 0
##$STSR= 0
##$SW_p= 3612.71676300578
##$SYMM= 0
##$S_DEV= 0
##$TDeff= 0
##$TDoff= 0
##$TI= <>
##$TILT= no
##$TM1= 0
##$TM2= 0
##$TOPLEV= 0
##$USERP1= <user>
##$USERP2= <user>
##$USERP3= <user>
##$USERP4= <user>
##$USERP5= <user>
##$WDW= 1
##$XDIM= 8192
##$YMAX_p= 0
##$YMIN_p= 0
$$ End of Bruker specific parameters
$$ ---------------------------------
##NTUPLES= NMR FID
##VAR_NAME=  TIME,          FID/REAL,        FID/IMAG
##SYMBOL=    X,             R,               I
##VAR_TYPE=  INDEPENDENT,   DEPENDENT,       DEPENDENT
##VAR_FORM=  AFFN,          ASDF,            ASDF
##VAR_DIM=   8192,          8192,            8192
##UNITS=     SECONDS,       ARBITRARY UNITS, ARBITRARY UNITS
##FACTOR=    0.0002004,     1,               1
##FIRST=     0,             0,               0
##LAST=      1.6414764,     0,               0
##MIN=       0,             -549978,         0
##MAX=       1.6414764,     376716,          0
$$ Real data points
##PAGE= N=1
##DATA TABLE= (X++(R..R)), XYDATA
$$ [...]
2777e48l311N911K884o531l509O476L242m016l571L622K181l403k058L807L030
2792D206l549l866K239M238j626m263J963M363k598n576K264P324j945p483J548
2807b761O628k202o241L349O057l373p152L027O989k841n839L712M676m518m685
2822e174M689N025l686n435L193L939k182l235K490L128k636l460J473M065k13
2837A981l711n40L341L31m261n2N557J221p200j706O796K351o569j994P409Q40
2853C794q692j023R693J374q681j407Q252M4q069J179R112j503r079P54Q323p42
2869C329o494J541N864k281o267J934N900m73m548j84L075M07l174J3L424J017
2885C083l811k673L906L232l238l377L206L452m146l920M968N500n565n963N290
$$ plain form
2777 -548 -3859 2052 4936 -1595 -5104 1372 4614 598 -2973 649 2830 -573 -2631 1176 4206
2792 4206 657 -3209 -970 3268 1642 -2621 -658 3705 1107 -4469 -2205 5119 3174 -4309 -2761
2807 -2761 3867 1665 -4576 -1227 4830 1457 -5695 -2668 4321 1480 -4359 -647 4029 -489 -5174
2822 -5174 -485 4540 854 -4581 -1388 2551 369 -2866 -376 2752 116 -3344 -1871 2194 1981
2837 1981 -1730 -2270 1071 1402 -2859 -2911 2646 3867 -3333 -5039 1757 4108 -2461 -4455 2954 3794
2853 3794 -4898 -5921 3772 5146 -3535 -4942 3310 3354 -4715 -3536 5576 4073 -5006 -4252 4071 3329
2869 3329 -3165 -1624 4240 1959 -4308 -2374 3526 3053 -1495 -1679 1396 1803 -1371 -1358 2066 3083
2885 3083 -728 -3401 505 3737 499 -2878 328 3780 -366 -4286 682 6182 617 -5346 -56
2900e6N905n789n083O506M953p352n029P607N121o492m940N882L871o193l430
2915d519P060L267o460m250N127L756l874l148M231K711m320l840L914M283k033
2930A905n105J686M337j987m470K543N593k936o420K263O300j795n938K145O359
2945D480l510o222L172P127l293o741L173N876l090n940L900N404l691n649L284
2960a720N493k275n280K047L812j831l874J902M713q76n058o23M701J273l945
2975a541j328M089J269n561j656O770K603o617l036O282K176o514j080P948R79
2990D783q453j557P649J481o667J2O902j171p460Q45P435m79o573P92N332j114
3006A757m884J650M858j420m135J76L592K35k825j54K020J137k721j382L080K451
$$ plain form
2900 -56 5849 60 -5023 1483 6436 -916 -5945 1662 6783 291 -4649 1233 5104 -1089 -4519
2915 -4519 2541 5808 -652 -4902 225 3981 107 -3041 1190 3901 -419 -4259 -345 3938 1905
2930 1905 -3200 -1514 2823 836 -3634 -1091 4502 1566 -4854 -2591 3709 1914 -4024 -1879 4480
2945 4480 970 -5252 -2080 5047 1754 -4987 -1814 4062 972 -4968 -1068 4336 645 -5004 -1720
2960 -1720 3773 1498 -3782 -1735 2077 246 -3628 -1726 2987 2111 -2947 -3570 1131 2404 -1541
2975 -1541 -2869 1220 2489 -3072 -4728 2042 4645 -1972 -5008 1274 3450 -3064 -4144 3804 4783
2990 4783 -3670 -5227 2422 3903 -2764 -2752 4150 2979 -4481 -3636 3799 3320 -3253 -2461 2871 1757
3006 1757 -3127 -1477 3381 1961 -2174 -1998 1594 1829 -996 -1150 870 2007 -714 -2096 984 3435
3022C435k605l660K054M281k244m240L252M339m075m935M407N425l774n428L923
3037A55M534m735m108N373M673o059m286M763L971m844k452N140J541n216k550
3052d100N149K863m338j918L241J104l494j028L480K190l266k510K214K664j534
3067G17k422J417K827k069l546K076M329j705m909J681M447j774m504K285M876
3082C726l101n124K894N397k617m918K574L820k853l907L789L673l185l586J595
3097a823L478j525k380J660K500k264k758J637L201k46k917k58K306J01k927N04
3113a711M140J55n100q89M989J183m733o41N390l71o131N76O833j14p126J086
3129b464N829j611n575J886O430k295o467J749O142j893m579K125L767k097m092
$$ plain form
3022 3435 830 -2830 -776 3505 1261 -2979 273 4612 537 -4398 9 5434 1660 -3768 155
3037 155 4689 -46 -4154 1219 5892 -167 -4453 310 4281 -563 -3015 2125 3666 -1550 -4100
3052 -4100 1049 3912 -426 -2344 897 2001 -1493 -2521 959 3149 -117 -2627 -413 2251 717
3067 717 -1705 -288 2539 470 -3076 -1000 3329 1624 -3285 -1604 2843 1069 -3435 -1150 3726
3082 3726 625 -4499 -1605 3792 1175 -3743 -1169 2651 -202 -4109 -320 3353 168 -3418 -1823
3097 -1823 1655 130 -2250 -590 1910 -354 -3112 -1475 1726 1480 -1437 -1695 611 712 -2215 -1711
3113 -1711 2429 2584 -2516 -3405 1584 2767 -1966 -2607 2783 2412 -3719 -3143 3690 3576 -3550 -2464
3129 -2464 3365 1754 -3821 -1935 4495 2200 -4267 -2518 3624 1731 -2848 -723 3044 947 -3145
3144c145K085M407j773l261O21J988J97j757K79K128k99k531j334K904K692k633
3160E68k606K356K469l175k390L997L462m379m139M296L591m457k898N351K374
3175D420o224k802O453K985n976k620N770J673n884r79O111J124n906j698N092
3190A539J745m490r36L890J035m498j169M102K251l464k651K245K770k204k670
3205b505K535L178l197l597K287M536j939m386J999L998k857m172L241N170l534
3220G57n087L018M224k640l868L766L265l964m172L748M135k572l646K271K572
3235A807k361k943K879L569k294l935R29M056q13k948O68L264r62m351N03N604
3251B672L63n362q91N112J63n183M44O329n67o961N4O753L01o285O61N885j612
$$ plain form
3144 -3145 -1060 3347 1574 -1687 -1066 922 1119 -638 -359 1769 1470 -1061 -2395 509 3201 568
3160 568 -2038 318 2787 -388 -2778 1219 4681 302 -3837 459 4050 -407 -3305 2046 4420
3175 4420 -1804 -4606 1847 4832 -1144 -3764 2006 3679 -2205 -3184 2927 4051 -1855 -3553 1539
3190 1539 3284 -1206 -2142 1748 2783 -1715 -2884 1218 3469 5 -2646 -401 2369 165 -2505
3205 -2505 30 3208 11 -3586 -1299 3237 1298 -3088 -1089 2909 52 -4120 -879 4291 757
3220 757 -4330 -1312 2912 272 -3596 170 3435 -529 -4701 -953 3182 610 -3036 -765 1807
3235 1807 -554 -3497 -618 2951 657 -3278 -2349 1707 894 -2054 -1386 1878 916 -3435 -2932 2672
3251 2672 3035 -2327 -3218 1894 2057 -3126 -2682 3647 3080 -3881 -3827 2926 3227 -3058 -2397 3488 1876
3268A876n996J758O430j642n644J241M471j269l619J983L597j819l682N46L896
3283B127J26k688m34J952K18k430j37K445K116l113k554K298L331k610k463K742
3299I26K776m375l083M876L759m370m486M877L138m807k795N877K700o180l061
3314d228N165K906m282k378M686J171m931j558N468J595l999j845L367J112l175
3329i26m81L104N73k607j618J576K687j384k340J036J831j448k275J707L553k163
3345H25m028J427L964j653l107K114L393l128m292L195M513k536m212K611L150
3360B236k959k936L291L362l131l220K324K715j585k480K341J890k483k465K424
3375f76K699j166k490k39K404L71k634K04L278n00l488o09M021O76l489m37L656
$$ plain form
3268 1876 -4120 -2362 4068 2426 -3218 -1977 2494 1225 -2394 -411 3186 1367 -2315 -1769 2127
3283 2127 2253 -435 -869 1083 1301 -1129 -1266 1179 3295 182 -2372 -74 3257 647 -1816 926
3299 926 3702 -673 -3756 1120 4879 509 -3977 900 4038 -769 -3564 2313 5013 -1167 -4228
3314 -4228 937 3843 -439 -2817 1869 3040 -1891 -3449 2019 3614 -385 -2230 1137 2249 -926
3329 -926 -1407 1697 2270 -337 -1955 -379 2308 924 -1416 -380 1451 3 -2272 -565 2988 825
3345 825 -3203 -1776 2188 535 -2572 -458 2935 -193 -4485 -1290 3223 687 -3525 -914 2236
3360 2236 -723 -3659 -368 2994 -137 -3357 -1033 1682 97 -2383 -42 1848 -635 -3100 -676
3375 -676 2023 857 -1633 -1872 532 903 -1731 -1527 1751 1251 -2237 -2846 1175 1851 -1638 -2075 1581
3392A581j45m533J162M798l92n138M75M711j011m341J826M510k633m359K209M285
3408C005j516l181J267K804j834k950K643K547j501k596R31J643n90j494R81J346
3424A505m00k025l53K196J443j834k162J961J677j995j799K895K447m150k350
3439b944L808K589l945j542L880J350n113n43M958J370n129j451M564O16m138
3454a670J67M400k97m786J6M111J53l330K91K865j061k918N42L272j10k592j100
3471b047J725J278j583q66K068R76k262k324K373L113k188k803K072K458k873
3486h83k169L333L075l586l497L065L420l310k342L090K340l649k590L823K644
3501B764l596j861K626J735k694j171K532J446j928k551J715K517j254k157J079
$$ plain form
3392 1581 1436 -3097 -1935 2863 2471 -2667 -2192 2519 1508 -2833 -1007 3503 870 -3489 -1280 3005
3408 3005 1489 -1692 -425 2379 545 -2405 238 2785 1284 -1312 -381 1262 672 -822 159 1505
3424 1505 1105 -920 -1273 923 2366 532 -1630 331 2008 13 -1786 1109 3556 -594 -2944
3439 -2944 864 3453 -492 -2034 1846 3196 -1917 -2460 2498 3868 -1261 -2712 1852 2468 -1670
3454 -1670 -1503 2897 2600 -2186 -2170 1941 2094 -1236 -945 1920 859 -2059 -1517 1755 1645 -947 -2047
3471 -2047 -322 956 -627 -1493 575 1551 -711 -3035 -662 2451 263 -2540 -468 1990 -883
3486 -883 -3052 281 3356 -230 -3727 -662 2758 -552 -2894 196 2536 -1113 -3703 120 2764
3501 2764 -832 -2693 -67 1668 -1026 -2197 335 1781 -147 -2698 -983 1534 280 -1877 -798
3516g98K315j482k862J679L599q67m017N89L866k87m233J826L699j897m685J593
3532a962N437j361m881J507M687k417m428K986M621k750m242J799L490j453k921
3547a888K183K658k478k883J679L198j125k099K32J425M7j839L23K410j87k345
3563f89j204K499J716k074j764K480J414l079j907L970K272m610j908L885K035
3578C036m189j420M694J231n479j028N317R71m537p79M299J6m696L12M591L19
3594B658m243n05K977N21k788M3K894J3l043n83K013J613j780j394J263J298j554
3611e97j429J899K616k015l310J460L352j409l015K182K750k954k872K755L473
3626B886k800l195K702K344k604k359L469K102l048k674K861K216k286j608K155
$$ plain form
3516 -798 1517 35 -2827 -1148 2451 1584 -2433 -1844 2022 1735 -2498 -672 3027 1130 -3555 -1962
3532 -1962 3475 2114 -2767 -1260 3427 1010 -3418 -432 4189 1439 -2803 -1004 2486 1033 -1888
3547 -1888 295 2953 475 -2408 -729 2469 1344 -755 -523 902 949 -890 -567 1843 1656 -689
3563 -689 -1893 606 2322 248 -1516 964 2378 -701 -2608 1362 3634 -976 -2884 1001 3036
3578 3036 -1153 -2573 2121 3352 -2127 -3155 2162 3133 -1404 -2183 2116 2132 -2564 -2252 2339 2658
3594 2658 -1585 -2090 887 1408 -1380 -1337 1557 1570 -1473 -2056 -43 1570 -210 -1604 -341 957 -597
3611 -597 -2026 -127 2489 474 -2836 -1376 1976 567 -2448 -266 2484 -470 -3342 -587 2886
3626 2886 86 -3109 -407 1937 -667 -3026 443 2545 -503 -3177 -316 1900 -386 -1994 161
3641A61J459k062j771J965K002j412k100J165J482l02j677O38K291p92l180O18
3657a515L510n78k689M6L079r18l358J437L716j009l557L9L964r86l075J769K869
3674B744j704l761K039L110j335k559J421J805j624j724J776J957j099k075R47
3689h2J256p80r48M00J354k26j338k76J232J141j762j250K052Q15k014r53K650
3706A271J112l031j396L172J675l636j442L516J041l866q73M158Q88m473j58L573
3722A531K26m026R42L145o23l376O07L144p37k532J051J805r09j496N6K025k56
3739E77j264k59R60N91j351l86J282P94j357j243J265J772j379k071J510K252
3755A693k054k079K436J904k495k120K768K462l419j836L243J548l101j431L389
$$ plain form
3641 161 1620 -442 -2213 -248 1754 342 -1758 -593 889 587 -1090 -452 1839 1047 -2133 -1515
3657 -1515 1995 1417 -1272 -1226 1853 935 -2423 -986 2730 1721 -1836 -1797 2167 1181 -1894 -125 2744
3674 2744 1040 -2721 -682 2428 1093 -1466 -45 1760 136 -1588 188 2145 1046 -1029 -82
3689 -82 1174 394 -554 -154 1200 974 -364 -640 592 1733 -29 -1279 773 1588 -426 -1379 1271
3706 1271 2383 -648 -2044 1128 2803 -833 -2275 1241 2282 -1584 -2457 1701 2589 -1884 -2042 1531
3722 1531 1757 -2269 -1327 1818 1195 -2181 -1574 1570 833 -1699 -648 1157 248 -1248 -1192 833 577
3739 577 -687 -946 14 605 -746 -1132 150 944 -413 -1656 -391 1381 2 -2069 -559 1693
3755 1693 -361 -2440 -4 1900 -595 -2715 53 2515 -904 -2740 503 2051 -1050 -2481 908
3770I08J152l042j118K900R46k475j207K748O30k500o37K053R95j432r92J468
3786C97R60j407j275J362J833j165k087Q54K366r71k435J525K463j816k601J648
3802c49K847j577l248J905L120k459k370K294K671k444k591K193K425k028k049
3817a660J885J958k150j440J420K003j503j543J156J511r27j403K50J432K26j865
3833f50n11K276N83k325r90K406J080k653p06K848O49l464l08L565J96l688L7
3850a655L559o8m372L34M463n74m117P48L441j002l049J036L396j451k955J207
3866a059K646j004k221P53K036n46j954k0K121P6j735o48J700Q87j625j212J534
3883b71J850j927j978K098J990j598k577K344K059k208k206K118K663k849k371
$$ plain form
3770 908 2060 -982 -2100 800 1746 -729 -1936 812 1442 -1058 -1695 358 1353 -79 -1071 397
3786 397 1357 -50 -1325 37 1870 705 -1382 -528 1838 867 -1568 -43 2420 604 -1997 -349
3802 -349 2498 921 -2327 -422 2698 239 -2131 163 2834 390 -2201 -8 2417 389 -1660
3817 -1660 225 2183 33 -1407 13 2016 513 -1030 126 1637 710 -693 -443 989 1215 -650
3833 -650 -1161 1115 1698 -627 -1617 789 1869 -784 -1490 1358 2007 -1457 -1765 1800 1996 -1692 -1655
3850 -1655 1904 1836 -2536 -2202 2261 1687 -2430 -1682 1759 757 -2292 -1256 2140 689 -2266 -1059
3866 -1059 1587 583 -1638 -885 1151 605 -1349 -1369 752 828 -907 -1555 145 1032 -593 -1805 -271
3883 -271 1579 -348 -2326 -228 1762 164 -2413 -69 1990 -218 -2424 -306 2357 -492 -2863
3898b863K734K190k780j339K769J478k827j527K792J630k809j145K200J100k427
3913h24o93K290J029j804j429J560J175j405j150J318J581j205k058J365J931
3928A681j097j994R04K359j354k226J087L281j454l123J325L066j861k412J715
3943a03K747j916k812K241K002j420k503K069J811j686j727J392J353r22j397
3958h71O93J936j232j158M75Q78o0j242k21J624L21j597n02J665L48j623q78K399
3976I55O72k629r09K914P02l413n8L252k0l367j25L527J8l227J31L482j017k836
3994a948P14L156r85k804O07K618j326j502N29J845o68j359K20J284o09n86J32
4011f82Q16J8q67l83R95R54j179j279J206J268q95j424J038J810j593j742J889
$$ plain form
3898 -2863 -129 2061 -719 -2058 711 2189 -638 -2165 627 2257 -552 -1697 503 1603 -824
3913 -824 -1517 773 1802 -2 -1431 129 1304 -101 -1251 67 1648 443 -1615 -250 1681
3928 1681 584 -1410 -506 1853 499 -1727 -640 2641 1187 -1936 -611 2455 594 -1818 -103
3943 -103 2644 728 -2084 157 2159 739 -1764 305 2116 430 -1297 95 1448 526 -871
3958 -871 -178 1758 526 -632 -157 721 661 -581 -802 822 1143 -454 -956 709 1057 -566 -1444 955
3976 955 1627 -1002 -1911 1003 1705 -1708 -1766 1486 1466 -1901 -2026 1501 1519 -1708 -1577 1905 888 -1948
3994 -1948 -1234 1922 937 -1867 -1260 1358 32 -1470 -941 904 236 -1123 -903 381 -228 -814 -682
4011 -682 134 152 -715 -1098 -103 851 -328 -1607 -401 867 -28 -1452 -414 1396 -197 -1939 -50
4028e0J921k058j758K220J151k091j243K802J029k999n20K272R63k302p04K354
4044I87M93k527m45K406N52k060m48J394Q03j617l47J124O69q27j342J355J386
4061A556r87j501R33J590j112j601J438J382q21k135J384J677j160k075J672K090
4077B330j878k063J613J916j820j349J480J663k017j243J765J105j626p92J327
4092D11Q59j440n46R34J165j307j120P77R73k02j113L89Q79L4j531J89J783J47
4110A281k211l32K022N32k691K15K418jk732j5K871l35k710Q39K408r11k629R25
4128a056K596j048k486J154K341j333k140J626J567j167j745J398J437j262o51
4143g69J59J026m16q99J20R77J27j209k70J140P86j362p11J467J231j977j341
$$ plain form
4028 -50 1871 -187 -1945 275 1426 -665 -1908 894 1923 -1076 -1596 676 1639 -663 -1367 987
4044 987 1480 -1047 -1492 914 1466 -594 -1042 352 1155 -462 -809 315 984 157 -1185 170 1556
4061 1556 569 -932 1 1591 479 -1122 316 1698 877 -1258 126 1803 643 -1432 240 2330
4077 2330 452 -1611 2 1918 98 -1251 229 1892 -125 -1368 397 1502 -124 -916 411
4092 411 1270 -170 -716 218 1383 76 -1044 -267 706 504 -609 -220 659 693 -838 -649 1134 1281
4110 1281 -930 -1262 760 1292 -1399 -1184 1234 1233 -1499 -1514 1357 1022 -1688 -849 1559 648 -1981 -1056
4128 -1056 1540 492 -1994 -840 1501 168 -1972 -346 1221 54 -1691 -293 1144 -118 -769
4143 -769 -610 416 0 -899 -779 198 325 -884 -1154 -14 772 -590 -1301 166 1397 -580 -1921
4160a921J882J520j704j341J975J074k190j053K528R64k393j339K759J163k524
4175f00r35K599J90k216m23K477L87k245l55J773L72j772K18J314O54j343q38
4192g43J287R23r90j509J318J072r69j317J397J397j344j479Q82J773j202j914
4208a418J503K020j865j981J652J944j492j799J487J954j933j637J814J844j894
4223A99j752J821Q15j024r79J369Q13r20j631J099R20m1j479J30J356j01j536
4240i41k3J882l83j448l60K241K62k494p8K328m6k232k62K688j2k811J42K766
4258A219m24k768R75K491j023k533J143K202j237j496O88K045q78j921R45J913
4274A341r92j481M59J086p27p34M56Q79kj035l2R34M68j039j096J071J494j611
$$ plain form
4160 -1921 -39 1481 -223 -1564 411 1485 -705 -1758 770 1734 -659 -1998 761 1924 -600
4175 -600 -1535 1064 1254 -962 -1385 1092 1479 -766 -1121 652 1024 -748 -530 784 1438 95 -743
4192 -743 544 1467 477 -1032 286 1358 389 -928 469 1866 522 -957 -75 1698 496 -1418
4208 -1418 85 2105 240 -1741 -89 1855 363 -1436 51 2005 72 -1565 249 2093 199
4223 199 -1553 268 1083 59 -920 449 1262 342 -1289 -190 730 689 -790 -660 696 595 -941
4240 -941 -964 918 535 -913 -1273 968 1230 -1264 -1342 986 940 -1292 -1554 1134 1122 -1689 -1547 1219
4258 1219 795 -1973 -998 1493 470 -2063 -920 1282 45 -1451 -763 1282 404 -1517 -572 1341
4274 1341 349 -1132 -673 413 -314 -1048 -592 287 285 -750 -782 152 620 -419 -1515 -444 1050 -561
4292e61p82J351J582j573j807J866J407j727r59J773R32k065j321K311J098k257
4308g32n73K058M83k154J85J861k87j785m1J800N9j359Q5J276M5j248k56J350
4326G67J72p87n47O76P99q11p83O65Q54j128r86R68J258n88k006J483J583j014
4344E75j771J545J033j094j648J520J160j447j005J605Q39j175j551J962P94j322
4360B0r90J261O42j090o15J326M48p73p98P33O14n28q77M88P63l13j192J84J558
4379H61l42j553K78J554l55j713M04J943o62k166O84K448r51k014O68K144q69
4396C59k077J082J948j245k190J406K214j580j122J272Q18j320q30J311P01r74
4412b27l85K01O87l29l08J82M53J71r90J5N04K63n01l03N02N66j270j72J321R02
$$ plain form
4292 -561 -1343 8 1590 17 -1790 76 1483 -244 -1203 570 1502 -563 -1884 427 1525 -732
4308 -732 -1305 753 1236 -918 -733 1128 841 -944 -985 815 874 -485 -400 876 921 -327 -583 767
4326 767 939 152 -395 281 1080 269 -514 151 1005 -123 -1109 -141 1117 529 -1477 6 1589 575
4344 575 -1196 349 1382 288 -1360 160 1320 -127 -1132 473 1312 137 -1414 548 1342 20
4360 20 -970 291 933 -157 -772 554 1002 229 -569 164 778 250 -627 -139 624 311 -881 -697 861
4379 861 519 -1034 -756 798 443 -1270 -866 1077 415 -1751 -1067 1381 430 -1584 -916 1228 359
4396 359 -1718 -636 1312 67 -2123 -717 1497 -83 -1205 67 885 -435 -1265 46 747 -227
4412 -227 -612 -411 276 -53 -361 -179 274 445 -545 -530 -26 237 -264 -567 -65 501 -769 -941 380 1282
4432A282k110p03J925J011j666j243K514K65k318k02K287K94k396j10K220j0k020
4449i80N84J854l06k177K33J951j14j442M09J179k59j556M7J133K65q94m56Q60
4467C31N95q10q29R24J018r06j238J138J103j015j112P91J277j260j232J884J060
4484A719j635j297J302J441j759q29J888N30j802p29J670J170j855q13J135O75
4500H11j271m32J380O46j066p71J85J155m18j074L50R77j79j457O20J556j75j978
4518a141M62J676m85j712L08J975n78k091M82K313p47j957R77J356j008j495J650
4535a5J407j371j381P18J442j031r37J001R63j172p63P66R53l55o22j27Q71l83
4553c6m30l97J117O85j435l44Q69O50r18o45J087J000j663q17J853J110k004r14
$$ plain form
4432 1282 -828 -1531 394 1405 -261 -1504 1010 1275 -1043 -1245 1042 1336 -1060 -1170 1050 1040 -980
4449 -980 -396 1458 1152 -1025 -792 1159 1045 -397 12 1191 932 -624 -577 556 821 -73 -529 331
4467 331 926 116 -713 211 1229 323 -915 223 1326 311 -801 -10 1267 7 -1225 659 1719
4484 1719 84 -1213 89 1530 -229 -1058 830 1360 -442 -1171 499 1669 -186 -999 136 811
4500 811 -460 -892 488 1134 68 -703 -518 637 219 -855 -505 472 293 -1164 -544 1012 837 -1141
4518 -1141 -679 997 512 -1200 -892 1083 505 -1586 -1104 1209 462 -1495 -518 838 -170 -1665 -15
4535 -15 1392 21 -1360 -642 800 -231 -1168 -167 796 -376 -1139 -373 580 225 -397 -524 347 -36
4553 -36 -466 -863 254 939 -496 -840 29 679 -239 -884 203 1203 -460 -1277 576 1686 -318 -1232
4571a232J971N25j998j34K105L9k131l78K176L34k183j10J938k2j778M87J332
4588I41P0j736K50J164m8r86O5J032r3j019r7Q22K43n54m38J93P22k37o19P18
4608C93R55j051j410R29J525j200j043J177J308j825q55J353J113j090j085J088
4624B82P86j567m01J296P58j533q99J457N90r34n56Q50M31p86o72Q04M81k49q33
4643f95L58Q29l95q47L30J132n59j499P01J437k11j641P00R44p17j053J046J435
4661A295j306j661R13J571n45j230R60Q21j014j557J167J547j122q51P97P09j046
4678e52n02J412K50p26l03P8O08k36l96J94N32j87l97l82J003L14q09o10P93Q45
4698I29j070n76J256O77j890j31J489M69j855k85J876j26j815L42J851j94j686
$$ plain form
4571 -1232 739 1264 -734 -868 1237 1276 -855 -1233 943 1277 -906 -1016 922 900 -878 -391 941
4588 941 1011 -725 -475 689 641 -345 -280 752 659 -360 -457 365 608 54 -384 -191 531 294 -325 393
4608 393 1348 297 -1113 -184 1341 141 -902 275 1583 -242 -1097 256 1369 279 -806 282
4624 282 1068 -499 -900 396 1154 -379 -1278 179 769 -165 -721 129 560 -226 -898 -94 387 138 -695
4643 -695 -337 492 97 -750 -420 712 153 -1346 -645 792 581 -1060 -360 584 -133 -1186 -140 1295
4661 1295 -11 -1672 -759 812 267 -963 -3 818 -196 -1753 -586 961 -161 -1012 -215 494 -552
4678 -552 -1054 358 608 -118 -421 -343 265 29 -367 -173 359 172 -225 -607 396 710 -99 -709 84 929
4698 929 -141 -717 539 1216 -674 -805 684 1153 -702 -987 889 763 -1052 -710 1141 947 -739
4715g39P5J608j57j722P17J287m06j609O76J441o57j007N15N56l76r18P48J196
4733A228p53q42J33P53J40k78l72K96L57q05l58R99O52j029j205J192O63p82r40
4752i51J466Q15j815q38J746O09j338m26J196K23j253n47J725L24j330m44J086
4769B48L47j048j70R07M65j151m89O86O81m86n85L97N16n75o77P63J167p87j220
4788a011J65J420j08j543Q93J126p53j669Q87J735r41j607J136J375j209j393
4804a497J469J175j326j089R03Q49n16m48O42m7m93n70R71M51k85p68K58O66l38
4823Gk41M7Q55Rr20m19R12N25r24l69R61K83j444O7J444L77j649m57J578L81j768
4844g45J77J869k17k116J40K100r9j789M22R84j57j331N00J336m99j209K88J165
$$ plain form
4715 -739 -664 944 787 -935 -218 1069 663 -946 -270 1171 514 -493 22 578 202 -716 32 1228
4733 1228 475 -367 -234 519 659 381 9 305 662 -143 -501 498 1150 121 -1084 108 771 -11 -951
4752 -951 515 1330 -485 -1323 423 1032 -306 -732 464 687 -566 -1113 612 936 -394 -838 248
4769 248 595 -453 -623 284 749 -402 -891 -205 476 -10 -595 -198 318 -257 -934 -171 996 209 -1011
4788 -1011 -846 574 466 -1077 -184 942 189 -1480 -593 1142 201 -1406 -270 1105 -104 -1497
4804 -1497 -28 1147 -179 -1268 -365 484 -32 -480 162 115 -378 -948 23 474 189 -579 -321 345 7
4823 7 -234 -187 668 677 -243 -662 250 775 -149 -518 443 726 -718 -651 793 1170 -479 -936 642 1023 -745
4844 -745 -568 1301 1084 -1032 -892 1208 1109 -680 -258 726 569 -762 -262 1074 575 -634 -346 819
4862H19n55n27M65J086j173o49L30O98K64q08m60P22L81n24o39R67K81r48p59
4881a029P83J073o50q43Q80N89j182p89J214J205j503q60J237N24j221k15J124
4898C37M15j529K9J261J86j142PP01j92m59o81J079N28p86p86N16P49Q1q37L43
4918a80P02o40n42K68J040m49j257N51O58K5j253O94J131p14j288P64R72m70j068
4937a056J312L15r80p45J388Q34j022q98P65O86r18n8Q12J24l77p77N29M68k75
4956A27K02m34K30N0m52L76L56K27j045k15N65Q13o64m73R50o9q43l47J432L91
4976A177j410k32J242J29j381J72J443r6j732J69J318k11j297O18J513r84j142
4993g04P85O19j85j122O86M82m18o98P70M79n10n66J29N78L6j32o42M98J11l5
$$ plain form
4862 819 264 -263 202 1288 115 -534 -204 494 758 -50 -510 212 593 69 -570 397 678 -270 -1029
4881 -1029 -246 827 177 -666 214 803 -379 -1168 46 1251 -252 -1112 125 649 -572 -787 337
4898 337 752 -777 -748 513 699 -443 -436 265 73 -386 -1067 12 540 -246 -1032 -516 233 314 -523 -180
4918 -180 522 -118 -660 -392 648 199 -1058 -507 151 176 -1077 -383 748 34 -1254 -490 482 12 -1056
4937 -1056 256 571 -409 -1154 234 1068 46 -852 -87 599 -319 -377 435 559 182 -595 -66 402 127
4956 127 329 -105 125 175 -277 99 455 682 -363 -578 -13 800 136 -337 613 544 -299 -646 786 1177
4976 1177 -233 -465 777 906 -475 -303 1140 1044 -688 -519 799 588 -709 -91 1422 438 -704
4993 -704 81 700 515 -607 79 561 143 -555 215 694 184 -382 -253 325 361 229 -413 85 196 161
5013A61n61P24M83j177o19J003N98r30m30J121M86j297p29J749j0q35o78J164
5031B23K93j278J16J061J78j427M9R34K38r46M82L37Nj028q0N60O82m85o22O80
5051b8J91m62o7M83J27m16q02N58P86m55l86L28O37q59n10J037P14o62j080P76
5071i0Q32r19p26J287L08j304j66O38Q35o61l74N26K74j154M2J124L63o88k28
5090h1J06L23j14n3K3J07j68n01J38P71L35j073j73R85j51r27K46R20J22j449
5110f14N5J321j04j063L47J137n08j638P39J526n69j152K82J217p80j001R91P61
5128I47q42q84O69P09m31m24M07N72p88o55O41M94k85k14k48N4P85m55n61O88
5148A79J55p46n18R54R32p47q00N35N67j173J11R21L10r30o93J116L74r56l64
$$ plain form
5013 161 -400 324 807 -370 -989 14 612 -318 -748 373 859 -438 -1167 582 572 -263 -941 223
5031 223 516 -762 -646 415 593 -834 -785 149 387 -559 -77 260 265 -763 -843 -283 399 -86 -708 -28
5051 -28 163 -299 -366 117 244 -172 -974 -416 370 -85 -471 -143 494 -365 -875 162 876 214 -866 -90
5071 -90 742 -177 -903 384 692 -612 -778 -140 695 34 -340 186 460 -694 -652 472 835 147 -81
5090 -81 25 348 234 181 204 311 143 -358 -220 551 886 -187 -360 625 474 -453 -207 713 835 -614
5110 -614 -559 762 658 -405 -58 1079 571 -1067 -328 1198 629 -523 -241 976 196 -805 186 947
5128 947 105 -779 -110 599 168 -256 151 723 -65 -720 -79 415 130 -84 -332 -278 507 52 -509 179
5148 179 334 -412 -930 24 956 209 -591 -56 511 -662 -551 370 680 -250 -943 173 547 -409 -773
5167g73J108J97j546L22J298j04j397Q6J052Q5o68k3O28J44p82n80P16M54k48
5186c1k50L33L26o42k89N46M69l09j118M50Q32n69l79M11O78m95j233R16J437
5205A083r77p09O00N77q03m61R65N35r70o65N12P99j77m36Q21M4q39k89P02L35
5225F47o40l1J55k68q6L15lO44k88p02Q5N69j59m24J4L92J01q38J31J221q6j130
5247c81k35J473m01p49L85P57m76j149N40J157j83j273M75M14l93p60P39O41m35
5266A46n88J19M93K88p14L46M01p36k38L54O03l79j56L8l40M41R1l18L76J32n90
5287b31k24M95O24r70j94N33M33j174j2J128J84j037k42P85L30q43m05J036j9
5306A97o82n41J256j17l04k00O07l14o72K76O58J67n58m19O28N3j69k39O88j62
$$ plain form
5167 -773 335 532 -1014 -692 606 502 -895 -809 243 328 -340 -363 265 409 -373 -953 -237 217 -31
5186 -31 -281 52 378 -264 -553 -7 462 153 -965 -515 317 -252 -631 -220 458 -37 -1270 -354 1083
5205 1083 106 -603 -3 574 -229 -690 275 810 -160 -825 -313 486 309 -127 694 738 -101 -390 312 647
5225 647 7 -24 131 -137 -223 92 89 733 445 -257 -172 397 238 -186 -172 220 321 -517 -386 835 749 -381
5247 -381 -616 857 456 -293 92 849 373 -776 -236 921 738 -535 -60 354 -39 -799 -60 581 146
5266 146 -442 -323 170 458 -256 90 491 -245 -483 -129 474 95 -61 -23 -363 78 169 -149 227 359 -231
5287 -231 -455 40 664 -306 -500 33 466 -708 -720 408 592 -445 -687 98 428 -415 -820 216 197
5306 197 -485 -1026 230 113 -191 -391 216 -98 -770 -494 164 331 -227 -646 -18 35 -134 -373 315 153
5326A53r3r26P21M84m28l01P1M74k37k67O77M17p74o13Q35J84l14k10K25N93j158
5347d87p8Q74M54r82L3N17l12j97j2P37j46l70l95N38L39m21r4J78M4Ol23o2N89
5370D30k2p11j01J090k89o28o9J069k16r12J43J123R0j523K51R68k77r15Q06Q31
5390A138j221n04O08P48n25p20R30K31o39q35P83Q15n82m56P07j41k66l14L28
5409H5J48j82l13k58N13K05R6o35N04k15o23K60N00K57o29l79O29N99q94l35R65
5430B98J5q52l59J313L46j117k65Q92q2p47O4R15j29p23q2O75R5q70K01O85j57
5451A16o01J25L13M39m13n65P31k45j95m48Q08M40n99j13j03M94l1m89N90K64
5471E18r13n08R54P25p64n73O00K66n74l83J053J93n79o63Q26O34q24k81L53O75
$$ plain form
5326 153 60 -866 -145 339 -89 -390 -319 155 -82 -349 328 745 -29 -642 193 377 63 -147 78 671 -487
5347 -487 -565 309 763 -219 -186 331 19 -178 -190 547 401 31 -364 174 513 92 -2 176 220 226 -97 -159 430
5370 430 408 -303 -404 686 397 -231 -300 769 553 -359 -216 907 997 -526 -275 693 416 -499 307 1138
5390 1138 -83 -587 21 769 244 -476 454 685 46 -789 -6 809 227 -229 478 337 71 -243 85
5409 85 233 51 -262 -520 -7 198 294 -341 163 -52 -675 -415 85 342 -287 -666 -37 562 -332 -667 298
5430 298 313 -539 -898 415 761 -356 -621 271 189 -558 -494 421 292 -431 -513 162 257 -613 -412 273 116
5451 116 -485 -360 -47 392 -21 -586 145 -100 -295 -743 65 505 -94 -207 -310 184 153 -336 254 518
5471 518 -395 -903 51 776 12 -561 39 305 -269 -652 401 594 15 -648 178 812 -12 -293 60 735
5491G35r38j7M11N41o83j70L11j1j61K93Nmk97m47m0P46L70q02k23R17k70n47
5513b81J33R60m98o90N5P52j23n94K3J081p71r65P52Q21l48p50O82L26n74n69
5533e78Q02M48n12o43J01O38m26M4L17j70j36j03K24K20J59m60n46P30J18k81
5553e4k45P4M71k66n47N83L95o33nL10J75m91l41Q42O2o74k20R50q2p56j9Q74
5575D03k13o13J72M01mn18L09J34j03n19L4O89K03n91k09M41j5l49K13L66j04
5596A27l20j33L69K28o2l61o7M66k74k07K79M10q4r21P80K09m53j04M20K43n26
5617A9o74Q75L19m70q8M44Ro68L36L5K64p33P4N04Rn08L46J66k32K11l46K68L13
5640D73j56m59nL77p5k97j02P85k86o98M41Q09k35j174O70L82l44m12R3O92m54
$$ plain form
5491 735 -203 -220 191 732 49 -121 190 179 18 311 316 312 15 -432 -472 274 644 -158 -381 536 266 -281
5513 -281 -148 812 314 -376 -321 431 308 -286 -263 818 47 -918 -166 655 307 -443 239 565 -9 -578
5533 -578 224 672 160 -483 -382 256 -170 -126 191 21 -115 -218 6 226 385 -75 -621 109 227 -54
5553 -54 -299 -225 246 -20 -567 16 411 -222 -227 83 258 -233 -574 268 330 -344 -564 386 304 -452 -471 403
5575 403 190 -423 -251 150 146 -372 -63 71 -32 -551 -517 172 375 -216 -425 16 1 -348 -135 231 127
5596 127 -193 -326 43 271 209 -152 -219 247 -27 -234 45 455 371 -550 230 439 -14 -118 302 545 19
5617 19 -655 220 539 69 -19 425 434 -234 102 137 401 -332 -258 246 255 -253 93 259 27 238 -108 160 473
5640 473 317 -142 -147 230 155 -142 -244 541 255 -443 -2 807 572 -602 68 450 106 -306 -213 479 25
5661B5n36P64N07q08m05Q19K0o93l82P48L85p51Q6L01R8m57J35J56L22o18k63
5682e47M47L12j43l62K3R5O6k10j41Q47J32r29k23Q06K48o03j74R43k90r53J94
5703d62O24J5m81j42N13L84r33K16N78k28r22N47O13k62p86L86O13j46o91M34
5723a30L70j95j89J09M02k87m22J21N09n3l60j77M71J51l65m94O25L94l17m92
5743c29Q40K04o20n52O56K48m76n15J035m13m47o2L16Q32o78k22L59P5p30J85
5763b94N52L60m02l97K32N41p11K24j58K16j42M4m7K17K70r49p3J123l30p45O09
5784A40L09j48q12J71J038l89p04M40N39m34m73M31O67o72p50P90K80l65n92Q57
5804C23R8l11l27K33L41n95N2L05L9k11l68J75N73j81n49j42M54M52l65k34M62
$$ plain form
5661 25 -511 253 760 -48 -453 366 386 -307 -689 59 444 -307 -221 80 178 -279 -144 12 334 -284 -547
5682 -547 -100 212 69 -293 -270 -175 -109 -319 -460 387 519 -410 -633 173 421 -182 -356 587 297 -656 -462
5703 -462 162 177 -304 -446 67 451 -482 -266 312 84 -838 -291 322 60 -726 -340 273 127 -564 -130
5723 -130 240 45 -144 -35 367 80 -342 -221 288 235 -125 -302 169 320 -45 -539 86 480 163 -329
5743 -329 511 715 95 -457 199 447 -29 -544 491 78 -369 -431 -115 717 39 -183 176 251 -479 -294
5763 -294 258 618 216 -181 51 592 -119 105 -53 163 21 65 18 235 505 -444 -517 606 276 -469 140
5784 140 449 301 -511 -340 698 309 -395 45 584 150 -323 108 775 103 -647 143 423 58 -534 323
5804 323 421 110 -217 16 357 -238 -186 119 158 -53 -421 -246 327 146 -403 -545 -91 361 -4 -238 224
5825B24k14m38o0Q35r9p44J79M98p5o17K53M80J86j002J06N90J74n29j33Q58m05
5846F7o35J63Q24k90o77P0N32j58k03K77K91k96o4o5M87J94n71k3K65oj21k0K91
5869C32r4k33l51O20j92K12n13K44K33m19k8J59M99m34m23N95L5j64j15P60j77
5890E46p48m5L55J99J91n51N90k12n44l3Q20k20l89j06K90K59m99j83K99J95j57
5911E7k01K93K10k27k46J0L70m22k35L39P45q43n89O03L46j05l24K43N00o27n06
5932f09M72N69o62J03M16j72m93J87P24l37o04p9K98K55p1j49O5M26l29l29M39
5953A20j68J93p8k17j0l9k25K07K87l2k9n22L19L14n56mM04L73o42j10Q12k44
5975A53o75R9O70j51n37J54R18o09n80M51M20k37q58P22L27q3k84m1O33p22J19
$$ plain form
5825 224 10 -428 -488 347 248 -496 -317 181 106 -511 -258 222 408 -594 -488 102 276 -253 -386 472 67
5846 67 -568 -405 419 129 -548 -478 54 -104 -307 -30 261 -35 -99 -164 323 517 -54 -77 188 182 61 41 332
5869 332 238 5 -346 274 82 294 -219 25 258 -161 -189 -30 469 35 -388 207 242 78 -37 723 546
5890 546 -202 -247 108 307 498 -53 537 325 -219 -252 568 348 -41 -147 143 402 -97 -280 19 214 57
5911 57 -144 149 359 132 -114 -104 266 -156 -391 -52 693 -150 -739 -136 210 105 -219 24 524 -103 -609
5932 -609 -137 432 -230 -127 289 117 -376 -189 535 198 -406 -485 -187 68 -3 -152 -87 339 10 -319 120
5953 120 -48 145 67 -150 -160 -199 -424 -217 70 38 9 -513 -194 120 -436 -440 -36 337 -305 -415 397 153
5975 153 -522 -423 247 96 -441 -287 631 22 -558 -107 313 76 -782 -60 267 184 -100 -141 492 -230 -111
5996a11J49J61j1j34k6Q3j20j76J41J75J81l16j60L21K19m41k46O12K75o08m66
6017d98N33M42n05r9O47j26o97K29N07O5n66r1K88L30m71kM27j20m21L31j16M61
6039E48k99l32L08P1j09r3Q6L11p07K6K0K07p0l9J51L82l27q78N07O93j04o65
6061c13J85L32l07k16L26M02n09l90M57J50l64k13N85J96n61j59L19L52j85l93
6081c06L96k66Mo2J15j69N6j37K36K53j94l17K65q4J56l07J40L26J37l76l30L73
6103i1M49n21q5M82j74p67N14L99J16m64KN02k19o14K07O73m73n72N20N15n43
6124a44J78J80K90o31J42L2J40n1j87jK75l5j11j51M7N88o82N6N5P66o54k15J49
6147C6K79n03K93pJ43j38l40L79K43m31l39P61J59q38j08O77J10j36m28M84j8
$$ plain form
5996 -111 38 199 188 54 28 111 -9 -185 -44 131 312 -4 -164 157 376 -65 -311 301 576 -32 -498
6017 -498 35 477 -28 -127 520 394 -303 -74 433 498 -68 -159 129 459 -12 -14 413 293 -128 203 87 548
6039 548 249 -83 225 296 187 94 180 491 -216 -190 -170 37 -33 -72 79 461 134 -744 -237 456 352 -313
6061 -313 -128 204 -103 -319 7 409 -100 -490 -33 117 -247 -460 125 321 -240 -399 -80 272 87 -306
6081 -306 90 -176 -172 -234 -119 -288 -232 -369 -133 120 -74 -391 -126 -210 -54 -361 -221 105 242 -134 -464 -91
6103 -91 358 -163 -248 234 60 -707 -193 206 322 -142 -140 362 143 -471 -264 409 -64 -636 -116 399 -144
6124 -144 34 214 504 -127 15 47 187 136 -51 -52 223 188 77 -74 -27 561 -121 -65 -10 756 102 -113 36
6147 36 315 -188 105 98 241 103 -237 142 385 -46 -385 376 535 -303 -411 266 376 240 -188 296 278
6168B78m36M20M0J23o37k1K23L04J64l63k84M37j19n05M84J40R4n69j44O36k94
6189b9k26L05M46o47k29P96l61N2l00q9N10n54J11K57N88q70j47L27L4l58K68
6210a16J25N6m78J90K44k27J00k07K32K8k03j67J48L40M03n94j99L82r6K1l06
6231c24M40M4k63m35Q04R4n29P6K01Q7l88K28M92j75q08J36O64k84j78J92K70
6252C44n82j98L79O25m69l3nK78j51j98O2N67l85n32LJ03L68o7l2J18L31n75K5
6275b4N9J94j70n6J94R7R3l74L18O9k00m48K59K67q3l30K66J28o48N42J79m4r5
6298A93l04M03j35k07L3J21J57n72J47lJ16R1k90K20Q2k07K58j74K8l57L28k21
6320b93N05j0l63O01l03m81L9O36p5n11l2M26n3j18j81K95J33j36m96L83L57m66
$$ plain form
6168 278 -158 262 302 425 -212 -233 -10 294 458 95 -189 248 129 -376 108 248 342 -227 -371 265 -29
6189 -29 -255 50 496 -151 -380 416 55 107 -193 -282 228 -326 -215 42 630 -240 -387 -60 -26 -384 -116
6210 -116 9 65 -413 -223 21 -206 -106 -313 -81 -53 -256 -423 -275 65 468 -126 -325 57 -39 -18 -324
6231 -324 116 160 -103 -538 266 360 -169 -93 108 195 -193 35 527 352 -456 -320 344 60 -118 74 344
6252 344 -238 -436 -57 568 99 66 61 339 188 -10 52 619 234 -298 -295 -192 176 109 77 195 526 -49 -24
6275 -24 35 229 59 3 197 294 387 13 331 400 200 -248 11 278 195 -135 131 259 -389 153 332 288 193
6298 193 -111 292 157 -50 -17 104 261 -311 -164 -167 -51 40 -250 -30 52 -155 103 -71 -43 -400 -72 -293
6320 -293 212 202 -161 440 137 -344 -305 331 256 -255 -287 139 86 -32 -213 82 215 79 -417 -34 323 -143
6342a43k19M37l43r1L23J60j56k0l05L21q1K66k01R8o7k18k2m1M92n4m11L00m
6365B1o6j55J88L02j09l21k13O97j56n21K77L29O2q77M76M35m58j36J52M85m11
6386Al77L99N19o84j36l6Q85l51l66lO25m68l02P45j88j50m0J23M06o11L79k07
6408A63J02J26l18k90J79O51q05j60M50J97k47l76O72l9m17L7M39k08j81J40O8
6429A83L0m72K58K74K53q69L26K85j26n36L65J10J34m18o7M80m93K93k07J9q9
6450b67K70j90J09M09l05l11K98N1k63o5J79K80k90m04K10O42l46j25K10K24m84
6471a68n18J025Kl70k45M44n01J38o0M36J00n51J82L1j7Mj55K75o7k65L33q6K95
6494B62l09j88k0K54K20l05p6J31J00l68L64K12m7m45J13K45j47j04j80P63l79
$$ plain form
6342 -143 -362 75 -268 -359 -36 124 -32 -52 -357 -36 -117 149 -52 46 -21 -239 -261 -302 190 136 -275 25 21
6365 21 -45 -200 -12 290 181 -140 -353 344 188 -333 -56 273 335 -542 -66 369 -89 -225 -73 412 1
6386 1 -376 23 542 -142 -278 -314 571 220 -146 -149 476 8 -294 451 263 113 73 196 602 -9 370 163
6408 163 265 391 73 -217 -38 613 -192 -352 98 295 48 -328 344 305 -112 -75 364 156 -25 115 183
6429 183 213 -259 -1 273 526 -343 -17 268 142 -394 -29 81 215 -203 -270 210 -283 10 -197 -178 -267
6450 -267 3 -187 -78 331 26 -285 13 64 -199 -264 -85 195 -95 -499 -289 353 7 -118 92 316 -168
6471 -168 -686 339 341 -29 -274 170 -331 -193 -253 183 283 -268 -86 -55 -72 -68 -223 52 -15 -280 53 -33 262
6494 262 -47 -235 -255 -1 219 -86 -162 -31 69 -299 65 277 230 -215 -102 143 -4 -108 -288 475 96
6515I6m40J21N41j78m42J32L14j38l72N12N05n36k99L71o7m52j4Q80n71J72PJ29
6537B71J04m21P1J93k31M20m07R3M37k29l86m8L47K78m89j79K50j8k05l15Q64
6558D00K01l72m27K40O5l64J37M83k88l40J72L90l58J04j96L99o62jK90j4K98
6579A57k86j18K86r5j1j6J38j38o2J82j28R8j02j0K3K98l55k51P07n82n5K5L9
6602b56O47l11l42L75N6l80q0N18l02l0j79K37o2n4q3M58j46m67K62k35K86p8
6624a66O7M0K17l60j04N41j01n6m53L58l25K84l9q0M69q3m86R6N29l5p08K39M38
6647B82l00k50K57M51m43k78N58j00k43j10M49J05o17j56O20K17k28n04N47k21
6667C6j86K55m0J63j09k72R8M85n54L19k6L35l48J5o6R6M69q16J2O4L2j33J76
$$ plain form
6515 96 -344 -223 318 140 -302 -170 144 6 -366 146 651 115 -184 187 120 -332 -346 534 -37 135 142 271
6537 271 375 -46 25 218 -13 407 0 93 530 301 -85 -133 214 492 3 -176 74 56 -149 -464 400
6558 400 601 229 -198 42 107 -257 -120 363 75 -265 -93 297 -61 43 -153 246 -416 -417 -127 -141 157
6579 157 -129 -247 39 -56 -67 -83 55 -83 -145 37 -91 7 -95 -105 -82 216 -139 -390 317 -265 -320 -295 -256
6602 -256 391 80 -262 113 169 -211 -291 227 -75 -105 -284 -47 -109 -163 -246 212 66 -401 -139 -374 -88 -166
6624 -166 -99 -59 158 -202 -306 235 134 78 -375 -17 -342 -58 -97 -177 292 209 -277 -181 348 313 -395 -156 282
6647 282 -18 -268 -11 440 -3 -281 277 177 -66 -176 273 378 -239 -395 225 442 214 -290 257 36
6667 36 -150 105 65 228 119 -153 -55 430 -124 195 169 504 156 171 105 201 670 -146 -134 -70 -38 -171 5
6690EL03l68k05Q0M14L32p31O4N86k96l54N1L54j9o37J60J25K59m57O4L17n7k81
6713b91J12M21j51j57m6L01m14j95J94J52L63l47k06K00l0R2r6J86K30j96j93
6734g1J99J23m01Q3R7j16j22l58O85K34k99l67M95k3k07j39J18j5j03K30J47j85
6756El3j95K32J43k83o3K36P1o8m19L06Q3J98l85P5L20n20J96K21q7M3o2j32J72
6780E4j75j8M43O6m70m52N85M24k27j59J6j36%q9J96O9J42j88K2K04p16K46M35
6803B72k04j48J5M37j15j21j11j82LK84j3j86j7K12j69j55N0O46m87n1K18nl78
6826b05L89J0j4l91k15O67k84J0P9k2J96o69K71M64k19j79M38k48J3j54k83M15
6848F9j12J71k0l5L5j80J66k19M6L3p0K99l12j50J59L15J38o42j90L75L86j75
$$ plain form
6690 5 308 -60 -265 -185 229 561 -170 -106 480 184 -170 -119 235 216 -421 -261 -136 123 -334 -270 47 -10 -291
6713 -291 -179 242 91 -66 -112 189 -225 -420 -226 -74 289 -58 -264 -64 -94 -2 -98 88 318 122 -71
6734 -71 128 251 -150 -67 30 -86 -208 -566 119 353 54 -313 182 159 -48 -187 -69 -84 -187 43 190 5
6756 5 -28 -223 9 152 -131 -194 42 113 45 -374 -68 15 213 -172 -97 223 -297 -101 120 33 76 14 -118 54
6780 54 -121 -139 304 370 -100 -552 33 457 230 71 87 -49 -49 -138 58 127 269 81 103 307 -409 -163 272
6803 272 68 -80 -65 372 257 136 25 -157 -154 130 117 -69 -86 126 -43 -198 -148 498 11 -40 178 173 -205
6826 -205 184 194 180 -211 -426 241 -43 -33 46 24 220 -449 -178 286 67 -112 326 78 91 -63 -346 69
6848 69 -43 128 108 73 108 -72 94 -125 -79 -46 -116 183 -129 -279 -120 195 333 -309 -499 -124 262 87
6870H7l76L11K84k90j72L91j49k07KM7Nj08N5o3j96J85M02j91m7o9O6J50o7l5
6894A5j44R7J2N4k78L97q9J17k37P8J70l45L0M7J16M8n82M07N36k05m18L25M02
6917E53n63j99M63Q5l25m49Q15J72p64PM54J43n59j31J84L76n46J00K91j5l1l13
6939b52L18K96m88J33l99N29j34l2J50L12m40Q1J18K5J8l72l2M97k02Q8l37L48
6961B25K22r06J60J72L58l53o0M76j69l79k47N47oJ30p8j80j6q5K25J21j75k80
6983b98M40O5k47q4j06L06k13j35J35J79k77J11J14j0R8k98O1m8K15k16K74R2
7005A58j87j24q7J98L04m15j60K68L03l33l6J11K40j38l37K10J85l95K83k11L40
7026A77k24J7l7J85k14J40M5J68k16N4j11m91P64j99J44j04j25r3L11J28j62o24
$$ plain form
6870 87 -289 22 306 16 -156 235 86 -121 -119 -72 -67 -175 -120 -183 -379 -194 208 17 -30 -99 -33 117 50 15
6894 15 -129 -32 -20 34 -244 153 64 181 -56 22 192 -153 -123 -76 40 88 -494 -87 449 244 -174 151 553
6917 553 -10 -209 254 339 14 -435 380 552 -212 -205 249 392 -167 -298 -114 262 -284 -184 107 92 61 -252
6939 -252 66 362 -126 7 -392 137 3 -29 121 433 -7 74 192 217 235 -137 -169 328 126 214 -123 225
6961 225 447 -459 -299 -127 231 -122 -182 294 125 -254 -501 46 40 170 92 -88 -104 -189 36 157 -18 -298
6983 -298 142 207 -40 -124 -230 76 -137 -272 -137 42 -235 -124 -10 -20 78 -220 -159 -207 8 -208 66 158
7005 158 -29 -153 -240 -42 262 -153 -313 -45 258 -75 -111 0 240 102 -235 -25 160 -235 48 -163 177
7026 177 -47 -30 -67 118 -96 44 89 257 41 95 -16 -507 257 58 202 98 -27 -120 191 319 157 -467
7048d67N24K30q8m38L92J21j90j67J96J56l15l33N46q0Q3j74J35N82q33K75J64
7069C19L0n31M7L81j90pL4l44J87J6J4R2n6oj93R8J73L38m60j12L35J8R2l79L09
7094B05j08k16P1J66j11k18O1N35n05lj49M13r9l82J40N39j16k44J73j06k29k33
7116d16K66N90l70k52l9K46p5p8K20j01P6k68K79k56N75j81l20q8M29k51N5J94
7138B35m11k2L03k61O9Q2n11O03k6j03J82r7J80j53k01k02K47o8M4O8J99j67m7
7161e7M9J6k75n2M67j74k2J51J63J4n43Q8M08l20K92m19J15L16j47n00L81Q9Q9
7184A29K2k96M30l16o4L55p1l30Q6jK34j83j26L87O1m64K63K16J75l70j05J60
7206A92J8l9j53n9J19l36J83R8o3L90m26K60j94K0l1j6J70j70J27K3l18L02k78
$$ plain form
7048 -467 57 287 199 -239 153 274 84 -83 113 269 -46 -379 167 87 170 -4 131 713 -120 155 319
7069 319 349 -182 -135 246 56 49 83 -261 -74 -58 -44 48 -8 -14 -207 -109 64 402 -58 -170 165 183 275 -104 205
7094 205 97 -119 -48 118 7 -211 -150 385 -120 -123 -272 141 42 -340 -200 339 223 -21 152 46 -183 -416
7116 -416 -150 440 70 -182 -221 25 -50 -128 92 -9 67 -201 78 -178 397 216 -104 -192 237 -14 41 235
7138 235 -176 -198 105 -156 -87 -5 -516 87 61 -42 140 43 223 70 -131 -333 -86 -154 -110 -42 157 -10 -57
7161 -57 -8 8 -267 -319 148 -26 -48 103 266 280 -263 -175 233 -87 205 -214 -99 217 70 -430 -49 40 129
7184 129 151 -145 285 -31 -95 260 189 -141 -55 -56 178 -5 -131 256 317 -147 116 332 507 137 32 192
7206 192 210 171 18 -41 78 -258 -75 23 -40 350 -76 184 -10 10 -21 -37 133 -37 90 113 -205 97 -181
7229a81J39L32k80j10j86L81j69j40J05K88j97m14L03Q8l11J05J06R5j09l2K46
7250E9J76k11Rj26K03j34j5P3j3j42q4K76k7P2m0Q8k96J71j67J31j32j47J99j7
7274i4J4L8k18K31j51j7K8Q3q8Q2k48L41J86l75P1J93j7K8o4N2J06nm58k0M61
7299A59k05o3J27L5k25J68lJ38O9m39L68p5r4k0O4R6R3k31j08J96J83l52L59k5
7323B15Q1j86j34K12j52J2k15M09j91k25J26K70j96j45k0j6K56j42K46j53J13
7344A65j52rK87l01l99L71j88J86NJ16n8l6j06k9pJ19J49j48J83n0Qk94PJ36Q8
7369D3l97L88j41J05j36j55O30m30n5Q7M0k3J71k42M3K09k6j37K63o09L51k17
7391b38r6NJ91J90r0l5J02l94K62R7l4O4l52K38L26k61Opk02L25K74k96l46M62
$$ plain form
7229 -181 -42 290 10 -100 -286 95 -74 -214 -109 179 -18 -432 -129 -41 -352 -247 -141 -46 -155 -187 59
7250 59 235 24 33 -93 110 -24 -39 34 21 -121 -205 71 44 116 76 164 -132 39 -128 3 -129 -276 -77 -94
7274 -94 -80 -42 -260 -29 -180 -197 -169 -86 -174 -92 -340 1 187 -188 -117 76 59 87 23 75 181 176 -282 -302 159
7299 159 -46 -109 18 53 -172 -4 -7 131 200 -239 129 54 -40 -60 4 100 193 -38 -146 50 233 -119 240 215
7323 215 296 110 -24 188 36 48 -167 242 51 -174 -48 222 26 -119 -139 -155 101 -41 205 52 165
7344 165 13 4 291 -10 -409 -38 -226 -40 -35 81 23 -13 -119 -148 -155 -36 113 -35 148 98 106 -188 -181 -45 43
7369 43 -354 34 -107 -2 -138 -293 337 -93 -148 -61 -21 -44 127 -115 -72 137 111 -26 237 -372 -21 -238
7391 -238 -334 -329 -138 52 -38 -73 29 -365 -103 -6 -40 24 -328 -90 236 -25 -19 -26 -228 97 371 75 -271 191
7415A91j42j17n4oK22m65L86K17K8k10jl7j96M24o44M13j64L04j54l41K01L5K40
7438A30l37J62j00L67j81R9j49R2j43M1M8j13m8K08q5Q7Qn2K9k87j0Q6M64k98
7462A8j84O0K13M2l63K88L6k83J30M11k03m95K13J72j25j6N3K5m7M3K65j89j0
7485E4J73Q6n32P9J50j08j00q3N1J57j98O01p7m24K47q9K7n3n3rk10K04n1K50
7509I2j21l44M88j80k85L46J77j09j30n6K27n1k9k27K76j31p1L82n5j46j38L12
7531B27k93j63K47q4j93M24k94M74k04j04m5k49K2rJ79j06K18k62M69n20L60j08
7553a4L50k51j02J18Kl92K91J52j0k22K6K34n05L82j13L84l88K46j85K20n35M65
7575A53k34L06j15J59o9K6j43k73J63m9J39k21P7J04P3j33o9J63J88l53P5J54
$$ plain form
7415 191 49 -68 -122 -128 94 -371 15 232 260 50 49 12 -184 240 -404 9 -155 149 -5 -346 -145 -110 130
7438 130 -207 -45 -145 222 41 140 -9 83 -60 -19 29 -84 -132 76 -9 78 86 34 63 -224 -234 -148 316 18
7462 18 -166 -106 107 149 -214 74 110 -173 -43 368 165 -330 -117 55 -70 -86 -33 -8 -55 -12 253 64 54
7485 54 227 313 -219 -140 10 -98 -198 -281 -230 -73 -271 330 253 -171 76 -13 14 -39 -92 -101 -311 -107 -158 92
7509 92 -29 -373 115 -65 -350 -4 173 64 -66 -122 105 54 25 -202 74 -57 -128 254 199 53 -85 227
7531 227 -66 -229 18 -66 -259 165 -129 345 141 37 -8 -257 -235 -244 -65 -171 47 -215 254 -266 94 -14
7553 -14 336 85 -17 101 103 -289 2 154 144 -78 -52 182 -323 59 -54 330 -58 188 3 223 -312 153
7575 153 -81 225 110 269 200 226 83 -190 -27 -76 63 -158 -81 23 96 -37 -106 57 245 -108 -33 121
7597A21O8j86l05K60M35o48K61J12j60l48J49O01q4l1j90J70j70j42j8j23M58
7618B30q8n6q3p5M8k47L36j23K62k68M9J30j55R4O8j86o9j17j7M46l57J05J94
7641A21L3k06k61J54N08m50J72j38j68p4J37L54j89k60K5q5L95j39J25r2K64q1
7663A45k25L4K13j30J11j11k73J15J0J22j29J31L05m37J93J02k89K2L09J22q66
7684e26N03J71J40m92Q3q1L71j12k08N53l10l73K12J31J86l48N7L3o0JK86J65
7706C82m66J19J30q1R4j14m1J38q8K18m08M4PJ76j02k06K42k83M0K71j79P2j30
7729a65N0L77p04K18K63j19k22J99P0N0J75j61K94l89p4O0L81r0j01k48J85j78
7751a29J62k75P6K60k15J92J4k93K21K7K2k74l6pJ39N0R9k5j61J67J16m28L6K92
$$ plain form
7597 121 189 3 -302 -42 393 -255 6 118 -42 -390 -241 360 276 245 55 225 55 -87 -105 -228 230
7618 230 142 86 3 -72 -24 -271 65 -58 204 -64 -15 115 -40 54 122 -64 -133 -250 -267 179 -178 -73 121
7641 121 154 -52 -313 -159 349 -101 71 -67 -235 -309 -172 182 -7 -267 -242 -327 68 -71 54 -38 226 145
7663 145 -80 -46 167 37 148 37 -236 -121 -111 11 -118 13 318 -119 74 176 -113 -91 218 340 -526
7684 -526 -23 148 288 -204 -121 -202 169 57 -151 402 92 -281 -69 62 248 -100 -43 -10 -70 -69 217 382
7706 382 -84 35 165 84 178 64 23 161 73 291 -117 -73 -66 110 8 -198 44 -239 -199 72 -107 -35 -165
7729 -165 -115 262 -442 -224 39 -80 -302 -103 -33 17 192 31 325 -64 -138 -78 303 213 112 -136 49 -129
7751 -129 33 -242 -166 94 -121 71 85 -208 13 40 62 -212 -248 -255 -116 -66 33 8 -153 14 130 -298 -262 30
7775C0q7k39K58L6J20L9l26J60k79Q5LQ3K5J28J52L5l80J10M40n3l42j89J9L47
7799A75j86K47J5o37N78K6n3r1j53K48p6k31J72m6j42K17l7K6p9L24j03k44m5
7822i5J2J64j29m5L04p7j15K15M7l93MJ6J75J08k37p3K21M2m45J42K25k52L58
7845A72M0l26K72j60O9n7RJ0J05j29J71J76l26j23RO5j79P4K40j46MO0k58P3L12
7870A57L3l98J75k09K58P5j63oJ87k87K12j65J8L3J26K01j90k21J10o4q7L46k41
7893a00p7L57k50k7J24M9q7k14J66m7P6k28K06Pr4J78k70N46k67l43M6J03N35
7916C89n84k9N45m0l27j4K7J00j15qj85K02j71K44J32k15K1k38N52j76q0j19K59
7939A70p0r0KJ0M0J10k44N1K46k60J29k26K57m1j66J41J14L20r06J20L52jM9j44
$$ plain form
7775 30 -57 -296 -38 -2 118 157 -169 -9 -288 -203 -200 -117 -92 36 188 223 -157 -47 393 340 -2 -191 -172 175
7799 175 -11 236 251 -386 192 218 165 74 -79 169 93 -138 34 -12 -154 63 26 52 -27 297 194 -50 -95
7822 -95 -83 81 -48 -93 211 134 19 234 281 -112 -108 -92 83 191 -46 -119 102 144 -301 -159 66 -186 172
7845 172 212 -114 158 -2 67 10 19 29 134 5 176 352 26 -97 -88 -23 -202 -128 112 -34 -30 30 -228 -155 157
7870 157 190 -208 -33 -242 16 91 -72 -78 109 -178 34 -131 -113 -80 46 247 57 -164 -54 -118 -205 141 -100
7893 -100 -177 180 -70 -97 27 76 -11 -225 -59 -106 -30 -258 -52 -45 -139 39 -231 315 48 -295 -249 -146 389
7916 389 -195 -224 321 281 -46 -60 -33 67 -48 -56 -241 -39 -210 34 166 -49 -28 -266 286 110 30 -89 170
7939 170 100 10 12 22 62 172 -72 -21 225 -35 94 -132 125 84 -82 59 173 493 -413 -293 59 58 107 -37
7963c7k8M7J08k39P1k6J38k37L03o0j04K09J05j01m66J09K99J45k13K4q8q9R4
7986c6ol6J24KJ3O4K94l38m0M0K66m91K38o6j57J78J15m00K62j24J89K26l09j34
8010a26o7K29j29L0r7K85j99m3N1P6J9M5o5j98l4j4N20q5k14J4j1K23m21K33j88
8035a66j5o7J18J50O8K03l38j33j46L82k00l01P95j40r7p7J66N5j62j11O1j21
8057g6J15L8K16j29j86J9K6J26k34L20n7r9j41j27L16j98N0K33j10M6l40L43k41
8080i0j9L85l23k21K38K53k66K76k01N3j46N1J85j91r1J31j67lJ20J73j54j50
8102a57L34l29J56r5j6M9J61m8m4J68NJ32k04j33q8j49K37k5l2L12j05L59n04
8125a6J95j93j11l8J43j54K51K05m08J2QJ66j54j06K59j28j77K08j43J21R9k20
$$ plain form
7963 -37 -65 -18 90 -149 -78 -104 34 -203 100 40 -64 145 250 149 -317 -208 91 236 23 47 -41 -130 -36
7986 -36 -42 -78 46 48 61 125 419 81 41 81 347 -144 94 28 -129 49 164 -236 26 -98 91 317 8 -126
8010 -126 -193 36 -93 -63 -160 125 -74 -117 -66 10 29 74 9 -189 -223 -237 283 198 -16 -2 -13 210 -211 22 -166
8035 -166 -181 -248 -130 20 88 291 -47 -180 -326 56 -144 -445 350 210 113 36 202 257 95 -16 45 -76
8057 -76 39 77 293 164 -22 -3 23 149 -85 235 178 79 -62 -189 127 -71 -21 212 102 148 -192 151 -90
8080 -90 -109 276 -47 -268 -30 223 -43 233 32 85 -61 -10 175 -16 -107 24 -143 -146 -26 147 -7 -157
8102 -157 177 -152 4 -91 -107 -58 103 55 11 179 184 316 112 -21 -109 -258 -21 -46 -78 234 129 488 -16
8125 -16 179 -14 -125 -163 -20 -174 77 282 -126 -114 -106 60 -94 -200 59 -69 -246 -38 -181 -60 39 -181
8147a81j19J00K7L44l49K77m06L23m2j67K64j04k49M16k41L90m88M48l1j69Mj37
8169i0k68K58o3j41N65j35j63J54K52n52j16L59J65j79l4K53r4K1l91J4K30k18
$$ plain form
8147 -181 -300 -200 -173 171 -178 99 -307 16 -26 -193 71 -33 -282 134 -107 283 -205 243 212 43 47 -90
8169 -90 -358 -100 -163 -304 261 126 -37 117 369 -183 -299 60 225 46 12 265 171 192 -199 -185 45 -173
8191a73
$$ Imaginary data points
##PAGE= N=2
##DATA TABLE= (X++(I..I)), XYDATA
0@%%%%%%qJ6j6J6k4L2m0M8n6P1p9Q8j06J30j52J71j98K33k69L05l48L97m46N02
30B67n66O37p16P97q87R92j104J222j355J504j664J838k034K256k500K772l085
47a626L440l845M319m883N563o396P451q847J0773j3601J8186k6841M8587j97047
61a64767l85211M87603L11416l60508k72919L46189J75777l86849k07172M14984
71d1457K77865l04669k66828K30867K00259j86072j18997K55680J51290k54963
81e7025k11480K00365K33218j12159j87298R1993J38184j32309j62212J59622
91c9101K32168j15931k64920N6935K45828k5969j88283Q7358K12808j22244k67830
102a89181J18436L25520m8250k95457K5446K39106p1262k35939J17811K84184
$$ plain form
0 0 0 0 0 0 0 0 -8 8 -8 8 -16 16 -24 24 -32 39 -40 48 -58 72 -80 91 -107 126 -143 162 -186 211 -235 267
30 267 -299 338 -378 419 -468 524 -580 642 -713 791 -873 965 -1069 1187 -1313 1459 -1626
47 -1626 1814 -2031 2288 -2595 2968 -3428 4023 -4824 5949 -7652 10534 -16307 32280 -164767
61 -164767 -549978 -62375 249041 -111467 -384386 -38197 137580 -249269 -456441 -41457
71 -41457 236408 -68261 -335089 -104222 96037 -90035 -209032 46648 197938 -57025
81 -57025 -268505 -68140 165078 52919 -134379 -42386 95798 -36511 -198723 -39101
91 -39101 193067 77136 -187784 -130849 114979 89010 -99273 -11915 200893 78649 -189181
102 -189181 -70745 254775 206525 -88932 -63486 175620 104358 -131581 -13770 270414
112B70414j14355l36003L7112K92083j5683k32853M7985K06274j10507k61167
122b16700R9027K99739l9183k76209M487K17752l6042k04183Q1371K51809p0855
133A11013k94734J1904K77102K4860k26176n145K03938l9062k34925M3372K71512
144A43659m397k62046k8426K16737J6242j82210K9196K02367m0309k34632Q561
155a35258K38377M1701j86024m1648J44305P487j46890J4465J87850K3169j94564
166d7030p7464J50330Q8990j07506n4323J19175L4747j71908p7251J90789J35515
177A84064j59402j52976J20912J16298j41044r7625J90515J26304k15034j73968
187b01956J83071J75853j52355j35006J63723J00561k07340j13101K26875J43800
$$ plain form
112 270414 156059 -179944 -142832 149251 133568 -99285 -51300 154974 44467 -216700
122 -216700 -117673 182066 142883 -133326 -128839 88913 52871 -151312 -69941 181868 111013
133 111013 -183721 -171817 105285 130145 -96031 -101176 102762 63700 -171225 -127853 143659
144 143659 139262 -122784 -151210 65527 81769 -100441 -71245 131122 90813 -143819 -135258
155 -135258 103119 144820 -41204 -82852 61453 68940 -77950 -63485 124365 147534 -47030
166 -47030 -124494 25836 114826 7320 -47003 72172 106919 -64989 -142240 48549 184064
177 184064 24662 -128314 -7402 108896 -32148 -129773 60742 187046 -27988 -201956
187 -201956 -18885 156968 4613 -130393 33330 133891 -73449 -186550 40325 184125
197A84125k00625j44244J65177J05475j62045o8994J88725P2781k01372j01418
207a62415J72121J10254j27015q3035J08215M9840j25544n3694J39131Q8529j16972
218e85j13544P4139J01496n4150p8069P3724Q7303r4251j26512Q3698J58320m7489
230F4080j49589L4539J27208n6707j28506Q5258J59608q2427j83523N7360J73687
241A00988m5122j45482O4769J37872r0528j55805R1806J74348o7575j63857M9899
252d8687J37272n7586j20584P7016J31618p9340j51120N5272J49345l1377j28162
263f6333L0149J09782m9151j22478N7577J49036l8116j59709J1209J43957p168
274E8755j24853L0103J36239m4784j64777L1725J78428l810j59045M49J35666
$$ plain form
197 184125 -16500 -160744 4433 109908 -52137 -121131 67594 140375 -60997 -162415
207 -162415 9706 119960 -7055 -90090 18125 67965 -57579 -111273 27858 116387 -585
218 -585 -114129 -39990 61506 7356 -70713 3011 90314 -3937 -130449 -46751 111569 64080
230 64080 -85509 -50970 76238 19531 -108975 -23717 135891 53464 -130059 -72699 100988
241 100988 55866 -89616 -24847 113025 22497 -133308 -41502 132846 65271 -98586 -48687
252 -48687 88585 30999 -89585 -12569 119049 39709 -111411 -56139 93206 61829 -66333
263 -66333 -36184 73598 24447 -98031 -40454 108582 70466 -89243 -78034 65923 58755
274 58755 -66098 -35995 100244 55460 -109317 -77592 100836 97026 -62019 -61570 74096
285G4096k4491j38916M2377J62298l0278j73768J720J49619O331j22184J1935
296d1261J17899k8236j38014J3575J46600J7818j27773l4172R9354K2496r4394
307d6108r435J15585K1332j32623n3698J23530P2117j01830o1679R8981M3322
318F9494j24211m7490J49250P3842j45915r0187J25223P6549j20049n0838J43670
329E9338M8081j67477o9060J62438Q4372j37394o8715J24795M1584j38892l6640
340i7570J55718N7778j46124p5315J14390O6397r4695m5917J02000M4324j15931
351c4945o8420J07371R1987p9622r1556N9826P5635o6839p3495Q4172R5098q5060
363A4152j19607O5370J21769m8867j06137N7591R8167p9068j12701Q8185J33635
$$ plain form
285 74096 49605 -89311 -46934 115364 85086 -88682 -86962 62657 68988 -53196 -41261
296 -41261 76638 48402 -89612 -76037 70563 88381 -39392 -73564 25790 48286 -46108
307 -46108 -55543 60042 81374 -51249 -104947 18583 90700 -11130 -72809 26172 69494
318 69494 -54717 -102207 47043 120885 -25030 -115217 10006 86555 -33494 -84332 59338
329 59338 107419 -60058 -129118 33320 117692 -19702 -88417 36378 77962 -60930 -97570
340 -97570 58148 115926 -30198 -105513 8877 75274 -19421 -65338 36662 80986 -34945
351 -34945 -103365 4006 95993 16371 -75185 -15359 60276 -6563 -80058 4114 99212 14152
363 14152 -105455 -40085 81684 32817 -73320 -15729 82438 3370 -109331 -21146 112489
374A12489p3123j34779N7343J15073o3084r8029Q4657J05950r3060j24003P6326
385c4240J25887n3435j04507N0632Q7266o6359r4056P2513J15561n3439j21985
396g6162K6104J06522j8813r1609L2244R9638l9487j23407K3044J35100J745j23218
408d8299r128J08856o269j14364J9158J36463j0563j48218q897J36213J3606j16424
420d7866K829J14284k0552j29723J6038J38263L521j24300j1767R9834j121r2675
432e3235J6048J04516j0814j14679j2123J02278K6733q0433j9314P2189O758q6569
444d8645j3624J01751L7978r6571n5615P8533N1811p4367l8828R1303M1087j09089
456c4276o1033J09217P5762r3841o8707Q7474N1186j00722m5968J17185N8761
$$ plain form
374 112489 39366 -95413 -38070 77003 13919 -84110 547 106497 13437 -110566 -34240
385 -34240 91647 38212 -66295 -15663 71603 5244 -88812 -16299 99262 45823 -76162
396 -76162 -50058 56464 37651 -53958 -21714 77924 38437 -84970 -61926 73174 74919 -48299
408 -48299 -57427 51429 45160 -69204 -50046 86417 75854 -72364 -81261 54952 68558 -47866
420 -47866 -45037 69247 48695 -81028 -64990 73273 76794 -47506 -59273 40561 39440 -53235
432 -53235 -37187 67329 56515 -58164 -70287 31991 58724 -21709 -41023 31166 37924 -48645
444 -48645 -62269 39482 77460 -19111 -74726 3807 55618 -18749 -57577 33726 74813 -34276
456 -34276 -95309 13908 89670 -4171 -72878 14596 65782 -34940 -80908 36277 95038
467I5038j15346p0035R6169O3358q3787m3858Q8763L5733j00154m6827R6324N9214
479G4592p5842n5843N8294L9672n9786l2608P0307M5291o8894o3018N1578O5663
491D9406l5055n4853L8068N0228n2472o2908N7964Q3115m6064q7816L3863P7073
503E0549l7381o8004N4343P6586o3909r1866N5260R5712m2977q2693M4199O9894
515E9713n8478p3591O6005Q5519n6047q8819L8911P4969l4227o0270M2802O0355
527E6842m7674p2640L6584P8290j8275o8180J0594N6814j8451n8216K5767P4401
539E5856j8640q4781L666P9659L329o9315O810P0615j8001q4551J6111R4393n331
552D9820q9041O99P6059j1967p4082K5443Q3733k6449r3278J4483Q7347p760p3120
$$ plain form
467 95038 -20308 -90343 5826 69184 -14603 -58461 30302 66035 -34119 -80946 15378 74592
479 74592 -1250 -57093 1201 40873 -18913 -51521 18786 64077 -4817 -67835 -16257 49406
491 49406 14351 -40502 -2434 47794 -4678 -67586 -9622 73493 27429 -60387 -26524 50549
503 50549 13168 -54836 -493 76093 12184 -79682 -24422 71290 28313 -54380 -10181 59713
515 59713 1235 -72356 -6351 79168 23121 -65698 -26787 48182 13955 -46315 -3513 56842
527 56842 9168 -63472 -26888 51402 33127 -35053 -24459 32355 13904 -44312 -18545 55856
539 55856 37216 -47565 -43899 35760 39089 -30226 -23416 47199 29198 -55353 -39242 55151 49820
552 49820 -39221 -38522 37537 25570 -48512 -23069 60664 34215 -59063 -44580 42767 35007 -38113
565c8113J3229O6889k2339p3467J8995Q1119m461p4977p839O1791O783n4865L97
578b6858O1772L232p1649j7010P2433K9357o3889k9346O1023K2110o9719k1495
590e0039Q2617L1042q5691m1337P7759L9351p3078k7593P8041J9683q9129k3334
602f1708R1340K9043q2650k5887P4292J3213p6408n834Q5057J0765q4628k0633
614e4038P3108K2886n9070j5555N6779J2173o1032k0578O1362L3741n0555l9631
626d0410M0540L5737m0534l5267M9369M4655n4120n9124M9044O6103m2952o3861
638e0820M3628O0828n2552o5667N7892P4050n4586p6759M8930O9494m9046o0729
650e5337N6683N8773o2672o3403O1365O5499n3285n9273M9393N1623n1942m9238
$$ plain form
565 -38113 -24884 42005 19666 -53801 -34806 46313 41852 -33125 -40964 20827 27610 -27255 -26858
578 -26858 34914 38146 -33503 -50513 21920 51277 -12612 -41958 19065 41175 -28544 -50039
590 -50039 32578 63620 -22071 -63408 14351 53702 -19376 -46969 31072 50755 -38374 -61708
602 -61708 29632 58675 -23975 -49862 24430 37643 -38765 -44599 40458 51223 -33405 -54038
614 -54038 19070 41956 -17114 -32669 24110 36283 -24749 -45327 16035 49776 -779 -40410
626 -40410 130 35867 -4667 -39934 9435 54090 -30 -59154 -10110 55993 13041 -50820
638 -50820 -7192 53636 1084 -64583 -6691 67359 12773 -63986 -15056 54438 5392 -55337
650 -55337 1346 60119 -2553 -65956 -4591 60908 7623 -51650 -2257 49366 -2576 -51814
662e1814N4219N5486m8039o0556L6812N7098k9331n0077L0294M9822l4205n8136
674d8427L0975O5954k2084o6579J6228O3003j9378o5668K4084P4219k2348q2218
686e2239J4138Q1429q426p6258J1284P4176j6489p7653J6425Q0344j0565p6444
698d0278O454O9659q011o4822J1074O6760r404o9545K085O7975O485o2653r821
711c4042N8183R089n9375j0767O3845J6431o5790k3601O2482K5499o0062k1996
723d0104O3045J9438p1675k2606P6565K8426p5506k9248P2998K4081p4796j9942
735d9324Q0755K1486q1712k4816P5547K4533o7938j7582O5191J3550o6184j5869
747d2363O4168K0939n6638k2626M8349K1006m4717k1928M4185K6784m1253l5175
$$ plain form
662 -51814 2405 57891 9852 -50704 -13892 43206 13875 -36202 -5908 43914 9709 -48427
674 -48427 -17452 48502 26418 -40161 -23933 39070 19692 -45976 -21892 52327 29979 -52239
686 -52239 -38101 43328 34902 -41356 -30072 44104 27615 -50038 -33613 46731 36166 -40278
698 -40278 -33824 35835 27824 -36998 -25924 40836 31432 -38113 -36028 31947 38432 -24221 -34042
711 -34042 24141 33230 -26145 -36912 26933 43364 -22426 -46027 16455 41954 -18108 -40104
723 -40104 22941 42379 -29296 -51902 24663 53089 -22417 -51665 21333 45414 -29382 -49324
735 -49324 31431 52917 -28795 -53611 21936 46469 -21469 -39051 26140 39690 -26494 -42363
747 -42363 21805 42744 -13894 -36520 11829 32835 -11882 -33810 10375 37159 -4094 -39269
759c9269L4243M0211k8276m1048K5186M2853k6566m7071K7746N3409k7422n7362
771d3366K6896N8686k8453n7950L3601N8949l8320o1137M0946O3122m0416o1168
783d8610M0656N6845m2592n3174M5345N2613m5317n2829M1913M9689l8491m4310
795c8262L7445M0710l8035m1734L4874M3770k8963m3578K2524M0894j9335l9725
807b9415J7567M2397j3990m6395Q058M8014l402m7109K685M7676m416m9644M277
820b3697N3292k413n4052P96N3194k033n2061L855N2590n145n3403M167N2502
833B7592k764n0521K291M7562l237m6097L332M6285k605m6162n27M4624L338m2761
847a9650m458M2143O076m5083q034M7141J2331m7719j5349M7511J5704m8719j4407
$$ plain form
759 -39269 -5026 35185 6909 -34139 -8953 33900 7334 -39737 -11991 41418 13996 -43366
771 -43366 -16470 42216 13763 -44187 -10586 48363 10043 -51094 -10148 52974 12558 -48610
783 -48610 -7954 48891 6299 -46875 -1530 51083 5766 -47063 -5150 44539 6048 -38262
795 -38262 -817 39893 1858 -39876 -5002 38768 9805 -33773 -11249 29645 10310 -29415
807 -29415 -11848 30549 16559 -29836 -21778 26236 22834 -24275 -21590 26086 21670 -27974 -23697
820 -23697 29595 27182 -26870 -26074 27120 25087 -26974 -23119 29471 24326 -29077 -24910 27592
833 27592 24828 -25693 -23402 24160 20923 -25174 -21842 24443 21838 -24324 -24851 19773 23111 -19650
847 -19650 -24108 18035 24111 -20972 -29006 18135 30466 -17253 -32602 14909 30613 -18106 -32513
860c2513N1273J6142n4080j7914N4030J7759n3152j4688N3064J2250n4615j2269
872c4713N4671J2624n1713j0335M8462P403m7460o276M5858O636m1734p520L7659
885A3562O935l4276p687L2404R972k9372j3438K6509J5518k4293j7762K4791K1819
898B4682k5523k6640K4451L1263k4355l2688K6689L5520l0381l9930L3161M2645
910C8894l2708m3261L4675M2596l8692m2455M1739M3655m2228m2826M1541L9868
922D0798m2375l6381M2990L5204m2111l4527L9559L1935l6208k9445L3977K7440
934C0856l1340k7311K8049K7490k4579k7244K1146K7850j8217k8998J5614L0637
946B3953j4376l2438J3121L6005j2012l9267J0332M1094j0102m2601J1613M4697
$$ plain form
860 -32513 18760 34902 -19178 -37092 16938 34697 -18455 -33143 19921 32171 -22444 -34713
872 -34713 19958 32582 -19131 -29466 18996 26399 -21061 -27337 18521 25157 -16577 -24097 13562
885 13562 20497 -13779 -21466 10938 20910 -8462 -21900 4609 20127 -4166 -21928 2863 24682
898 24682 -841 -27481 -3030 28233 3878 -28810 -2121 33399 3018 -36912 -3751 38894
910 38894 6186 -37075 -2400 40196 1504 -40951 788 44443 2215 -40611 930 40798
922 40798 -1577 -37958 5032 40236 -1875 -36402 3157 35092 -1116 -30561 3416 30856
934 30856 -484 -27795 254 27744 3165 -24079 -2933 24917 6700 -22298 -6684 23953
946 23953 9577 -22861 -9740 26265 14253 -25014 -14682 26412 16310 -26291 -14678 30019
958C0019j2971m7824J2245M8917j1339m8255J2371M7484j4702m8693J4826M9581
970C1659j3203m7948J1040M5239j1112m4191J0678M4385p916m4063L713M2559
982B0840j726m0827o1M1290K597m2810n666M2342P740m2608q196M3953R585m6394
996a9941j0984M6503J1848m6405j0355M7897Q873m9830r747N0748J0060m8391
1008a9724q433M7856M609m8210m221M8235O626m5665o795M1038N724l8450n363
1021b2773L8335Q326l6549j2689L2128J5312k8276j6371K8106J8905k8386k4034
1033b7966K7869K9089k5496l1783K5478L2655k5818l5052K8318L8397k9680l9847
1045c3836K9574M0883l0336l9620L1686L8628l4196l7037L5505L6202l5691l4909
$$ plain form
958 30019 17048 -30776 -18531 30386 19047 -29208 -16837 30647 15945 -32748 -17922 31659
970 31659 18456 -29492 -18452 26787 15675 -28516 -17838 26547 18631 -25432 -21719 20840
982 20840 19114 -21713 -21774 19516 22113 -20697 -26363 15979 23719 -18889 -27085 16868 26453 -19941
996 -19941 -30925 15578 27426 -18979 -29334 18563 27436 -22394 -32141 18607 28667 -19724
1008 -19724 -28157 19699 24308 -23902 -28123 20112 26738 -18927 -25722 15316 21040 -17410 -22773
1021 -22773 15562 23888 -12661 -25350 6778 22090 -6186 -22557 5549 24454 -3932 -27966
1033 -27966 -97 28992 3496 -28287 -2809 29846 4028 -31024 -2706 35691 6011 -33836
1045 -33836 -4262 36621 6285 -33335 -1649 36979 2783 -34254 1251 37453 1762 -33147
1057c3147L4262L2330l3074k8962L2713K7382l3062k7264K9816K7525k5512k5715
1069b2708K2627K3310k1692k3885K0813K6645j6657k8955J2189K8801j0190k8658
1081a8360R714L2216r383l6260O659L8810m521l9560M493L9872n851m1925O230
1094a7866M3357o980m3010O067M2213p489m0903P791L9387q194l7761Q218L6224
1107B1054p667l5408N739L3574m044l1067L674K9304l705k9177J406K9826K837
1120A6346k8885m994K6811M805k7102m766L0460P138l3547j0462L2972J1673l2490
1133a2041r547L4204P814l8477q404M0231R815l8132r704L6045O363l5797m315
1146b1945L7419N087l6974o571L3752P032k8960m802K6600L282k6254m504K6179
$$ plain form
1057 -33147 1115 33445 371 -28591 4122 31504 -1558 -28822 994 28519 3007 -22708
1069 -22708 -81 23229 1537 -22348 -1535 25110 8453 -20502 -8313 20488 10298 -18360
1081 -18360 -8646 23570 14187 -22073 -15414 23396 18875 -20685 -16192 23680 17829 -24096 -17866
1094 -17866 25491 18511 -24499 -18432 23781 16292 -24611 -16820 22567 14373 -23388 -15170 21054
1107 21054 13387 -22021 -16282 17292 13248 -17819 -14145 15159 11454 -17723 -16317 13509 16346
1120 16346 -12539 -17533 9278 14083 -13019 -17785 12675 19813 -13734 -24196 8776 20449 -12041
1133 -12041 -21588 12616 20430 -18047 -26451 13780 23595 -14537 -24241 11804 18167 -17630 -21945
1146 -21945 15474 20561 -16413 -22984 10768 17800 -11160 -15962 10638 13920 -12334 -16838 9341
1159I341Q333k2611j0558J8304J0972j5971j0506J7528J2998j9104j8161J7891
1171a544K2108j4955k1752J5353J9703j9875k0724K3770K5498k4434k7537K2236
1183b153K5042k3629k0937K8793K1233l2782k3717L1363K4514k8036k0109K7213
1195F795J6070k9993j5136L0969J7163k7442j7454K1933J5482j9946j2487K0376
1207F330J2836j9698j6714J6747J9068j2027j9826Q915J8430r006k0298J0811
1219d432K3232j0201k7174P380K7670o356k6203Q043K5871j2398k8714J4109L1786
1232B2613j2830l1576J1514K8651j3713k6732J7454K7704j7757l0305J5574K8799
1244A9396j2336k4473J2276K1570j4026k2674J3325K5579r846k6119N287K3865
$$ plain form
1159 9341 17674 -4937 -15495 2809 13781 -2190 -12696 4832 17830 -1274 -19435 -1544
1171 -1544 20564 5609 -16143 -790 18913 -962 -21686 2084 27582 3148 -24389 -2153
1183 -2153 22889 -740 -21677 7116 28349 -4433 -28150 3213 27727 -309 -20418 6795
1195 6795 22865 -7128 -22264 8705 25868 -1574 -19028 2905 18387 -1559 -14046 6330
1207 6330 19166 -532 -17246 -499 18569 6542 -13284 -4369 14061 5055 -15243 -4432
1219 -4432 18800 8599 -18575 -11195 16475 10119 -16084 -8041 17830 5432 -23282 -9173 22613
1232 22613 9783 -21793 -10279 18372 4659 -22073 -4619 23085 5328 -24977 -9403 19396
1244 19396 7060 -17413 -5137 16433 2407 -20267 -6942 18637 8791 -17328 -12041 11824
1256A1824m194k3095N003K5540m855k9554J058L1675L344l0488m896K9405K274
1269A3041l0679j53L4376J446l6841k804L5173L368l2262Q10L2143m003l4688
1282b1073M367L5907j008l2914J26K7721j679k5742M496K6613k804k7001k096
1295a5087K4491M624k0064m567J8832L812k1058o449K3886J1978k3394j6575K1502
1308A931J7180k1315j6433K5172J8337k8722k2669L0135K4977k7758k3870K7529
1320D494K0883l0379j9444L3955K0770l4258k2199L1790J9683k9449j5685K9792
1332I953J3574l1303j4477K9192J5909k4896j4872J9879J2138j9043j0724J9225
1344D555J2881j7783j6787J4259J7848j0654j7372R548J7798j1550k0872J2638
$$ plain form
1256 11824 7630 -15465 -10462 15078 10223 -19331 -18273 13402 16746 -13742 -18638 10767 13041
1269 13041 -17638 -17791 16585 18031 -18810 -21614 13559 16927 -15335 -14525 17618 13615 -21073
1282 -21073 -16706 19201 18193 -14721 -14595 13126 11447 -14295 -9799 16814 14010 -12991 -15087
1295 -15087 9404 14028 -6036 -10603 8229 12041 -9017 -15466 8420 20398 -2996 -19571 1931
1308 1931 19111 -2204 -18637 6535 24872 -3850 -26519 3616 28593 835 -23035 4494
1320 4494 25377 -5002 -24446 9509 30279 -3979 -26178 5612 25295 -4154 -19839 9953
1332 9953 23527 -7776 -22253 6939 22848 -2048 -16920 2959 15097 -3946 -14670 4555
1344 4555 17436 -347 -17134 -2875 14973 4319 -13053 -3505 14293 2743 -18129 -5491
1356e491K5633j1308k8746R336K7878q676k7484J1345K8863j4082l2113J3683
1368a1162L3988j1902l2640J1503K8897j3780k7844J6173K9694j5143l0751J0928
1380a2039K8153q058k4533R160K2878j0436k5143Q125K6841k992k5449K45K2167
1393H919p12k1068J712K4334o36k6951k887K7368M949k5222l507K5407N34k8237
1407a5997N74L1064J882l1505k747K8994J102k6373J511K7070l106k8837J814
1420a4554K8273R47k4360j638K0315K18j9601R20K1362K369k1675p189J8421R196
1434A3004j3981q338J4286Q280j7407j1894J9065J7160j6723j9623J4558J7618
1446A6005j5879j5712K0273J7744k4155k0529K3184K0774k1510j6563K1927J3449
$$ plain form
1356 -5491 20142 8834 -19912 -10576 17302 8626 -18858 -7513 21350 7268 -24845 -11162
1368 -11162 22826 10924 -21716 -10213 18684 4904 -22940 -6767 22927 7784 -22967 -12039
1380 -12039 16114 8056 -16477 -7317 15561 5125 -20018 -11893 14948 11956 -13493 -13248 8919
1393 8919 8207 -12861 -11149 13185 12549 -14402 -17289 10079 15028 -10194 -13701 11706 12240 -15997
1407 -15997 -15423 15641 17523 -13982 -16729 12265 13367 -13006 -11495 15575 12469 -16368 -14554
1420 -14554 13719 14666 -9694 -11332 8983 9201 -10400 -9480 11882 14251 -7424 -14613 3808 13004
1434 13004 -977 -9315 4971 13251 -4156 -16050 3015 20175 3452 -16171 -1613 16005
1446 16005 126 -15586 4687 22431 -1724 -22253 931 21705 195 -16368 5559 19008
1458A9008k6377j3130K8406J4843k6452j4357K2735J0155k1132o575K2763N662
1470A5549k4135p435K1426Q244j6438o577J3332L869j3722m788J4851R047j2152
1483A071j3312O870J3834m464j2136N521J3737q560j8382Q202K2650m915k2591
1496a2475L535J9574o817j9765J1617K2809j2129k5833R651K4216q539k0184J1495
1509b845J8554j5492k0135J5528K1738j2354j9345R968J4863j1512j2815J3816
1521c1J4606j2872j6592Q781J6278n962j3967O134J3798p862j5939P368K0017
1534A3757m803k0648J906J9130j463j8613M268K0148n277k3223L890K4704j692
1547A2084k2871K178K0378m953k0961P485K3299o246k3554K975K0124j943j6767
$$ plain form
1458 19008 -7369 -20499 7907 22750 -3702 -18059 4676 14831 -6301 -12876 9887 15549
1470 15549 -8586 -16021 5405 13649 -2789 -9366 3966 7835 -5887 -10675 4176 13223 1071
1483 1071 -12241 -5371 8463 3999 -8137 -2616 11121 2561 -15821 -7619 15031 10116 -12475
1496 -12475 -8940 10634 3817 -15948 -4331 18478 6349 -19484 -9833 14383 5844 -14340 -2845
1509 -2845 15709 217 -19918 -4390 17348 4994 -14351 -4383 10480 -1032 -13847 -31
1521 -31 14575 1703 -14889 -6108 10170 4208 -9759 -3625 10173 2311 -13628 -6260 13757
1534 13757 8954 -11694 -9788 9342 7879 -10734 -6466 13682 8405 -14818 -10928 13776 12084
1547 12084 -10787 -8609 11769 6816 -14145 -6660 16639 10393 -13161 -10186 9938 7995 -8772
1560h772M477J4992n335j7249L576J7979O44j5025l235J1816K427j2115j130J6023
1574I073L323j8624p724J8069J0187j6420q859J7461P170k1922p861K5495J0971
1587B0339k5634j2244K4259R465k5051n749K7790M965l0715o601K9049P476k6105
1600h756n204K3954J844k4685j230K4959L409k2696n266J7954M975j4367k636
1613g745J3968K776j4887o498J3927J0440r865j1504O994J0490q003j1381J1395
1626A07J4961j1858j9654R714K0428q409j8992J1335J7710j5367k0494J6934K3767
1639B0182j6406k2626J4997J9022j5868j7747J9455J8210k0292j9874J7460K0053
1651A6566j4917j6399J4463J4390j5310j5086J4967J7526j1970j7906Q249J6534
$$ plain form
1560 -8772 -4295 10697 5362 -11887 -8311 9668 10312 -4713 -7948 3868 6295 -5820 -6950 9073
1574 9073 12396 -6228 -13952 4117 14304 -2116 -10975 6486 13656 -8266 -16127 9368 20339
1587 20339 -5295 -17539 6720 16185 -8866 -14615 13175 18140 -12575 -19176 9873 17349 -8756
1600 -8756 -13960 9994 11838 -12847 -14077 10882 14291 -8405 -13671 4283 9258 -5109 -7745
1613 -7745 6223 8999 -5888 -12386 1541 11981 2116 -9388 -2394 8096 93 -11288 107
1626 107 15068 3210 -16444 -6730 13698 5289 -13703 -2368 15342 -25 -20519 -3585 20182
1639 20182 3776 -18850 -3853 15169 -699 -18446 1009 19219 -1073 -20947 -3487 16566
1651 16566 1649 -14750 -287 14103 -1207 -16293 -1326 16200 4230 -13676 -5427 11107
1663A1107o326j4558O548J6084p024j8983M943K1636k528k0640O64J8539j493
1676G969j9473M295K1641m210k4359K037K3706j239k0545L254J9434o362k1146
1689a4998O923K2779l747k1049J659J6921k586j4697M928J6329m106j8214J9J7343
1703G504L407j4093l451J3008K372j6224l184J8678P366j8739j0978J6741J0684
1716A3091j6576q857J8926Q630k2605j0940K3423J2717k2055j1486K0544Q260
1728A3072k2038n606K3997O562k4416p621K1232O728j7604l105J6944O05j7770
1741i020k017J7697M292j3854m932R655K903q849j589J0454M103j0957q716Q043
1755b787J0737n044j0102N048R661q093j2590R905J6837r035j8735P515J7633
$$ plain form
1663 11107 4781 -9777 -3229 12855 5831 -13152 -8209 13427 10899 -9741 -9077 9462 7969
1676 7969 -11504 -7209 14432 10222 -14137 -12100 11606 10367 -10178 -6924 12510 6148 -14998
1689 -14998 -8075 14704 10957 -10092 -8433 8488 5902 -8795 -3867 12462 8356 -9858 -9839 7504
1703 7504 10911 -3182 -6633 6375 8747 -7477 -10661 8017 15383 -3356 -14334 2407 13091
1716 13091 -3485 -12342 6584 15214 -7391 -18331 5092 17809 -4246 -15732 4812 13072
1728 13072 -8966 -14572 9425 15987 -8429 -16050 5182 11910 -5694 -8799 8145 8750 -9020
1741 -9020 -11037 6660 10952 -2902 -7834 1821 4724 -4125 -5714 4740 8843 -2114 -10830 -2787
1755 -2787 7950 2906 -7196 -2148 7513 -580 -13170 -3265 13572 4537 -14198 -6683 10950
1768A0950q600j5622J1692J6412j3902j8417J3754J9310j2318j6759J2039J4220
1780A2759j3874j2816J5412J4154j4662j4282J1695J2484r499r616R647Q329j1058
1793a327r146R469J0892o491j0184L440Q142l081q221M881J0532n037j3609K420
1807g320J5159n63j3554J969J2808m861j4973O567J8102m676j8441L149J5955
1820I321m415j3263P022J4971q459j7237O521J6476m310j3820M590J1140o121
1833B416j1753O834J2789m014j3076M68J0713R78q728n76R475o4j2326j784J4000
1848E352M754j3175n496J1851M099j2758k456J6080K647j8436m662J8493M683
1861A0976j6533k386J6544n81j9240J497K1130l60j9957k93J6850j850j5510M325
$$ plain form
1768 10950 2350 -13272 -1580 14832 930 -17487 -3733 15577 3259 -13500 -1461 12759
1780 12759 -1115 -13931 1481 15635 973 -13309 -1614 10870 1371 -8245 1402 9731 -1327
1793 -1327 -10473 -1004 9888 3397 -6787 -3347 4795 1714 -6507 -1626 8906 3869 -9740 -7320
1807 -7320 7839 7276 -6278 -4309 8499 3638 -11335 -4768 13334 8658 -9783 -6634 9321
1820 9321 4906 -8357 -1335 13636 5177 -12060 -5539 10937 6627 -7193 -2603 8537 2416
1833 2416 -9337 -2503 10286 6272 -6804 -6336 4377 5355 -3373 -3949 5526 5462 -6864 -8648 5352
1848 5352 10106 -3069 -8565 3286 7385 -5373 -7829 8251 10898 -7538 -12200 6293 10976
1861 10976 -5557 -7943 8601 8020 -11220 -9723 11407 11047 -8910 -9203 7647 5797 -9713 -5388
1875e388J6381m127j7526K005J5005N6j1352j86R345q11j0053k88J1461L526j0430
1890b382o971P914Q117p098o715Q006P622j0471j0433J1120J3538j0218j3815
1903a1786R807J1878j1159j0824J4533J2287j6851j3523J5192J3412j3729j0763
1915a1526J4740P645j6997p574J7803R571j5678r692J2528O968j1678n005J3599
1928D704O041j4147q936J1519J0422p696q634O211Q054q390r500R165J3379o453
1942E739j5813L879J4562l635j2737N859J4867q292j7703P014J9387n181j7308
1955i362M946J4748p230j5031R796J6369r007j6786O097J4848m959j1333N825
1968a079J0615p686j2064O015J3806k554j2379J00J0158j220r586K691J1851o99
$$ plain form
1875 -5388 10993 6866 -10660 -8655 6350 6406 -4946 -5132 4213 3402 -6651 -6939 4522 8048 -2382
1890 -2382 -9353 -1439 6678 -420 -7135 871 8493 -1978 -12411 -1291 12247 2029 -11786
1903 -11786 -1979 9899 -1260 -12084 2449 14736 -2115 -15638 -446 12966 -763 -11526
1915 -11526 3214 10859 -6138 -13712 4091 13662 -2016 -11708 820 7788 -3890 -8895 4704
1928 4704 10745 -3402 -12338 -819 9603 1907 -6727 -516 7538 -852 -10352 -1187 12192 5739
1942 5739 -10074 -6195 8367 4732 -8005 -2146 12721 4429 -13274 -6260 13127 7946 -9362
1955 -9362 -4416 10332 3102 -11929 -2133 14236 5229 -11557 -5460 9388 4429 -6904 -1079
1968 -1079 9536 1850 -10214 -4199 9607 7053 -5326 -5226 4932 3712 -5874 -3183 8668 7969
1982G969j5312k303J5340M453j3795l501J4267J420j7799j376K0590L833k0508
1995f722n030J7925L289j7548k63J9441q95k1303q10K0310J754j6504j175J4705
2009G174j408j5341K149J5954k63j4125k608J0897K325p719j440Q089J323r442
2023d435m100R009P166o664q491M835P617o117p087R360R225j0945j3107J0511
2037c223J3735q696j2005R975J0405j3730j1079J5586J3743j4204j3568J2303
2049g58R659j2165p070J4902P718j6018r871J3351J0220j0024p560R142N275j0688
2063c887n700J0359Q302p014q963L653P202k517n959M238P719n099j0172L394
2077d444J1794j426j0802J225J0098l234j0578M989J3243m511j4861L352J2795
$$ plain form
1982 7969 -7343 -9646 5694 10147 -3648 -7149 7118 8538 -9261 -10637 9953 13786 -6722
1995 -6722 -11752 6173 9462 -8086 -8349 11092 10197 -11106 -11916 8394 10148 -6356 -7531 7174
2009 7174 5766 -9575 -7426 8528 8265 -5860 -8468 2429 4754 -2965 -4405 3684 5007 -4435
2023 -4435 -8535 474 7640 976 -7515 -2680 4937 -1180 -8267 1093 10318 -627 -13734 -3223
2037 -3223 10512 1816 -10189 -214 10191 -3539 -14618 968 14711 507 -13061 -758
2049 -758 8901 -3264 -10334 4568 12286 -3732 -13603 -252 9968 -56 -7616 1526 6801 -3887
2063 -3887 -9587 772 9074 2060 -6903 -3250 3952 1435 -4524 -286 7433 2334 -7838 -4444
2077 -4444 7350 5924 -4878 -3653 6445 3211 -7367 -2378 10865 6354 -8507 -5155 7640
2090G640k967j0375M852J0172p104j1849O628J2835m797j1025L859Q382n496p714
2104f959P116R332n852j0799K578J0016m32p622P09P185j035r811N35J1075K307
2119H343j1019l543R342K926r925j039J2117J199j4815k171J4408K502j3212j588
2133f475J3039j281j3424J824J4481j438j3886O49J1632j772r988L879R626m871
2147A995j0372M022R951k341p829J472N672k092n013J503O978L83p329l332N533
2162g99N225m155m904N107M295p481n914Q846Q970r497r174Q535Q286j0061o855
2177i576J2205P626j3687r323J2969R298j1836o568J1987M319j3353l792J4016
2190D285M555j2808l991J1039K444r876o36J0430J204j0472k823R253L647o850
$$ plain form
2090 7640 4673 -5702 -850 9322 2218 -9631 -3003 9832 5035 -5990 -2131 6251 755 -6959
2104 -6959 157 9489 3637 -7162 -4584 5432 5000 -2622 -1913 5272 4237 -5574 -5039 6036 8343
2119 8343 -2676 -6219 3123 6049 -3876 -4915 7202 8401 -6414 -8585 5823 8325 -4887 -6475
2133 -6475 6564 5283 -8141 -6317 8164 6726 -7160 -6511 5121 3349 -6639 -2760 6866 1995
2147 1995 -8377 -4355 5596 3255 -4574 -3102 2570 478 -4535 -3032 3946 4329 -3000 -6332 -799
2162 -799 4426 271 -4633 474 4769 -2712 -8626 220 9190 -307 -9481 -946 7340 -2721 -9576
2177 -9576 2629 10255 -3432 -12755 214 9512 -2324 -8892 3095 7414 -5939 -9731 4285
2190 4285 8840 -3968 -7959 3080 5524 -4352 -4988 5442 6646 -3826 -6649 2604 6251 -599
2204e99l248N857K205n324m123O805N966o021p979M629Q150m039p601N413Q174
2219H265p229j0190P523J1974o478j1837O028J0407o917j0107Q490J1433r262
2232B100j1937P598J1562o741q762O677P913p603q497P207R526m933r174K891
2246b173P988l472o918L510Q694l308j0508J335J1134l03j0366j57J0240j480
2260D216j1353J821J3137j119j4670Q11J3382p21j3497L001J3663m085j4974L962
2274f426J5024k614j3729K784J1842m041j0606M226J0984l543j0934J705R516
2287D188l07p569N37O129k43p697j208Q480L693p671n964O186N765n864n800P980
2303F35P084j0307q511R742R893r507q452R868P336j1869o796J3828Q123j3733
$$ plain form
2204 -599 -3847 2010 4215 -1109 -5232 1573 7539 1518 -6461 -1832 6318 2279 -5322 91 8265
2219 8265 1036 -9154 -1631 10343 3865 -7972 -1944 8463 1546 -8561 -71 11362 2100
2232 2100 -9837 -2239 9323 2582 -6180 497 8410 807 -7690 -483 9043 4110 -5064 -2173
2246 -2173 5815 2343 -4575 -1065 7629 4321 -6187 -4852 6282 5979 -4387 -4544 5696 4216
2260 4216 -7137 -5316 7821 6702 -7968 -7157 6225 5504 -7993 -4992 8671 4586 -10388 -6426
2274 -6426 8598 5984 -7745 -4961 6881 2840 -7766 -3540 7444 3901 -7033 -5328 4188
2287 4188 3881 -3688 -3151 2978 2735 -4962 -6170 2310 6003 -1668 -7632 -1446 4319 -1545 -7345 635
2303 635 7719 -2588 -11099 -1357 8536 -971 -9423 445 7781 -4088 -10884 2944 11067 -2666
2317b666q152J2856O494j2358m546J3332L764j3860m084J3207M491j1243l786
2330f551J0130K061r112k210R379L227q786m470O095N499m265m746M019M368m552
2345H6o388M608R451l387r676J795R008k423q617M627J0059n259j1865M242J2153
2360H414l018j0665L986R442o221r830P142J0529n444j0290M113P913m203o921
2374e053N684P174o010q553M460P940k204o804J911N630k238o912K634Q131j347
2389D443r237k78Q851Q12q339M8R137j104j0959O99J2112M80j1598p11J0284m82
2405D158j0501K277J1264k672j1439J019J0478o12q559J682P451l595p557K752
2419c854P917j115o425l44M250l67l257Q35M348M85n274k504M583M091l744l809
$$ plain form
2317 -2666 -10818 2038 8532 -3826 -8372 4960 8724 -5136 -9220 3987 8478 -2765 -6551
2330 -6551 3579 5640 -3472 -5682 3697 6924 -1862 -6332 -237 5262 997 -3749 270 4638 86
2345 86 -6302 -1694 7757 4370 -5306 -3511 5497 3074 -5543 -916 9143 3884 -7981 -3739 8414
2360 8414 5396 -5269 -1283 8159 1938 -7892 -750 9779 4335 -5955 -1842 6071 1868 -5053
2374 -5053 631 7805 1795 -6758 -2298 5642 3438 -3366 -1455 4175 1937 -4975 -2341 5790 4443
2389 4443 -4794 -5072 3779 4591 -3748 -3700 5437 4333 -6626 -5927 6185 6665 -4933 -5644 4640 4158
2405 4158 -6343 -4066 7198 4526 -6913 -5894 4584 3972 -4587 -2905 4546 951 -6606 -3854
2419 -3854 4063 2948 -3477 -3821 429 62 -3195 -2360 1988 2473 -2801 -5305 -722 3369 -375 -4184
2435d184L640M072n779m255P196O154p683o516P322O224p904n169R552M428j0760
2450c662n081J1465N390j0831m292R798L021j0358j810J1213J811j0874k636R402
2464B556J800p009m09O934n29o951o26O640K313m436k362K686J581k699j205L446
2480A730L360m051n080K999N595j487n735K979N270m798o433N444P642m857p986
2495e408M671P059n816o094P156O951q353q033P810P198o317o240O527M934p334
2510a289m602P300N333n812o271M387N562m135m221L670N037l952o261K725P414
2525D885j575p122R49O648k068o674K301Q348k019r672J126R347j584q870K992
2540b988Q914m119r707M059J0161l830r125M014P655m527p515N145P669m567p400
$$ plain form
2435 -4184 -544 3528 -2251 -6506 690 6844 -839 -7355 -33 6191 -1713 -6882 2670 7098 -3662
2450 -3662 -8743 2722 8112 -2719 -7011 2787 5808 -4550 -6360 4853 6664 -4210 -6846 2556
2464 2556 4356 -2653 -3062 3872 3343 -3608 -4234 2406 4719 283 -2079 607 2188 -511 -1716 1730
2480 1730 5090 1039 -4041 -1042 4553 3066 -2669 310 5580 782 -5651 -207 7435 2578 -5408
2495 -5408 -737 6322 506 -5588 1568 8519 166 -7867 -57 7141 824 -5416 1111 6045 -1289
2510 -1289 -5891 1409 6742 930 -5341 -954 4608 473 -3748 -78 4959 1007 -5254 -2529 4885
2525 4885 3310 -3812 -2863 3785 1717 -4957 -2656 5692 3673 -5999 -4873 4474 2890 -5980 -2988
2540 -2988 5926 1807 -7900 -3841 6320 2490 -6635 -2621 5034 507 -7008 -1863 5806 1239 -6161
2555f161L264P273l092n684K619N416k523n813J364O483M64o358j977O329K223
2570C827n901k497P014L147q727l727Q534N376q932n074Q900M586r901l866J1084
2585C843L945j1592l890J1421K971j0453j947J0587J498j1585p30J0981Q15r226
2599c362p28P830K07p441J58P959J11p369j250O096K071n202j927M340K608n010
2615i09l131N061M991m272o457L582O693l914o395M830P136n732q847O350Q600
2630G586n319q544N888P289o854p541P344Q324o990q310O151P105n879n453N775
2645E72N359n863n915M934N983m230m661L269M401l492m815L410N762k668o556
2660d510R50O753k89p130J548O887j595q563J815Q899j038r020J006Q386j509
$$ plain form
2555 -6161 -2897 4376 1284 -4400 -1781 3635 1112 -4701 -3337 3146 3610 -2748 -4725 1604 3827
2570 3827 -2074 -4571 2443 5590 -3137 -6864 1670 7046 -1886 -6960 1940 6526 -3375 -7241 3843
2585 3843 7788 -3804 -7694 3727 6698 -3755 -5702 4885 6383 -5202 -5932 5049 5864 -3362
2599 -3362 -4090 3740 3947 -3494 -3336 4623 4734 -2635 -3885 2211 4282 -920 -2847 1493 4101 -909
2615 -909 -4040 1021 6012 1740 -4717 -1135 5558 1644 -4751 79 7215 1483 -7364 -1014 7586
2630 7586 2267 -6277 -389 6900 46 -7495 -151 8173 1183 -7127 -976 6129 250 -5203 572
2645 572 5931 68 -5847 -913 5070 840 -3821 -552 3849 357 -4458 -1048 4714 2046 -4510
2660 -4510 -3560 3193 2904 -4226 -2678 4209 2614 -5949 -4134 4765 3727 -5293 -4287 4099 2590
2675B590q807L007R096l354r307K664Q797k619p412K975O949l157p295L245P048
2690D420j748o579J029M672m93m083R95M506l24m812j221M649K279l655l188M497
2706I44K817n211l217O139M314p163m432O880M526o720l941P692K788q540k748
2721e872R010L159q931k159Q331R90q314l70R416j88q770r58Q059O56o157k2O104
2738C984q41n951j42N114J372l811j229K087J352k200j386L212K359l028m942
2753d050K685N137j736m970K444M537l765n203M039O675m267o199L629N295m519
2768b68m844N915M871o488n107O227M654n299l853N530K873o298k789O250L522
2783D896m982l785L682L062l665k144L854K635m168l734K781M978k359m096J254
$$ plain form
2675 2590 -6217 -3210 5886 2532 -6775 -4111 4686 2067 -5345 -2370 4579 1422 -5873 -2628 4420
2690 4420 2672 -3907 -2878 1794 1301 -2782 -1787 2719 2395 -2417 -3638 1011 3290 -365 -3553 944
2706 944 3761 -1450 -4667 1472 5786 -1377 -5809 1071 5597 -1123 -5064 2628 5416 -3124 -5872
2721 -5872 3138 6297 -2634 -4793 3538 4528 -3786 -4156 5260 5072 -3698 -4656 3403 4059 -2098 -2120 3984
2738 3984 3143 -2808 -2950 2164 3536 -275 -1504 583 1935 -265 -1651 1561 3920 892 -4050
2753 -4050 -1365 3772 2036 -2934 -490 4047 282 -4921 -882 5793 1526 -4673 -1044 4251 -268
2768 -268 -5112 803 5674 -814 -5921 306 4960 -339 -4192 1338 4211 -2087 -4876 1374 4896
2783 4896 -86 -3871 -189 2873 -792 -2936 918 3553 -615 -4349 -1568 3410 1051 -3045 -1791
2798a791M312k515m652K818O280k246p366J600O598j065o646K971N889l353o881
2813f047L808P132k908o516L190N343m294m479M498N324m630n106L684M310k641
2828F68l255K443K891k555l508J923M380p63m327o3L157P18l758l5M891K76n970
2845b887j642P123K377o471k319O537J378p459j342R321J278r437j280Q715O22
2860D514p903Q33Q239j585r034R59R048p08p261J113O058k168n908K189O134j476
2876C044n226p0L942K46l294L77L333L22m215j591L999L122l181l955L218L079
2892C150l771l506M781M958n543n911N663N865n270n278N773M769p135m593P317
2907A269N597p308n482O560M087o259l565O780L386p011l861N620M350m393l637
$$ plain form
2798 -1791 2521 6 -4646 -1828 4452 2206 -5160 -3560 3038 1973 -4673 -1702 4187 834 -6047
2813 -6047 -2239 4893 1985 -4531 -1341 4002 -292 -4771 -273 5051 421 -4685 -1001 3309 668
2828 668 -2587 -144 2747 192 -3316 -1393 2987 2224 -2103 -2166 991 1709 -2049 -2084 2807 3083 -2887
2845 -2887 -4529 2594 4971 -1500 -3819 2718 4096 -3363 -4705 4616 5894 -3543 -4823 3892 4514
2860 4514 -3389 -2556 5683 4098 -4936 -3977 5071 4363 -2898 -1785 4273 2105 -3803 -1614 4520 3044
2876 3044 -2182 -2252 1690 1936 -1358 -981 2352 2674 -1541 -3132 867 3989 808 -3147 71 3150
2892 3150 -621 -4127 654 5612 69 -5842 -179 5686 416 -4862 911 5680 -1455 -6048 1269
2907 1269 6866 -442 -5924 636 4723 -1536 -5101 1679 5065 -1946 -5807 -187 4163 -230 -3867
2922c867M028K998m709l059M537L754l052m594J632M814j614m240K315M714k683
2937I74o056K333P013k110o231J988N943k591o679L631O826l272p038L035O465
2952D231l163n738L598N315l901n219L478N686k963n298K176M377j604m064J683
2967a406M436j567m462M18M561J472m501j699M111J503m970j411O417K301o563
2982a360l313O582K561o262j701P388J157q265j581Q297J501p162j039P080n70
2997C313p534J029P623l78p142K03N858r93m729J713M578j163n180P91M323N0
3013B362l224m31K301Q32k261j219K683J949k467l345J991M218k021m204K565
3028b71L950l542m549M327N578m768n799L892N477m549m499N383M120n569m655
$$ plain form
2922 -3867 161 3159 -1550 -4609 -72 3682 630 -3964 -2332 2482 868 -3372 -1057 3657 974
2937 974 -5082 -2749 4264 2154 -4077 -2089 3854 1263 -5416 -1785 5041 1769 -5269 -2234 4231
2952 4231 1068 -4670 -1072 4243 342 -4877 -1399 4287 1324 -3974 -1798 2579 975 -3089 -1406
2967 -1406 3030 1463 -2999 -2581 1980 3452 -1049 -2748 1363 2866 -2104 -3515 2902 5203 -1360
2982 -1360 -4673 1909 4470 -1792 -3493 3895 5052 -3213 -4794 3503 5004 -2158 -3197 3883 3313
2997 3313 -4221 -3192 4431 4053 -3089 -2886 2972 1979 -2750 -1037 3541 2378 -2802 -2011 2312 2362
3013 2362 -862 -1293 1008 1840 -421 -1640 1043 2992 525 -2820 -829 3389 1368 -2836 -271
3028 -271 3679 137 -4412 -85 5493 725 -5074 -1182 4295 -254 -4753 630 4750 -819 -5474
3043e474N316M461m965l014M592K316n485k232N923K097m427k508L700J673k908
3058i35j666L587J338l067k476K652K817k030k278J262K647k131k829K129M097
3073C117k327m262J338M906j716m287J873M357k582m693K380N690k734m927K670
3088a197M027k465m061L641L564l218m158K818L815j784l129K067J898j842k521
3103b545J813L461p91l269j88K837j13k447L98L669o12m237r33M986J294m734
3119a411q31M735J14n756O44O490j70p089N15O170p06n500J412N984k374o389
3135d162K514O030j742n478J485M807k395m082K692M106k217l752R22L048k31
3150A545k188M17J673k47k508n49K816K100k590k873J994K844k565k666M129K356
$$ plain form
3043 -5474 -158 4303 -662 -3676 916 3232 -2253 -4485 1438 3535 -892 -3400 300 1973 -935
3058 -935 -2601 986 2324 -743 -3219 -567 2250 220 -2058 -796 1851 -280 -3109 -980 3117
3073 3117 790 -3472 -2134 2772 1056 -3231 -1358 2999 417 -4276 -1896 3794 1060 -3867 -1197
3088 -1197 2830 365 -3696 -55 3509 291 -3867 -1049 2766 982 -2147 -80 1818 -24 -2545
3103 -2545 -732 2729 1938 -1331 -1519 1318 1205 -1242 -844 2825 2213 -2024 -2957 2029 3323 -1411
3119 -1411 -2242 2493 2607 -3149 -2505 3985 3815 -3274 -2759 3411 2705 -2795 -1383 4601 2227 -4162
3135 -4162 -1648 4382 2640 -2838 -1353 3454 1059 -3023 -331 3775 1558 -2194 -1272 1776 1545
3150 1545 -643 -226 1447 1200 -1308 -1857 959 3059 469 -2404 -410 2434 -131 -2797 1332 3688
3166C688m396l824M310M168m392l196M547K846o009k472O496L186o832k536N885
3181A469J533n305j445O215Q85o195j289N672J481m649j370L822J173l857j027
3196b887L825J968l970k432K714K732j926k531K145K483k423l420K720M245k178
3211A065m476J837M367k456m128L246M649l728n187L429N198l187m303L486L571
3226C383l846m042M321M446l468m291K491L572k703k505L142L050l008l474J021
3241a911M299k89l867J80L635p50l947J181M696k2n327j002N345Q73n063l1N432
3258C432l99o825N49P456k97o842N21N512r71n543J541O575j982n948J230M840
3274B849n43m272J867L526k268l722J517L497l29l107j68K197R8j507m15K380
$$ plain form
3166 3688 -708 -4532 -222 3946 -446 -3642 905 3751 -2258 -4730 1766 4952 -1880 -4416 1469
3181 1469 3002 -2303 -3748 2467 3352 -2843 -4132 1540 3021 -1628 -2998 824 1997 -1860 -2887
3196 -2887 938 2906 -1064 -3496 -782 1950 24 -2507 -362 2121 -302 -3722 -1002 3243 1065
3211 1065 -3411 -1574 2793 337 -3791 -545 4104 376 -4811 -1382 3816 629 -3674 -188 3383
3226 3383 -463 -4505 -184 4262 794 -3497 -1006 2566 -137 -2642 500 3550 542 -2932 -1911
3241 -1911 2388 2099 -1768 -1588 2047 1297 -2650 -1469 3227 3205 -2122 -3124 2221 3094 -1969 -2000 3432
3258 3432 3033 -3792 -3243 4213 3916 -2926 -2405 3107 2136 -3407 -1866 4709 2727 -3221 -1991 2849
3274 2849 2306 -1966 -99 3427 1159 -2563 -1046 2451 2122 -985 -1153 1044 1142 -365 -780 1600
3290A600O24k915j887K829K685k521k704K735K159l521k465L975M127n224l908
3305d411M569L769m804l033N058K830n929k874N708L369n173k445M882J110m992
3320b366j075N318J239m722j548L745J069k802o35K703O19l015j486K735K070
3335A849j807k127R05J901q98j979J425L015j821l657J602L886j347l517J686
3350h84L139k395l868L396M317k734m344K062L844k504k758K978K849l123l461
3365c486L166K980k282k387K158J731k481j383J643K797j526k550M57K243L40
3380A420k214o1L259q15l562J87L555R02l465r70L685N00m048O19M236n37m955
3397b264L16M892o97m074J410M216k436m669K318M550j628m136J947K768k227
$$ plain form
3290 1600 2224 -691 -2578 251 2936 415 -2289 446 2605 -916 -3381 594 4721 -503 -4411
3305 -4411 158 3927 -877 -3910 1148 3978 -1951 -4825 883 4252 -921 -3366 1516 2626 -2366
3320 -2366 -3441 1877 3116 -1606 -3154 591 1660 -1142 -1777 926 1545 -1470 -2956 -221 1849
3335 1849 42 -2085 -1180 721 -177 -2156 -731 2284 463 -3194 -1592 2294 947 -2570 -884
3350 -884 2255 -140 -4008 -612 3705 971 -3373 -1311 2533 29 -2729 249 3098 -25 -3486
3365 -3486 -320 2660 378 -2009 149 1880 -601 -1984 -341 2456 930 -1620 -1163 1080 1420
3380 1420 -794 -855 2404 1589 -1973 -1786 1769 2671 -794 -1764 1921 2421 -1627 -1008 3228 2691 -2264
3397 -2264 -1948 2944 2247 -1827 -417 3799 1363 -3306 -988 3562 1934 -2202 -255 2513 286
3412B86k468K611K590k252k748J760J682m94j545N21J019k13k236L77K308R82
3428B180k252j996J875J984j791k088K634J983l346k613M151K705l817k327L394
3443F76J642m114j242M955J449n320j576M677J014m266J40M134k06m899k0M555
3459A599P5l575j01L052k99k965N51K906L60k947p87J831J741j772j205J657J349
3476A470k434j895K975K472k121l389K094K766j955k524K750L030l739k991L110
3491c81L662l253k792L086K410l452k428L892K436l627k381K975K112k858j271
3506a870K571J567k522k240K801K233j467k326Q12K191j223k283J559L093j229
3521A667l696P74L247q9l681J192L819j891m232J552M848j199m957J160M781k207
$$ plain form
3412 286 -2182 429 3019 767 -1981 -221 1461 967 -578 -57 962 749 -1487 -1110 1198 2180
3428 2180 -72 -2068 -193 1791 0 -2088 546 2529 -817 -3430 721 3426 -391 -2718 676
3443 676 2318 -1796 -3038 1917 3366 -1954 -3530 1147 2161 -2105 -1965 2169 1963 -2936 -2956 1599
3459 1599 1674 -1901 -2002 1050 751 -2214 -1663 1243 1603 -1344 -2131 -300 1441 -331 -1536 121 1470
3476 1470 -964 -2859 116 2588 467 -2922 -828 1938 -17 -2541 209 3239 -500 -3491 -381
3491 -381 3281 28 -2764 322 2732 -720 -3148 744 3180 -447 -2828 147 2259 -599 -1870
3506 -1870 701 2268 -254 -2494 307 2540 1073 -1253 -441 1750 527 -1756 -197 2896 1667
3521 1667 -2029 -1255 1992 1903 -1778 -586 3233 1342 -2890 -1338 3510 2311 -2646 -1486 3295 1088
3537A088l909K362M670k896m606K125M236j737l793K420K335j998k772K207K559
3552B291j125k766P99J539k08j419N76J605k3k456p38K269J752k387j769K247
3568A87J513k496k022M496J434m796j846M186K252m217j550M330J054n321p86
3583c582N340J285m985j100M214N83m415J10M828j43m504k80L385Q73k953l26
3599a670K725qk766m98K788J151j967j505J567J216j094j451J419K158j793l111
3615b839J784L333j728k554J647K363j775l295K779L773k972l239K472K467k396
3630a80k142L092K287l294k547L348K108k429k047K226J191j670j677K361J528
3645B155j666k303J386K157o84j844O05J974r87k469R12K987j95l310K21K762
$$ plain form
3537 1088 -2821 -459 4211 1315 -3291 -1166 3070 1333 -2460 -40 2295 297 -2475 -268 2291
3552 2291 1166 -1600 -801 738 530 -889 -313 1292 1269 -1187 -1925 344 2096 -291 -2060 187
3568 187 1700 -796 -2818 1678 3112 -1684 -3530 656 2908 -1309 -2859 1471 2525 -2796 -3582
3583 -3582 1758 3043 -1942 -3042 1172 1755 -2660 -2550 2278 2135 -2369 -2649 736 1609 -1344 -1670
3599 -1670 1055 1047 -1719 -2217 571 1722 -245 -1750 -183 1033 -61 -1512 -93 2065 272 -2839
3615 -2839 -1055 2278 550 -2004 -357 2006 231 -3064 -285 3488 516 -2723 -251 2216 -180
3630 -180 -2322 770 3057 -237 -2784 564 2672 243 -1804 422 1613 -57 -1734 627 2155
3645 2155 489 -1814 -428 1729 1045 -799 -194 1780 793 -1676 -764 2223 2028 -1282 -1061 1701
3661A701k96l026P75L885j555m101J347L829j066k998R50L182k300k924J845L551
3677B799j955k665J542J812j418j991K124J625j630j838R61J864n51j208K3J249
3693G43k81j338j01J338J240k197r92J677J204k112r34K593J091l320j217L281
3709F75J715l694j350L580P61l435n95L787O02m227k75M016k46k857P2L172p66
3726I35l604J253K942m64l143J049K105p20k113J061J803n75j759L35J158L77
3742F40j024o54J470M38j125j198J641J303j214k078J646K241k032k020K126K030
3758B190k483j964K782J978k670j999K564K145k854j652K874J635l046j388K525
3773F37J461k548j259K771N39k230p31K205J342k183j096J371J294j459p70J232
$$ plain form
3661 1701 1405 -1621 -846 3039 1484 -2617 -1270 2559 1493 -1505 -555 2627 327 -2597 -752 2799
3677 2799 844 -1821 -279 1533 115 -1876 248 1873 243 -1595 -634 1230 679 -529 -506 743
3693 743 462 -876 -977 361 1601 -596 -1588 89 1293 -819 -1753 840 1931 -1389 -2606 675
3709 675 2390 -1304 -2654 926 1687 -1748 -2343 1444 2046 -2181 -2456 1560 1314 -1543 -1471 1701 935
3726 935 -2669 -1416 1526 1062 -2081 -1032 1073 353 -1760 -699 1104 529 -1230 -895 263 640
3742 640 -384 -1038 432 870 -255 -1453 188 1491 277 -1801 -155 2086 54 -1966 160 2190
3758 2190 -293 -2257 525 2503 -167 -2166 398 2543 -311 -1963 911 2546 -500 -1888 637
3773 637 2098 -450 -1709 1062 1601 -629 -1360 845 2187 4 -1092 279 1573 114 -656 576
3789E76J016j042k191J329K418j081k403J226K286j524k358J581K529j872k857
3804b367J710L063k099k796K603K571k392l032K606K491k527k064K637J534k113
3819a75j539J725J843j874j515J384J396q79j389M4J691k07j692p2K088L01k512
3836a382o30K472R62k708n04K417Q50l637k96L733M62l372q42M131l74l606K18
3853b106M242m10m018p6M251n90l745J178L523j279l409J375K782j003k295Q78
3869g02K066p62k384R87J822k29j907J40J362N41j263m48Q24J563j696j589J860
3886A85J890j666k490K055K296k072k561K877K250k823k470K970K293k765k030
3901b061K879J830l224j391L097J114k821j220K456J027k325o75K406O67j752
$$ plain form
3789 576 1592 550 -1641 -312 2106 1025 -1378 -152 2134 610 -1748 -167 2362 490 -2367
3804 -2367 -657 2406 307 -2489 114 2685 293 -2739 -133 2358 -169 -2233 404 1938 -175
3819 -175 -1714 11 1854 -20 -1535 -151 1245 366 -1023 -979 712 505 -1187 -1259 829 1130 -1382
3836 -1382 -2012 460 1422 -1286 -1790 627 1477 -2160 -2456 1277 1739 -1633 -2475 1656 1282 -2324 -2106
3853 -2106 2136 1726 -2292 -2368 1883 1293 -2452 -1274 2249 970 -2439 -1064 1718 715 -1580 -702
3869 -702 1364 602 -1782 -795 1027 798 -1109 -969 393 934 -329 -777 47 1610 -86 -1675 185
3886 185 2075 409 -2081 -26 2270 198 -2363 514 2764 -59 -2529 441 2734 -31 -2061
3901 -2061 818 2648 -576 -1967 1130 2244 -577 -1797 659 1686 -639 -1314 1092 1759 7
3916Gr88J307J237j538j044J448J442j615j731J507J852p60k520R93K275j269
3932F03k215J100K351q96k885J389K787j524k570J458K422j683k408J897K196
3947B022j563k104J434J937j497j608R69J726j309j601J258J406q56j417P75J130
3963G02n13j078R5Q39O48j847l08J913L65j680n65K240M30k732q08L154R60l204
3981a389o01L082M91l562n0L267K66l060J04K851m10l187P19L146n99k690L77
3998a245K562r87k005J085J887r85j523Q06J334n21j323N38Q72k34k71m52Q03
4015C41P54j044r05P59J395j280j041J157J490j669j468K009J795k462j342J844
4031C33J775k185j409K651Q61k576j148K777R22k270j275K596L93k246j59J956
$$ plain form
3916 7 -981 326 1563 25 -1019 429 1871 256 -1475 32 1884 1124 -1396 -403 1872 603
3932 603 -1612 -512 1839 943 -1942 -553 2234 710 -1860 -402 2020 337 -2071 -174 2022
3947 2022 459 -1645 -211 1726 229 -1379 -410 1316 7 -1594 -336 1070 214 -1203 -428 702
3963 702 189 -889 -794 45 693 -1154 -1462 451 816 -864 -1429 811 1241 -1491 -2299 855 1815 -1389
3981 -1389 -1990 1092 1583 -1979 -2029 1238 1504 -1556 -1452 1399 989 -2198 -1479 1667 1068 -1622 -1245
3998 -1245 1317 330 -1675 -590 1297 312 -1211 -405 929 408 -915 -377 495 261 -10 -462 341
4015 341 1095 51 -854 -95 1300 20 -1021 136 1626 -43 -1511 498 2293 -169 -1511 333
4031 333 2108 -77 -1486 1165 2026 -550 -1698 1079 2001 -269 -1544 1052 1445 -801 -960 996
4047I96M44j956m38J909J76j494k37J197O10j313q19J236R40r27r86P41J048o93
4065D34j584Q85J811j005j923R10J842j257j557J091K115j659k057J737J953k267
4081e31j189K250R79k145r10J799J220j775j375J555Q82q09j053J026P99j258
4097e35o39R75J082k98j730M28J124O0j779K14K011p5k191pK077N58k632NK427
4116A075J2k914L67L292m33l310L89K975q76k918J126L242j437k429Q25K321p33
4133E74k249J145K082j094j949J320J526j250j209R55J019n61j047L58J100K89
4149A009j580M5Q78L79p45p13R30J188j676j109J910J332j731j850K298J251j852
4166c6j421K407J325k796j143K545J196k530r21K895L59k430p96K897O3k230o35
$$ plain form
4047 996 1440 -516 -954 955 1131 -363 -600 597 1207 -106 -925 311 1251 324 -662 79 1127 434
4065 434 -1150 -265 1546 541 -1382 -472 1370 113 -1444 -353 1762 103 -1954 -217 1736 -531
4081 -531 -1720 530 1509 -636 -1546 253 1473 -302 -1677 -122 760 -49 -1102 -76 723 -535
4097 -535 -1174 -199 883 585 -1145 -717 407 467 -1312 -1098 913 838 -1353 -1360 717 1275 -1357 -1352 1075
4116 1075 1087 -1827 -1460 1832 1399 -1911 -1522 1453 577 -2341 -1215 2027 590 -1839 -1014 1307 574
4133 574 -1675 -530 1552 458 -1491 -171 1355 105 -1104 -149 870 309 -738 -380 720 1009
4149 1009 -571 -526 352 731 -14 -727 203 1391 -285 -1394 516 1848 117 -1733 565 1816 -36
4166 -36 -1457 950 2275 -521 -1664 881 2077 -453 -1374 1521 1880 -550 -1346 1551 1614 -616 -1251
$$ [...]
8191c68
##END NTUPLES=NMR FID
##END=
