##TITLE=1H_SAM_22.BBSX1_THF 2.4 HFB
 CDCl3, 64 sc, 
 8.5.2019
##JCAMPDX= 6.0         $$ Bruker NMR JCAMP-DX V2.0
##DATA TYPE= NMR FID
##DATA CLASS= NTUPLES
##ORIGIN= UXNMR, Bruker Analytische Messtechnik GmbH
##OWNER= root
$$ XWIN-NMR		Version 3.5
$$ Wed May  8 14:50:30 2019 Russian Standard Time (UT+4h)  she@DPX200
##.OBSERVE FREQUENCY= 200.1315
##.OBSERVE NUCLEUS= ^1H
##.DELAY= (6, 6)
##.ACQUISITION MODE= SIMULTANEOUS
##.ACQUISITION SCHEME= undefined
##.AVERAGES= 64
##.DIGITISER RES= 18
##SPECTROMETER/DATA SYSTEM= spect
##.PULSE SEQUENCE= zg30
##.SOLVENT NAME= CDCl3
##.SHIFT REFERENCE= (INTERNAL, CDCl3, 0, 15.7039)
##AUDIT TRAIL= $$ (NUMBER, WHEN, WHO, WHERE, WHAT)
$$ ##TITLE= Audit trail, XWIN-NMR		Version 3.5
$$ ##JCAMPDX= 5.01
$$ ##ORIGIN= Bruker BioSpin GmbH
$$ ##OWNER= she
$$ F:/spectra/data/she/nmr/H-F/1/audita.txt
$$ ##AUDIT TRAIL=  $$ (NUMBER, WHEN, WHO, WHERE, WHAT)
(   1,<2019-05-08 14:47:31.65 +0400>,<she>,<DPX200>,
      <continue with go, POWCHK disabled, PULCHK disabled
       configuration hash MD5:
       00 E9 B6 7A A2 85 ED C7 34 08 36 98 17 FE 4E 26
       data hash MD5: 16K
       1C C6 64 A5 F5 6F EE E2 68 D1 DA 72 D5 60 C5 98>)
$$ ##END=
$$ 
$$ hash MD5
$$ E9 F7 E5 05 38 03 72 D7 44 C1 11 F3 BB D2 14 53
##$RELAX= 
##$RELAX= 
##$RELAX= 
##$RELAX= 
##$RELAX= 
##$RELAX= 
$$ Bruker specific parameters
$$ --------------------------
##$DU= <F:/spectra>
##$EXPNO= 1
##$NAME= <H-F>
##$PROCNO= 1
##$TYPE= <nmr>
##$USER= <she>
##$AMP= (0..31)
100 100 100 100 100 100 100 100 100 100 100 100 100 100 100 100 100 100 
100 100 100 100 100 100 100 100 100 100 100 100 100 100 
##$AQSEQ= 0
##$AQ_mod= 1
##$AUNM= <au_zg>
##$AUTOPOS= <>
##$BF1= 200.13
##$BF2= 200.13
##$BF3= 200.13
##$BF4= 200.13
##$BF5= 200.13
##$BF6= 200.13
##$BF7= 200.13
##$BF8= 200.13
##$BYTORDA= 1
##$CFDGTYP= 0
##$CFRGTYP= 5
##$CHEMSTR= <none>
##$CNST= (0..31)
1 1 145 1 1 1 1 1 1 1 1 1 1 1 1 1 1 1 1 1 1 1 1 1 1 1 1 1 1 1 1 1 
##$CPDPRG= <>
##$CPDPRG1= <>
##$CPDPRG2= <>
##$CPDPRG3= <>
##$CPDPRG4= <mlev>
##$CPDPRG5= <mlev>
##$CPDPRG6= <mlev>
##$CPDPRG7= <mlev>
##$CPDPRG8= <mlev>
##$CPDPRGB= <>
##$CPDPRGT= <>
##$D= (0..31)
0 1.2 0 0 0 0 0 0 0 0 0 0.03 0 0 0 0 0 0 0 0 0 0 0 0 0 0 0 0 0 0 0 0 
##$DATE= 1557312205
##$DBL= (0..7)
120 120 120 120 120 120 120 120 
##$DBP= (0..7)
150 150 150 150 150 150 150 150 
##$DBP07= 0
##$DBPNAM0= <>
##$DBPNAM1= <>
##$DBPNAM2= <>
##$DBPNAM3= <>
##$DBPNAM4= <>
##$DBPNAM5= <>
##$DBPNAM6= <>
##$DBPNAM7= <>
##$DBPOAL= (0..7)
0.5 0.5 0.5 0.5 0.5 0.5 0.5 0.5 
##$DBPOFFS= (0..7)
0 0 0 0 0 0 0 0 
##$DE= 6
##$DECBNUC= <off>
##$DECIM= 24
##$DECNUC= <off>
##$DECSTAT= 4
##$DIGMOD= 1
##$DIGTYP= 9
##$DL= (0..7)
0 120 120 120 120 120 120 120 
##$DP= (0..7)
150 150 150 150 150 150 150 150 
##$DP07= 0
##$DPNAME0= <>
##$DPNAME1= <>
##$DPNAME2= <>
##$DPNAME3= <>
##$DPNAME4= <>
##$DPNAME5= <>
##$DPNAME6= <>
##$DPNAME7= <>
##$DPOAL= (0..7)
0.5 0.5 0.5 0.5 0.5 0.5 0.5 0.5 
##$DPOFFS= (0..7)
0 0 0 0 0 0 0 0 
##$DQDMODE= 0
##$DR= 18
##$DS= 0
$$ [...]
##$SUBNAM2= <"">
##$SUBNAM3= <"">
##$SUBNAM4= <"">
##$SUBNAM5= <"">
##$SUBNAM6= <"">
##$SUBNAM7= <"">
##$SUBNAM8= <"">
##$SUBNAM9= <"">
##$SW= 24.9337058887773
##$SWIBOX= (0..15)
0 0 2 0 0 0 0 0 0 0 0 0 0 0 0 0 
##$SW_h= 4990.01996007984
##$TD= 16384
##$TD0= 1
##$TE= 0
##$TE2= 300
##$TE3= 300
##$TEG= 300
##$TL= (0..7)
0 120 120 120 120 120 120 120 
##$TP= (0..7)
150 150 150 150 150 150 150 150 
##$TP07= 0
##$TPNAME0= <>
##$TPNAME1= <>
##$TPNAME2= <>
##$TPNAME3= <>
##$TPNAME4= <>
##$TPNAME5= <>
##$TPNAME6= <>
##$TPNAME7= <>
##$TPOAL= (0..7)
0.5 0.5 0.5 0.5 0.5 0.5 0.5 0.5 
##$TPOFFS= (0..7)
0 0 0 0 0 0 0 0 
##$TUNHIN= 0
##$TUNHOUT= 0
##$TUNXOUT= 0
##$USERA1= <user>
##$USERA2= <user>
##$USERA3= <user>
##$USERA4= <user>
##$USERA5= <user>
##$V9= 5
##$VALIST= <valist>
##$VCLIST= <CCCCCCCCCCCCCCC>
##$VD= 0
##$VDLIST= <DDDDDDDDDDDDDDD>
##$VPLIST= <PPPPPPPPPPPPPPP>
##$VTLIST= <TTTTTTTTTTTTTTT>
##$WBST= 1024
##$WBSW= 4
##$XGAIN= (0..3)
0 0 0 0 
##$XL= 0
##$YL= 0
##$YMAX_a= 3149811
##$YMIN_a= -4677165
##$ZGOPTNS= <>
##$ZL1= 120
##$ZL2= 120
##$ZL3= 120
##$ZL4= 120
##$ABSF1= 10
##$ABSF2= 0
##$ABSG= 5
##$ABSL= 3
##$ALPHA= 0
##$AQORDER= 0
##$ASSFAC= 0
##$ASSFACI= 0
##$ASSFACX= 0
##$ASSWID= 0
##$AUNMP= <proc_1d>
##$AZFE= 0.1
##$AZFW= 0.1
##$BCFW= 1
##$BC_mod= 2
##$BYTORDP= 1
##$COROFFS= 0
##$CY= 11.3945322036743
##$DATMOD= 1
##$DC= 2
##$DFILT= <>
##$DTYPP= 0
##$F1P= 18.9103706918063
##$F2P= -1.10871071338519
##$FCOR= 0.5
##$FTSIZE= 0
##$FT_mod= 4
##$GAMMA= 1
##$GB= 0.15
##$INTBC= 1
##$INTSCL= 1
##$ISEN= 128
##$LB= 0.24
##$LEV0= 0
##$LPBIN= 0
##$MAXI= 10000
##$MC2= 0
##$MEAN= 0
##$ME_mod= 0
##$MI= 1.114404
##$NCOEF= 0
##$NC_proc= 0
##$NLEV= 6
##$NOISF1= 3.799351
##$NOISF2= 2.8
##$NSP= 1
##$NTH_PI= 0
##$NZP= 0
##$OFFSET= 15.70392
##$PC= 1
##$PHC0= -8858.45
##$PHC1= 18.60026
##$PH_mod= 1
##$PKNL= yes
##$PPARMOD= 0
##$PSCAL= 0
##$PSIGN= 0
##$REVERSE= no
##$SF= 200.130013532006
##$SI= 16384
##$SIGF1= 3
##$SIGF2= 2
##$SINO= 400
##$SIOLD= 16384
##$SREGLST= <1H.CDCl3>
##$SSB= 0
##$STSI= 0
##$STSR= 0
##$SW_p= 3612.71676300578
##$SYMM= 0
##$S_DEV= 0
##$TDeff= 0
##$TDoff= 0
##$TI= <>
##$TILT= no
##$TM1= 0
##$TM2= 0
##$TOPLEV= 0
##$USERP1= <user>
##$USERP2= <user>
##$USERP3= <user>
##$USERP4= <user>
##$USERP5= <user>
##$WDW= 1
##$XDIM= 8192
##$YMAX_p= 0
##$YMIN_p= 0
$$ End of Bruker specific parameters
$$ ---------------------------------
##NTUPLES= NMR FID
##VAR_NAME=  TIME,          FID/REAL,        FID/IMAG
##SYMBOL=    X,             R,               I
##VAR_TYPE=  INDEPENDENT,   DEPENDENT,       DEPENDENT
##VAR_FORM=  AFFN,          ASDF,            ASDF
##VAR_DIM=   8192,          8192,            8192
##UNITS=     SECONDS,       ARBITRARY UNITS, ARBITRARY UNITS
##FACTOR=    0.0002004,     1,               1
##FIRST=     0,             0,               0
##LAST=      1.6414764,     0,               0
##MIN=       0,             -4677165,        0
##MAX=       1.6414764,     3149811,         0
$$ Real data points
##PAGE= N=1
##DATA TABLE= (X++(R..R)), XYDATA
$$ [...]
506 -591143 -172329 613036 287470 -500625 -263486 406758 129219 -454089 -46087 595513
516 595513 145974 -599024 -250431 485663 262768 -342421 -122407 368901 56162 -465434
526 -465434 -127713 488172 261621 -363639 -283570 227821 172244 -244822 -110741 345942
536 345942 176275 -405253 -328939 306993 365213 -198694 -279832 211231 203210 -330251 -252653
547 -252653 416061 397619 -328424 -411098 250812 341273 -228148 -207207 383077 268875 -428744
558 -428744 -346534 402350 421244 -255965 -303239 261066 223761 -331464 -228883 401091 346769
569 346769 -322574 -397087 184986 317038 -146881 -233118 199916 233159 -273570 -360363 202380
580 202380 417149 -97401 -384834 42376 299772 -120959 -323864 193668 433175 -168658
590 -168658 -513598 75068 485091 -27349 -387852 109571 379900 -197402 -451134 207623
600 207623 521085 -126850 -478428 85902 373044 -156344 -340353 243121 397044 -257344
610 -257344 -483453 138650 426484 -82916 -341596 83942 265746 -172919 -345756 132188
620 132188 395317 -35952 -388081 -72660 284292 48513 -255572 10927 331179 -139
630 -139 -425583 -97955 440979 193374 -364336 -165211 352890 111359 -409116 -91097
640 -91097 502519 170855 -501008 -228441 429191 195348 -385817 -109275 422745 61073
650 61073 -499205 -109907 493749 146485 -439519 -144206 363331 56379 -392781 -36873
660 -36873 432764 79276 -438285 -162825 355887 178543 -270468 -120999 275012 98735
670 98735 -319204 -137099 356348 245819 -275518 -250869 234293 234462 -221672 -181122 321155
681 321155 263765 -330443 -336888 295543 383635 -214420 -323316 228581 288680 -283432 -314133
692 -314133 309694 373647 -262690 -379662 195606 310657 -202375 -261182 249364 275973
702 275973 -271089 -328289 228244 355134 -149490 -307156 135410 277999 -147095 -274841
712 -274841 180662 346695 -125931 -357149 81216 350421 -41939 -292714 91357 309264
722 309264 -127610 -362855 123398 415287 -75785 -409217 44624 359001 -95005 -370589
732 -370589 128144 405001 -135119 -459454 59287 406359 -45951 -354088 63056 305735
742 305735 -124848 -348388 99560 362974 -42851 -330424 -1555 260031 -15630 -238862
752 -238862 40952 279472 -3408 -300977 -68463 278157 123273 -222475 -116375 209505
762 209505 98280 -246539 -122099 276597 164706 -279819 -204047 244266 172620 -265360
772 -265360 -158537 290437 134617 -356286 -178160 349743 181355 -343840 -177030 317848
782 317848 129083 -339370 -108574 359726 117044 -356393 -130205 322030 123905 -272492
792 -272492 -73722 279599 63258 -283233 -69097 292253 120571 -231954 -119040 195773
802 195773 113638 -171076 -95405 195313 138483 -182517 -181341 144989 204116 -99844 -182358
813 -182358 103066 171860 -134769 -200120 150359 242676 -129496 -250615 111638 231897
823 231897 -118338 -207703 162232 233331 -169127 -250176 161504 261785 -126154 -218873 143333
834 143333 208508 -150649 -195194 174816 226818 -141445 -215559 127458 206059 -110507 -179079
845 -179079 129951 194438 -128267 -215291 112972 236269 -78526 -228944 61021 213336
855 213336 -73197 -224271 80250 246558 -73996 -270859 43794 256284 -40807 -238574
865 -238574 60360 235420 -87662 -263485 78843 270534 -58717 -252005 50036 216849
875 216849 -74609 -213068 88891 227173 -73567 -227250 40276 191888 -38741 -170702
885 -170702 43754 165013 -51966 -189387 12597 177290 5009 -172785 -27566 154002
895 154002 11369 -189968 -45073 193763 55805 -215622 -91359 202789 77122 -233107
905 -233107 -96321 238375 91870 -262519 -107783 258429 91581 -279176 -95093 282027
915 282027 88080 -288892 -88027 276907 68447 -279325 -58763 280586 56733 -272894
925 -272894 -60292 248999 50152 -227687 -33963 223089 34117 -214181 -47170 194217
935 194217 60304 -162331 -53775 154125 61628 -146712 -73511 152460 108404 -127613
945 -127613 -112626 128583 130699 -123740 -132688 146291 168164 -134604 -169675 148694 191019
956 191019 -140388 -182860 164453 207706 -154858 -195623 173983 211780 -163447 -196957 182872
967 182872 216962 -161814 -197638 168984 199542 -154795 -179364 167926 197185 -140757 -186516
978 -186516 130681 187140 -105615 -167382 113839 181832 -97726 -188701 83394 197297 -60779
989 -60779 -185578 63120 191542 -65750 -208411 58068 219053 -45380 -217282 42885
999 42885 210641 -57385 -228312 54539 233473 -53212 -237214 43885 219517 -62896
1009 -62896 -228452 60625 227523 -58712 -230736 35799 199474 -49408 -201525 41621
1019 41621 195634 -37845 -209232 -4360 176424 4807 -175795 -19802 163659 11063
1029 11063 -199651 -62176 178254 68503 -181865 -91271 160577 65562 -198556 -95630
1039 -95630 198859 102963 -212136 -129155 186486 102111 -206827 -101469 214849 93844
1049 93844 -233073 -107745 218304 96500 -212484 -82113 208915 65604 -215496 -63807
1059 -63807 209615 64456 -198278 -65587 178973 61411 -162677 -54749 154607 55996
1069 55996 -151171 -69519 141332 88202 -117009 -95548 100844 96742 -94623 -97321 110193
1080 110193 130787 -96684 -146960 89614 166684 -65764 -145015 92690 167450 -93213 -170682
1091 -170682 112093 206713 -76334 -174950 97887 179642 -94296 -155478 127169 183711 -99765
1102 -99765 -162182 107006 161658 -87650 -128855 108941 140851 -93661 -129826 92975 135919
1113 135919 -71576 -118718 72860 125340 -56693 -116293 55126 124293 -43149 -121989 46433
1124 46433 141310 -26043 -140763 21186 147823 -12199 -141980 29750 162376 -26145
1134 -26145 -176064 18696 181033 -6032 -167897 15420 159955 -36188 -175210 32513
1144 32513 177203 -26890 -177786 4665 140450 -29967 -144376 25004 129936 -41671
1154 -41671 -153586 1652 119561 -8157 -121218 -13239 88462 -13719 -115192 -12117
1164 -12117 106911 15289 -123646 -50913 98003 42721 -104200 -47125 106191 34787 -138557
1175 -138557 -58614 141559 67182 -144056 -76589 128889 47454 -152102 -42386 170628
1185 170628 41174 -191778 -69170 163793 53181 -157054 -39261 150396 11372 -177495
1195 -177495 -31149 166881 41874 -143833 -42942 115917 19372 -114541 -10921 128540
1205 128540 32419 -116605 -46989 101422 64243 -66248 -41031 82328 59967 -74934 -59896
1216 -59896 96547 103353 -65826 -95173 73340 109707 -57454 -85315 93439 107722 -94658
1227 -94658 -109648 112023 132491 -93597 -115962 102716 109476 -109216 -95699 137134 118622
1238 118622 -126506 -120541 117622 121602 -92193 -86789 111146 89701 -112115 -90040 118801
1249 118801 118108 -78279 -97102 71389 93141 -61916 -77388 84671 109654 -68407 -127262
1260 -127262 46519 132648 -22854 -118768 28072 112222 -46862 -134922 42144 149291
1270 149291 -36208 -161432 9946 129040 -34189 -132315 44681 129302 -70587 -165965
1280 -165965 40641 152703 -37821 -146016 25795 111662 -59085 -131008 53602 135908
1290 135908 -44384 -146324 5870 110180 -10658 -99015 16381 96039 -30629 -131468
1300 -131468 -3698 129245 24291 -126657 -47131 102241 21479 -128553 -30179 143288
1310 143288 38527 -168735 -77141 142011 69942 -138202 -61802 133982 35206 -166033
1320 -166033 -47684 172066 60091 -161540 -60316 139792 39021 -137183 -14283 159311
1330 159311 24267 -156948 -37230 144713 52322 -102831 -25824 101056 20155 -98241
1340 -98241 -16550 114554 53100 -84647 -57603 70034 62489 -51830 -42123 77981 64082
1351 64082 -84000 -86174 86352 117613 -58089 -106524 61874 107765 -69979 -104258 96484
1362 96484 135765 -85298 -139624 81362 141796 -64913 -109444 92180 113089 -100213 -112559
1373 -112559 113072 134816 -84772 -117571 76212 101131 -72163 -80807 91390 95416 -82780
1384 -82780 -107205 57607 102352 -31805 -78446 32255 62090 -51279 -82321 46336 99688
1395 99688 -28468 -107159 1098 82601 -14535 -84754 25357 97571 -35608 -130506 7760
1406 7760 125503 558 -116104 -1213 100034 -26659 -117510 27213 124968 -22911
1416 -22911 -133450 1318 106995 -12506 -99798 18037 94352 -33023 -115561 11453
1426 11453 109940 3627 -103817 -21920 73104 4467 -79365 -5628 86780 10153 -104530
1437 -104530 -43015 85459 48332 -70806 -40214 68680 20923 -97498 -31636 115257 53695
1448 53695 -106974 -63386 89338 43598 -88182 -17619 116500 24459 -130426 -39424 120844
1459 120844 48807 -90336 -18388 91904 518 -102364 5072 121631 23963 -96096
1469 -96096 -23950 76511 17599 -57822 7290 77272 8628 -78066 -25906 72576 53927 -35804
1481 -35804 -39567 32227 36145 -35726 -34284 59511 68304 -49746 -84665 35851 88359 -21124
1493 -21124 -65629 47385 69890 -68833 -85972 78298 111161 -55392 -97994 51075 74719
1504 74719 -66361 -59982 99151 79535 -97127 -92142 77338 79410 -61100 -47632 74042
1515 74042 34961 -97700 -52308 91953 68411 -65530 -63374 39487 34071 -52949 -33170
1526 -33170 63833 46410 -66177 -79244 28142 68297 -17371 -61124 13145 45884 -41171
1537 -41171 -78528 32201 92483 -21751 -104246 -4160 78929 -12597 -78820 26705 84871
1548 84871 -43236 -111482 22569 107455 -10864 -92898 9106 71063 -35482 -81195 40839
1559 40839 94117 -31366 -103862 5461 77534 -8032 -63667 19381 61919 -35333 -89412
1570 -89412 15083 95593 9596 -83256 -20166 62380 2835 -71763 9979 99757 5598 -112967
1582 -112967 -28078 106302 41446 -80432 -12802 94240 2936 -110328 -1489 135047
1592 135047 34249 -108119 -27647 96759 17596 -83302 12469 112467 3988 -110973
1602 -110973 -17385 102346 33961 -64452 -9596 63630 -472 -70838 -2155 84048 33529
1613 33529 -62297 -43226 42099 39235 -30685 -23446 51223 37224 -63327 -59660 61914 83615
1625 83615 -38440 -72630 41254 63120 -54200 -59903 83246 86603 -79411 -99484 66490
1636 66490 92454 -59197 -70396 77584 65148 -100422 -82844 96276 90879 -80213 -84066
1647 -84066 59391 50304 -79678 -52249 82077 54288 -84505 -78827 47339 57782 -40543
1658 -40543 -49525 31417 33331 -51428 -60023 33733 67270 -20920 -73315 -1415 54887 -7838
1670 -7838 -56814 14272 68186 -20823 -88802 2314 89400 4066 -84206 -4562 72205 -17184
1682 -17184 -87235 20324 94484 -19840 -107069 1889 87388 -9208 -79821 16342 72415
1693 72415 -33820 -91995 19761 91381 -5412 -80691 -4125 60116 -6223 -58319 16464
1704 16464 77742 -1745 -81501 -15443 76982 34200 -51624 -13725 61828 13898 -68395 -13812
1716 -13812 91167 43130 -71013 -40674 67052 35502 -59193 -13038 83999 22475 -88858
1727 -88858 -30283 85123 38070 -64724 -19274 64157 7794 -72229 -4185 82765 20087
1738 20087 -67691 -21458 54817 20005 -38096 -148 51549 8861 -51007 -17770 52927 39972
1750 39972 -28950 -31754 27054 30501 -27957 -26641 47430 49466 -42677 -63397 32269 66004 -24160
1763 -24160 -56613 33286 50772 -55128 -68676 53394 74948 -50165 -78161 35504 52770
1774 52770 -53396 -52827 60755 50581 -71248 -66465 50824 51375 -47881 -40809 44260 24625
1786 24625 -59264 -34242 53820 36266 -43830 -40398 24816 23304 -27361 -20672 28339 21221 -35137
1799 -35137 -41542 18648 41332 -11633 -44323 233 31080 -17737 -47494 15797 54266 -20200
1811 -20200 -75437 -961 62360 -5977 -60953 9571 56218 -29490 -76002 22659 80268 -13821
1823 -13821 -72911 8629 56257 -20530 -52047 35630 66897 -26632 -68285 15965 62173 -2975
1835 -2975 -39959 17207 40831 -22000 -46965 19352 61048 2540 -48136 -7488 39098 4292
1847 4292 -34819 9421 52723 -1403 -62072 -9874 64497 20588 -50148 -9420 55670 2922
1859 2922 -63978 3400 82070 13110 -73794 -12100 70031 12873 -56046 8203 70745 -4437
1871 -4437 -71118 3042 77327 15575 -52976 -4623 49513 -258 -47004 7929 60780 11453
1883 11453 -54219 -23332 41271 27602 -28483 -18504 31632 16877 -44060 -30927 44952 46429
1895 46429 -36558 -50261 26906 39166 -36962 -36388 52159 44122 -62523 -59207 53040 57345
1907 57345 -48770 -47544 50978 34793 -68212 -42076 71648 47685 -65426 -51099 50046
1918 50046 34224 -52523 -25799 59106 21919 -68657 -39940 50593 38497 -40014 -36266 25561
1930 25561 18955 -39372 -31013 35794 41513 -31314 -58669 4625 44960 -4432 -41998 9506
1942 9506 40681 -25158 -64500 14330 70688 -3822 -67133 -2924 51067 -15204 -57425 25649
1954 25649 71008 -22740 -82055 8192 70014 -6848 -54557 19232 52734 -33149 -64783 26118
1966 26118 69114 -12474 -57342 6957 41560 -13934 -39715 24564 53462 -16566 -60005 -657
1978 -657 54838 13685 -41670 -5570 43030 1001 -51670 -1185 66379 20827 -59699 -26556
1990 -26556 52448 24429 -44437 -6867 61270 10193 -68447 -18147 71732 31358 -52450 -17695
2002 -17695 51628 10218 -53248 119 68327 17915 -57373 -21121 44976 19955 -28764 -1149
2014 -1149 39191 4663 -42902 -12689 43376 29048 -24806 -23816 20040 18721 -24370 -16569 37378
2027 37378 33193 -36002 -44279 28830 46301 -20871 -39516 27367 34979 -40577 -44747 46072 55054
2040 55054 -39918 -55671 32655 42432 -38752 -34796 50904 35802 -58313 -48575 46386 44843 -35568
2053 -35568 -33465 30818 17416 -44173 -23427 43314 30030 -34182 -36610 10896 17463 -14161
2065 -14161 -12173 17313 13629 -27237 -34986 7210 33979 1812 -29985 -6804 18066 -10129
2077 -10129 -31690 10023 44654 -6219 -54981 -9057 41963 1278 -38585 8304 43401 -19796
2089 -19796 -57515 12892 59325 -8006 -52683 7669 40354 -20106 -43089 26556 49338 -22724
2101 -22724 -53504 11121 41920 -8974 -32461 13420 28660 -20373 -36432 12848 40328 -1366
2113 -1366 -34034 -5399 23548 753 -21891 7104 33560 -264 -39492 -7930 40348 18464
2125 18464 -26886 -6909 32731 3037 -37615 1288 51916 12064 -43090 -10680 40253 9144
2137 9144 -33160 7612 45908 -2539 -47470 -514 46854 8228 -34444 -343 32311 -4561
2149 -4561 -33173 5113 40612 6025 -36141 -11919 29548 15575 -21065 -9308 25960 13243
2161 13243 -30080 -17002 34680 30006 -26072 -29409 24865 27785 -24696 -21312 38645 30294 -41254
2174 -41254 -36358 40174 38837 -33446 -30808 36404 20920 -47529 -24201 49960 28325 -47390
2186 -47390 -30163 34852 15025 -38502 -10686 40173 7826 -49164 -21579 34828 17750 -27383
2198 -27383 -15683 20744 5187 -28503 -14701 27253 21783 -20272 -31513 6793 24986 -7273
2210 -7273 -24011 11031 28119 -17590 -42187 10603 47520 -6620 -48429 2674 39216 -14592
2222 -14592 -47266 17511 50636 -21621 -60131 10734 50611 -14122 -46609 15949 38242 -27111
2234 -27111 -46853 23556 47487 -19919 -44377 13072 33665 -16149 -29358 23300 34001 -18622
2246 -18622 -36831 12262 37748 435 -25022 4755 26673 -5203 -29578 7694 41963 6515
2258 6515 -37784 -10046 36553 11178 -31292 -1642 42443 2911 -48294 -8976 50597 16060
2270 16060 -41270 -9998 39984 6479 -42300 -2181 49802 11272 -45065 -11927 40578 14361
2282 14361 -30038 -3828 35588 7927 -33942 -7675 37951 19906 -24943 -16009 24059 18926
2294 18926 -18323 -12138 29213 21334 -28884 -27729 27831 32194 -21360 -27919 22922 22614 -32399
2307 -32399 -27688 37048 32012 -36651 -37815 26865 27537 -31131 -23622 36449 20971 -45562 -31250
2320 -31250 37011 29537 -31334 -22585 27096 13198 -33918 -16051 34108 21266 -26881 -23695
2332 -23695 15197 16076 -12554 -13506 12951 15157 -15352 -26217 6173 25985 -1717 -28629 -4643
2345 -4643 20867 -2390 -29361 1658 31460 -5291 -42030 -3469 37507 -341 -38930 925
2357 925 34511 -11520 -41025 11839 45423 -9694 -43475 7591 36017 -12264 -30989 20460
2369 20460 34678 -20413 -36184 16322 35166 -8074 -23325 12759 21438 -15361 -23379 16469
2381 16469 28666 -3595 -25279 -1592 19853 1966 -15660 2474 21812 808 -25583 -7861
2393 -7861 27418 14825 -20872 -10449 22345 9237 -25334 -5381 33821 13112 -29699 -10801
2405 -10801 30893 13845 -24010 -3079 30283 5828 -30032 -1821 34519 9465 -25831 -3311
2417 -3311 24972 3922 -21160 2768 26793 2386 -25888 -6767 22458 9596 -17139 -7266
2429 -7266 17291 4238 -22021 -10521 24809 17634 -22607 -21077 16201 15583 -18250 -14876 23876
2442 23876 16939 -28321 -23667 26342 23555 -23898 -19983 24789 14776 -31445 -16940 32251 18406
2455 18406 -30985 -19339 24180 11343 -25572 -10431 24289 5562 -28879 -11826 20247 9100
2467 9100 -18858 -10842 9775 4083 -16156 -9012 12250 9941 -15654 -19678 5681 15839 -5008
2480 -5008 -17409 4429 16521 -12297 -25355 10238 30661 -6852 -31871 4278 28728 -9792
2492 -9792 -27877 16828 35332 -16962 -37752 14841 37262 -12175 -29799 17703 28607 -22370
2504 -22370 -30154 22532 33834 -15709 -28219 14431 22995 -13688 -17390 18920 22075 -14701 -22439
2517 -22439 10632 22983 -2559 -14573 5976 16573 -4708 -15683 7105 25357 3583 -22116
2529 -22116 -3922 23695 7543 -19178 -55 28687 3137 -29990 -3202 36031 9596 -28578
2541 -28578 -4716 29844 2214 -31264 1479 37067 3016 -35526 -4876 32014 5192 -27464
2553 -27464 -1113 27507 -569 -31546 -4051 28808 7536 -24710 -8934 20081 5633 -21107
2565 -21107 -7304 21126 9722 -24367 -15773 19608 17202 -18425 -17214 17369 14288 -25065 -19097
2578 -19097 25526 20101 -26598 -24655 19931 17998 -24109 -17732 24933 14040 -31415 -20237 25244
2591 25244 17379 -25241 -16081 20577 8255 -27629 -12042 25272 12622 -24383 -18338 14450
2603 14450 11999 -14503 -11104 12408 11093 -15698 -18320 9487 20850 -4625 -21363 1150 17966
2616 17966 -4183 -21528 7086 27846 -5643 -32631 1817 31332 -491 -27565 5602 28318
2628 28318 -9585 -30781 12515 35107 -5994 -31058 7283 27161 -8691 -22477 16976 27617
2640 27617 -13648 -26701 12644 25579 -6109 -15320 12297 16640 -11079 -15287 13363 22318 -1973
2653 -1973 -15895 1889 14572 972 -10025 4717 19415 2035 -18842 -3824 22394 11254
2665 11254 -14679 -6492 18944 6819 -20292 -4819 27561 11380 -24288 -10428 23452 10441
2677 10441 -21848 -4926 24861 4133 -27128 -6869 26051 7860 -21882 -7272 17829 1704
2689 1704 -20280 -1397 20553 1887 -20805 -6836 13658 5617 -12991 -4778 10464 1374 -16804
2702 -16804 -8473 15355 9664 -14358 -14435 9402 8683 -13668 -11620 14901 10593 -20517 -18815 14995
2716 14995 14797 -17468 -16541 14556 8436 -23184 -13903 20756 11978 -23682 -16377 15360 8810 -18676
2730 -18676 -9918 16417 6491 -20461 -11731 14973 9611 -10800 -7638 6907 4539 -9645 -5609
2743 -5609 11494 9795 -7476 -13016 3768 12513 -622 -9552 3710 13095 -4764 -16645 5453
2756 5453 22513 -726 -18281 3756 18373 -5710 -17256 13290 24493 -10455 -24338 10603
2768 10603 24141 -8052 -18026 16151 20150 -16753 -19284 18067 23743 -11336 -15195 14366 16788
2781 16788 -11546 -10781 16878 15218 -9546 -11363 9165 13761 -2335 -6884 6583 11384 -3007
2794 -3007 -9902 4983 15750 1717 -13723 -3755 14279 4271 -13497 -2181 16363 3241
2806 3241 -20522 -5522 21451 5311 -20103 -5081 19143 -1379 -22751 800 23876 -170
2818 -170 -26019 -2253 20406 -1228 -21038 2262 19838 -5151 -24378 453 20454 865
2830 865 -18647 -3007 13427 -1421 -16423 -1736 16241 796 -20582 -10081 13281 6250
2842 6250 -16394 -10327 12095 5486 -19608 -13844 15817 10798 -20139 -17644 14019 10743 -18965
2855 -18965 -12582 18361 8421 -23013 -12846 19085 10810 -17425 -9529 16322 5406 -19613 -7003
2868 -7003 19300 9992 -16361 -9500 12257 8694 -11862 -5451 13628 7713 -12670 -11344 10257
2881 10257 14167 -4703 -10753 5507 11533 -6963 -14846 9564 21513 -5385 -21071 5330 22221
2894 22221 -4578 -18827 10400 24537 -9433 -22704 11390 26216 -5905 -19382 12366 22183
2906 22183 -9003 -17604 15230 23255 -9925 -18344 12380 19132 -7483 -13143 12368 15333 -7943
2919 -7943 -11497 10597 14615 -3712 -10442 3036 10525 -1036 -8281 1816 10912 397 -14026
2932 -14026 -3338 14276 6120 -13260 -5202 14707 3474 -17957 -4426 20918 7157 -20562
2944 -20562 -8233 18096 5659 -19778 -3666 21462 3100 -24178 -5519 20881 3853 -20213
2956 -20213 -4405 17412 -601 -21293 -3157 17512 969 -19050 -5912 11314 62 -14255
2968 -14255 -4217 9459 598 -14108 -7363 9339 5555 -11276 -10391 6862 5382 -11042 -9054
2981 -9054 9896 6935 -14430 -12312 9953 10376 -11587 -11021 11153 7622 -15232 -10778 14927 11235
2995 11235 -13575 -11830 11984 6886 -12606 -5876 13936 7099 -14910 -9515 10435 8434 -7749
3008 -7749 -5133 7487 4643 -9036 -7216 8473 10806 -3154 -8510 2707 9785 -1907 -8079
3021 -8079 5938 13589 -1691 -13352 4012 16108 103 -12226 6335 15860 -3734 -13708 8674
3034 8674 18057 -4990 -15419 9300 17290 -6533 -12460 10817 14092 -10141 -11746 12616 14067
3047 14067 -8617 -9668 9438 9481 -8097 -6047 10849 8631 -6926 -8370 5713 8356 -1938
3060 -1938 -4295 3417 5781 -1771 -7888 1137 10046 3164 -8572 -3423 8634 3659 -10121 -1684
3074 -1684 13613 3308 -15187 -5826 14683 3102 -15403 -3698 14234 64 -17868 -1504
3086 -1504 15913 -791 -18295 -1921 13685 -3437 -16127 1032 13245 -4945 -16197 1470
3098 1470 12628 -3055 -13774 -88 8508 -3014 -10942 1184 9692 -2134 -12526 -3710 7585
3111 7585 2273 -9119 -3926 7532 1357 -13763 -5754 11939 7964 -11540 -9479 9106 5583
3124 5583 -11914 -6378 13758 6831 -15298 -10807 11847 8404 -12560 -6191 12423 4307 -14661
3137 -14661 -5629 13883 6230 -10956 -5565 10193 4053 -9633 -2729 11132 6493 -8866 -6911
3150 -6911 8137 7090 -4686 -5232 7875 8179 -6787 -8287 7772 12898 -5120 -12461 6145 13494
3164 13494 -4189 -10693 9235 14911 -7901 -14747 11376 18250 -7239 -13761 10293 14082 -9730
3177 -9730 -12011 13837 15480 -10201 -12722 9721 13094 -7143 -7938 8586 8451 -8466 -8846 7349
3191 7349 10870 -2807 -7228 3181 5819 -2320 -6507 3278 9957 -725 -10628 -1134 9273 3109
3205 3109 -8836 -3362 9683 2136 -13757 -3043 15300 3997 -14880 -4476 13520 1301
3217 1301 -14254 -674 16543 -1139 -18625 -1760 16202 436 -16437 -1164 13029 -2733
3229 -2733 -16597 1813 15140 -842 -15691 -2100 10164 -1626 -10245 642 10140 -202
3241 -202 -11467 -3778 9243 3980 -7401 -5108 4894 2997 -8354 -5915 10195 6146 -10432
3254 -10432 -10093 6544 8557 -6824 -6607 8972 6774 -12225 -10302 10873 8492 -9661 -8562 7984
3268 7984 5681 -10726 -5011 12181 7191 -11181 -7542 8961 6858 -7315 -4279 8392 4633
3281 4633 -8634 -5215 9109 8330 -3675 -6514 3652 7422 -2754 -6008 7018 9658 -4305
3294 -4305 -9777 4144 11793 -1257 -8786 3390 9773 -4668 -10314 6602 13587 -4649 -12134
3307 -12134 5137 11981 -4361 -8855 7381 10984 -7701 -10377 6929 10371 -4865 -7661 5924
3320 5924 5888 -6189 -5449 7619 6877 -3254 -5365 2829 4779 -1202 -3538 2251 4301 -1407 -5830
3335 -5830 92 7490 2095 -7921 -4281 5972 1076 -8639 -1047 9447 2598 -12584 -5628 9834
3349 9834 2793 -11314 -1614 10685 -263 -13663 -722 13051 925 -13815 -1244 10299
3361 10299 -2686 -10674 1912 10870 -2663 -11511 706 8549 -1490 -7693 2627 5014 -3567
3374 -3567 -8410 1251 7261 -198 -6611 -2107 3384 97 -4392 -1300 5161 1692 -8148 -4845 5843
3389 5843 4926 -6188 -4790 5935 3677 -8126 -3407 9701 6257 -8878 -6736 8058 5636 -8202
3403 -8202 -3080 10066 3703 -9881 -4119 9708 5293 -7226 -3349 6451 1511 -6098 -622 8390
3417 8390 3903 -6828 -3873 6117 4305 -3188 -2726 4863 4247 -4794 -4915 6184 7999 -3566 -6784
3432 -6784 3744 7527 -3235 -5928 7198 9245 -6193 -8995 6529 10230 -4284 -6656 7925
3445 7925 7683 -8501 -7062 9951 9757 -6655 -7985 8109 7311 -6368 -4368 8541 6050 -7786
3459 -7786 -5777 5294 5948 -3777 -4882 3116 3949 -4063 -5755 3028 6055 -912 -7376 -1182 5198
3474 5198 1915 -7006 -849 7636 -922 -9558 -2430 10039 2345 -10733 -2705 9472 -332 -11535
3488 -11535 1690 12008 -998 -13399 -709 11644 -428 -11672 1646 10431 -4944 -12565
3500 -12565 2035 10200 -2283 -10387 -328 6766 -3872 -8686 2173 7572 -1935 -8652 -1296
3513 -1296 7202 1152 -4704 -1493 4141 1170 -6120 -2852 6685 5168 -7538 -6168 4959 5483 -6082
3528 -6082 -4823 8033 5695 -8642 -7263 9076 6988 -6494 -5241 8374 4843 -8937 -3492
3541 -3492 9659 5646 -8014 -6251 7983 5436 -5853 -1744 8049 3266 -7443 -3994 6905
3554 6905 5462 -3410 -3796 4618 4422 -3948 -2827 6382 6834 -3830 -6200 4052 8479 -939 -5053
3569 -5053 5019 7473 -4484 -8093 4974 10137 -3051 -8198 3680 6996 -4564 -7038 6734
3582 6734 7969 -5917 -8399 4567 7921 -3425 -6017 4405 4726 -5276 -6254 4173 6009 -2338
3596 -2338 -5381 903 3172 -1637 -2703 1659 3100 -1264 -5187 -883 4754 1076 -5264 -2239 4026
3611 4026 779 -6590 -1828 7710 1626 -9132 -3490 6501 1142 -7857 -848 7771 -449 -10879
3625 -10879 -1544 10360 -250 -9542 -1363 6569 -1812 -8853 910 8556 -1957 -9682 44 5654
3639 5654 -1490 -4916 1374 5320 -2161 -5779 120 4004 222 -3620 -1475 1243 -126 -3885 -1542
3654 -1542 2908 2189 -4609 -3578 3273 3681 -2614 -3291 3817 3974 -5088 -3791 6610 5712 -5864 -4351
3670 -4351 4575 4379 -5482 -1692 6430 4025 -6054 -3568 8010 3940 -5256 -2333 6146 2255 -5033
3685 -5033 -931 7537 3350 -4267 -2433 4971 3098 -3017 -1365 4946 2822 -3703 -2428 4716 5374
3700 5374 -1514 -3714 2907 3553 -2262 -4695 4178 6502 -3711 -5385 2985 5543 -2572 -4483 3633
3715 3633 4811 -4188 -5143 4465 6199 -4683 -4779 4959 3088 -4426 -2705 5444 3619 -4915 -4000 2712
3731 2712 2115 -3426 -3157 1796 1175 -3165 -3768 1460 3514 -1590 -5298 -122 3253 -54 -5433 -550
3747 -550 5341 -1257 -8818 -1146 6630 156 -8278 -2081 5899 -849 -8171 45 7952 -1326 -8837
3762 -8837 -479 6584 -3115 -8004 1611 6163 -3217 -9193 1248 7031 -3229 -5923 1326 4625
3776 4625 -4068 -5115 2045 3876 -1332 -4838 141 4140 84 -3371 -1025 3072 716 -3049 -987
3791 -987 4570 2847 -3910 -3998 3725 3891 -4369 -2467 5679 3483 -5313 -3644 6002 5586 -5062 -3585
3807 -3585 6378 4014 -6451 -2468 8851 4885 -6492 -3601 7507 2846 -4712 -995 6373 2894
3821 2894 -6253 -1973 6864 3799 -3168 -1318 4511 2570 -2508 -1612 4868 3755 -3081 -3901 3322
3836 3322 4938 -2107 -3351 3686 4942 -3315 -4680 3935 6064 -3032 -6140 3493 4950 -3706 -5142
3851 -5142 3748 5586 -4771 -5905 4353 5418 -2917 -4630 2440 3670 -3188 -4090 2688 3575 -2955
3866 -2955 -3990 1261 3791 -2409 -3611 1464 3015 -3089 -5126 117 4266 289 -4398 -2975 3204
3881 3204 -313 -4904 -1441 4583 442 -7458 -2488 4916 -293 -5955 -298 5326 -1663 -7789 -421
3896 -421 6295 -1075 -7068 -651 4741 -1768 -7116 1552 5763 -1629 -6132 295 4725 -1122 -4636
3911 -4636 1944 3101 -1547 -3977 970 3111 472 -2953 -752 2720 1678 -1675 -923 2500 1759
3926 1759 -3477 -2069 2984 3422 -2282 -2624 4107 3871 -3070 -2426 4109 4220 -3519 -3229 5638 4514
3942 4514 -2939 -1574 6241 3504 -5304 -1980 6192 3316 -3329 -807 4758 1826 -3934 -766 5345
3957 5345 2131 -3329 -1196 3025 1938 -1846 -724 4171 1321 -2580 -1111 2300 2226 -721 -2203
3972 -2203 1604 2506 -1156 -2970 1965 3856 -1610 -3711 2181 3491 -1859 -2882 2178 4186 -2668
3987 -2668 -3747 3044 3719 -2753 -4007 1985 2898 -2854 -2068 2253 1410 -3131 -3573 1616 2397 -2371
4003 -2371 -2391 574 829 -2704 -3003 -44 1344 -1501 -3576 -329 1896 -1359 -3239 172 2456 -861
4019 -861 -4610 -682 3921 -1739 -6018 -168 4811 -1435 -6061 443 4695 -1710 -5561 -118 5041
4034 5041 -1351 -5841 1537 3710 -2897 -4746 2166 3494 -2228 -3973 1802 3394 -1221 -3144 1707
4049 1707 3072 -1012 -1991 259 3481 81 -2019 -286 1905 1458 -1549 -20 2413 1880 -2141 -934
4065 -934 3173 2644 -1543 -2282 4772 3046 -3471 -1884 5435 2702 -4332 -1942 5607 2718 -4395 -1003
4081 -1003 6151 2422 -4373 -577 6175 1896 -4884 -891 4634 1482 -3722 -661 5493 1522 -3798
4096 -3798 -1345 3932 1666 -1329 -232 2617 2003 -2290 -305 2996 2751 -1450 -2758 2077 2350 -2138
4112 -2138 -2768 1260 3152 -3170 -3669 1828 3309 -3138 -4365 1881 3603 -3806 -4626 3514 3363 -3204
4128 -3204 -4140 2376 2229 -3155 -2830 1954 3185 -3949 -2562 2449 2921 -2700 -4445 1298 2272 -1674
4144 -1674 -2652 1216 2073 -1464 -3557 -106 2153 -90 -3754 -791 3283 -987 -3641 -273 5428
4159 5428 -543 -5269 -558 3948 -826 -5022 719 4837 -1454 -5389 453 4482 -795 -4476 1602
4174 1602 3879 -1877 -3000 1235 3990 -800 -3028 637 2639 -823 -1952 2657 3400 290 -2095
4189 -2095 -159 2158 1686 -561 -1017 1560 1794 -1412 -964 2988 2370 -2463 -2661 3359 2839 -2676 -2273
4206 -2273 3946 3093 -3848 -2192 4510 3032 -3848 -2082 4796 3249 -3391 -1444 4857 1944 -3052
4221 -3052 -1511 3504 2112 -3201 -675 3346 412 -3048 -519 3057 1134 -1216 -599 1347 1761
4236 1761 -1669 -1562 2198 1976 -1559 -2291 1070 1578 -835 -2199 1555 2168 -1406 -2775 2297 3380
4252 3380 -1436 -3712 799 3030 -1721 -3526 2060 2247 -2478 -3378 1697 2610 -1985 -2763 1585 1116
4268 1116 -2988 -2480 1297 1482 -1787 -2537 740 1524 -1439 -2103 955 1690 -1086 -1972 441 1219 -634
4285 -634 -2787 37 1891 -419 -2776 -76 1986 -626 -3910 -138 3564 453 -4109 -244 2769
4300 2769 -829 -4103 1339 3420 -1375 -3691 909 3761 -986 -2986 1436 2719 -1974 -2977 1795
4315 1795 2672 -747 -839 1254 1988 62 -1488 1300 2098 56 -1667 706 1906 236 -883 -295
4331 -295 2475 1794 -1162 -1643 2706 1713 -1875 -1408 1935 1879 -2722 -1575 3159 1551 -3103 -1538 3743
4348 3743 2263 -3128 -1311 3557 371 -3302 -227 3963 1842 -3587 -251 3739 -22 -1617 660
4363 660 3003 -45 -2957 185 2544 1178 -2217 -802 2066 -373 -1677 -1214 960 1106 -1251 -2328
4379 -2328 925 1043 -2784 -1813 344 1987 -1961 -1858 1123 1373 -1489 -3323 1839 2540 -2425 -3458
4395 -3458 1489 2253 -2786 -2228 1664 2083 -2966 -3402 1580 853 -2251 -1937 2420 2321 -2415 -2166 835
4412 835 839 -1837 -1662 1134 1391 -2026 -3324 888 1865 215 -2853 360 2085 -460 -2621 546 2958
4429 2958 -315 -3581 -104 2711 -248 -3114 412 2909 -1473 -2834 621 3360 -495 -2720 1618
4444 1618 2709 -1130 -1868 1951 4137 -1702 -1320 1661 2694 -755 -1800 976 1766 -616 -1728 978
4460 978 1799 652 -1203 -116 2307 1114 -1189 -23 2468 1702 -1490 -667 3811 1907 -1554 -960
4476 -960 2719 2117 -2102 -923 4010 2351 -2972 -1873 3013 1263 -2559 -885 4008 822 -3548
4491 -3548 -544 3522 840 -3091 -857 1582 512 -2607 -7 1779 89 -1634 -165 1034 -43
4506 -43 -1682 -199 733 -28 -2024 -1291 561 874 -720 -1958 230 1166 -1049 -2210 -16 1294 -1520
4523 -1520 -3364 733 1943 -1480 -3077 954 2270 -3165 -2234 1086 2380 -2258 -2322 1549 1523 -2046
4539 -2046 -2314 1722 825 -2021 -1623 1232 721 -1325 -1415 18 785 -1684 -1499 448 1223 -346 -1856
4556 -1856 -616 1276 -652 -2176 271 1946 -260 -2365 50 2128 -77 -1802 -194 1778 -495
4571 -495 -2989 765 2270 -745 -2860 1577 3987 -325 -1102 1221 1862 -49 -1644 1054 1920 -1089
4587 -1089 -702 1599 1703 1010 -390 1188 1843 -684 -1346 -443 748 836 -244 -369 1046 1110 -1001 -57
4605 -57 1902 1748 -1607 -843 1225 1589 -1715 -957 2339 1148 -2383 -692 2798 1053 -2330 96
4621 96 2808 7 -1615 -399 3159 172 -1813 -310 2357 -1165 -1704 938 2051 -913 -1708 335
4637 335 569 -306 -1382 -368 1738 532 -2192 -353 776 -467 -283 -1428 75 795 -685 -1836
4653 -1836 873 654 -1999 -2585 1717 960 -1660 -2424 1083 620 -1519 -1071 553 983 -2111 -2181 1539
4670 1539 814 -1177 -1161 1249 641 -2779 -732 2010 503 -1464 -1317 298 916 -1469 -785 1597 973
4687 973 -1710 -998 962 823 -836 -709 847 2277 -535 -913 1460 2558 -1204 -1522 202 2325
4703 2325 -858 -1169 46 2146 -492 -1204 544 2986 87 -1547 1615 2005 -927 -672 2030 1751
4719 1751 -392 -1529 1078 1465 -587 -168 1159 1017 -348 -906 579 1021 885 -1468 -771 1156 1147
4736 1147 -50 71 2023 958 -721 -500 1551 1385 -1925 -357 1197 702 -1223 -885 2395 201
4752 201 -2503 -936 2096 134 -1757 447 2124 14 -2145 1257 2264 327 -1907 -122 1288
4767 1288 -353 -1845 15 2316 -180 -1903 -802 744 -356 -946 -482 733 847 -1175 -88 966
4783 966 1556 -664 -1248 934 947 -1312 -2036 677 725 -1783 -2284 642 1693 -1781 -1570 530 563 -1306
4801 -1306 -1846 2004 1257 -2161 -1739 872 1206 -1739 -1722 861 489 -1871 -930 537 733 -2127 -1210
4818 -1210 769 475 -1028 48 911 1693 -632 -1864 113 853 -775 -581 1210 1330 -750 -916 126
4835 126 2254 -104 -1712 -136 995 -21 -1720 856 2589 -350 -656 701 2099 -1166 -992 389
4851 389 1462 -410 -771 1060 1627 -1059 -499 1334 1479 410 -1066 895 993 -62 -373 805 495
4868 495 619 -930 162 812 -176 -1043 262 2149 1005 -698 210 1519 653 -1440 -221 1082 411
4885 411 -1418 -291 1663 257 -1815 -268 1545 -85 -1828 -45 1582 206 -2237 -642 1798
4900 1798 -509 -989 -160 1385 -931 -1667 -509 718 -382 -981 -912 132 -488 -490 791 -1092 393
4917 393 -911 -238 448 329 -138 -285 375 299 -487 -998 1020 696 -1005 -1647 596 964 -1281 -1169 1147
4936 1147 1394 -1558 -1291 1951 1443 -748 -2100 1336 1111 -1307 -528 2245 -287 -1099 -135 -83 -289
4953 -289 -450 629 330 -122 -228 -527 1357 629 -544 -332 22 608 -97 -552 1242 338 -62 -1590
4971 -1590 88 1690 -382 -864 732 1540 -829 -1391 662 1014 -664 -1465 774 892 -146 -463 1081
4988 1081 368 -1075 -451 382 898 28 -342 1163 929 -237 211 957 1407 -722 -912 -797 1356 449
5006 449 -505 103 703 -66 -117 600 853 248 -1477 -395 1502 -746 -1288 -281 1105 -560 -1179 -863
5024 -863 1855 525 -1301 -50 1737 -605 -1763 -38 1858 -456 -1627 -74 796 -888 -1693 -146
5040 -146 775 -256 -2099 350 -91 -250 -1120 -78 480 555 -92 128 -358 203 -349 -1058 9 1222
5058 1222 -493 -816 687 955 -1165 -1082 1116 1169 -1504 -1759 769 756 -1624 -1130 1411 413 -1788 -1110
5076 -1110 1103 472 -1470 -184 830 -239 -1939 122 1192 64 -898 -634 468 557 -476 265
5092 265 1793 975 -1135 -1330 1298 1076 -602 -1214 803 1013 273 -457 875 1003 -526 -614 -367 967
5110 967 370 -893 849 1427 -748 -834 115 1433 791 -224 1220 941 -250 -790 -1 693 -223 -1066
5128 -1066 -552 1463 -788 -210 198 1179 -87 -1156 387 615 675 -344 40 1520 86 -497 478
5145 478 1576 42 -1627 -988 178 1034 -1057 700 1504 -312 -1503 -518 1327 987 -1237 1217
5161 1217 2239 -949 -1530 -156 1002 295 -1184 -457 1504 439 -1577 140 -28 -244 -923 -970 1279
5178 1279 -171 -1418 -295 -787 -6 -818 -467 -113 38 -978 100 312 925 -509 -920 410 248
5195 248 564 -814 688 1130 -702 -349 51 1248 -390 -1477 294 479 -1732 -165 1406 403
5211 403 -732 -483 889 1052 -29 -446 1515 568 -937 -538 782 905 -42 -439 83 -45 -793 -141
5229 -141 895 608 461 -115 1019 639 103 -1120 1052 614 477 -516 656 1010 102 -889 1067 738
5247 738 552 77 -669 1300 -600 -910 763 1519 392 450 656 1668 -493 -607 949 754 -460 -248
5265 -248 476 1010 -5 -1043 815 401 173 -655 232 666 127 -76 -24 -413 337 -678 -400 705 134
5284 134 -387 -1017 925 -664 -1253 -184 254 -224 -1265 -378 1655 277 -573 123 308 -628 -1301 961
5302 961 716 -447 -1547 -326 748 -769 98 -51 -74 -120 -951 -844 604 -560 -650 -201 -109 -137 -1170
5321 -1170 111 -18 139 -791 -1019 1089 376 84 165 179 -107 -551 -527 255 726 333 -1354 -16 -127
5340 -127 -1253 -358 1504 714 -1391 -622 199 73 -348 -245 934 423 -1747 171 1509 129 -420
5357 -420 -53 1081 -400 -260 300 213 476 -1026 -271 322 751 -56 64 197 456 -505 -191 1210 899
5376 899 -792 -645 1196 1331 -339 572 1252 1376 -166 -465 945 435 -247 -266 461 840 -711 -1155
5394 -1155 -126 269 -148 -386 1032 639 -454 -560 -124 544 -163 -146 -1 494 367 -218 -154 53 333
5413 333 92 429 860 196 -1226 284 427 491 -386 245 732 266 -846 446 -298 -274 -264 -71 568 -698
5433 -698 -1351 266 -33 -426 -1512 -180 221 568 -115 -56 -4 461 -1020 -198 -26 -654 -65 363 29
5452 29 -270 -295 -435 -62 -111 -1285 -826 1144 -211 -269 -1436 351 -121 40 -365 52 1289 -791 138
5471 138 192 120 -70 52 647 -391 -115 -957 290 311 -481 -717 699 56 -40 40 194 85 -816 30 455
5492 455 650 -259 406 -242 361 -153 3 530 -227 -581 -213 522 678 554 -782 34 -12 599 -682 727
5512 727 1809 -580 -321 660 110 -1350 -1 399 1200 -369 -1164 -182 265 -98 -452 973 144 55
5530 55 93 562 741 559 -137 -14 371 -739 -79 755 190 -435 -693 332 -387 -894 25 238 -657 -503
5550 -503 -729 -357 711 -401 274 -688 -117 133 -223 295 913 -106 -614 486 920 564 -325 -338 213
5569 213 33 -493 440 871 29 -732 -656 303 69 -651 947 499 -392 -373 -654 644 685 -469 18 28
5589 28 -165 -754 658 1558 271 -360 -229 -264 25 -94 -1129 128 131 -883 -734 7 1211 -569 -6
5608 -6 1762 645 -1163 665 581 308 -1322 100 1286 36 -346 98 975 209 -180 -538 -123 735
5626 735 -749 -1019 562 198 -367 139 -348 -593 254 335 -58 329 371 -669 327 -623 -90 -2 -6 1130
5646 1130 -722 -40 161 494 -509 255 688 696 -156 -305 666 185 -129 -563 111 -768 -227 -768 231 501
5666 501 -400 -613 -530 -248 127 262 172 771 -1764 15 628 694 -40 -4 -234 76 -485 -480 274 346 -583 -767
5688 -767 -66 262 192 -64 359 -130 -994 -874 596 195 -116 -717 -516 640 -396 -1402 -63 193 -539
5707 -539 -234 766 -130 -263 -859 -141 86 161 37 109 571 -184 -622 -315 -123 -121 196 -37 581 -1095 50
5728 50 103 192 68 199 -151 332 399 -226 27 742 722 -743 -604 610 562 -46 -240 452 -277 -1230 969
5749 969 930 469 -220 470 1471 455 259 509 998 -365 -28 -2 719 519 180 183 104 -54 -670 -735 500
5770 500 319 -357 -263 -342 963 158 -77 236 563 -137 234 -961 303 512 -574 81 298 208 -173 229
5790 229 330 105 343 705 -537 76 -43 262 516 -186 -42 316 663 -433 -527 474 -843 118 -172
5809 -172 773 -814 329 -51 623 472 -499 -1155 232 445 -692 -186 233 268 -66 -1346 722 -143
5827 -143 -48 -48 345 -851 -162 -421 95 619 -1139 -1230 647 402 530 -76 702 -35 -550 -341 186 241 19
5848 19 -552 864 699 -520 107 -378 290 93 -624 -423 657 392 -247 309 555 28 -118 535 593 390
5868 390 174 55 -323 -243 -341 404 690 1075 234 303 647 504 -39 -487 708 354 388 -36 -675 505 93
5889 93 -72 396 703 409 377 510 299 -158 -34 583 -210 46 195 -13 109 -251 -40 -304 407 -417 -731
5910 -731 -222 -130 599 402 95 2 -402 -553 -40 601 157 -677 739 334 -477 -102 1553 539 -1068
5929 -1068 94 285 490 212 -924 -104 -42 -278 -595 797 846 -487 304 139 -243 -198 -152 342 1071 134
5949 134 22 314 1086 342 -781 256 363 -574 -536 564 -458 777 -771 335 495 -783 -726 -270
5967 -270 -134 -480 -1502 -7 532 -478 -461 158 658 362 -474 336 -124 -131 -248 -228 120 -195 210 95
5987 95 299 -1114 -21 -223 1210 20 -475 549 483 109 165 1089 354 -136 -270 -254 471 52 73 980
6007 980 733 174 -1122 334 510 -46 214 162 716 -108 -343 689 -233 999 320 -208 523 753 -499
6026 -499 -481 1123 -127 -569 103 380 -628 -247 398 427 275 95 -392 759 488 709 832 -68 1106
6045 1106 -420 -83 -32 239 -633 -447 -253 464 -749 -1296 449 295 -394 -22 -18 64 -556 -782 271 792
6065 792 -291 -561 574 576 -217 -847 1232 319 -688 -746 -357 555 -1020 -230 -556 461 -934 -670 1045
6084 1045 -220 -300 -476 -330 415 -61 810 214 71 -388 -641 934 386 -64 532 455 -98 -330 82 126
6104 126 341 500 136 56 407 796 -490 243 984 223 -376 280 185 517 -522 339 293 -81 21 46 571
6125 571 -941 -360 427 480 -165 -490 202 1294 -43 -154 -400 -144 -348 112 106 -313 5 -557 83 503
6145 503 7 -707 279 -404 267 -335 134 789 -328 -434 208 545 258 -394 -42 453 699 -791 -451
6164 -451 -294 -526 -225 32 -30 629 -444 -180 -192 -672 382 -44 -1213 94 396 601 -564 -109 -316
6183 -316 -105 1285 -187 -946 256 326 82 -772 -327 -825 688 -408 323 154 -943 316 -17 64
6201 64 -868 -1359 324 1066 -280 -293 186 790 628 -770 -313 -47 -176 -107 -691 392 333 -484 -762 -539
6221 -539 -437 430 -538 303 340 -277 -1075 -178 117 137 -251 779 -736 -856 -82 195 -33 676 26 579
6241 579 -6 401 -55 199 387 64 -678 -141 -106 417 -242 128 -11 -483 143 -111 372 -217 -414 699
6261 699 127 -359 -139 -483 290 283 461 569 328 89 -751 690 -230 207 76 206 291 -409 -261 583 510
6282 510 -156 -43 -235 -435 357 -375 -147 -492 434 39 235 930 -148 49 -272 870 246 650 89
6301 89 1310 1194 -772 129 -80 -219 1126 -86 109 260 -53 330 398 400 -6 -404 -201 -416 -517 -365
6321 -365 -515 87 -877 590 234 -907 -741 203 629 545 -500 -275 114 739 -59 -265 493 -252 -110
6340 -110 196 1094 261 -1036 -333 160 -312 -605 -474 -5 -476 -666 -542 -32 344 -154 -521 4 -219 -232
6360 -232 -180 350 -786 -437 191 -215 -399 65 284 -717 -459 -245 327 350 656 62 -203 -846 -146 760
6380 760 -118 181 965 -538 589 356 -311 352 -607 -191 146 -175 -650 219 145 364 -443 -501 -96 202
6400 202 203 915 -230 -914 -444 1314 661 506 617 447 -32 1039 -529 245 236 -90 199 524 1304 -14
6420 -14 -361 485 124 755 65 230 573 32 430 618 511 -765 -837 13 727 736 -332 -65 725 348 710
6441 710 267 -235 -281 -921 -162 930 634 -935 -349 662 122 -243 -286 -494 667 -100 664 -743 -321
6460 -321 -511 -412 -1084 29 711 -354 1279 -370 -119 128 -2 548 -114 -121 34 -427 -811 664 -419
6479 -419 -607 148 262 -722 411 231 -140 235 138 -51 -239 -67 -484 -154 919 -26 -127 -3 55 263
6499 263 226 359 -531 659 806 -150 298 -300 74 -217 303 -475 -1021 -65 112 152 55 348 -263 612 887
6520 887 -12 900 53 153 239 -492 797 -305 -347 720 1045 238 688 437 -323 724 398 313 394 -485
6540 -485 144 378 62 48 434 -463 233 274 -848 259 -29 873 803 43 274 38 764 -343 -104 327
6560 327 321 -489 -156 46 -754 -544 -225 272 -621 -740 -558 -73 -344 -907 333 2 248 -748 -907 -399
6580 -399 -395 -379 423 -184 -393 74 646 881 -449 -926 -86 -62 301 -749 -52 -563 -168 -451 -387 -451 -461 -453
6602 -453 -622 483 883 81 -446 430 -343 -276 -508 448 723 -215 -62 544 -519 930 -595 -243 706
6621 706 -735 -344 -193 23 -29 -755 -769 149 -255 -481 624 13 -162 124 1 171 490 94 -131 -489
6641 -489 -137 -30 652 33 23 123 68 836 383 -96 375 -181 -778 198 966 134 176 -113 123 -334 272
6662 272 382 -123 -241 319 -42 1392 -244 455 1093 971 403 -1114 -47 24 235 656 -646 0 -394
6681 -394 168 -241 -403 -25 -391 -333 82 -144 -7 480 -55 -25 648 79 -32 164 -90 272 228 -611 -372
6702 -372 1 1011 354 -84 -253 -381 774 307 511 439 -418 -10 -558 -10 -70 -169 -212 -67 83 -312 -26
6723 -26 -418 -182 171 522 -418 932 -165 -671 -363 -35 -256 14 -286 351 -329 -393 -962 -557 253 -436
6743 -436 -101 24 21 -725 -160 53 592 -674 -312 19 357 -88 324 865 460 718 -503 13 -196 801
6763 801 -810 114 -523 -197 212 479 380 -724 397 -247 251 -511 -1267 -286 -45 -404 -887 -426 726
6782 726 -396 -1175 374 -81 877 471 498 65 -200 206 99 992 -505 845 174 -315 -1284 -185 284
6801 284 -124 -100 -351 233 653 328 184 -246 1329 -696 380 -243 49 966 -627 -783 393 -210 -445
6820 -445 636 891 -34 -224 148 -65 -105 -426 245 -298 -702 -952 -102 207 -413 -1139 106 857 142 -541
6840 -541 -481 -575 -46 473 -447 -169 78 569 547 -128 -882 863 822 172 -211 114 115 -679 102 -261 -365 -223
6862 -223 131 -729 -841 44 310 -756 568 -100 -587 -1042 41 1160 74 -301 91 493 366 -163
6880 -163 -37 430 -763 -286 -607 107 -43 190 325 -114 -52 525 -191 227 -78 16 -53 145 37 516 368
6901 368 1016 -561 326 -624 103 -147 70 -385 -324 396 -15 428 236 -13 924 -190 6 -456 40 396
6921 396 -202 524 219 -23 538 542 -441 118 -54 170 300 -312 265 -67 8 -635 -190 278 -1641 -546
6941 -546 325 -76 290 -68 -176 1248 -117 573 -260 -834 -284 -468 -734 -255 310 24 -490 -103 349
6960 349 201 758 -398 -209 2 209 -65 165 237 -571 -132 -1465 -544 796 133 -41 -450 492 290
6979 290 890 -1 -142 -302 -612 53 111 -408 -399 -191 -165 64 -276 383 28 94 -28 -104 331 -60 104 854
7001 854 -153 -547 600 -345 -984 -155 -58 -136 -565 802 -825 227 259 818 -133 -374 183 537 36
7020 36 106 -361 -395 -145 149 -61 -27 -762 -128 -609 68 324 -348 92 -673 296 123 -1055 -97 45 463
7041 463 151 816 808 -325 564 443 -75 -762 157 -233 21 63 -345 1041 -380 82 69 47 333 279 249
7062 249 495 281 303 -251 -564 -282 -473 -783 311 -127 -128 380 -605 96 45 -741 -429 129 -538 -624 478
7083 478 -53 -189 -181 764 897 444 399 113 -204 103 143 315 30 368 9 298 -28 -523 176 -237 571
7104 571 634 379 634 670 -791 -182 -441 65 -540 -543 509 -43 -126 337 -8 -528 -462 -381 -347 452 13 -119
7126 -119 -523 731 108 -1345 387 591 -740 -386 -29 -174 -263 -976 414 -611 -761 -445 718 936
7144 936 -288 53 -633 -160 50 -872 214 62 624 94 515 228 -189 842 -657 301 302 580 -252
7163 -252 693 445 332 -306 45 1275 328 -530 -286 396 481 552 290 700 178 -389 143 -376 139 -171
7183 -171 -479 28 -111 184 -733 271 -1026 1252 1032 -7 -800 -140 -196 166 421 294 306 -692 394
7202 394 89 187 -177 -627 292 602 -189 220 -279 441 64 -441 138 922 -204 63 -7 -483 -246 515
7222 515 -76 -203 -74 926 765 -707 -535 350 -328 788 391 344 -336 100 -106 -386 28 111 -124 -763
7242 -763 -282 451 336 -123 293 391 -498 -800 1001 -436 200 -510 -978 151 412 -805 -1440 -205 -302
7261 -302 173 408 1234 -67 -338 -686 -348 -507 -271 -689 -278 -422 260 436 546 497 134 -376 95 -256
7281 -256 321 716 592 993 1066 136 -293 267 13 1028 351 -338 -450 982 -122 -85 -219 -353 -219 223
7301 223 -130 -323 -16 -46 306 99 132 -501 442 231 -7 593 -138 98 -211 33 156 -2 378 -511 243
7322 243 -41 128 379 189 -271 671 -314 419 -179 -86 725 -466 -301 -142 -617 119 174 -377 235 351
7342 351 117 225 -923 -122 -470 805 332 416 119 -375 81 -428 391 545 -174 -442 -697 -348 92 -753
7362 -753 54 28 32 0 -255 -319 686 448 -170 -337 -757 223 56 -659 478 -550 69 254 226 -297 -366
7383 -366 188 -126 375 -681 -398 719 207 118 204 259 331 -538 -242 -819 207 211 -260 497 165 153 -901
7404 -901 193 115 242 1107 -92 -315 -920 -132 153 101 -236 455 -281 137 -175 -139 716 114 316 -105
7424 -105 111 126 -232 -208 386 10 -74 564 -341 311 387 763 659 377 184 517 -76 183 -193 -378 596
7445 596 608 -394 -106 -1150 744 755 90 -174 -130 469 128 -100 -439 107 -284 -389 -108 -371 264 343
7465 343 -18 -5 200 -581 -1092 -59 -362 -933 60 -775 -838 -683 -286 5 358 -29 -533 -168 544 600 726
7486 726 -138 -544 392 250 -630 -691 352 -301 -502 1638 -232 -980 431 -34 428 -473 -549 -404 -360 175
7506 175 511 -649 -736 -156 -359 4 -473 469 -72 -344 -225 13 -662 154 99 -293 -343 -158 -418 -910 512
7527 512 386 -107 -238 149 -860 -269 283 265 -52 -719 -455 367 -813 -251 215 444 151 -797 -569 695
7547 695 -42 138 333 -263 -273 53 951 177 67 539 438 -86 870 412 -611 553 -996 -311 -76
7566 -76 -570 -182 664 -652 364 190 -55 -160 -15 199 96 -20 -1063 243 -590 292 375 378 -423 308
7586 308 -902 332 -308 393 -372 567 -33 695 553 30 444 102 375 842 -711 -429 21 210 809
7605 809 -303 370 374 -154 -805 90 36 -66 0 -144 -807 -1277 -391 531 -700 -482 82 256 74 -424 -144
7626 -144 -147 -439 -38 -170 -889 -11 -183 523 -331 48 -1409 -628 -132 465 -80 322 56 -77 795 1209
7646 1209 90 -216 -233 381 590 503 -50 -368 -218 864 -160 -259 537 -355 -46 -9 239 306 -169 -546
7666 -546 26 -159 26 -757 -297 901 -485 298 416 -410 679 -555 -393 184 264 304 -382 -82 -310
7685 -310 34 84 197 1040 119 815 -110 201 -329 -281 642 482 564 809 855 55 -260 -7 220 -346 -289 406
7707 406 696 -147 73 -193 333 497 530 -207 271 503 -84 -509 18 -269 -586 -775 -399 53 920 -260
7727 -260 722 -247 -281 -706 -123 -471 -390 1015 136 76 -1013 427 -649 -230 -221 -286 -391 169 90 472 349
7748 349 70 -280 597 -337 -307 233 189 461 476 436 126 -257 -139 458 -857 507 28 -3 231 -118 744
7769 744 -1028 -218 691 -37 257 6 -56 -414 235 191 -591 -102 -172 -440 -209 -204 260 -172 991 381 -259
7790 -259 -465 218 541 -1121 702 68 1023 81 879 -415 -378 -201 177 -39 137 -268 -82 -49 -416 417
7810 417 -188 -136 323 -639 317 -296 -596 -224 -467 -141 -314 56 1076 936 303 -462 -719 79 1062 -263
7830 -263 -317 -465 1055 228 -117 316 847 -395 -211 -780 538 201 18 796 -178 329 -390 -3 316
7849 316 51 126 88 558 70 -831 261 576 -285 -396 855 -339 -469 97 -202 -94 3 511 -687 -127
7869 -127 -461 -940 -474 152 520 11 110 352 97 119 507 115 391 -343 -588 -634 -132 -102 -998 65 57 -255
7891 -255 143 83 -20 182 -139 177 -215 -521 262 218 344 -157 -32 -114 -515 1168 181 -57 1046 -22
7911 -22 -125 -39 88 -291 353 396 404 601 162 60 -1001 91 -473 -359 -315 -776 217 -144 568 -701 140
7932 140 413 347 1263 478 251 479 684 -495 1324 -797 784 154 384 1109 312 -74 -212 249 -536
7951 -536 118 291 -200 76 -154 79 400 398 595 -175 246 368 93 550 377 284 -295 360 -872 726
7971 726 822 1021 -158 11 392 -630 91 370 3 -686 280 -387 449 -207 -179 -470 489 95 73 -500
7991 -500 270 184 -649 -1066 -1017 163 1367 -72 215 -416 -325 639 4 -56 519 -141 -148 15 60 -817 -88
8012 -88 -46 436 152 771 277 -382 311 266 -117 -98 348 257 -384 -162 348 127 -105 714 -513 438 246
8033 246 -328 -180 -194 35 368 -71 444 322 -188 148 -24 15 -318 442 -179 600 -71 589 169 152 -415
8054 -415 -15 97 -564 -167 -644 -267 -330 -474 331 -306 -19 617 262 -476 168 -239 -383 212 -402 850
8074 850 12 516 246 -159 258 15 206 -866 -98 -314 -1077 68 -38 -934 419 904 -320 103 -523
8093 -523 26 -173 256 303 -499 657 152 -215 -189 471 -289 242 -84 383 666 45 543 -20 326 -535
8113 -535 558 -465 -327 455 234 -558 -198 377 -284 166 -68 19 202 -479 649 118 71 -601 627
8132 627 896 -608 521 84 468 -60 -996 297 666 408 220 -379 124 -396 536 -560 1025 903
8150 903 -134 -353 273 735 -1112 476 -160 -280 265 92 -114 862 425 -168 502 213 -597 -603 385 145
8170 145 203 -110 336 597 106 -138 232 -136 441 -191 386 258 105 302 516 -1018 145 221 -894 399
8190 399 502
8191E02
$$ Imaginary data points
##PAGE= N=2
##DATA TABLE= (X++(I..I)), XYDATA
0 0 0 0 0 0 -64 0 -64 64 -64 64 -128 132 -192 192 -256 320 -384 448 -519 634 -733 835 -969 1132
24 1132 -1290 1454 -1672 1900 -2142 2409 -2718 3059 -3415 3802 -4251 4741 -5252 5826 -6473
39 -6473 7167 -7925 8767 -9715 10772 -11929 13239 -14746 16457 -18417 20734 -23506
51 -23506 26869 -31030 36392 -43568 53666 -68912 94586 -145775 286643 -1448157 -4677165
62 -4677165 -446207 2075956 -1019056 -3248371 -286564 1106489 -2169601 -3817325 -284741
71 -284741 1962433 -634268 -2807367 -833843 789796 -790641 -1729187 434877 1648435
80 1648435 -498578 -2221018 -527885 1380868 430978 -1088620 -295417 822014 -309907
89 -309907 -1646635 -291687 1633326 655066 -1544187 -1062546 956517 715883 -833884
98 -833884 -72491 1692135 643296 -1588292 -590479 2105351 1689308 -727729 -474937
107 -474937 1476869 828563 -1115875 -76588 2280960 1299321 -1467731 -1124125 1244262
116 1244262 1050220 -832535 -343517 1345756 337689 -1831528 -961732 1507958 1134093
125 1134093 -1109662 -997563 760758 354521 -1332829 -565769 1543713 913161 -1526547
134 -1526547 -1404966 852304 1013661 -814392 -777026 903645 519556 -1448475 -1074935
143 -1074935 1173031 1154532 -970451 -1201361 529313 618874 -867984 -584421 1108960
152 1108960 778164 -1173289 -1143203 788336 1153223 -326297 -636983 534642 555235
161 555235 -695763 -583465 1004920 1253790 -332342 -1009666 186091 892187 10626
170 10626 -392106 654597 949277 -532989 -1229319 341548 1498208 230991 -999042
179 -999042 -10250 890724 -329210 -1128314 500626 1591855 -162804 -1633580 -185829
188 -185829 1217377 -8035 -1041065 342627 1144937 -605679 -1571007 271176 1476446
197 1476446 -95812 -1226089 76551 854326 -488863 -1017034 565497 1193432 -427765
206 -427765 -1291478 30315 898609 -71011 -671592 212383 582314 -472769 -951575 157621
216 157621 929320 66508 -845207 -327356 432457 -300 -602212 26658 782860 35515
226 35515 -1060505 -469430 829440 530709 -634921 -365801 646142 156276 -940388
235 -940388 -255250 1124112 531211 -981018 -600125 765579 412452 -739830 -171333
244 -171333 982653 229481 -1111868 -419825 1017397 536575 -751790 -350436 712057
253 712057 193071 -800769 -133415 993608 380651 -862436 -472608 684919 444943
262 444943 -516905 -223405 657165 211585 -826434 -394425 838718 612609 -629222
271 -629222 -586920 492459 409780 -579842 -305841 844982 531117 -835716 -696311 698227
281 698227 756402 -437212 -435632 627121 414679 -761602 -477786 889014 775361 -593749
291 -593749 -687985 442843 500893 -456691 -337985 671613 486429 -693788 -705373 459543
301 459543 700539 -249852 -529571 230799 373240 -438929 -533864 464346 740109 -315624
311 -315624 -839682 69058 652840 -108964 -553861 281046 631842 -433283 -911360 277234
321 277234 973919 -106230 -846625 85872 653171 -333429 -744026 471311 960127 -374047
331 -374047 -1049464 157298 864672 -147239 -660378 346685 685813 -486049 -881578
340 -881578 362057 948755 -117819 -764456 49898 542459 -206187 -560770 300514 734777
350 734777 -178874 -840388 -91347 681589 167799 -517508 -76277 496696 -64339 -714038
360 -714038 -54657 811505 242881 -758393 -374876 559068 227268 -579253 -103708 731077
370 731077 106907 -902907 -302016 833090 386267 -662712 -271081 605000 83318
379 83318 -747693 -61939 902605 243110 -827338 -352498 632775 277832 -509406 -80158
389 -80158 643845 90900 -764326 -262046 729949 447692 -495741 -375905 399062 240467
399 240467 -482673 -210345 661309 427736 -609632 -581878 441058 572884 -304469 -390760
409 -390760 432105 377190 -582793 -515126 613991 699676 -421125 -634931 330025 477311
419 477311 -392063 -367235 586349 500178 -587210 -625857 437435 605915 -271348 -399881
429 -399881 332690 305086 -475714 -399808 498389 557655 -329203 -562408 144614 385667
439 385667 -179816 -304826 302899 392205 -362147 -605798 173510 614501 -26316 -510276
449 -510276 12580 392405 -192537 -526465 229886 692279 -126647 -760554 -40865 620268
459 620268 11016 -515590 144829 575157 -242365 -738022 141304 767688 335 -625120
469 -625120 -1880 474696 -144987 -495578 233238 615132 -151852 -656217 -21365 503896
479 503896 39162 -361721 56438 340246 -162929 -489466 57320 529932 95833 -446606
489 -446606 -178099 291190 68347 -312729 12384 453358 52843 -551763 -212043 496918
499 496918 293768 -357274 -177121 383291 85922 -499744 -87903 636914 253513 -554476
509 -554476 -285309 451219 211353 -401236 -58441 535233 85578 -611657 -200748 557347
519 557347 278746 -401559 -198057 334073 70586 -418470 -75437 493684 196983 -441390
529 -441390 -294839 282823 234871 -215136 -124699 295445 130008 -387425 -249561 378415
539 378415 375893 -233928 -322126 197182 241198 -254120 -198596 402513 339139 -376151 -414330
550 -414330 291145 394539 -216039 -260129 301145 219308 -422318 -310551 427174 393862
560 393862 -335206 -384205 230703 241506 -302259 -222193 367542 272655 -391436 -400934 238708
571 238708 357514 -159597 -277540 155689 208578 -254017 -296511 249036 399532 -150400
581 -150400 -414510 53902 339288 -69831 -294352 167117 375309 -194457 -484983 123088
591 123088 513423 -37882 -436566 55113 364740 -165267 -415013 210229 488712 -179568
601 -179568 -522395 85986 416181 -118037 -351878 195739 350600 -274455 -455995 198199
611 198199 464054 -103170 -387769 70284 288973 -130992 -293067 171093 382155 -85168
621 -85168 -399614 -23584 345397 81905 -248077 -8108 289971 -12888 -377006 -37206
631 -37206 452942 160671 -400577 -188951 348639 137911 -372556 -90948 458534 122033
641 122033 -517533 -211322 465039 221372 -401239 -157108 391954 71358 -465455 -79499
651 -79499 506333 131792 -471799 -154279 397381 106233 -362730 -30714 419693 56936
661 56936 -438100 -114607 413325 191092 -296786 -144194 270554 110291 -286719 -99555
671 -99555 355555 199702 -316552 -254015 252886 250304 -215087 -198893 269206 209171 -339221
682 -339221 -307762 316361 367202 -256149 -366213 204555 293319 -260332 -298051 300332 341472
693 341472 -298274 -390525 222426 347833 -190815 -279883 224446 260453 -267078 -301108 257606
704 257606 351483 -184749 -334632 135328 288816 -138678 -268737 167515 306767 -163058
714 -163058 -363560 96813 354051 -60637 -326983 53403 284401 -122507 -341645 124620
724 124620 385431 -110368 -429511 44627 375160 -71113 -363824 108994 377862 -145646
734 -145646 -443406 96693 440370 -46747 -379563 48344 322665 -94828 -319853 124766
744 124766 366290 -69978 -350440 17046 297682 1442 -238039 35993 257899 -29694
754 -29694 -295507 -31660 295756 100657 -251002 -128431 204603 101431 -228660 -109121
764 -109121 261142 139611 -287018 -193336 259545 191477 -250428 -165230 275701 143189
774 143189 -324099 -150214 362099 187830 -343226 -177167 335133 161497 -317899 -106430
784 -106430 359434 119027 -353387 -116402 350133 140880 -286100 -91976 278479 70119
794 70119 -276050 -55983 297712 98072 -262497 -123813 212826 118737 -178300 -100233
804 -100233 183396 112978 -193590 -161266 167222 198863 -119271 -196574 94865 173593 -117512
815 -117512 -181198 148293 224648 -141052 -249393 119186 246059 -108045 -214195 141635
825 141635 218073 -168227 -241692 169298 262393 -140090 -243117 129391 209882 -147252 -199161
836 -199161 163093 208992 -165088 -228311 129510 207539 -121562 -196394 113081 177348 -138229
847 -138229 -209590 118578 222027 -101858 -241449 59578 213472 -70453 -221346 72331
857 72331 229946 -84813 -266478 55905 263721 -41185 -250421 44863 230006 -79609
867 -79609 -250627 84969 268921 -70478 -266791 47767 230384 -62687 -213826 82137
877 82137 215976 -89237 -235273 51359 207845 -39415 -183244 37243 160900 -55027
887 -55027 -181445 30584 183348 -5354 -178875 -21534 157350 16872 -170921 -26294
897 -26294 191666 50342 -205281 -74648 208462 86971 -212977 -82574 240629 98288
907 98288 -247955 -96444 265015 105889 -262025 -86309 287813 97981 -280428 -81988
917 -81988 289625 86994 -269605 -55108 286385 62613 -272015 -52866 269028 63768
927 63768 -230304 -34341 230415 37820 -213768 -32607 213019 61442 -170583 -51792
937 -51792 162171 62136 -143654 -59522 156786 96662 -134407 -107885 131129 127525 -120767
948 -120767 -126443 139782 153990 -137557 -166907 143730 183647 -142696 -185626 153909 196100
959 196100 -159516 -201772 163830 203690 -168265 -205223 173817 206022 -175464 -210287 163333
970 163333 195872 -164467 -191429 157585 183682 -161094 -198529 130009 182022 -122556 -182339
981 -182339 102246 165674 -114419 -193432 83249 186930 -78132 -199954 51703 179069
991 179069 -72925 -207282 56352 207534 -57970 -228075 33530 205317 -57255 -224736
1001 -224736 52146 226457 -59273 -243376 41044 220775 -57372 -227411 58688 223301
1011 223301 -67109 -237433 39737 210879 -45972 -203304 43035 193512 -46945 -209406
1021 -209406 13249 190993 4246 -177203 -14932 164457 9814 -184901 -35689 190928
1031 190928 67534 -178775 -81238 169955 79832 -174965 -75226 205803 104724 -202659
1041 -202659 -113476 204140 124593 -186886 -92768 217423 103792 -217530 -94773 235177
1051 235177 111058 -208161 -83141 216815 79162 -205408 -56428 220489 70867 -199024
1061 -199024 -59373 195442 71555 -163238 -51952 164021 60524 -147189 -55236 155269
1071 155269 86773 -123197 -85788 116475 104089 -88027 -86695 111169 119619 -99194 -132930
1082 -132930 101000 166496 -68176 -148656 81851 158951 -88106 -163554 108994 195135 -90885
1093 -90885 -191005 86406 175808 -94529 -165623 112008 167584 -117971 -177674 99256 158813
1104 158813 -99223 -148921 94006 129672 -108605 -140606 88156 127863 -87335 -132154 66637
1115 66637 116628 -70382 -126521 50255 115691 -53971 -126691 39911 125739 -42304 -148435
1126 -148435 17034 138278 -21950 -150656 12642 140869 -37649 -178743 14346 173097
1136 173097 -19949 -185313 -1707 151130 -36389 -177030 27297 168740 -40760 -190722
1146 -190722 5476 151034 -24121 -148602 20866 129361 -40578 -148811 18286 136433
1156 136433 -7385 -122331 -4642 102903 -1053 -99160 3801 113115 14228 -114094
1166 -114094 -31471 114367 53112 -96208 -42884 105893 42716 -118706 -41374 145352 67161
1177 67161 -141269 -71806 138818 66996 -134450 -39793 164520 42586 -180910 -52392
1187 -52392 185028 69873 -152651 -40318 157269 29191 -157609 -9470 185252 47639
1197 47639 -148162 -37286 136880 41845 -101499 -1084 133079 29665 -114328 -31216
1207 -31216 120167 68379 -72920 -44803 80187 55010 -72515 -53116 92451 85823 -78561
1218 -78561 -98279 69770 104835 -62696 -96895 74096 94517 -95813 -109836 102286 120191
1229 120191 -104938 -128529 94079 110455 -105477 -101876 123968 104849 -135922 -123822 121324
1240 121324 122745 -104712 -106545 97419 82404 -115363 -90637 115785 101711 -103512 -116231
1251 -116231 65775 88446 -70944 -89550 65453 82798 -89229 -129774 49357 123652 -42304
1262 -42304 -136543 12300 102706 -46878 -131796 37761 133410 -49645 -167134 13087 139840
1273 139840 -25469 -134608 34309 123145 -65112 -152697 54691 160729 -39966 -152492
1283 -152492 26693 126239 -43132 -119076 59521 133632 -50581 -143994 23535 130183
1293 130183 -4443 -101162 13179 94049 -26614 -113561 16852 134961 17042 -127408
1303 -127408 -37017 114477 36867 -109549 -21385 139565 35562 -156184 -54799 162540
1313 162540 82749 -133014 -60307 139861 52779 -142124 -31983 179875 62274 -161649
1323 -161649 -55784 156952 59557 -128722 -16176 155960 23024 -154253 -23432 161164
1333 161164 53200 -117532 -36840 103895 26112 -94319 -11747 111575 36968 -100234
1343 -100234 -56812 78258 63551 -56426 -48382 64933 50926 -82894 -74107 89200 104495
1354 104495 -71250 -114366 58271 105998 -65069 -103055 84149 118394 -94549 -140350 83664
1365 83664 142928 -72125 -127893 74103 107060 -100321 -115054 106146 121710 -104639 -133942
1376 -133942 73688 104264 -77005 -92677 77476 79050 -96136 -108694 64680 101687 -49394
1387 -49394 -97146 22215 61727 -48410 -74832 47072 86931 -43330 -110594 8218 91642
1398 91642 -8888 -84444 16154 85275 -36518 -118668 20450 129515 -3285 -124297
1408 -124297 -5023 104103 -15151 -107035 29036 121814 -28562 -134486 10890 120591
1418 120591 -4433 -102960 14602 93479 -28349 -104467 25145 117481 -2252 -106978
1428 -106978 -13765 88711 16811 -71072 -155 85380 9227 -94178 -22483 102157 53993
1439 53993 -73128 -42111 71129 33694 -75885 -17358 113780 47249 -108728 -57120 101755
1450 101755 61532 -79965 -24760 105839 21878 -122376 -28208 132812 52772 -100100 -33083
1461 -33083 90171 11838 -92807 9736 117556 11463 -109333 -24417 87242 24809
1471 24809 -61621 -1633 67642 -2037 -79214 -14997 77903 42335 -53537 -49837 29723 36422
1483 36422 -32944 -33580 47769 47915 -59832 -81312 40981 88288 -28213 -78636 28905 60324
1495 60324 -61553 -79079 75153 98639 -72106 -112800 47385 83817 -58923 -67425 80378
1506 80378 63707 -107298 -91869 85803 85867 -69355 -69261 58762 32681 -92577 -46009 94255
1518 94255 57543 -85451 -74711 45034 42814 -49179 -32494 57254 33753 -71470 -67768 44601
1530 44601 74610 -21713 -66538 9843 48376 -28995 -59990 39214 86160 -27828 -100825 8441
1542 8441 93071 -1362 -74758 21483 79972 -35904 -96782 36661 114915 -14783 -100324
1553 -100324 9248 83182 -18755 -70942 43090 90285 -36916 -99803 20526 95393 419
1564 419 -65940 14941 63317 -26094 -71281 31818 99943 1681 -87125 -13177 76707 18487
1576 18487 -57854 11441 89882 1211 -103830 -11368 117578 44631 -86188 -23342 88355
1587 88355 10304 -97621 4513 129741 21644 -122704 -32756 103141 26589 -85453
1597 -85453 313 97349 -8435 -115794 -12333 107215 27917 -83688 -25445 59305 1105
1608 1105 -68086 807 77908 14782 -78754 -42279 50743 41400 -35174 -31634 37769 25461
1620 25461 -60736 -49799 63393 71863 -52401 -83581 33720 64028 -49661 -63197 67278
1631 67278 69067 -89925 -101181 68866 93409 -64692 -87058 59896 58907 -95772 -78900
1642 -78900 95508 82583 -95159 -96179 61428 62411 -71887 -52391 77863 48968 -88734
1653 -88734 -70792 65405 69152 -41543 -53992 33162 39581 -42235 -44163 46378 66815 -27933
1665 -27933 -72194 9121 67125 712 -52629 13533 62416 -18143 -79122 13170 92464 2443
1677 2443 -85793 -4930 77316 -4860 -76735 20767 92351 -20372 -101322 12219 100966 -151
1689 -151 -79219 15321 77653 -22153 -77414 34215 98300 -6830 -82555 4254 74932 6802
1701 6802 -51487 19658 73411 -6100 -75457 -2403 86299 32014 -59193 -22277 57288 15795
1713 15795 -61540 -9564 84738 30441 -82004 -45080 68838 38870 -60665 -22366 69994
1724 69994 14372 -89502 -27577 87467 35701 -75083 -30669 61629 11685 -66956 -2358
1735 -2358 78026 12003 -76630 -23055 61420 21875 -44586 -9527 43708 2732 -54017 -13534
1747 -13534 52743 27628 -44777 -40202 23048 26793 -29863 -30663 34074 31610 -51945 -63768 32315
1760 32315 61281 -32135 -66923 21507 45760 -49793 -63720 50164 68113 -56513 -84072
1771 -84072 37418 62472 -45463 -52877 56384 48364 -70842 -61209 61128 61082 -48470 -47898
1783 -47898 44197 31491 -51895 -27270 58736 35837 -50063 -40939 32533 31114 -23891 -21296
1795 -21296 26837 17504 -34517 -32161 27016 42723 -15226 -44728 3627 36619 -6646 -35582
1807 -35582 18606 51886 -17104 -64602 11212 74063 2942 -56859 10641 60711 -17200 -61058
1819 -61058 32584 84511 -12888 -73241 13823 69873 -8348 -47129 35460 62561 -29285 -65108
1831 -65108 25126 71133 -4517 -46514 11421 39760 -17605 -40540 24605 57398 -7337 -56389
1843 -56389 -6363 44195 7861 -33995 4129 44410 -6265 -57844 -2381 65952 18761 -54584
1855 -54584 -16883 53088 7049 -57133 3489 76427 3991 -79245 -13080 72994 15367 -60698
1867 -60698 -1543 61544 -8863 -72988 3516 74665 5614 -68247 -14443 48206 -744 -49579
1879 -49579 2172 50756 -2827 -62615 -22487 44380 23497 -37861 -26534 24339 12625 -41956
1891 -41956 -26106 44098 37175 -44325 -53574 27862 42842 -32454 -37934 43181 36782 -61189 -55112
1904 -55112 57364 59102 -51191 -55271 45474 37419 -62079 -38711 69482 43055 -72856
1915 -72856 -54049 54845 41478 -51756 -30276 53058 19926 -68367 -33154 59982 39869 -46528
1927 -46528 -39546 30718 26373 -31985 -22955 39726 36079 -35036 -51138 18650 54798 -607 -40775
1940 -40775 6974 39991 -17375 -50250 24318 72161 -6436 -68559 -111 61993 -2310 -50476
1952 -50476 25429 66142 -25080 -76513 17880 80297 -1978 -59299 14076 53216 -26243 -55637
1964 -55637 34212 71573 -16728 -63312 9402 51635 -7001 -36186 23632 49292 -20465 -55275
1976 -55275 9424 61197 10645 -45272 -7885 41762 4171 -45023 2851 62165 13044 -64310
1988 -64310 -24198 57159 28395 -44890 -14450 52046 8093 -65377 -12552 73582 26593 -62201
2000 -62201 -27494 50039 14215 -50994 -3958 62234 7414 -65937 -21413 50543 20349 -35877
2012 -35877 -11192 30831 -387 -42620 -8950 43363 19909 -35961 -29480 19314 19685 -22934
2024 -22934 -18559 29343 21566 -41336 -42643 30326 45360 -25603 -44817 19988 32786 -37335
2036 -37335 -41625 42251 47605 -46102 -59373 32687 48128 -36291 -39203 41671 32568 -57985 -44618
2049 -44618 51947 47024 -42295 -41784 29070 21294 -38684 -20121 44093 24954 -41756 -37099 20295
2062 20295 27088 -11089 -14335 13973 10002 -25341 -24364 19908 36504 -1946 -32666 -7218 22786
2075 22786 -126 -22803 13203 40013 -8821 -50531 -773 51378 8985 -38052 4567 40764
2087 40764 -14564 -48604 20164 61566 -8997 -54068 7347 47839 -11074 -38789 25992 46320
2099 46320 -24365 -50551 18943 51283 -7055 -35607 12468 31535 -15589 -30035 21590 42174
2111 42174 -4204 -35769 -924 31918 7844 -18597 6221 29050 -1977 -34656 -1259 44536
2123 44536 17524 -30751 -11441 30036 6834 -32836 1992 46437 6882 -48458 -12857 41374
2135 41374 11355 -35034 -938 37175 -7067 -47220 1268 47649 3947 -41500 -5673 31664
2147 31664 -3322 -34046 4617 36882 -1755 -40554 -10167 32001 14073 -25970 -12457 22875
2159 22875 9454 -29108 -15462 33323 22817 -32992 -33426 22670 27482 -25785 -27050 29221 22124
2172 22124 -43607 -35770 38904 35650 -38698 -39613 29451 21382 -44878 -24685 47861 22247 -52608
2185 -52608 -33755 37304 20869 -36558 -14332 36495 6020 -47597 -14854 41917 20812 -30805
2197 -30805 -17656 22824 9284 -24751 -8423 29602 19291 -24331 -27645 14326 29230 -4594
2209 -4594 -24107 8916 25492 -14289 -35127 14073 45497 -8226 -47683 3017 44175 -8004
2221 -8004 -42721 17331 49705 -20080 -55630 17375 57258 -9915 -47208 16072 44242 -20136
2233 -20136 -40409 29409 50658 -19270 -42671 18271 41509 -10164 -26563 24637 33298 -19749
2245 -19749 -33019 17525 40679 -2892 -28218 3644 26930 -4624 -25944 8669 38047 -227
2257 -227 -41119 -8425 37836 11948 -32511 -6207 36456 1027 -45906 -5374 49855 13889
2269 13889 -45442 -14495 39732 9243 -39285 -2563 47138 6336 -48241 -11254 44545 14504
2281 14504 -33820 -8890 32852 4982 -35523 -7486 35754 12648 -33652 -20765 23264 16746
2293 16746 -22986 -17159 21980 13317 -32583 -27267 26202 28286 -26846 -34352 17684 22738 -29773
2306 -29773 -26161 33557 27445 -41118 -38552 29780 32258 -30278 -26101 33119 20102 -42677 -25397
2319 -25397 41414 31323 -33668 -27511 27048 17042 -31077 -13264 34502 17915 -31523 -24396
2331 -24396 19296 19831 -13340 -16440 12147 12460 -16519 -21962 9615 26477 -4581 -29322 -3202
2344 -3202 25185 1943 -24414 2562 30639 -3264 -36784 1823 41830 3696 -36092 1819
2356 1819 37333 -4192 -36084 14106 46579 -8026 -42698 9886 42305 -6001 -29932 19479
2368 19479 33628 -19101 -34297 20641 39508 -9611 -28238 10517 22415 -13600 -20155 16934
2380 16934 27882 -8994 -27979 772 23475 3004 -15345 1457 19280 -586 -23965 -3908
2392 -3908 28586 13018 -22869 -12491 22318 11192 -21934 -4789 30481 9454 -32001 -12443
2404 -12443 31481 13058 -26991 -8733 26522 2622 -31587 -4432 31802 4565 -31718 -8857
2416 -8857 22960 1514 -23763 -1094 21793 -3737 -29678 -6762 22606 7251 -21797 -10560
2428 -10560 14351 2981 -21025 -8062 22138 12002 -24343 -20510 17025 18314 -17976 -15471
2440 -15471 21631 14244 -28739 -21347 28094 23875 -25757 -23498 22890 16331 -27919 -17046 30854
2453 30854 16085 -33095 -21014 25506 14965 -24920 -10783 22205 6244 -26927 -8274 24835
2465 24835 10226 -20169 -10670 13920 7292 -12731 -4731 16285 9186 -13850 -13788 11703 19880
2478 19880 -3266 -14878 6420 17472 -6844 -17765 13702 30934 -5352 -30142 6395 31790
2490 31790 -4774 -25310 15038 33117 -15600 -35963 18814 39748 -11548 -31756 15342 29284
2502 29284 -19285 -27578 25161 33906 -18397 -30339 15679 26421 -12481 -17842 18596 21160 -15689
2515 -15689 -20807 14269 23809 -5123 -17809 5077 15435 -3723 -14412 6660 21109 -1545
2527 -1545 -24778 -4584 22906 6468 -22279 -5088 22397 -1293 -29673 -4115 32862 5458
2539 5458 -33374 -9313 27322 1205 -31549 -2047 32703 -2063 -38712 -6624 32138 3149
2551 3149 -30947 -4001 25322 -2597 -31548 -1784 29336 4510 -28542 -10729 20158 5871
2563 5871 -20919 -7597 19789 6949 -24803 -15622 20077 17025 -19543 -18140 15635 13997 -22570
2576 -22570 -16912 23609 19361 -27583 -23476 22392 20882 -21970 -17234 24026 14618 -29060 -16682
2589 -16682 29301 19578 -24756 -16676 22871 12610 -22823 -8827 27495 13751 -24558 -14702
2601 -14702 20550 15265 -12869 -8799 14547 11355 -14627 -13035 15480 21207 -4929 -19897 3583
2614 3583 20735 -588 -17700 8036 26353 -5516 -28083 6041 33131 1026 -27750 4497
2626 4497 29149 -6264 -28497 12232 36231 -7535 -32457 7977 30723 -5850 -22555 14266
2638 14266 26212 -14502 -26371 13904 27686 -7928 -19514 9280 15635 -12293 -15070 13359
2650 13359 19504 -8251 -19658 2232 15701 110 -12189 1073 14012 -1807 -20487 -3612
2662 -3612 20761 8381 -19690 -10284 15045 5102 -20351 -6499 21968 5765 -29034 -12656
2674 -12656 23122 9861 -24392 -9842 21535 1489 -29300 -7373 24993 4554 -26358 -9339
2686 -9339 17277 1278 -20335 -1619 18095 -1396 -22595 -6218 15944 5213 -14855 -6823
2698 -6823 9696 2479 -15050 -5409 15655 8570 -15834 -13294 11595 11427 -11674 -10084 13793
2711 13793 9584 -18360 -15164 17919 17388 -16065 -16303 15522 12185 -18940 -10409 23141 14002 -20982
2725 -20982 -14719 19446 14054 -15453 -7387 19555 9141 -17617 -6777 19353 12426 -11045 -6869
2738 -6869 10890 8189 -6981 -2065 12781 9662 -6965 -9727 7357 14967 642 -8549 4345
2751 4345 13114 -3497 -12790 8296 21421 -2009 -19342 2763 20293 -1827 -16517 9847
2763 9847 22737 -10560 -24678 10963 25605 -8340 -20034 12057 19265 -15868 -19277 19543
2775 19543 22493 -14730 -19437 11951 15420 -11593 -12504 13478 12415 -14001 -15712 8714 12925
2788 12925 -5052 -11940 2486 8069 -6592 -11799 1696 11885 -2701 -17587 -4882 12023
2800 12023 2615 -15323 -5148 12646 -755 -21239 -6132 19158 3817 -22934 -8026 16469
2812 16469 1774 -22623 -771 22247 -2182 -26890 -1707 22352 -439 -22363 1255 18486
2824 18486 -5120 -23595 498 21612 -1119 -21205 -3587 14665 -435 -17029 -372 16612
2836 16612 824 -18477 -7154 15799 7681 -14074 -8424 13445 6695 -16195 -8350 19250 12924
2849 12924 -17435 -12728 17868 15174 -15049 -9475 20176 11852 -18422 -10160 22381 15246 -16800
2862 -16800 -8755 18445 9131 -16154 -3455 20974 10068 -16988 -8450 16659 11405 -9761 -4675
2875 -4675 13021 7206 -11924 -7963 13247 15022 -5652 -11352 5680 12332 -4230 -11049 10282
2888 10282 18820 -5433 -19807 6992 22638 -2530 -19147 9266 22819 -8960 -23530 10750
2900 10750 25926 -7487 -22582 8636 20582 -10432 -19447 13265 19893 -13130 -20961 9783
2912 9783 17603 -10531 -16498 8609 12605 -12297 -14245 7623 11205 -8579 -14750 1868 8982
2925 8982 -3680 -11054 320 8186 -2685 -14175 -4005 13340 4326 -14775 -8223 12211 2378
2938 2378 -16857 -5295 18065 4315 -21846 -9633 18339 5541 -19775 -5855 18854 404
2950 404 -25294 -5738 21266 3473 -22354 -5226 16404 -302 -20301 -1532 17649 962
2962 962 -18852 -3702 14017 1777 -12915 -2473 11965 2282 -12175 -4215 11943 6884 -10372
2975 -10372 -7326 10147 8543 -8335 -6352 10925 9985 -10290 -8704 13620 13716 -9407 -9680 12358
2989 12358 9612 -12423 -7400 16455 12369 -13080 -10464 13734 9910 -9749 -4477 15539 7719
3002 7719 -14293 -6512 14393 10706 -8435 -5401 9654 6985 -6936 -4273 11159 11725 -3513
3015 -3513 -8360 4781 11089 110 -7654 6930 12501 -2471 -12469 4454 15702 -866 -12128
3028 -12128 3833 15030 -3609 -14961 6758 15959 -5931 -16706 6399 15253 -8505 -15053
3040 -15053 7448 12515 -11066 -13447 10423 12398 -11967 -12315 8384 8144 -9875 -9247 8135 6671
3054 6671 -10355 -9514 6282 7694 -3963 -7139 758 4032 -3983 -8273 841 7377 -1152 -11498
3068 -11498 -5172 7060 2266 -11100 -3660 9929 409 -16419 -5520 15004 4293 -17124 -5464
3081 -5464 13548 959 -17883 -2859 16161 -514 -18525 -1933 16318 -661 -15865 1656
3093 1656 13507 -4906 -15065 2775 13738 -1952 -12643 1887 11056 -1951 -9477 2488
3105 2488 11097 -1782 -10662 -1201 11446 3784 -8058 -2123 8614 2593 -9077 -3375 13252
3118 13252 7422 -10257 -7854 11074 8672 -9848 -4227 14371 8403 -14709 -7060 15256 11783
3131 11783 -9368 -5137 14289 7103 -12290 -3167 16118 8888 -11214 -5625 11222 6024 -7835
3144 -7835 -2498 10534 5765 -9157 -5590 10123 8673 -4661 -5761 6336 7606 -5621 -6670
3157 -6670 8487 10967 -6842 -11352 6101 13091 -5347 -11524 6542 12435 -9438 -14401 10345
3170 10345 16557 -8253 -16106 8915 13198 -9918 -13742 10185 13161 -12139 -14683 8121 12064
3183 12064 -8415 -9446 7192 8389 -9335 -9903 8221 8684 -6482 -10656 1437 5414 -3046 -6645
3197 -6645 2748 6497 -3511 -10902 -1910 8529 2976 -9590 -4382 7712 551 -12789 -3334 13699
3211 13699 2256 -15952 -5089 13697 2892 -15121 -1011 14920 -272 -18148 -1892 18089
3223 18089 1483 -16677 -1443 14465 -1360 -14403 1615 15600 -1467 -15633 -1038 13265
3235 13265 989 -8478 1031 9524 -881 -10922 97 10717 4903 -7833 -5006 5938 4963
3248 4963 -5611 -2930 8856 6330 -9617 -8405 8941 11175 -5158 -7160 7747 6889 -10742
3261 -10742 -6610 11626 10898 -9240 -8660 9999 7442 -8582 -4484 12887 6910 -11244 -6785 10996
3275 10996 7081 -7116 -4646 8393 4122 -7073 -4237 8921 8050 -5613 -7674 4919 7478
3288 7478 -3449 -5166 5047 8057 -4971 -9518 3695 11946 -2991 -10914 1803 9506 -3728
3301 -3728 -11649 5273 11971 -5629 -14220 3618 11265 -4511 -10235 6069 9638 -7835 -10912
3314 -10912 7619 11008 -6086 -8588 4751 5549 -6111 -5690 6408 5604 -5983 -7399 3256 5490
3328 5490 -2945 -4446 1226 2945 -2782 -5976 -172 6391 194 -8624 -4378 5327 1372 -7684 -2390
3343 -2390 8270 1105 -11517 -4417 10971 2688 -11444 -2628 9853 358 -12529 -774 14535
3356 14535 328 -13602 -1265 11968 130 -9845 2901 10781 -2793 -11401 1844 10628 -930
3369 -930 -7749 1128 6009 -2853 -6655 2474 8229 105 -6965 -763 4512 1192 -4053 -1041 5019
3384 5019 2249 -6034 -2867 7621 5627 -4386 -3682 6310 4806 -6132 -2536 10388 6017 -8881
3398 -8881 -5968 9621 7353 -7814 -2717 9838 4344 -10280 -3670 10451 5209 -8233 -4272
3411 -4272 7459 3496 -6672 -844 9026 2842 -7878 -4110 6339 4832 -4205 -4339 4963 3988
3425 3988 -4565 -5069 5801 6757 -4531 -8136 3521 7489 -3044 -6246 5177 7206 -6851 -9594
3439 -9594 6215 9843 -6651 -8868 5185 6605 -8341 -8523 8730 8893 -9456 -10284 6539 6589
3453 6589 -7113 -6575 7245 4381 -8971 -7090 5551 6124 -4983 -6749 2841 3815 -4333 -5000 2938
3468 2938 4747 -2809 -7844 -614 6828 1132 -6907 -1223 6523 -574 -8358 -1647 10607 1940 -11494
3483 -11494 -3285 9901 615 -9958 553 12039 -1421 -13395 -87 13196 -611 -10976
3495 -10976 605 9968 -2451 -11289 2733 11013 -1688 -10372 1216 9148 -965 -6867 3034
3508 3034 7972 -2331 -8031 2058 8074 2100 -5041 -1218 5514 2120 -4491 -1140 8136 5341
3522 5341 -6183 -4715 6735 7597 -4024 -3646 7106 5152 -8293 -5591 9574 7705 -7111 -6117
3536 -6117 7285 5053 -7465 -2621 9957 5402 -9597 -4832 8903 6330 -6933 -3301 7325
3549 7325 2968 -6923 -3005 7627 4734 -5988 -5769 3984 4681 -3660 -3160 5307 4807 -4951 -7522
3564 -7522 3296 7547 -1828 -7227 2726 5372 -3824 -8081 5960 8593 -4732 -10210 2644 7240
3578 7240 -4124 -7411 4567 7508 -6320 -9589 4757 7463 -4238 -7292 2351 3227 -5872 -5348
3592 -5348 4331 5864 -4811 -6676 1560 3028 -1969 -4145 565 3229 -2186 -5486 -173 5126 1091
3607 1091 -5757 -3060 4317 1832 -6132 -1964 6928 950 -8796 -3370 7701 1897 -7739 -1308 7909
3622 7909 309 -9637 -310 10240 -62 -10107 -906 8448 -211 -8087 1878 9407 -1710 -8472
3636 -8472 1056 8512 -970 -4712 1939 5096 -1403 -4380 1627 5813 839 -3364 -1181 2248 1059
3651 1059 -1736 -193 3550 2610 -2974 -2701 3982 4759 -1543 -2826 4287 4281 -2974 -3164 6238 5847 -5399
3668 -5399 -3366 5962 5166 -4983 -3023 6550 2674 -6730 -2902 7976 4279 -5435 -2883 5390 2860
3683 2860 -5788 -1207 6828 1791 -6566 -2100 5192 1806 -3211 -1347 3442 789 -4592 -3037 4049
3698 4049 4339 -2454 -4729 1646 2657 -3251 -4973 2964 4526 -4007 -6084 2149 4656 -4217 -5088
3713 -5088 3260 4134 -5997 -6225 3625 4085 -5133 -5617 3383 2851 -5543 -4592 4219 2984 -5340 -4731
3729 -4731 4315 3865 -4364 -4382 2087 1691 -3359 -3121 1515 3105 -2446 -4940 -176 3657 -118 -5077
3745 -5077 -721 5144 -831 -6775 -21 5805 62 -7379 -1302 6306 46 -7207 1732 8716 -804
3760 -804 -8563 919 8460 -704 -7682 2365 6526 -2368 -7010 3557 8717 -1729 -5641 2475
3774 2475 6671 -1669 -4018 3078 5493 -969 -3573 2491 4316 -36 -2224 786 4492 1190 -2726
3789 -2726 -668 5172 2501 -3033 -2511 3980 3399 -3175 -3011 4660 3968 -4925 -3241 7834 5197 -5096
3805 -5096 -4075 5706 5169 -5913 -2163 7356 3431 -7403 -2945 6664 3390 -5029 -1664 5594 906
3820 906 -6347 -2324 5957 3440 -4991 -3270 3942 1345 -4295 -2609 3886 3114 -4157 -3539 2666 3805
3836 3805 -3210 -4669 2106 3039 -4131 -4747 2260 4903 -3602 -6644 1814 4622 -4094 -6367 3874
3851 3874 4745 -5159 -6278 3393 4931 -3966 -5003 2429 3754 -4042 -4126 2194 3299 -3976 -6359 1830
3867 1830 2549 -2211 -3143 757 2482 -1720 -5056 -320 3918 -335 -4941 -1575 3213 -444 -4061
3882 -4061 228 5394 -1083 -6084 -1726 6214 907 -5556 -470 6401 -840 -6462 821 6613 490
3897 490 -5960 -2 6178 -312 -5060 1835 6519 -1274 -5352 1847 5086 50 -3720 1937 4853
3912 4853 -300 -2400 1449 3490 95 -2907 -1055 3192 1475 -1017 -869 3032 2060 -2015 -872
3927 -872 3545 4175 -1211 -3494 3393 4542 -2395 -2715 4443 4608 -4099 -3706 5008 3500 -3783 -1919
3943 -1919 5165 2738 -5490 -2305 5203 2723 -5052 -1781 3712 1989 -4695 -1178 5012 1707 -3576
3958 -3576 -2756 2840 1135 -3313 -1423 2649 1755 -3565 -1454 1597 1527 -2479 -2609 1055 1719 -2380
3974 -2380 -3566 1329 2880 -2345 -5094 927 3103 -2953 -5129 1429 3151 -3351 -3992 1762 2565
3989 2565 -3412 -4715 1924 2334 -2760 -3119 1420 2193 -3256 -3344 1629 2604 -2673 -2474 1227 1076 -2105
4006 -2105 -3067 882 2205 -1343 -3924 480 2163 -585 -2888 125 2660 -958 -3772 -377 4023
4021 4023 -231 -3923 705 5296 -497 -4779 1487 5913 -526 -4262 1722 6621 -626 -4976 1628
4036 1628 4899 -654 -3959 2431 5600 -872 -3803 2556 4624 -1279 -2861 2955 3425 -390 -2126
4051 -2126 2034 3165 -51 -1668 1172 2110 887 -993 -656 3456 1764 -2256 -1676 3824 2169 -2236
4067 -2236 -1480 4138 3778 -3024 -2623 3789 2370 -4860 -1976 5370 2456 -5240 -2647 4995 2066 -5524
4083 -5524 -679 5508 1625 -5570 -2081 4696 767 -4455 -475 3664 305 -5192 -1742 2753 1130
4098 1130 -4611 -1219 2361 836 -2715 -2176 1780 991 -1770 -3134 1495 1928 -1955 -3114 1559 2230
4114 2230 -3039 -3675 1912 2600 -2457 -3973 2052 2891 -2881 -4239 2396 2324 -3713 -4075 2738 2371 -3393
4131 -3393 -3082 2612 2612 -3252 -3119 2832 2741 -1404 -2579 1118 2666 -1168 -2840 1882 2839 -1503 -2863
4148 -2863 1892 3636 -325 -4095 -1179 3600 -57 -2664 76 4167 660 -4310 252 4477 -441
4163 -441 -4000 1012 5599 -615 -4840 1149 4940 146 -3811 1426 4008 -1410 -3206 2408 4042
4178 4042 -697 -3681 985 3276 194 -2075 2223 3149 -778 -1520 1533 2982 1207 -1818 -806
4193 -806 1933 1705 -1827 -862 1736 2411 -2927 -2208 2446 2935 -2293 -2138 3110 2316 -3933 -2518 4735
4210 4735 3430 -4149 -2536 3821 2018 -3329 -2194 3839 974 -4507 -2135 3241 1387 -3415 -2039
4225 -2039 2903 231 -3541 -1566 2473 120 -2656 -1996 716 -533 -1870 -891 218 416 -2110 -1401
4241 -1401 1906 1171 -2427 -3400 868 1369 -1883 -2251 1448 2859 -1568 -3434 1183 2059 -2191 -3489
4257 -3489 2084 1729 -2301 -3068 1609 2666 -1231 -3195 1353 2184 -2964 -2399 2037 2285 -1851 -2415
4273 -2415 570 2254 -1086 -1333 174 1910 -1549 -2189 2243 2825 -124 -1796 339 1840 -510 -1882
4289 -1882 694 2925 -150 -2004 1003 2962 552 -2138 471 3848 -773 -2489 1145 3407 -1118
4304 -1118 -2727 1626 3996 -571 -2551 2285 3815 -1473 -2492 2375 3497 -819 -2266 1644 1497
4319 1497 -1287 -1101 2021 1765 -240 -1498 322 1863 659 -182 -146 1938 575 -835 -982 1776
4335 1776 1696 -3084 -1191 1630 1521 -3033 -1380 2595 405 -3696 -1894 3146 1504 -3752 -2077 3260
4351 3260 937 -4152 40 3469 -327 -4367 -779 3432 -341 -3841 -143 3259 -39 -2433 -445
4366 -445 2206 -342 -2271 -848 1457 125 -1924 -1230 959 783 -1896 -2241 498 1054 -1005 -1488
4382 -1488 891 1412 -1168 -2014 1120 2374 -1139 -2806 1243 1983 -1729 -2825 2241 2724 -2987 -2515
4398 -2515 2014 2005 -2538 -1660 2797 2094 -1565 -1194 1635 1136 -2672 -1853 2346 1950 -1499 -1885 1082
4415 1082 1575 -1055 -1285 2081 2672 -75 -2476 1014 2430 49 -1737 1214 3543 151 -3262 1031
4431 1031 4350 -350 -2803 1397 3902 -716 -3167 1258 3851 -571 -2466 1323 3565 -796 -2195
4446 -2195 1440 2829 -1819 -2390 1293 2667 -168 -1894 996 1937 -94 -975 1214 1433 192 -1490
4462 -1490 -887 1822 1510 -1945 -1071 1880 832 -2635 -1239 2607 1057 -3638 -2350 1644 483 -2906
4478 -2906 -2190 2877 1245 -3685 -1819 2991 1077 -3611 -1340 3054 1489 -3804 -477 2957 754
4493 754 -2873 -1121 2066 211 -2806 -304 2147 -616 -2894 -502 1376 341 -1160 -1462 -819 -85
4509 -85 -1320 -1098 1388 1508 -909 -2640 903 1936 -394 -1312 1104 1241 -1598 -2081 1666 2923 -1694
4526 -1694 -2550 716 2403 -2481 -2666 2135 2415 -2288 -2620 1384 1773 -895 -1368 1541 2039 -1465 -1613
4543 -1613 2214 2294 -1348 -803 1657 2083 -499 -1182 1427 2267 -357 -1453 -173 2212 -332 -1015 -530
4560 -530 1544 -362 -1913 532 2946 389 -1966 748 2353 -226 -1639 1192 3193 -662 -2495
4575 -2495 923 2473 -1194 -1472 468 2570 -821 -1249 1589 1829 -370 -1119 1243 1078 -393 -1419
4591 -1419 1183 197 -944 -863 -403 2184 -38 -832 -335 1818 216 -1295 -944 1551 1317 -2214 -1559
4608 -1559 799 829 -1801 -1095 1362 17 -2646 -1460 1968 1176 -2749 -713 936 -184 -2721 -643
4624 -643 2552 106 -2532 -619 2867 -561 -1588 78 2152 -707 -1175 -774 294 74 -1852 246
4640 246 891 98 -665 136 829 205 -1524 -1032 426 858 -928 -992 -169 717 -831 -1771 1093 1293 -1317
4659 -1317 -2087 1787 1659 -760 -1734 2022 1490 -2135 -2075 1997 2106 -1522 -2024 1807 1493 -1821 -67
4676 -67 2806 2701 -1464 -912 1760 1239 -1432 -315 1701 1491 -1139 -1102 1900 1759 -274 -1315 1021
4693 1021 2006 -14 -603 1761 1388 -830 -971 1529 2050 -361 -1056 1182 1887 -883 -2145 1030 2577
4710 2577 -420 -2051 976 2598 -694 -1301 1381 2069 -612 -1952 397 2015 -531 -1396 379 894
4726 894 -1314 -797 360 952 -1538 -1207 -288 1003 130 -1627 -189 1604 -266 -1736 33 1517
4742 1517 1172 -3081 -400 911 1079 -2010 -403 1729 259 -1996 -263 2259 -241 -2234 14
4757 14 1219 -366 -3066 38 1890 -461 -2924 -51 1743 101 -2393 -945 1313 -669 -2267
4772 -2267 478 944 -163 -742 -785 -197 483 -219 -523 1236 728 -431 -1377 414 1142 -981 -915 450
4790 450 918 -1014 -1755 932 1856 -1061 -1744 1396 1402 -1482 -1547 2613 1782 -1315 -1998 2449 1577 -990
4808 -990 -732 1644 1237 -1515 -177 2012 223 210 -663 698 732 -191 -89 530 1215 -575 -819 918
4826 918 1756 267 -161 794 1205 376 -894 393 1732 -30 -842 321 1937 -146 -200 633 1148 -546
4844 -546 -291 568 1398 469 -1302 333 920 -633 -1520 1673 1341 -274 -1563 187 1948 -483 -694
4861 -694 230 1464 153 -801 -125 2260 638 -1004 -360 -62 196 -1415 -937 715 332 -1665 -880
4878 -880 1005 1214 -2293 -987 1099 415 -1514 -209 1695 -522 -2717 -269 2301 427 -1991 -263
4894 -263 1847 72 -2188 -152 935 -605 -1707 86 507 -918 -1720 658 283 -121 -613 92 473
4911 473 296 -998 -54 957 661 -653 -403 367 447 -460 -709 1013 1543 -531 -556 760 1774 -449
4929 -449 -1251 2151 1593 -751 -947 855 639 -1224 -873 1484 1036 -606 -1154 1894 1482 -1227 678
4946 678 1377 691 -1169 -725 831 280 322 -432 1919 1150 -591 4 1091 784 42 -235 99 1044 -314
4965 -314 -14 1097 978 -580 134 990 1023 12 -928 424 984 -1363 -1227 1120 1119 -767 -2071 693
4983 693 726 -798 -408 462 897 -889 -1912 778 1434 -1264 -1901 462 686 -393 -646 715 547 -204
5001 -204 -1070 4 771 -440 -1661 -809 539 -566 -1598 -199 588 -121 -1363 -566 1210 898 -2112
5018 -2112 -9 746 -277 -1323 -399 1222 -985 -1538 -377 1965 114 -1532 -352 1513 -1606 -1615
5034 -1615 -432 841 -574 -1501 521 1302 -299 -1195 252 1409 188 -503 -432 -277 436 -551 -446
5051 -446 698 26 -1147 -1176 365 1542 -1041 -447 707 781 -1292 -756 742 1027 -1394 -1858 1477
5068 1477 1285 -1022 -816 644 484 -1421 -915 1801 192 -1966 -117 1656 502 -1371 -62 1938
5084 1938 287 -142 -560 1401 899 -417 -219 1281 665 -867 -46 335 607 -205 -1098 655 1053 -732
5102 -732 -1053 192 486 -278 -825 292 1170 -44 -943 -640 1065 -126 -1169 923 1790 371 -1387
5119 -1387 393 1252 -732 -1192 1102 1463 -791 -1926 235 1577 -397 -434 148 207 -856 -605 797
5136 797 451 249 -1375 -991 721 -493 -629 152 957 -998 -677 -710 1246 -71 -1215 -253 -62 -91
5154 -91 -1682 651 1732 -130 -1521 -718 691 -323 -147 293 1128 -286 -1685 -263 916 -295
5170 -295 -1078 342 221 -491 -1243 240 809 577 -600 -206 780 542 88 -537 683 -9 81 -54 451
5189 451 1115 407 -560 -314 1145 248 -261 568 1247 -42 -1697 172 1372 -536 -796 1715 814 -584
5207 -584 -512 1229 1049 -1216 -661 1452 604 -941 -924 1346 -193 -291 80 2099 1046 -1680 -376 852
5225 852 733 -735 126 800 123 -371 806 313 523 874 -393 -285 -172 -376 -628 421 1439 155
5243 155 -484 789 286 -230 -825 703 573 -1686 -1063 236 900 -1607 -634 549 166 -1180 -999 72
5261 72 511 -373 -1136 448 814 -299 -439 279 1345 -1673 -559 366 709 67 -827 -22 103 -249 -1268
5280 -1268 258 956 75 -945 -45 431 -680 -497 -854 946 -148 -1143 -411 1352 278 -876 734
5297 734 650 -304 -872 794 1175 -715 -1354 -317 651 358 -749 738 342 -798 -127 608 -171 -112 -847
5316 -847 -264 -3 141 -162 57 243 418 -989 74 -155 317 -702 -1244 482 857 -552 -438 778
5334 778 1406 -988 -67 1074 347 -818 -503 1119 772 -366 258 1552 852 -627 -1066 439 59
5351 59 -229 69 717 293 -143 275 1787 -75 -530 -265 288 -218 -1358 -299 494 229 -179 -202 -68
5370 -68 -606 -250 -619 252 480 -346 -1330 706 976 -170 -332 -289 320 -373 -368 646 633 961 -1811 -176
5390 -176 1246 -1228 -491 671 400 -799 -551 250 -725 -654 -516 -53 -231 -446 -1024 454 341 -962
5408 -962 -70 -174 371 -317 480 202 496 -53 -572 -892 736 -320 -1675 -555 113 -373 -1179 796
5426 796 783 -1114 -1809 -853 738 -440 -586 522 338 -575 -525 -118 701 -407 -670 -145 -432 845 46
5445 46 1474 852 -1030 -703 110 613 829 306 -561 -63 386 -467 442 864 1175 -1022 -1114 781 746 34
5465 34 252 214 235 -20 -655 1757 508 -82 -605 1016 634 -1064 -747 854 796 -605 -404 1095 1102 233
5485 233 675 499 -97 -1693 -372 -11 496 -584 351 225 -75 -965 -102 1092 -370 -440 -704 -100 1025
5504 1025 -77 -390 -84 313 136 -437 1012 354 -19 -892 -212 258 -676 -722 487 924 6 -552 105
5523 105 359 -1111 -652 253 447 -738 -757 323 348 -1558 -842 822 844 -108 58 513 92 -461 -1315
5542 -1315 127 717 -58 -1289 -743 290 238 -1034 -396 241 -56 -990 -86 9 222 -105 1091 716 -491
5561 -491 -267 150 1417 161 -291 -331 934 -189 -584 345 1199 -48 -920 508 966 -421 -295 118
5579 118 678 390 -129 73 875 -33 -511 -131 52 193 32 425 -166 170 -584 -275 888 607 -375 -95
5599 -95 409 348 -281 -774 119 -578 -686 -385 735 559 -335 769 447 266 -268 -651 78 956 -791 79
5619 79 742 -252 -654 -136 920 298 -182 -188 177 230 212 286 -437 549 283 143 387 286 736 134 -74 269
5641 269 410 -671 374 -579 -550 -729 -420 484 -425 -494 57 879 -527 -324 569 1092 -252 -389 -100
5660 -100 139 -54 -1050 630 -90 -596 -768 -517 944 -931 -1162 256 -139 -224 -1019 390 198 -620 -759
5679 -759 -373 56 -154 -145 163 189 -454 -1010 31 796 -578 584 -261 708 50 -634 474 505 -429 -321
5699 -321 -811 137 -23 -801 918 1254 -437 -1504 1101 -66 -76 -1216 553 139 -160 219 956 503
5717 503 -336 -647 48 708 -484 185 8 812 827 655 189 381 453 -403 -74 80 813 33 -336 246
5737 246 237 229 117 736 40 816 78 885 -67 -244 -374 801 21 -998 429 258 139 -1039 432 573
5757 573 76 -650 -146 1113 122 293 -965 348 777 -399 -532 262 -114 -961 -298 343 -237 444 -388
5776 -388 -194 69 -534 -105 617 425 462 -339 -956 -166 -537 -78 661 860 -533 -263 -53 700 -905 -1683
5796 -1683 496 1054 -745 -641 863 437 -896 -162 -127 258 -312 -173 -622 -151 -1527 -859 -633 42
5814 42 -37 -812 23 149 15 -955 -133 324 125 -366 -82 339 -796 -124 925 850 319 -1205 439 380
5834 380 -234 -386 600 874 -465 -995 595 1244 52 -340 -145 428 971 -37 -260 233 118 -104 204
5853 204 -74 -155 -341 -469 276 -53 -956 957 574 487 -100 -227 727 283 -162 -59 267 358 -404 -368 74
5874 74 111 337 -37 648 108 -1024 241 382 228 22 622 841 -905 -547 -267 535 313 -413 -507 503
5894 503 235 93 82 -539 -167 -309 117 -222 -370 -157 427 -165 -89 167 -1142 -69 -283 -40 339 -771
5914 -771 318 -229 -134 285 442 -405 -875 -54 -682 -693 -609 714 -188 232 -406 -307 368 -521 -196 961
5934 961 274 -393 -993 189 -274 -1315 -1743 79 -269 531 232 390 -40 -677 -259 685 -36 187 -154
5953 -154 -86 532 -1162 67 51 622 140 -146 71 -83 314 -303 784 414 300 -658 310 717 143 -891
5973 -891 403 -341 581 -147 29 758 -95 443 475 189 -194 280 217 -13 -494 234 800 685 824 -216
5993 -216 1284 -231 76 -675 437 615 1114 112 -114 594 479 -521 -536 -254 -51 -420 -351 -465 143
6012 143 33 -459 81 449 -593 340 683 456 -177 81 6 160 112 -157 310 222 -1052 119 1202 -434
6032 -434 38 179 186 -358 -934 -350 -155 -764 -1068 -312 -56 -9 497 -302 -24 418 -523 10 496 500 -202 -127
6054 -127 205 739 -188 -521 -13 -158 73 -1351 -899 407 -636 -502 -56 -402 -554 -506 319 25 -206
6073 -206 -989 439 -55 -41 65 128 93 -139 -24 263 433 -116 33 -128 -362 1194 -105 643 140 -544
6093 -544 174 290 9 556 525 -129 128 53 440 400 1121 -614 -1209 1116 742 87 -464 -497 217 -295 -245
6114 -245 125 360 293 182 12 671 -82 437 13 463 583 -531 -519 -531 24 -178 876 257 299 573 104
6135 104 237 204 -77 173 151 -42 -745 668 790 48 107 610 548 -284 -152 -57 -200 146 -72 362 243
6156 243 -944 -6 221 -44 -417 -347 -505 -70 -918 -227 33 488 18 -489 252 36 -502 231 -697 -133
6176 -133 -1387 65 -964 112 316 50 30 250 -126 -316 -719 113 718 70 -130 -232 411 -185 38
6195 38 -210 305 -621 -54 -300 136 52 -669 252 210 -644 -299 660 129 -871 -821 33 189 -1126 248
6215 248 28 -5 -612 -39 535 -280 -45 -699 995 431 -817 -483 518 -209 -519 140 800 -277 -38
6234 -38 162 -165 780 127 -540 25 948 560 146 76 184 94 -602 -336 457 26 -110 468 289 738 2
6255 2 741 -8 -507 1108 1375 -209 -908 -696 152 -203 -410 -734 675 631 284 -339 -701 -53 -311 217
6275 217 378 -431 66 243 1143 347 -150 -94 363 656 64 326 816 881 563 445 63 889 -321 -237 -283
6296 -283 -34 -698 -335 566 -3 78 -780 -389 -49 -287 -658 140 363 -539 -600 32 -90 -40 -338 -818 821
6317 821 288 -389 -237 461 642 -843 -962 -213 -563 -47 33 332 359 504 192 157 -71 1211 -331 76
6337 76 217 -209 -686 156 412 -842 58 27 402 -421 204 -278 877 36 -911 50 49 722 450 279 -120
6358 -120 394 -630 413 748 114 -566 847 -190 -549 -375 698 -193 533 135 -152 795 -318 411
6376 411 1026 -136 -534 -758 471 448 716 -472 -510 596 225 -194 639 805 -118 -428 125 412 370 -153
6396 -153 740 -36 69 -749 189 -147 702 -402 -339 -611 -577 -937 101 -185 -613 -324 -389 514 -363 533
6416 533 14 187 820 -59 978 -237 -176 -589 -446 132 -1007 -392 75 266 -549 644 635 179 9 -594
6436 -594 -1054 -655 -432 -1248 522 150 -330 -1401 1221 640 514 896 -732 -418 -68 392 -499 -437 -1035
6455 -1035 -297 337 -350 97 28 -901 791 -447 20 -1017 -124 611 -395 -456 -94 447 -392 82 1123
6474 1123 123 -199 -426 176 39 -1514 -867 1097 36 680 115 556 62 -616 248 -550 363 -401
6492 -401 -90 516 101 -462 423 466 -171 383 -483 909 165 28 27 -187 233 -403 -326 272 208 546 2
6513 2 63 249 -228 101 423 706 27 -1161 269 643 289 97 -886 -159 -565 -638 -313 281 113 517 498
6534 498 362 -64 696 -52 670 -226 -720 -368 -496 97 -293 736 374 -140 -900 -447 851 -762 921
6553 921 -470 -280 -405 784 1099 -51 -164 -709 249 -473 -41 -531 -353 323 -1053 64 -71 263
6571 263 103 -5 925 -393 -126 -714 -319 -642 473 50 370 -94 -812 -242 -615 133 -419 348 610
6590 610 717 392 -126 -95 574 561 766 -315 -173 72 107 340 390 -102 -442 -280 643 -348 369 -128 249
6611 249 -1043 -83 -244 -175 310 423 1218 1079 -401 -107 583 616 114 -132 -24 -770 491 -2 541 257
6631 257 218 -847 262 791 -583 348 -73 216 -76 -474 -206 368 593 -330 -152 504 -75 252 -99
6650 -99 248 -387 -494 -268 846 -368 -669 -157 352 266 -653 -615 514 795 -81 -393 0 -88 316 32
6670 32 411 -158 -402 -115 -125 279 -232 -35 49 -72 -419 -432 -557 143 -265 -274 541 -421 1075 -205 322
6691 322 -551 -699 -979 -298 487 765 63 -1038 489 27 -564 159 693 -766 -648 -122 -281 -159 -96
6710 -96 -365 126 169 -241 794 791 -27 -224 135 -861 -131 -465 570 457 674 172 244 -86 456 9 -401
6731 -401 -736 -285 -336 170 -170 603 565 -751 244 973 195 523 324 -58 117 61 -12 68 -812 -146 -6
6752 -6 18 -755 312 667 1524 -646 -228 -339 293 -593 -230 455 427 283 246 -126 -209 918 -272 339 580
6773 580 -262 355 418 -349 -285 -1074 -512 709 -88 457 308 282 -396 -301 173 563 -785 -861 324 191 66
6794 66 240 112 -371 -351 385 186 240 109 198 357 -59 15 -494 45 -30 -335 -605 294 418 83 -85 -67
6816 -67 263 -852 387 461 401 393 22 -538 309 -957 -355 -964 404 -254 -584 998 209 100 -219 407
6836 407 -157 44 -294 -677 -371 50 -557 -192 -762 -32 555 -4 338 -49 -278 -746 -261 -169 -47 -801
6856 -801 -91 652 -356 312 225 -804 -379 1220 -368 -458 -128 889 379 135 32 155 512 331 -327
6875 -327 609 -762 -199 377 -197 184 -170 -85 -48 401 597 -773 -54 475 12 522 438 -245 498 -162
6895 -162 -133 1234 -562 1195 493 -130 -24 -289 509 -113 666 156 -436 245 257 98 726 151 -70 -212
6915 -212 14 -443 257 560 -644 264 -41 -792 571 326 797 -204 -1074 47 380 -629 183 -77
6933 -77 581 130 -126 654 1306 92 387 588 813 199 -427 -152 583 -322 -450 300 -213 -491 -473 740
6953 740 -360 -267 -497 154 -841 -348 950 -294 -591 489 -333 168 779 134 -337 -212 -389 551 89
6972 89 553 64 -413 -570 292 343 -760 143 -460 -240 -453 799 512 -201 -216 408 605 940 -427 -290
6992 -290 76 -225 -209 -79 26 683 -442 -312 -498 297 102 321 169 -366 301 -431 -252 -185 -173 237 385
7013 385 574 -612 -81 -312 238 139 -690 -465 -252 -59 -64 353 -199 416 -9 591 -786 408 557 123
7033 123 262 381 -475 166 1184 591 328 -898 -283 -399 -69 32 -383 9 484 -1021 353 565 -334
7052 -334 43 -330 -20 -247 350 230 214 -64 -165 -591 -375 142 -503 62 -87 114 404 -27 -294 19
7072 19 -341 -626 251 473 -322 108 97 -591 -273 465 -498 93 -303 -62 -685 -43 388 246 443 -920
7092 -920 -768 -327 -63 341 -962 -142 -437 -99 -268 572 374 158 215 -445 363 -649 51 225 491 -599
7112 -599 -247 -249 338 -758 -857 265 198 -247 -48 -7 -278 -128 132 73 -98 499 342 33 -3 -742 317
7133 317 -82 758 -152 426 -571 1051 110 -141 4 431 279 234 -149 713 305 50 706 -154 580 -365
7153 -365 1474 -396 -252 -208 -134 298 -292 -248 -359 -444 -54 -259 119 25 -714 -549 -73 63 -470 -535 223
7174 223 -425 -248 -148 350 743 -18 -129 -254 152 -692 55 -192 -629 144 -824 -692 -42 -51 89 -34 469
7195 469 -54 -654 -111 155 -687 -88 110 618 -120 -521 -432 82 -60 -531 459 -185 459 -406 389 1044
7215 1044 -207 -291 -240 -870 -688 251 397 -1036 -395 -454 424 449 -110 -591 1127 160 353 -3 66 204
7235 204 606 -158 -734 -86 67 -647 -266 -438 -172 -270 -774 1384 -124 507 -111 981 176 -209 592
7254 592 883 723 -217 -754 -516 458 -167 81 -587 168 163 285 410 487 591 560 273 683 203 889 -94
7275 -94 154 545 -415 13 150 -186 -333 587 -70 39 179 -253 1097 636 -446 -595 1114 102 176
7294 176 317 151 -239 167 -64 378 -629 -504 -155 522 414 -602 -696 840 237 -59 191 154 12 -189
7314 -189 -501 -454 -440 489 397 555 357 -1284 -217 102 -35 330 -158 -84 -283 -499 -507 -164 -605 -474 261
7335 261 -616 -303 -423 141 120 391 -484 596 513 -227 -58 498 142 299 -284 -250 -880 476 739 -200
7355 -200 388 -36 -1072 -194 -829 258 232 -144 -338 -607 -218 -178 80 -524 427 -679 249 -381 -372 623
7375 623 -3 991 -569 1095 -27 124 72 334 164 589 -538 245 -52 -164 236 -207 -194 126 122 284
7395 284 -38 570 -147 584 -286 445 359 -434 -419 -411 169 -448 312 175 40 -275 114 330 329 572 -347 276
7417 276 -130 157 162 -345 -244 489 63 -531 270 223 184 -650 176 212 -267 -206 131 252 -243 -49 190 -302
7439 -302 317 -300 727 -158 56 107 -250 218 -781 360 242 -160 -317 -261 -296 -630 -96 -248 -405 162
7459 162 -175 10 -91 514 446 239 538 -65 -99 -539 673 95 -577 132 646 -134 238 -43 -806 -57
$$ [...]
8191c28
##END NTUPLES=NMR FID
##END=
