##TITLE=1H_SAM_22.BBSX1_THF 2.2
 CDCl3, 8 sc, 
 6.5.2019
##JCAMPDX= 6.0         $$ Bruker NMR JCAMP-DX V2.0
##DATA TYPE= NMR FID
##DATA CLASS= NTUPLES
##ORIGIN= UXNMR, Bruker Analytische Messtechnik GmbH
##OWNER= root
$$ XWIN-NMR		Version 3.5
$$ Mon May  6 14:03:17 2019 Russian Standard Time (UT+4h)  she@DPX200
##.OBSERVE FREQUENCY= 200.1315
##.OBSERVE NUCLEUS= ^1H
##.DELAY= (6, 6)
##.ACQUISITION MODE= SIMULTANEOUS
##.ACQUISITION SCHEME= undefined
##.AVERAGES= 8
##.DIGITISER RES= 18
##SPECTROMETER/DATA SYSTEM= spect
##.PULSE SEQUENCE= zg30
##.SOLVENT NAME= CDCl3
##.SHIFT REFERENCE= (INTERNAL, CDCl3, 0, 15.7039)
##AUDIT TRAIL= $$ (NUMBER, WHEN, WHO, WHERE, WHAT)
$$ ##TITLE= Audit trail, XWIN-NMR		Version 3.5
$$ ##JCAMPDX= 5.01
$$ ##ORIGIN= Bruker BioSpin GmbH
$$ ##OWNER= she
$$ F:/spectra/data/she/nmr/H-F/1/audita.txt
$$ ##AUDIT TRAIL=  $$ (NUMBER, WHEN, WHO, WHERE, WHAT)
(   1,<2019-05-06 14:00:49.68 +0400>,<she>,<DPX200>,
      <created by zg, POWCHK disabled, PULCHK disabled
       configuration hash MD5:
       00 E9 B6 7A A2 85 ED C7 34 08 36 98 17 FE 4E 26
       data hash MD5: 16K
       A0 B1 53 26 A2 6D 55 08 63 B2 05 C0 B9 45 81 C7>)
$$ ##END=
$$ 
$$ hash MD5
$$ 88 AD 0E B5 44 A0 7F 68 15 35 4C 63 8C 76 E8 30
##$RELAX= 
##$RELAX= 
##$RELAX= 
##$RELAX= 
##$RELAX= 
##$RELAX= 
$$ Bruker specific parameters
$$ --------------------------
##$DU= <F:/spectra>
##$EXPNO= 1
##$NAME= <H-F>
##$PROCNO= 1
##$TYPE= <nmr>
##$USER= <she>
##$AMP= (0..31)
100 100 100 100 100 100 100 100 100 100 100 100 100 100 100 100 100 100 
100 100 100 100 100 100 100 100 100 100 100 100 100 100 
##$AQSEQ= 0
##$AQ_mod= 1
##$AUNM= <au_zg>
##$AUTOPOS= <>
##$BF1= 200.13
##$BF2= 200.13
##$BF3= 200.13
##$BF4= 200.13
##$BF5= 200.13
##$BF6= 200.13
##$BF7= 200.13
##$BF8= 200.13
##$BYTORDA= 1
##$CFDGTYP= 0
##$CFRGTYP= 5
##$CHEMSTR= <none>
##$CNST= (0..31)
1 1 145 1 1 1 1 1 1 1 1 1 1 1 1 1 1 1 1 1 1 1 1 1 1 1 1 1 1 1 1 1 
##$CPDPRG= <>
##$CPDPRG1= <>
##$CPDPRG2= <>
##$CPDPRG3= <>
##$CPDPRG4= <mlev>
##$CPDPRG5= <mlev>
##$CPDPRG6= <mlev>
##$CPDPRG7= <mlev>
##$CPDPRG8= <mlev>
##$CPDPRGB= <>
##$CPDPRGT= <>
##$D= (0..31)
0 1.2 0 0 0 0 0 0 0 0 0 0.03 0 0 0 0 0 0 0 0 0 0 0 0 0 0 0 0 0 0 0 0 
##$DATE= 1557136849
##$DBL= (0..7)
120 120 120 120 120 120 120 120 
##$DBP= (0..7)
150 150 150 150 150 150 150 150 
##$DBP07= 0
##$DBPNAM0= <>
##$DBPNAM1= <>
##$DBPNAM2= <>
##$DBPNAM3= <>
##$DBPNAM4= <>
##$DBPNAM5= <>
##$DBPNAM6= <>
##$DBPNAM7= <>
##$DBPOAL= (0..7)
0.5 0.5 0.5 0.5 0.5 0.5 0.5 0.5 
##$DBPOFFS= (0..7)
0 0 0 0 0 0 0 0 
##$DE= 6
##$DECBNUC= <off>
##$DECIM= 24
##$DECNUC= <off>
##$DECSTAT= 4
##$DIGMOD= 1
##$DIGTYP= 9
##$DL= (0..7)
0 120 120 120 120 120 120 120 
##$DP= (0..7)
150 150 150 150 150 150 150 150 
##$DP07= 0
##$DPNAME0= <>
##$DPNAME1= <>
##$DPNAME2= <>
##$DPNAME3= <>
##$DPNAME4= <>
##$DPNAME5= <>
##$DPNAME6= <>
##$DPNAME7= <>
##$DPOAL= (0..7)
0.5 0.5 0.5 0.5 0.5 0.5 0.5 0.5 
##$DPOFFS= (0..7)
0 0 0 0 0 0 0 0 
##$DQDMODE= 0
##$DR= 18
##$DS= 0
##$DSLIST= <SSSSSSSSSSSSSSS>
$$ [...]
##$SUBNAM2= <"">
##$SUBNAM3= <"">
##$SUBNAM4= <"">
##$SUBNAM5= <"">
##$SUBNAM6= <"">
##$SUBNAM7= <"">
##$SUBNAM8= <"">
##$SUBNAM9= <"">
##$SW= 24.9337058887773
##$SWIBOX= (0..15)
0 0 2 0 0 0 0 0 0 0 0 0 0 0 0 0 
##$SW_h= 4990.01996007984
##$TD= 16384
##$TD0= 1
##$TE= 0
##$TE2= 300
##$TE3= 300
##$TEG= 300
##$TL= (0..7)
0 120 120 120 120 120 120 120 
##$TP= (0..7)
150 150 150 150 150 150 150 150 
##$TP07= 0
##$TPNAME0= <>
##$TPNAME1= <>
##$TPNAME2= <>
##$TPNAME3= <>
##$TPNAME4= <>
##$TPNAME5= <>
##$TPNAME6= <>
##$TPNAME7= <>
##$TPOAL= (0..7)
0.5 0.5 0.5 0.5 0.5 0.5 0.5 0.5 
##$TPOFFS= (0..7)
0 0 0 0 0 0 0 0 
##$TUNHIN= 0
##$TUNHOUT= 0
##$TUNXOUT= 0
##$USERA1= <user>
##$USERA2= <user>
##$USERA3= <user>
##$USERA4= <user>
##$USERA5= <user>
##$V9= 5
##$VALIST= <valist>
##$VCLIST= <CCCCCCCCCCCCCCC>
##$VD= 0
##$VDLIST= <DDDDDDDDDDDDDDD>
##$VPLIST= <PPPPPPPPPPPPPPP>
##$VTLIST= <TTTTTTTTTTTTTTT>
##$WBST= 1024
##$WBSW= 4
##$XGAIN= (0..3)
0 0 0 0 
##$XL= 0
##$YL= 0
##$YMAX_a= 353169
##$YMIN_a= -388014
##$ZGOPTNS= <>
##$ZL1= 120
##$ZL2= 120
##$ZL3= 120
##$ZL4= 120
##$ABSF1= 10
##$ABSF2= 0
##$ABSG= 5
##$ABSL= 3
##$ALPHA= 0
##$AQORDER= 0
##$ASSFAC= 0
##$ASSFACI= 0
##$ASSFACX= 0
##$ASSWID= 0
##$AUNMP= <proc_1d>
##$AZFE= 0.1
##$AZFW= 0.1
##$BCFW= 1
##$BC_mod= 2
##$BYTORDP= 1
##$COROFFS= 0
##$CY= 11.3945322036743
##$DATMOD= 1
##$DC= 2
##$DFILT= <>
##$DTYPP= 0
##$F1P= 18.9103706918063
##$F2P= -1.10871071338519
##$FCOR= 0.5
##$FTSIZE= 0
##$FT_mod= 4
##$GAMMA= 1
##$GB= 0.15
##$INTBC= 1
##$INTSCL= 1
##$ISEN= 128
##$LB= 0.24
##$LEV0= 0
##$LPBIN= 0
##$MAXI= 10000
##$MC2= 0
##$MEAN= 0
##$ME_mod= 0
##$MI= 1.114404
##$NCOEF= 0
##$NC_proc= 0
##$NLEV= 6
##$NOISF1= 3.799351
##$NOISF2= 2.8
##$NSP= 1
##$NTH_PI= 0
##$NZP= 0
##$OFFSET= 15.70392
##$PC= 1
##$PHC0= -8855.938
##$PHC1= 18.00026
##$PH_mod= 1
##$PKNL= yes
##$PPARMOD= 0
##$PSCAL= 0
##$PSIGN= 0
##$REVERSE= no
##$SF= 200.130013532006
##$SI= 16384
##$SIGF1= 3
##$SIGF2= 2
##$SINO= 400
##$SIOLD= 16384
##$SREGLST= <1H.CDCl3>
##$SSB= 0
##$STSI= 0
##$STSR= 0
##$SW_p= 3612.71676300578
##$SYMM= 0
##$S_DEV= 0
##$TDeff= 0
##$TDoff= 0
##$TI= <>
##$TILT= no
##$TM1= 0
##$TM2= 0
##$TOPLEV= 0
##$USERP1= <user>
##$USERP2= <user>
##$USERP3= <user>
##$USERP4= <user>
##$USERP5= <user>
##$WDW= 1
##$XDIM= 8192
##$YMAX_p= 0
##$YMIN_p= 0
$$ End of Bruker specific parameters
$$ ---------------------------------
##NTUPLES= NMR FID
##VAR_NAME=  TIME,          FID/REAL,        FID/IMAG
##SYMBOL=    X,             R,               I
##VAR_TYPE=  INDEPENDENT,   DEPENDENT,       DEPENDENT
##VAR_FORM=  AFFN,          ASDF,            ASDF
##VAR_DIM=   8192,          8192,            8192
##UNITS=     SECONDS,       ARBITRARY UNITS, ARBITRARY UNITS
##FACTOR=    0.0002004,     1,               1
##FIRST=     0,             0,               0
##LAST=      1.6414764,     0,               0
##MIN=       0,             -388014,         0
##MAX=       1.6414764,     353169,          0
$$ Real data points
##PAGE= N=1
##DATA TABLE= (X++(R..R)), XYDATA
0@%%%%Qj6J6j6K4l2L4m2N6p2Q8j08J32j60J91k23K64l09L54m09M74n45O22p08
28c77Q05r11J026j153J297j454J622j809K016k240K483k755L056l384L746m146
44b178M594n095N653o287P014p850Q826r988J1399j3151J5391j8380K2593k9017
58a6476M0144o4778K14039j02785l13529M01457J95097l30508k68105L20819K04534
69B79909k96816k46755K71439J98192k49570k09591K39263J80938k20829j84397
79b38217K18332J77689j91479j75383J86180J70331j67272j75474J54660J72342
89A31709j38363j79719J20817J72457j15818j83404J04396J87074r3294j94018
99a88163Q7888K03942p5306k05962Q1182K27886o0231k25414O3206K42538m7058
$$ plain form
0 0 0 0 0 0 8 -8 8 -8 16 -16 18 -24 32 -40 48 -60 72 -88 103 -120 144 -165 189 -220 254 -291 331 -377
28 -377 428 -483 543 -610 687 -767 855 -954 1062 -1178 1305 -1450 1606 -1778 1968 -2178
44 -2178 2416 -2679 2974 -3313 3701 -4149 4677 -5311 6088 -7063 8328 -10052 12541 -16476
58 -16476 23668 -41110 172929 70144 -243385 158072 353169 22661 -245444 75375 279909
69 279909 -16907 -263662 7777 205969 -43601 -253192 -13929 167009 -53820 -238217
79 -238217 -19885 157804 -33675 -209058 -22878 147453 -19819 -195293 -40633 131709
89 131709 -6654 -186373 -65556 106901 -8917 -192321 -87925 99149 5855 -188163
99 -188163 -100275 103667 28361 -177601 -96419 131467 71236 -154178 -90972 151566 104508
110A04508k35808N4936K50478m6566k51822M5922K54678m5061k53372M8217K51375
121A77485n8555k59152N8038K58741o3033k60966O2049K56632o7942k59773O5043
132i1433K58193o1661k54828N5399K45941n4012k40536M8605K33156m4741k26642
143a32559L6284K14148l3176k07872K6921K00230k0492j97267Q995J89602K78
154H5092j83911q978J79807K0817j75901l1552J71742M2288j64108m7455J64629
165E2470N5332j63400o1439J65566P1186j63654p5121J67633Q0495j72281q5954
176a29167J78502R5257j79833j00271J80734J04005j84023j06069J87221J10357
186A56713j87780j13141J85455J12388j85318j11298J86472J10313j86435j11855
$$ plain form
110 104508 -131300 -76364 174114 127548 -124274 -78352 176326 131265 -122107 -73890 177485
121 177485 118930 -140222 -82184 176557 113524 -147442 -85393 171239 103297 -156476 -91433
132 -91433 166760 105099 -149729 -94330 151611 97599 -142937 -94332 138824 94083 -132559
143 -132559 -96275 117873 84697 -123175 -96254 103976 83484 -113783 -104788 84814 85092
154 85092 -98819 -107797 72010 92827 -83074 -114626 57116 99404 -64704 -112159 52470
165 52470 107802 -55598 -117037 48529 119715 -43939 -119060 48573 129068 -43213 -129167
176 -129167 49335 144592 -35241 -135512 45222 149227 -34796 -140865 46356 156713
186 156713 -31067 -144208 41247 153635 -31683 -142981 43491 153804 -32631 -144486
196a44486J83338J10818j80546j08957J77705J07800j74977j08925J68481J09546
206A39797j60931j08164J53361J06752j47003j08222J38358J08222j30559j08684
216a17073J22028J07403j17130j10965J09433J13784j01609j17523R3801J18797
226A00946q8884j21795Q3604J27509p7020j31724P1097J35830o6264j37515O3725
237d0491J42537o0847j47180N6429J50596n4578j52008N3268J55614n3674j59568
248a09902N0968J62604m8698j63561M7962J64420m7231j65450M6703J67353m4159
259F1009j65807M2526J63702m1402j62104M0789J60918l8025j59646L4944J56179
270I3083l3289j54247L1152J52469k7820j50215K3736J47173j9616j43632J6519
$$ plain form
196 -144486 38852 149670 -30876 -139833 37872 145672 -29305 -138230 30251 139797
206 139797 -21134 -129298 24063 130815 -16188 -124410 13948 122170 -8389 -117073
216 -117073 4955 112358 -4772 -115737 -6304 107480 5871 -111652 -17851 100946
226 100946 12062 -109733 -26129 101380 24360 -107364 -36267 99563 33299 -104216 -40491
237 -40491 102046 41199 -105981 -49552 101044 46466 -105542 -52274 103340 49666 -109902
248 -109902 -58934 103670 54972 -108589 -60627 103793 56562 -108888 -62185 105168 61009
259 61009 -104798 -62272 101430 60028 -102076 -61287 99631 61606 -98040 -63096 93083
270 93083 59794 -94453 -63301 89168 61348 -88867 -65131 82042 62426 -81206 -64687
281f4687J42053j1581j38894O799J37279j193j33739k706J32290P505j31111j2452
293g0437J30004J7415j28290k1847J27870K5521j28296k9919J27917L4957j27179
304d2284l9752J26583M3042j26812m5927J26628N0040j26749n3254J26319N4972
315I2806j26440n7085J25979N9327j26396o1482J25289O2798j24003o4509J22695
326B8979O5171j21751o7240J20249O8228j17330p0173J15934P0933j14010p1701
337i2711J11949P2467j08726p3334J05795P4774j03352p5461J00033P6782r6678
348h462p8034R3463P9608r0323q1912Q7572Q3338q3743q5667Q0506Q6309p7692
360D963q7929P4849Q9605p2013r1918O8354R3186o5665r4779O2444R6826o0574
$$ plain form
281 -64687 77366 65785 -73109 -66310 70969 69776 -63963 -66669 65621 73126 -57985 -70437
293 -70437 59567 76982 -51308 -73155 54715 80236 -48060 -77979 49938 84895 -42284
304 -42284 -82036 44547 87589 -39223 -85150 41478 91518 -35231 -88485 37834 92806
315 92806 -33634 -90719 35260 94587 -31809 -93291 31998 94796 -29207 -93716 28979
326 28979 94150 -27601 -94841 25408 93636 -23694 -93867 22067 93000 -21010 -92711
337 -92711 19238 91705 -17021 -90355 15440 90214 -13138 -88599 11434 88216 -8462
348 -8462 -86496 6967 86575 -3748 -85660 1912 85250 1507 -84160 -3654 82655 4963
360 4963 -82966 -8117 81488 9475 -82443 -14089 79097 13432 -81347 -18903 77923 17349
372A7349r8875N7882J00575n5362j02354N3316J03272n1525j04758M9714J06007
383G5241m7074j07490M5012J08190m3044j08676M1099J09664l9494j09606L7277
394c8901J10622l5183j10853L4023J11057l1907j10514L0210J10912k8174j10437
405f9145K6432J09673k3159j09414K1667J09051j9394j08352J6721J08108j3852
416D8336j07613J1899J07110r362j06086P111J05454m855j04109J476J03749J477
428E4587j02382l925J01873O691j01216r713J00934J2413j00276j5108R9800J7530
440F1208r9012k0010R8585K2590r8012k5529R7074K8037r6338l0138R5455L2775
452F6685r5081l4945R4317L6563r3852l8818R3057M0466r2618m1979R1490M3544
$$ plain form
372 17349 -81526 -23644 76931 21569 -80785 -27469 75803 24278 -80480 -30766 75241
383 75241 28167 -79323 -34311 73879 30835 -77841 -36742 72922 33428 -76178 -38901
394 -38901 71721 36538 -74315 -40292 70765 38858 -71656 -41446 69466 41292 -69145
405 -69145 -42713 66960 43801 -65613 -43946 65105 45711 -62641 -45920 62188 48336
416 48336 -59277 -47378 59732 50370 -55716 -48605 56849 51994 -52115 -50639 53110 54587
428 54587 -47795 -51720 50153 56844 -44372 -54085 46849 59262 -41014 -56122 43678 61208
440 61208 -37804 -57814 40771 63361 -34651 -60180 36894 64931 -31407 -61545 33910 66685
452 66685 -28396 -63341 30976 67539 -26313 -65131 27926 68392 -24226 -66205 25285 68829
464F8829r1266m5032Q9834M6529q8846m8264Q7177M9303q5538n1164Q4294N2219
476F8075q2992n3610Q1091N4499p9542n5716P7457N6301p5653n7419P3603N9194
488F5288p1763o0804O9141O2135o6994o3790O5233O4521o2707o6474O0394O7817
500F1997n8109o8919N6027O9496n3837p1332N2531P2583n0388p4062M8649P5600
512F0236m7242p7186M5829P8470m3603p9822M1821Q1386m0257q2035L8523Q2789
524E8909l6635q2730L5627Q2636l3954q2981L2927Q3954l1704q4311L0596Q4050
536E6384k8506q4322K7641Q5013k5623q5035K3325Q4706k1330q3225J9152Q3115
548E1295j7224q2347J5170Q1786j2479q0670J0479Q0427r125p9943P255P9977
$$ plain form
464 68829 -22437 -67469 22365 68894 -19952 -68216 18961 68264 -17274 -68438 15856 68075
476 68075 -14917 -68527 12564 67063 -12479 -68195 9262 65563 -10090 -67509 6094 65288
488 65288 -6475 -67279 1862 63997 -2997 -66787 -1554 62967 260 -66214 -5820 61997
500 61997 3888 -65031 -9004 60492 6655 -64677 -12146 60437 10049 -64013 -15364 60236
512 60236 12994 -64192 -18363 60107 16504 -63318 -21497 59889 19632 -62403 -23880 58909
524 58909 22274 -60456 -24829 57807 23853 -59128 -26201 57753 26049 -58262 -27666 56384
536 56384 27878 -56444 -28803 56210 30587 -54448 -31123 53583 32253 -50972 -31820 51295
548 51295 34071 -48276 -33106 48680 36201 -44469 -33990 46437 37312 -42631 -35376 44601
560D4601m120q0148J560P9732J011p9553l566P9438O951p9589r384P8752J1725
573D7410p7918j3810P8024J5149p8212j7125P8235J8657p8936j9617P9244K1043
585E2144p9714k3418P9464K5108p9019k6338P8284K7358p8383k8463P6883L0200
597E4106p5694l0348P3859L0394p3820l0780P2969L1724p1716l2832P0099L3071
609E1032o9438l3953O8012L6205o5841l8311O2867L9325o0700l9950N8629M1219
621D9096n6836m3063N4245M4150n1829m4985N0461M6609n0070m8697M8085N1620
633D8786m6600n2914M4636N4827m4072n7178M3309N8992m1091o0599L9940O0562
645D8598l8897o1988L8831O3360l7837o4025L6943O4352l7099o4871L8033O5902
$$ plain form
560 44601 40481 -39667 -38107 41625 42636 -36917 -40483 38955 45906 -33683 -43067 35685 47410
573 47410 -30508 -44318 33706 48855 -29357 -46482 31753 50410 -28526 -48143 31101 52144
585 52144 -27570 -50988 28476 53584 -25435 -51773 26511 53869 -24514 -52977 23906 54106
597 54106 -21588 -51936 21923 52317 -21503 -52283 20686 52410 -19306 -52138 17961 51032
609 51032 -18406 -52359 15653 51858 -13983 -52294 10573 49898 -10802 -50752 7877 49096
621 49096 -7740 -50803 3442 47592 -4237 -49222 1239 47848 -2222 -50919 -2834 48786
633 48786 2186 -50728 -6092 48735 4663 -52515 -9206 49786 8695 -51904 -11964 48598
645 48598 9701 -52287 -13456 49904 12067 -51958 -15015 49337 12238 -52633 -14600 51302
657E1302l7424o6739L6023O6903l5271o5814L4412O6724l3276o6728L1561O5701
669D7374k9660o3864K8670O3350k7516o3420K6103O2922k3318o1465K1887O0783
681D1846k0988o0969J8999O1095j5039o0524J1326O0669r180o0443O849O0874
693C4515l166o1188O97N9651J559n9443l144O1322M617o1842p612O2793Q883o2884
707b5242j0145O4168J1653o5991j3963O6130J6017o5798j6403O6015J6584o7338
719b4313j7260O6646J8290o5687j8085O4520J7187o5246j7140O5510J8205o4513
731b1886j8600O2985J8114o2703j8944O2533K0506o1100k1624N7338K1950n4908
743a6339k1905N3332K3193n2029k5035M9029K5680m6754k6167M6385K7034m5654
$$ plain form
657 51302 13878 -52861 -16838 50065 14794 -51020 -16608 50116 16840 -49888 -18327 47374
669 47374 17714 -46150 -17480 45870 18354 -45066 -18963 43959 20641 -40824 -18937 41846
681 41846 20858 -40111 -21112 39983 24944 -35580 -24254 36415 27235 -33208 -26359 34515
693 34515 31349 -29839 -29142 30509 32068 -27375 -30519 30803 35420 -26422 -34034 28759 37642 -25242
707 -25242 -35387 28781 40434 -25557 -39520 26610 42627 -23171 -39574 26441 43025 -24313
719 -24313 -41573 25073 43363 -22324 -40409 24111 41298 -23948 -41088 24422 42627 -21886
731 -21886 -40486 22499 40613 -22090 -41034 21499 42005 -19095 -40719 16619 38569 -16339
743 -16339 -38244 15088 38281 -13748 -38783 10246 35926 -10828 -36995 9390 36424 -9230
755i230l0439M3934L2906m1591l4168L9332L6599l9354l9085L7356M2006l4701
767C565m3608L3475M3823l3304m5322L3718M7274l3141m8558L2764M8940l3337
779F289n0014L4675N2382l4515n3710L3066N3853l2444n3382L3308N3591l2507
791A0592n4229L1403N3209l0691n0836L1523M9997l1862n0174L0861N0233k9105
803A0921m8662K8161M7752k7178m8264K5530M8992k2512m7569J9186M6853j7988
815A5222m6086J6241M6326j3153m5796J0869M4781r365m5032Q338M6018n159m8204
828b5000L222M7920n05m9054o40N0388K737n1782n754N1751P940n1469q362N1819
842B3211Q591n3553r318N3860J0121n3836j0105N4547R218n5713j0366N7134J1044
$$ plain form
755 -9230 -39669 4265 37171 -4420 -38588 744 37343 -2011 -41096 -3740 38266 3565
767 3565 -40043 -6568 37255 3951 -41371 -7653 39621 6480 -42078 -9314 39626 6289
779 6289 -43725 -9050 43332 8817 -44893 -11827 42026 9582 -43800 -10492 43099 10592
791 10592 -43637 -12234 40975 10284 -40552 -9029 40968 9106 -41068 -10207 40026 10921
803 10921 -37741 -9580 38172 10994 -37270 -11740 37252 14740 -32829 -13643 33210 15222
815 15222 -30864 -14623 31703 18550 -27246 -16377 28404 19039 -25993 -17655 28363 23204 -25000
828 -25000 -21778 26142 25637 -23417 -24057 26331 29068 -22714 -28468 23283 31223 -20246 -28608 23211
842 23211 31802 -21751 -31069 22791 32912 -20924 -31029 23518 32736 -22977 -33343 23791 34835
855C4835n6388j1904N5386J1497n5377j1608N5065J2101n3754j2325N1158J1910
867C0596n0258j0854M9334J1790m8843j3341M7291J3275m5361j3741M4760J4759
879B9407m3729j7343M1759J8913l9201k0037L7454K1394l6838k3353L5160K5446
891B9032l3571k6180L2441K7158l2506k8819L1931L1671l1281l3462L0787L4302
903C1503l0700l5970L0935L7528k9831l9031K8617M0069k8685m0041K9220M1005
915C4619k9510m1547K9315M1671k9030m1039K9740M1044k9945m1647K9079M2077
927C4827k7548m1334K7475M0333k6819m0285K5981L9998k4001l8823K2641L7840
939C0285k1841l7603K1326L7991j9453l7508J7302L6838j5828l6981J4885L7486
$$ plain form
855 34835 -21553 -33457 21929 33426 -21951 -33559 21506 33607 -20147 -32472 18686 30596
867 30596 -19662 -30516 18818 30608 -18235 -31576 15715 28990 -16371 -30112 14648 29407
879 29407 -14322 -31665 10094 29007 -10194 -30231 7223 28617 -8221 -31574 3586 29032
891 29032 -4539 -30719 1722 28880 -3626 -32445 -514 31157 -124 -33586 -2799 31503
903 31503 803 -35167 -4232 33296 3465 -35566 -6949 33120 4435 -35606 -6386 34619
915 34619 5109 -36438 -7123 34548 5518 -35521 -5781 35263 5318 -36329 -7250 34827
927 34827 7279 -34055 -6580 33753 6934 -33351 -7370 32628 8627 -30196 -7555 30285
939 30285 8444 -29159 -7833 30158 10705 -26803 -9501 27337 11509 -25472 -10587 26899
951B6899j2591l7853J0296L7507q414l7410P617L8193o018l9153L863L9411k276
964B0071l9347J676L9753l72m1274p71M1740K294m2042k999M2300L656m3935l886
978b3136M4286M658m3927n838M3613N746m3976o027M4264O563m4030p614M3763
991A8345P114m3426o956M3175P146m2643q068M1490Q277m0474q432L9690Q899
1004B4137l9479r902L8154J0306l6686j1222L6047J1396l4778j3028L4200J3566
1016B2711l2491j5038L2111J5041l0940j6819L0274J8159k9252j9242K8665K0088
1028B3267k8419k1351K7897K3336k7866k3814K6763K4743k6748k5186K6595K7021
1040B6238k6801k7817K6409K8229k5655k8617K5752K9218k5403l0242K5568L0547
$$ plain form
951 26899 14308 -23545 -13249 24258 15844 -21566 -13949 24244 18226 -20927 -17064 22347 20071
964 20071 -19276 -17600 22153 21781 -19493 -20264 21476 23770 -18272 -21271 21029 24685 -19250 -23136
978 -23136 21150 25808 -18119 -23957 19656 25402 -18574 -24601 19663 26226 -17804 -25418 18345
991 18345 25459 -17967 -24923 18252 25398 -17245 -25313 16177 24454 -16020 -24452 15238 24137
1004 24137 -15342 -25244 12910 23216 -13470 -24692 11355 22751 -12027 -25055 9145 22711
1016 22711 -9780 -24818 7293 22334 -8606 -25425 4849 23008 -6244 -25486 3179 23267
1028 23267 -5152 -26503 1394 24730 -3136 -26950 -187 24556 -2192 -27378 -783 26238
1040 26238 -563 -28380 -1971 26258 603 -28014 -2262 26956 1553 -28689 -3121 27426
1052B7426k5090l0407K5372L0201k5026l0180K4517L0449k3593l0528K3698L0155
1064B6994k2683l0315K1880L0383k0693l0113J9664L0653j9870k9606J8498K9955
1076B4747j7206k9970J6122L0260j5611k9632J4036L0213j3070l0325J1699L0290
1088B1553j0002l0955R634L1092q518l1831P913L1426n981l2122N222L2027m542
1101A4916l2660L874L2887k528l3688K253L3627j400l4070O3L5040k32l5014k60
1115a7192L4638J116l5167j075L4918J322l5017j825L4782K568l4896l065L4489
1128A5596L094l4287l825L4512L666l3830m515L3464M887l3147n419L2446N575
1141A8217l1435o294L0652P119l0345q202K9920Q967k9408r504K8682J0031k7782
$$ plain form
1052 27426 2336 -28071 -2699 27502 2476 -27704 -3187 27262 3669 -26859 -3161 26994
1064 26994 4311 -26004 -4124 26259 5566 -24547 -4883 25770 5900 -23706 -5208 24747
1076 24747 7541 -22429 -6307 23953 8342 -21290 -7254 22959 9889 -20436 -8737 21553
1088 21553 11551 -19404 -9770 21322 12804 -19027 -11114 20312 14331 -17791 -12569 19458 14916
1101 14916 -17744 -13870 19017 16489 -17199 -14946 18681 17281 -16789 -16726 18314 18082 -16932 -17192
1115 -17192 17446 18562 -16605 -17680 17238 18560 -16457 -18282 16500 19068 -15828 -18893 15596
1128 15596 18690 -15597 -19422 15090 18756 -15074 -19589 13875 18762 -14385 -19804 12642 18217
1141 18217 -13218 -19512 11140 18259 -12086 -20288 9632 18599 -10809 -20313 8369 18400 -9382
1154i382j1181K7370J1927k6837j2621K6370J3580k6329j4179K5796J5314k5543
1166e715j5824K4703J7437k4722j8113K4482J8630k4022j9369K3589K0112k3275
1178b087k0654K3671K0886k3230k1388K2804K1927k2595k1862K2515K2896k2681
1190B02k2673K1977K3574k1804k3584K1352K3828k0964k3367K0075K3448j9321
1202B743k3316J8996K3337j8316k3414J7859K3700j7281k3868J6515K3892j5732
1214E115k4266J5054K4678j3832k4862J2804K4803j1782k4807J0788K4619r542
1226H770k5167R332K4919q145k5767P795K5928p329k6231O247K6949n705k7639
1239a6043N169K7633m113k7976L071K8431k771k8217J633K8754j647k9135J395
$$ plain form
1154 -9382 -20563 6807 18734 -8103 -20724 5646 19226 -7103 -21282 4514 19828 -5715
1166 -5715 -21539 3164 20601 -4121 -22234 2248 20878 -3144 -22513 1076 21188 -2087
1178 -2087 -22741 930 21816 -1414 -22802 2 21929 -666 -22528 -13 22883 202
1190 202 -22471 -494 23080 1276 -22308 -956 22872 1908 -21459 -1384 22064 2743
1202 2743 -20573 -1577 21760 3444 -19970 -2111 21589 4308 -19560 -3045 20847 5115
1214 5115 -19151 -4097 20581 6749 -18113 -5309 19494 7712 -17095 -6307 18312 8770
1226 8770 -16397 -7065 17854 9709 -16058 -8263 17665 10336 -15895 -9648 17301 11596 -16043
1239 -16043 -10874 16759 12646 -15330 -12259 16172 13401 -14816 -13183 15571 13924 -15211 -13816
1252a3816K9251j267k9200R45K9213j260k9105O41K9342m75k9421l86K9272Q33
1266A4567k9132j221K8686J734k8165k458K7463K849k6771k948K6261L013k6287
1279a2409l424K5754M147k5533m497K5025N494k4902o730K5083P150k3855q634
1292a7331K3450R171k2495r827K2103J0857k1937j1507K1630J1741k1191j2092
1304a7428K1268J3012k1606j4219K1976J5163k1778j5693K2000J6274k1548j7092
1316a9671K1411J7712k0911j7679K0710J7614k0505j7655K0778J7639k0235j7459
1328a8251J9794J7990k0754j7579K0579J8296j9966j8539J9054J8624j8410j8020
1340a7182J7565J8333j6881j8485J5951J8231j4778j7709J4415J7566j4168j8056
$$ plain form
1252 -13816 15435 14168 -15032 -14087 15126 13866 -15239 -14598 14744 14269 -15152 -15538 13734 14567
1266 14567 -14565 -15786 12900 14634 -13531 -15989 11474 14323 -12448 -15396 10865 13878 -12409
1279 -12409 -15833 9921 14068 -11465 -15962 9063 14557 -10345 -17075 8008 15158 -8697 -17331
1292 -17331 6119 15290 -7205 -17032 5071 15928 -6009 -17516 4114 15855 -5336 -17428
1304 -17428 3840 16852 -4754 -18973 3003 18166 -3612 -19305 2695 18969 -2579 -19671
1316 -19671 1740 19452 -1459 -19138 1572 19186 -1319 -18974 1804 19443 -792 -18251
1328 -18251 1543 19533 -1221 -18800 1779 20075 109 -18430 624 19248 838 -17182
1340 -17182 383 18716 1835 -16650 -699 17532 2754 -14955 -540 17026 2858 -15198
1352a5198J3670J8186j2495j8824J2082J9124j1711j9645J0264K0701q925k1527
1364a4298Q062K1807p727k1531O459K2404o006k2603N389K2684n749k3247N946
1377h410K3916n692k5091N055K5172m615k5443M154K6134l845k6610L388K6100
1390A4213l102k6034L610K5222l870k4916L290K5067l541k3946K807K4290l488
1403I602k4270L129K4023j837k3980J282K2680l91k2837M15K2297N46k1350j600
1417a2291K0515J608j9427k123J9355L301j9938l949J9552N015j9587n537J9839
1430F333O565k0039q123K0111R104j9245r568J9395J0145j9766j0994J9941J1713
1443A5572j9025j2444J9934J1822k0272j1829K0269J3103k0261j3475K0621J3140
$$ plain form
1352 -15198 -1528 16658 4163 -14661 -2579 16545 4834 -14811 -4547 16154 7229 -14298
1364 -14298 -6236 15571 7844 -13687 -7228 15176 9170 -13433 -8044 14640 8891 -14356 -8410
1377 -8410 15506 9814 -15277 -10222 14950 10335 -15108 -10954 15180 11335 -15275 -11887 14213
1390 14213 11111 -14923 -11313 13909 10039 -14877 -11587 13480 9939 -14007 -11200 13090 9602
1403 9602 -14668 -11539 12484 10647 -13333 -12051 10629 10238 -12599 -12184 10113 10659 -10691 -12291
1417 -12291 8224 9832 -9595 -11718 7637 10938 -9000 -12949 6603 11618 -7969 -13506 6333
1430 6333 12898 -7141 -15264 4847 13951 -5294 -14862 4533 14678 -5088 -16082 3859 15572
1443 15572 -3453 -15897 4037 15859 -4413 -16242 4027 17130 -3131 -16606 4015 17155
1455A7155k0405j3705K0785J4265k0486j4274J9754J3642j8918j3541J9335J3433
1467A7040j8797j3599J8013J3417j7431j2799J7256J2952j7414j3113J6110J3713
1479A5348j5041j3205J4041J3498j3600j3967J2317J4554j0692j5303J0441J4576
1491A2967r674j5773R863J6190q940j6410Q061J7018q287j7575P908J8454p512
1504F290j9609O747K0017o205k0452O580K0880o641k1448O154K0938n455k1411
1517a3615O040K1374o278k2090O154K1795n660k1672N940K1562o294k2107N890
1530h961K2115n398k1687N234K0713n022k0644M980K0332m237j9492L390J8720
1543A0043l309j7914K958J8023k179j7962Q10J7773n37j6891MJ7067J090j7422
$$ plain form
1455 17155 -3250 -16955 3830 18095 -2391 -16665 3089 16731 -2187 -15728 3607 17040
1467 17040 -1757 -15356 2657 16074 -1357 -14156 3100 16052 -1362 -14475 1635 15348
1479 15348 307 -12898 1143 14641 1041 -12926 -609 13945 3253 -12050 -1609 12967
1491 12967 3293 -12480 -2617 13573 4633 -11777 -3716 13302 5015 -12560 -4652 13802 6290
1504 6290 -13319 -6572 13445 7240 -13212 -6632 14248 7607 -13841 -7687 13251 7796 -13615
1517 -13615 -7575 13799 7521 -14569 -8415 13380 7720 -13952 -8012 13550 7256 -14851 -8961
1530 -8961 13154 7756 -13931 -8697 12016 6994 -13650 -8670 11662 7425 -12067 -8677 10043
1543 10043 6734 -11180 -8222 9801 7622 -10340 -9530 8243 7706 -9185 -9181 7886 8976 -8446
1557h446k482J6948L651j6523l945J6668M695j7310n343J6978O512j6509p037
1570a2143J7347O516j7551p412J8313Q729j8525q984J8328R021j8657q719J8720
1583D983R753j8798r955J8236R835j8439r108J8972R781j9352r720J8687R539
1596A4414j8122q900J7987Q693j8189q912J7458R062j5852r387J5663R229j5598
1609b454r486J4925R876j3864r636J2932R833j3013j0158J2585J0790j1385j1734
1622a0789J0566J1669j0071j2269J0151J2806r499j3586Q381J4107q136j4615
1634a1285Q492J5146q148j6298P933J5911p361j5884P159J6986q271j7058P109
1647e569J7768p168j7774P096J8310p627j8594P664J8379p248j8433P350J7876
$$ plain form
1557 -8446 -10928 6020 9671 -6852 -10797 5871 10566 -6744 -12087 4891 11403 -5106 -12143
1570 -12143 5204 11720 -5831 -13243 5070 13799 -4726 -13710 4618 13639 -5018 -13737 4983
1583 4983 14736 -4062 -14017 4219 14054 -4385 -13493 5479 15260 -4092 -13812 4875 14414
1596 14414 -3708 -12608 5379 14072 -4117 -13029 4429 13491 -2361 -11748 3915 13144 -2454
1609 -2454 -11940 2985 12861 -1003 -10639 2293 12126 -887 -11045 1540 12330 945 -10789
1622 -10789 -223 11446 1375 -10894 -743 12063 2564 -11022 -2641 11466 3330 -11285
1634 -11285 -2793 12353 4205 -12093 -4160 11751 4390 -11494 -4335 12651 4380 -12678 -5569
1647 -5569 12199 5031 -12743 -5647 12663 5036 -13558 -5894 12485 5237 -13196 -5846 12030
1660A2030p604j7682P023J8070o552j7818O231J7037o217j7131O451J6580m998
1673E420j6857M710J5894m261j5470M021J5227l555j5245K558J5340j686j5145
1686i049J141J5251o73j4959o17J5608Q43j4653j746J5085K029j5172k605J5452
1700E935L439j5246l838J5155M467j5702m668J6381N164j6611n504J6615N635
1713A1222j6611n638J7071O065j7128o531J7456O024j6790n955J6737O031j6497
1726d544o709J6776O699j6484o452J6281O358j6359o507J5870O464j4714o681
1739a0002J4361O897j3894p163J3530P584j3120p594J2439P476j2143p990J1801
1752B182Q890j1567r073J0573R245j0059r715R897J0408r857j1032R409J1263
$$ plain form
1660 12030 4426 -13256 -6233 11837 5285 -12533 -6302 10735 4518 -12613 -6162 10418 5420
1673 5420 -11437 -6727 9167 4906 -10564 -6543 8684 5129 -10116 -7558 7782 6096 -9049
1686 -9049 -7908 7343 6670 -8289 -8906 6702 7545 -7108 -8854 6231 8260 -6912 -9517 5935
1700 5935 9374 -5872 -9710 5445 9912 -5790 -10458 5923 11087 -5524 -11028 5587 11222
1713 11222 -5389 -11027 6044 12109 -5019 -11550 5906 11930 -4860 -10815 5922 11953 -4544
1726 -4544 -11253 5523 12222 -4262 -10714 5567 11925 -4434 -10941 4929 11393 -3321 -10002
1739 -10002 4359 11256 -2638 -9801 3729 11313 -1807 -9401 3038 10514 -1629 -9619 2182
1752 2182 11072 -495 -9568 1005 10250 191 -9524 373 10781 924 -10108 -699 10564
1765A0564r162j1744Q759J2321q911j2729Q651J2907q319j2914Q156J3065q461
1778B183j3459P756J4859q627j4144P742J4387q032j4605P916J4681p524j4927
1791a1794P350J4692p565j4448P236J4570o897j4358O824J4044o496j4111O110
1804d843J4382o171j4037N224J4080n255j3375M930J3217m040j3396L757J3198
1817G671l167j2962K674J3094k185j3037J568J3027n71j3367K89J3852m70j3425
1831g009m55J3966P78j3781q86J3487J848j3911k205J4257K714j4620k591J4330
1845E922L340j4261l932J5156L202j4720l390J4648L908j4897l616J4972L561
1858I893j4717m056J4803M125j4604m185J4524M275j4367m645J4113M847j3823
$$ plain form
1765 10564 1402 -10342 -1583 10738 1827 -10902 -2251 10656 2337 -10577 -2421 10644 2183
1778 2183 -11276 -3520 11339 2712 -11432 -3690 10697 2665 -11940 -4024 10657 3133 -11794
1791 -11794 -4444 10248 2683 -11765 -4529 10041 3144 -11214 -4390 9654 3158 -10953 -4843
1804 -4843 9539 3368 -10669 -5445 8635 3380 -9995 -5065 8152 4112 -9284 -5527 7671
1817 7671 4504 -8458 -5784 7310 5125 -7912 -6344 6683 6112 -7255 -6966 6886 6416 -7009
1831 -7009 -7464 6502 7280 -6501 -7387 6100 7948 -5963 -8168 6089 8803 -5817 -8408 5922
1845 5922 9262 -4999 -8931 6225 9427 -5293 -8683 5965 9873 -5024 -8640 6332 9893
1858 9893 -4824 -8880 5923 10048 -4556 -8741 5783 10058 -4309 -8954 5159 10006 -3817
1871c817m501J3316M559j2966m800J2493N099j2284n423J2223N540j1867o131
1884h559J1410O555j1074o845J0614O866j0295p242J0144P431r367q195R027Q184
1898H654r011q427Q650R415r022r690Q761J0075q755j0717Q755J1011q608j1366
1912a0275Q417J1541q235j1817P740J2005p889j2021Q061J1907p833j2127P601
1925b925J2274p784j1956P525J2060p712j1865P275J1971p120j2114P080J2220
1938H929o893j1678N767J2004n688j1715N199J2065n155j1217M445J1142l706
1951C499j1398L729J1016l001j1598L119J1198j967j1879K152J1553j194j1622
1964f393O19J1832Lj2417L12J1912N26j1888j025J2370R18j2182j267J2416J598
$$ plain form
1871 -3817 -8318 4998 9557 -3409 -8209 4284 9383 -2901 -8324 3899 9439 -2428 -8559
1884 -8559 2851 9406 -1668 -8513 2101 8967 -1328 -8570 1574 9005 -362 -8557 470 8654
1898 8654 -357 -8784 -134 9281 259 -9431 -670 9405 650 -10067 -1312 9699 1091 -10275
1912 -10275 -1858 9683 1448 -10369 -2629 9376 1487 -10534 -2473 9434 1601 -10526 -2925
1925 -2925 9349 1565 -10391 -2866 9194 1482 -10383 -3108 8863 1743 -10371 -3291 8929
1938 8929 2036 -9642 -3875 8129 2441 -9274 -4075 7990 2835 -8382 -3937 7205 3499
1951 3499 -7899 -4170 6846 3845 -7753 -4634 6564 4597 -7282 -5130 6423 5229 -6393
1964 -6393 -5774 6058 6061 -6356 -6044 5868 6394 -5494 -6519 5851 6769 -5413 -6680 5736 7334
1979G334j2593j652J2821J847j3126k135J3475K191j2942k563J3446K535j3501
1992d863k787J3450K976j3124k633J2612K477j2560k798J2703K913j2396k860
2005f890J2133K910j2151l317J2283L155j1696l717J0961M318j0887l982R961
2018C081N118j0627m401R243M767q968n482R316N718r045o113Q708O202q488o786
2033g757Q411P142q201q096Q508Q228q328q491P688Q878p735r082P889R125p840
2048C39r430Q057R091p797r737Q344R702q349j0072P854J0601p518j0922P850
2062a987J0327p328j0202P125R762o784r495P011R143p007r232O619R568o556
2076I64r070O170R229n825r309N085R765m626r301L882R347l307r775L243R599
$$ plain form
1979 7334 -5259 -6911 5910 7757 -5369 -7504 5971 8162 -4780 -7343 6103 8638 -4863
1992 -4863 -7650 5800 8776 -4348 -6981 5631 8108 -4452 -7250 5453 8366 -4030 -6890
2005 -6890 5243 8153 -3998 -7315 4968 8123 -3573 -7290 3671 7989 -2898 -6880 3081
2018 3081 8199 -2428 -6829 2414 7181 -1787 -7269 2047 7765 -1280 -7393 1315 7517 -971 -7757
2033 -7757 654 7796 -405 -8501 7 8235 -93 -8584 -896 7982 247 -8835 -946 8179 339
2048 339 -9091 -1034 8057 260 -9477 -1133 8569 220 -9852 -1998 8603 1085 -9837 -1987
2062 -1987 8340 1012 -9190 -2065 7697 913 -8582 -1571 7572 565 -8667 -2048 7520 964
2076 964 -8106 -1936 7293 1468 -7841 -2756 7009 2383 -6918 -3036 6311 3004 -6771 -3528 6071
2091F071k626r720K622R413k116r319J882R746j261j0319J300J0677r32j1040
2105e622O46J1023m8j1495j63J1554L95j1069q04J1757K96j1678o80J2080N90
2120F782j1535p65J1532R53j2296j99J1879P61j2039q49J1949L95j1671n59J1454
2135E792J597j1499j739J0990J364j0454r48R855J481j0058j798R760J841r599
2149c415k160R261K503r212l181R212L346q521l647Q084M095q123n233Q277N218
2164F504p897n016P304N796q011o319Q251O251p988o086P535O547p931p385Q267
2179a78P833p931q122P769P886q182p411P863Q057q043q134P787Q016p671p782
2194h243P975P633q202p956Q045P876p278p725P200P851p213p983O906P791o152
$$ plain form
2091 6071 3445 -6275 -3653 5760 3644 -5675 -3793 5953 4692 -5627 -4327 6350 5418 -5622
2105 -5622 -4976 6047 5999 -5496 -5659 5895 6290 -4779 -5583 6174 6470 -5208 -5888 6192 6782
2120 6782 -4753 -5518 6014 6967 -5329 -5528 6351 7112 -4927 -5776 6173 6568 -5103 -5662 5792
2135 5792 7389 -4110 -5849 5141 6505 -3949 -4897 4958 6439 -3619 -5417 4343 6184 -3415
2149 -3415 -5575 3686 6189 -3023 -6204 3008 6354 -2167 -5814 2270 6365 -1758 -6991 1286 6504
2164 6504 -1393 -6409 895 6691 -1320 -7639 612 6863 -1125 -7211 324 6871 -1060 -8445 -178
2179 -178 7655 -276 -8398 -629 7257 -925 -8336 -473 7584 -459 -8593 -806 7210 -461 -8243
2194 -8243 -268 7365 -837 -8793 -748 7128 -150 -7875 -675 7176 -37 -8020 -1114 6677 525
2209E25p501N635P614n601p629N738P470n204p352M490P229m096p298L630Q531
2224F181l582q172K778Q331k497q467K137R026k019q822J407R244r57r260J140
2239c532R407j195j0057J209J0073n06j0236O66J0154m58j0799O23J1061l75j1077
2254e042M59J0681m31j0820M29J0899j52j0687J9J0477m19j0579R53J0245p90
2269E242j0359M55R729j72q842l04R112J17r043o11Q645J018q606q36P891J591
2285E027q277j916Q113K500p848k750P239K940p384l230P345L643o990m376P044
2300A080M234p041m752P050N481p346n553P629N202p405n633P792N651p774o451
2315g836P831O436p676o099P624O494q014o526P741O579p647o304P596O199p639
$$ plain form
2209 525 -6976 -1341 6273 672 -6957 -1219 6251 1047 -6305 -1815 5414 1318 -5980 -2350 6181
2224 6181 2599 -5573 -2795 5536 3039 -5428 -3291 5735 3716 -5106 -3699 5545 4588 -4672 -3532
2239 -3532 5875 4680 -5377 -4168 5905 5399 -4837 -4171 5983 5525 -5274 -4651 6410 6035 -5042
2254 -5042 -4583 6098 5667 -5153 -4724 6175 6023 -4664 -4645 5832 5413 -5166 -4213 6032 5242
2269 5242 -5117 -4662 5067 4895 -3947 -4251 4861 4978 -4065 -4676 3969 4987 -3619 -4455 3436 5027
2285 5027 -3250 -5166 2947 5447 -2401 -5151 2088 5028 -2356 -5586 1759 5402 -1588 -5964 1080
2300 1080 5314 -1727 -6479 571 6052 -1294 -6847 782 5984 -1421 -7054 738 6389 -1385 -7836
2315 -7836 -5 6431 -1245 -7344 280 6774 -1240 -7766 -25 6554 -1093 -7397 199 6398 -1241
2330a241o324P530O375p127o107P193N683p416n411O884O176o333o144N761O092
2345E591n883n653N405O194n242n886M397O124m006o105L850O646l743o807L325
2360a793O824k845o904K526P551k435q123K576P998k322p704J878Q250j852q795
2375e170K017Q838j594r054J549Q839j486r004J944Q998j395r236J079R646j399
2390D572r656J870R355j715r109J556Q677j272r140J570R060j369q851J026Q487
2405E061j210p946P13Q219p11q361P02P446L31p578n31P188O52p252r64P373J062
2422D194o863j523O695J528o873j723O775K586p100k624O547L243p300l049O987
2437A500L687p255l746O552M483p047m206P222M007p094m512P222M556p379m276
$$ plain form
2330 -1241 -7565 -35 6340 -787 -6894 299 5982 -1434 -6845 39 6215 -118 -6262 -501 5591
2345 5591 -292 -5945 -540 5654 412 -5474 -1077 5047 1041 -5064 -1214 5432 1689 -5118 -1793
2360 -1793 5031 2186 -4718 -2192 5359 2924 -5199 -2623 5375 3053 -4651 -2773 5477 3625 -5170
2375 -5170 -3153 5685 4091 -4963 -3414 5425 3939 -5065 -3121 5877 4482 -4754 -3675 5971 4572
2390 4572 -5084 -3214 6141 4426 -4683 -3127 5550 4278 -4862 -3292 5768 4399 -4452 -3426 5061
2405 5061 3851 -4095 -3382 4837 4126 -4235 -3533 3913 4244 -3334 -3865 3323 3975 -3277 -4241 3132 4194
2422 4194 -2669 -4192 2503 4031 -2842 -4565 2210 4796 -2304 -4928 1619 4862 -2438 -5487 1500
2437 1500 5187 -2068 -5814 738 5221 -1826 -6032 1190 5197 -1897 -6409 813 5369 -2010 -6286
2452f286P398M321p406m386P099M821p115n039P628M506p215m775P449M608p023
2467a415m546O352M614o365m339O054M673n767m556N590M566n552m638N378M662
2482D711m807m925M708M839m516m666M055N218l560n438L169O079l497n878L151
2497a357O158k893o401K899O702l040o243K516O845k509p315K623P433k298q048
2512d928K995P150j907p521J971P586k208p388K020P679k178p751J993P839j741
2527C611q023K002P664j936p791J898P594k182p030J468P733j937o955R84P260
2542D360j144p265R66P159r40o566M43O636o60o371J42O270K91o264n56O151Q74
2559C526o332j088O482J054o340j885O270K112o379k197O693J955o700j929O234
$$ plain form
2452 -6286 1112 5433 -1973 -6359 740 5561 -1554 -6593 1035 5541 -1674 -6449 1000 5608 -1415
2467 -1415 -5961 391 5005 -1360 -5699 355 5028 -739 -5295 295 4861 -691 -5329 49 4711
2482 4711 -96 -5021 -313 4526 10 -4656 -601 4617 1057 -4381 -1212 4867 1370 -4508 -1357
2497 -1357 4801 1908 -4493 -1594 5108 2068 -4175 -1659 5186 2677 -4638 -2015 5418 3120 -4928
2512 -4928 -1933 5217 3310 -4211 -2240 5346 3138 -4250 -2230 5449 3271 -4480 -2487 5352 3611
2527 3611 -4412 -2410 5254 3318 -4473 -2575 5019 2837 -4193 -2725 5008 3071 -3884 -2900 4360
2542 4360 3216 -4049 -3083 4076 3136 -3430 -2987 3649 2989 -3382 -3240 3030 3321 -2943 -3499 2652 3526
2559 3526 -2806 -3894 2588 3642 -2698 -4583 1687 3799 -2580 -4777 1916 3871 -2829 -4758 1476
2574A476K620o467k695O136L262o432l175O480L424o484l802P183L190o866l611
2589e761P029L475o559l516O546L493o768l252O607L538o781l350O616L753o596
2604a526l480O385L363o205l479O071L267n435l763N122M282n089l879M570M345
2619D549m750l734M239M109m114m170L787M394l493m897L697N106l329n634L710
2634e30N391l258n664L163N652k802n760K577O343k746o625L151N852k299o881
2649d436L325O144k862o400K688O913l295o809L212O429k537o653K565O557k619
2664B222o419K011O833k776o130K054O505k216o243K297N759j491o319J724N895
2679C706j472n817J190N905q72o187L89O575j216n276K9N427O0n579l66N971K18
$$ plain form
2574 1476 4096 -2371 -5066 1070 4332 -2100 -5275 1205 4629 -1855 -5657 1526 4716 -2150 -5761
2589 -5761 1268 4743 -1816 -5332 1214 4707 -2061 -5313 1294 4832 -1949 -5299 1317 5070 -1526
2604 -1526 -5006 1379 4742 -1463 -4942 1129 4396 -1039 -4802 320 4602 -487 -4366 204 4549
2619 4549 -201 -3935 304 4413 299 -3871 -84 4310 817 -4080 -383 4723 1394 -4240 -530
2634 -530 4861 1603 -4061 -898 4754 1952 -3808 -1231 5112 2366 -4259 -1108 4744 2445 -4436
2649 -4436 -1111 5033 2171 -4229 -1541 5372 2077 -4732 -1520 4909 2372 -4281 -1716 4841 2222
2664 2222 -4197 -2186 4647 1871 -4259 -2205 4300 2084 -4159 -1862 3897 2406 -3913 -2189 3706
2679 3706 2234 -3583 -2393 3512 2640 -3547 -3158 3417 2201 -3075 -3046 2381 2441 -3138 -3504 2467 2685
2696B685n595r47N677R97n778r08N890P98n397j730N896K119o193j837N823K366
2712C866o348k178O065K382n692k497N926K306o472k127O446K448o248k684O547
2727A740K274o494k288O540K511o192k674N854K992n692k795N722K707n280k764
2742c839M806L134m977l187N499K385m734k791M933K854m380l474M688L243m180
2757b0l316L856L482l620m021L259M537l315m223L278M296l461m310L163M568
2772D153k768m978K989N166l324m872K655N269k662n370K534N941k686o193K796
2787a350N927k836n583K780N575k795n816K774N922k924n730K625N731k687n548
2802c935K489N635k694n228K076N399k148n106J841N190j635n263J710M401j267
$$ plain form
2696 2685 -2910 -3857 1820 2817 -2961 -3869 2021 2819 -2578 -4308 1588 3707 -2486 -4323 1500 3866
2712 3866 -2482 -4660 1405 3787 -1905 -4402 1524 3830 -2642 -4769 1677 4125 -2123 -4807 1740
2727 1740 4014 -2480 -4768 1772 4283 -1909 -4583 1271 4263 -1429 -4224 1498 4205 -1075 -3839
2742 -3839 967 4101 -876 -4063 1436 3821 -913 -3704 1229 4083 -297 -3771 917 4160 -20
2757 -20 -3336 520 4002 382 -3639 -380 4157 842 -3381 -103 4193 732 -3578 -415 4153
2772 4153 1385 -3593 -604 4562 1238 -3634 -979 4290 1628 -3742 -1208 4733 2047 -4146 -1350
2787 -1350 4577 1741 -3842 -1062 4513 1718 -4098 -1324 4598 1674 -4056 -1431 4300 1613 -3935
2802 -3935 -1446 4189 1495 -3733 -1657 3742 1594 -3512 -1671 3519 1884 -3379 -1669 2732 1465
2817A465m966J354M961j072m743N20M863o44m677J22N282k20n133k5N234r5n109
2834b883rM929N40n261o91M978J373n540j053N745R79n761j180N730J186n524
2850b442j521N662J528n595j413N591J739n822j842O004J361n545j446N878J381
2865C518n897j116N415J489n464j162N160J403n409j604N142J952m776j856M736
2880A531K130m758k135M152K644m347j973M047K031l619k484L732K495l722k666
2895b942L757K528l260l268L565L367l178l610L168L560l148l738L021M191l014
2910I99m464K910M422k724m518K815M829l217m912L403M621l297m553L084M722
2925D120l210m721L374M526l025m749L382M194l088m481K649N001l127m051K214
$$ plain form
2817 1465 -3501 -2147 2814 1742 -3001 -2481 2382 1738 -2939 -2817 2465 2245 -2888 -2913 2321 2226 -2883
2834 -2883 -2892 2037 2577 -2684 -3375 1603 2976 -2564 -3617 2128 3107 -2654 -3834 1896 3082 -2442
2850 -2442 -3963 1699 3227 -2368 -3781 1810 3549 -2273 -4115 1889 3250 -2295 -3741 2137 3518
2865 3518 -2379 -3495 1920 3409 -2055 -3217 1943 3346 -2063 -3667 1475 3427 -1349 -3205 1531
2880 1531 3661 -1097 -3232 920 3564 -783 -2756 1291 3322 -297 -2781 951 3446 -276 -2942
2895 -2942 815 3343 83 -3185 380 3747 569 -3041 127 3687 539 -3199 -178 4013 999
2910 999 -3465 -555 3867 1143 -3375 -560 4269 1052 -3860 -457 4164 867 -3686 -602 4120
2925 4120 910 -3811 -437 4089 1064 -3685 -303 3891 803 -3678 -1029 3972 845 -3206 -992
2940i92M407k430m344K153M395k223m024J596M353j858m169J538M088j078m645
2955c233J199M034p18m097P58M516j107m100K57M469k75m532K44M528K11m554
2971b400k55M375N84m567q66M809O33m667o31N006P01n381m53N042P35n115r13
2988c363N654P97n589n67N010P62m864j324N679P04n204r13N300Q11m891p90M659
3005A871J170m549j298M545J190m167j148M270R75m630p62M078J282l685j727
3020b585L917J614l893j255L267K337l673j946L071K726l889k203L470K486l406
3035C8k916L378L027l303l183L306L041k911l581L250L298k936l408K970L817
3050C887l661l516L575L711l502l843L180L650l259l919L352L749k804l986K852
$$ plain form
2940 -992 3415 985 -3359 -1206 3189 966 -3058 -1462 2891 1033 -3136 -1598 2490 1412 -3233
2955 -3233 -2034 2000 1282 -2815 -2057 2459 1352 -2748 -2491 1978 1703 -2829 -2585 1943 2154 -2400
2971 -2400 -2655 1720 2304 -2263 -3129 1680 2313 -2354 -2985 2021 2722 -2659 -3112 1930 2665 -2450 -3363
2988 -3363 2291 3088 -2501 -3068 1942 2704 -2160 -3484 2195 2899 -2305 -3218 2082 2893 -1998 -2788 1871
3005 1871 3041 -1508 -2806 1739 2929 -1238 -2386 1884 2859 -1771 -2533 1545 2827 -858 -2585
3020 -2585 1332 2946 -947 -2202 1065 3402 -271 -2217 854 3580 -309 -2512 958 3444 38
3035 38 -2878 500 3527 224 -2959 347 3388 477 -3104 146 3444 508 -2900 70 3887
3050 3887 226 -3290 285 3996 494 -3349 -169 3481 222 -3697 -345 3404 600 -3386 -534
3065e34M087l186l592K947L469k912l637K638L982k915l498K650L309k245l729
3080c166J907L877k087l615J848L647j559l971J523L842j382l457R23L904q22
3095A412m371Q11M213l62m468M11M124k05m589O80M727m19m595k9M346K90m175
3112b199k36M573K12m858n3M557J58m620J7M774J89n134j66M907N98m672l86M767
3130B428k44m458n8M483K38m328k72M105O25m543k17M059N17l983l72L991M38
3147B409l950p24L901R77l642r80L652R00l529r33L398J328l131j785L255J520
3163B666k919j960L279J887l116k419L233K268k867k517L348K337l021k914L184
3178D69K718l036k752K948L076l426l288L572L236l286l429L403L012l144l315
$$ plain form
3065 -534 3553 367 -3225 -278 3191 279 -3358 -720 3262 347 -3151 -501 2808 563 -3166
3080 -3166 -1259 2618 531 -3084 -1236 2411 852 -3119 -1596 2246 864 -2593 -1670 2234 1412
3095 1412 -2959 -2148 2065 1703 -2765 -2354 1770 1565 -3024 -2344 2383 1964 -2631 -2660 1686 1976 -2199
3112 -2199 -2435 2138 2350 -2508 -2561 1996 2154 -2466 -2449 2325 2514 -2620 -2786 2121 2719 -1953 -2339 2428
3130 2428 2184 -2274 -2332 2151 2389 -1939 -2211 1894 2519 -2024 -2241 1818 2335 -1648 -2020 1971 2409
3147 2409 -1541 -2265 1636 2613 -1029 -2009 1643 2543 -986 -1919 1479 2807 -324 -2109 1146 2666
3163 2666 -253 -2213 1066 2953 -163 -2582 651 2919 52 -2465 883 3220 199 -2715 469
3178 469 3187 151 -2601 347 3423 -3 -3291 281 3517 231 -3198 205 3217 73 -3242
3193c242L471K876l041l045K770L287l254k812K896L075k640l526K823L198k963
3208a27k838K476K794k325k863K335K788j808l082J795K672j596l012J197L726
3223B132j583l149J352L047j454l079J422L203q89l677Q09L551p52l196L62M087
3239B186q57l578M5L864j88l988O28M186m68m411M89M300o12l580J01L886J02
3256B105m749L81M496m68m053P49L844L2m358K09L727k5l561N5L835n44l681L70
3274a636L625J52l423m31L648j61l163lL248M68l010q67L094N64l057p46L169
3291A471P95l339p07L060J086k757j792L002J843l035j570K668K100l326j360
3306a861K624K322l319k216L189K185l243k367L145K739l275k628K920K833l422
$$ plain form
3193 -3242 229 3105 64 -2981 -211 3076 -178 -2990 -94 2981 341 -3185 -362 2836 -127
3208 -127 -2965 -489 2305 -20 -2883 -548 2240 432 -2650 -855 1817 221 -2791 -1594 2132
3223 2132 549 -2600 -1248 1799 345 -2734 -1312 1891 1002 -2675 -1866 1685 933 -2263 -1901 2186
3239 2186 1329 -2249 -2204 1660 1472 -2516 -1888 2298 1830 -2581 -2092 2208 1596 -1984 -1883 2003 2105
3256 2105 -2644 -2263 2233 1765 -2288 -1539 2305 2337 -2021 -1812 1915 1890 -1671 -1616 2219 1675 -2006 -1636
3274 -1636 1989 2141 -1282 -1713 1935 1774 -1389 -1392 1856 2324 -686 -1553 1541 2105 -952 -1698 1471
3291 1471 2266 -1073 -1780 1280 2366 -391 -2183 819 2662 -373 -1943 725 2825 -501 -1861
3306 -1861 763 3085 -234 -2450 739 2924 -319 -2686 459 3198 -77 -2705 215 3048 -374
3321c74k280K783K903l314k469K980K483k943k712L181K285l286j918K766K590
3336B675l026k426K645K425k619k469K600K236k213k467K211K473k112k579K207
3351d39K510k143k550J787K616j678k577J872K242j271k828J088L159r24l024
3366b160Q77K936j055k967R11L300j112l075J242L213j136l229J035L229p88l765
3382b544J145L644p63m094O83L856n79l323N03L747j084l278L23L891o49l301
3398a823K88L800m48l655O79L297k46l732L64L661m45k989k7L295p94k412J01
3415a086K813J31l279K26K727j09k723J47K707M68l083l51K709P08k677p69K655
3432A214Q76k773q23K602R23k652j260K752J232k573j641K971J516k546j914K836
$$ plain form
3321 -374 -2654 129 3032 -282 -2751 229 2712 -231 -2943 238 2523 -763 -2681 85 2675
3336 2675 -351 -2777 -132 2293 -326 -2795 -195 2041 -172 -2639 -428 2045 -67 -2646 -439
3351 -439 2071 -72 -2622 -835 1781 103 -2474 -602 1640 369 -2459 -1371 1788 864 -2160
3366 -2160 -1283 1653 598 -2369 -1458 1842 730 -2345 -1103 2110 974 -2255 -1220 2009 1221 -2544
3382 -2544 -1399 2245 1482 -2612 -1929 1927 1348 -1975 -1472 2275 1191 -2087 -1764 2127 1478 -1823
3398 -1823 -1535 2265 1817 -1838 -1159 2138 1892 -1840 -1476 2185 1740 -1249 -1276 2019 1225 -1187 -1086
3415 -1086 1727 1858 -1421 -1195 1532 1423 -1300 -1153 1554 2022 -1061 -1412 1297 2005 -672 -1441 1214
3432 1214 2090 -683 -1506 1096 2019 -633 -1893 859 2091 -482 -2123 848 2364 -182 -2096 740
3448G40J619k921k040L131K167l353j731K963J995l212j811K785J910l005j947
3463b710K896K051l088j583K832J746l158j385K648J789k499k019K599J990k600
3478d91k256K872J798k297j940J887K058k298j461J733K265k081j815J456K259
3493A689j657j950J327K627j710k501J323K392q01k834J224K810j234k696J130
3508h61K830j439k282Q36K779q87k956J082L133j169l090J130L240j167l174O78
3524a317L482q11l626J272L252j005k950R05L223r39l147N04L573r79l101Q90
3540g74L202j184k963R38K457l76k840O85K665k71k913L64K853j05k544j88K690
3557A696l86k092n58K852L05k640o37K684L87k559p95K933J040k817j374K673
$$ plain form
3448 740 2359 -562 -2602 529 2696 -657 -2388 575 2570 -642 -2453 332 2242 -763 -2710
3463 -2710 186 2237 -851 -2434 398 2144 -1014 -2399 249 2038 -461 -2480 119 2109 -491
3478 -491 -2747 125 1923 -374 -2314 -427 1631 -667 -2128 -395 1870 -211 -2026 -570 1689
3493 1689 32 -1918 -591 2036 326 -2175 -852 1540 739 -2095 -871 1939 705 -1991 -861
3508 -861 1969 530 -1752 -916 1863 976 -1980 -898 2235 1066 -2024 -894 2346 1179 -1995 -1317
3524 -1317 2165 1354 -2272 -1000 2252 1247 -1703 -798 2425 1486 -1661 -1157 2416 1437 -1664 -774
3540 -774 2428 1244 -1719 -781 1676 1300 -1540 -855 1810 1539 -1374 -1010 1843 1738 -806 -994 1696
3557 1696 1310 -782 -1340 1512 1817 -823 -1460 1224 1611 -948 -1743 1190 2230 -587 -1961 712
3573G12J069k678j072K819J144k956j130K747J339k984j044L030Q36k763j248
3588b179L127J411l097j465K811J620l408j336L268J270k951j191K779J166k798
3603i73j089K361J516k608j469K236J710k478j156K229J049k192j274K303J363
3618A528k281j344J809J934j903j895K278J526j865j943K023J554j400k055K084
3633E0J414j294j905J115K432j371k582J449K179j123k327J249K903j716k523
3648b050J396K691j221k851J396K668j327k290J026K891j613k640J428K447j186
3663G65k574J365K584j013k987J192K710j473k057R88K749j485k426J204K520
3678B062j098k283P24K429r13k311R64K177m35k413J61K346m13k210L25K143K05
$$ plain form
3573 712 1781 -897 -1969 850 1994 -962 -2092 655 1994 -990 -2034 996 1832 -931 -2179
3588 -2179 948 2359 -738 -2203 608 2228 -1180 -2516 752 2022 -929 -2120 659 1825 -973
3603 -973 -2062 299 1815 -793 -2262 -26 1684 -794 -1950 279 1328 -864 -2138 165 1528
3618 1528 -753 -2097 -288 1646 -257 -2152 126 1652 -213 -2156 -133 1421 21 -2034 50
3633 50 1464 170 -1735 -620 1812 441 -2141 -692 1487 364 -1963 -714 2189 473 -2050
3648 -2050 -654 2037 816 -2035 -639 2029 702 -1588 -562 2329 716 -1924 -496 1951 765
3663 765 -1809 -444 2140 1127 -1860 -668 2042 569 -1488 -500 2249 764 -1662 -458 2062
3678 2062 964 -1319 -595 1834 921 -1390 -426 1751 1316 -1097 -936 1410 997 -1213 -888 1255 1460
3695A460k366m3K325l33k264pK400L16k320k50K412L30k569o08K798K56k748n14
3713a725K726O81k811m41K633P69k941r72L096O82k924q08L059O67k987r42L103
3730H65M95k382r17K721N90k705n19K690R12k476j068K095R65k325j063K401Q90
3747A169j997j087K364O28k253l51J480J464j950j260J801J433j829j506J596
3762b98J703j558j566J379J614j228j710J443J775j803j606J475K464j867j953
3777a736J479K097j794k022J852K241j848k099J490K255j433k370J981J959j331
3792G21k172J077K274j421k087J296K343j526k079J650J949j238k400J531J648
3807A566q86k071J189J912j063j965R52K043j098j768P07K166o47k430P50K085
$$ plain form
3695 1460 -906 -949 1376 1043 -1221 -1228 1172 1488 -832 -1082 1330 1660 -909 -1517 1281 1537 -1211 -1725
3713 -1725 1001 1682 -1129 -1570 1063 1832 -1109 -2081 1015 1697 -1227 -2035 1024 1691 -1296 -2238 865
3730 865 1360 -1022 -1939 782 1372 -1333 -1852 838 1750 -726 -1794 301 1266 -1059 -2122 279 1169
3747 1169 -828 -1915 449 1077 -1176 -1527 -47 1417 -533 -1793 8 1441 -388 -1894 -298
3762 -298 1405 -153 -1719 -340 1274 46 -1664 -221 1554 -249 -1855 -380 2084 217 -1736
3777 -1736 -257 1840 46 -1976 -124 2117 269 -1830 -340 1915 482 -1888 93 2052 721
3792 721 -1451 -374 1900 479 -1608 -312 2031 505 -1574 76 2025 787 -1613 -82 1566
3807 1566 680 -1391 -202 1710 647 -1318 -366 1677 579 -1189 -482 1684 1037 -1393 -643 1442
3823A442n48k145O71J961k49k164K90J759K47k163j63K198K37k497r5K551J71
3840A503k914N83K205q5k523j75K151N88k394J8K085K34k780m21K925J68k498
3857a330j71K373N02k796l93K591L33k520l72K310R24k478p62K470M34k127o71
3874a683K152O32k283n36K460K41k036n22K206L01j955n73K480L55j798o82J385
3891A44Q97j220r76J310J171j700r30J345J478j649j394J618J706j833j529J713
3907A51J454j343j853J463J996j797j863J794K048j923j595J449J925j786j753
3922a633J726J630j319k071J611K162j498k004J682J849j719k029J677J663j460
3937B67j394J196J832j423j926J433J709j214j776J100K071j552j687J205J695
$$ plain form
3823 1442 894 -1251 -580 1381 1132 -1032 -742 1017 1264 -899 -1062 1136 1373 -1124 -1219 1332 1503
3840 1503 -1411 -828 1377 1292 -1231 -1406 745 1333 -1061 -1043 1042 1276 -1504 -1925 1000 1168 -1330
3857 -1330 -1501 872 1374 -1422 -1815 776 1109 -1411 -1783 527 1451 -1027 -1789 681 1115 -1012 -1683
3874 -1683 469 1101 -1182 -1718 742 983 -1053 -1575 631 932 -1023 -1596 884 1239 -559 -1241 144
3891 144 1041 -179 -1155 155 1326 -374 -1304 41 1519 -130 -1524 94 1800 -33 -1562 151
3907 151 1605 262 -1591 -128 1868 71 -1792 2 2050 127 -1468 -19 1906 120 -1633
3922 -1633 93 1723 404 -1667 -56 2106 608 -1396 286 2135 416 -1613 64 1727 267
3937 267 -1127 69 1901 478 -1448 -15 1694 480 -1296 -196 1875 323 -1364 -159 1536
3952A536p83j847Q28J625o74j490M34J755n46j955R19J573m63j989K76K088n27
3969G60j537j82K084J89k243k41J984K17k353J31J946K19k276r4K365K27k534
3986a338k57K766J44k699o4K716k37k510JK529k8k604P7K708r8k406L86J718K18
4005A022k212l34K067K91j707n59K355K38k403k13J604P88j719m00J570N40j595
4022f67l52J341L67j320r83J863Q14j695o08J646R97j682j161J733J325j463j591
4039a436J309J520j637r98J316J344j589j084J529J336j524j417J488J513j329
4054C41j712J659J343j805j064J374J719j414j558J591J351j513j627J275J886
4069A846j596j923K074J175j447j391J605R92j188j539J390J351j082j322R82
$$ plain form
3952 1536 753 -1094 -266 1359 685 -805 -371 1384 838 -1117 -198 1375 912 -1077 -801 1287 760
3969 760 -777 -959 1125 1314 -929 -1170 814 1031 -1322 -1191 755 974 -1302 -1396 969 1196 -1338
3986 -1338 -1595 1171 1315 -1384 -1448 1268 1031 -1479 -1478 1051 1023 -1581 -1504 1204 1106 -1300 -914 804 1022
4005 1022 -1190 -1524 543 834 -873 -1432 923 1161 -1242 -1455 149 937 -782 -1182 388 928 -667
4022 -667 -1019 322 689 -631 -1614 249 1063 -632 -1240 406 1403 -279 -1440 293 1618 155 -1436
4039 -1436 -127 1393 -244 -1242 74 1418 -171 -1255 274 1610 86 -1331 157 1670 341
4054 341 -1371 288 1631 -174 -1238 136 1855 441 -1117 474 1825 312 -1315 -40 1846
4069 1846 250 -1673 401 1576 129 -1262 343 1335 147 -1392 -2 1349 267 -1055 -73
4084g3J500q03j707P91J621j006j561R85J391n12j758Q72J225n95j443P11J319
4101I57j90j735M16J613m18j937L92J801j25k060M47J864l94j729P1K102k39k215
4119a379K50K180l99k245L37K108Rj985J80J836l53j828J7J894k32j381k54J827
4137E82J57j957K0J865o0j810J05K032j1j961j26J784R0j781J13J340L80j317
4155e55k44J210L30j294o23J727L37j327r04J916L34j399o17J426R51j362j078
4172a172J468J003j427j110J771R06j537j130J479J197r06j945J521J458j889
4187c13r33J679R75j285j155J522J073j878j104K125Q98j622j138J877Q21j442
4203A00j454J644Q80r91j280J141J232r96j453J159J169p25j356J481P57r41j158
$$ plain form
4084 -73 1427 624 -1083 -292 1329 323 -1238 -253 1138 626 -1132 -260 965 370 -1073 -362 957
4101 957 767 -968 -552 1061 643 -1294 -902 899 774 -1286 -839 1025 631 -1098 -1027 1075 836 -1379
4119 -1379 -1129 1051 652 -1593 -1256 852 861 -1124 -944 892 539 -1289 -1272 622 390 -991 -1245 582
4137 582 739 -1218 -1198 667 607 -1203 -1098 934 923 -1038 -1164 620 710 -1071 -958 382 762 -555
4155 -555 -799 411 741 -553 -1176 551 888 -439 -1343 573 907 -492 -1109 317 1268 -94 -1172
4172 -1172 296 1299 -128 -1238 533 1439 -98 -1228 251 1448 542 -1403 118 1576 -313
4187 -313 -1246 433 1408 123 -1032 490 1563 -315 -1419 706 1604 -18 -1156 721 1542 100
4203 100 -1354 290 1170 179 -1101 40 1272 276 -1177 -18 1151 426 -930 551 1308 367 -791
4220g91P82J385j405q89Q31J127r14q75K29J481n66j348L52J887j023j291M40
4237e88J729p10j615M16J719n24j484K04J735o02j316L92J700n45j703K57J697
4254G62o5k038M65J734n10j719L82K363o75j797O1J714l0j963K74K124l53j919
4272a190O22R67K57j656NK040o64j438K77J479p2j679J45J804k24j490L84O91
4290B58L59j401J05R63M21r03o44J544J92j623j08J399M39j392m24J456M32j156
4308h3q10J384P91j624m16J212Q77j636r07J769Q60j529p44J381Q56j657q68J770
4326F26P83j547p57J395P06j057j272J649O82j310m57J256P41j453p73J220P97
4343A229j518q75J536P98j552p35J103J122r17j153J041R20q11j226J062R92j069
$$ plain form
4220 -791 -9 1376 -29 -918 -87 1040 126 -749 -520 961 395 -953 -601 1286 263 -1028 -588
4237 -588 1141 431 -1184 -768 951 427 -1057 -853 882 280 -1036 -644 1056 511 -1192 -935 762
4254 762 697 -1341 -876 858 348 -1371 -989 1374 699 -1098 -1037 677 647 -1316 -1042 1082 729 -1190
4272 -1190 -568 399 656 -1000 -995 1045 381 -1057 -780 699 627 -1052 -907 897 673 -817 -433 258
4290 258 617 -784 -679 284 705 -198 -842 702 894 -729 -837 562 1001 -391 -815 641 1073 -83
4308 -83 -893 491 1282 -342 -758 454 1331 -305 -1212 557 1417 -112 -856 525 1381 -276 -1144 626
4326 626 1409 -138 -895 500 1206 149 -1123 526 1208 -102 -559 697 1438 -15 -788 432 1229
4343 1229 -289 -1164 372 1170 -382 -1117 -14 1108 191 -962 79 999 188 -1038 24 1016 -53
4360e3o68N87J011m89j427M88J088l57j362P32J547q05j134L12J354m40j681M49
4378h48K009q64j485Q83J287q24j614O94J770p90j492N32J550k51j677L40J903
4395A123p83j490M79J485o26j690Q93J399l52j520R04J039k37j684P12J315p32
4412B35j174J90J470o0j375k10J457j5j446K75J464n7j087n77J413K82j339j66
4430g20J328j41j030k93J614j36j096m95J577O59j629l64J415L06j023r01J545
4447F16Q95j929k07J242O60j710p27J857N28j873k35J365Q46j541p16J518K16
4464H05j206m22J276O72j525n06J216Q48j625l16J362L32j145m09J118L78r88
4481a35m84R16O70r92j114J415N81q05r31P99J094j187j189J197J003o97j226
$$ plain form
4360 -53 -721 -134 877 388 -1039 -551 537 180 -1182 -450 1097 292 -842 -530 824 384 -1297 -848
4378 -848 1161 297 -1188 -305 982 158 -1456 -762 1008 218 -1274 -742 808 557 -1120 -780 1123
4395 1123 340 -1150 -671 814 188 -1502 -609 790 438 -1082 -178 861 624 -1060 -348 967 235
4412 235 -939 -749 721 661 -714 -924 533 518 -928 -653 811 754 -333 -910 503 785 -554 -720
4430 -720 608 467 -563 -856 758 622 -474 -969 608 1267 -362 -726 689 995 -28 -929 616
4447 616 1511 -418 -625 617 1277 -433 -1160 697 1225 -648 -883 482 1328 -213 -929 589 805
4464 805 -401 -823 453 1125 -400 -906 310 1158 -467 -783 579 911 -234 -643 475 853 -135
4481 -135 -619 297 967 -25 -1139 276 857 52 -879 -80 1014 -173 -1362 -165 838 141 -1085
4498a085M43J320m04j311Q89R09n84j174O97J063o62j411O60J634r19j351P71
4515e15J358p39j227N49J386q45q57O20J154n62j435N98J705r94j228M69J394
4532H31n97j532P00J433n60j432R46R51n12j257M17J598q82j092M85J198k26j427
4550i58M25J317m50j032J59J595m01j226j37J453k07j060n0J319O1j488M17J006
4568G43n4p43n48J368J70j285j41J184L72j043m01J166P4j409k31J619R6j228
4586b91n61J432N41j378j48R44N67j583j65J018K97j160k66J572O6j413J68J103
4604G43J22j256m01J192Q7r11l08Q05N54r01n75J348J45j007n30O99P23p31p70
4623i72J103M43q29o13O96O11m81p79R97L12q27l71M76J017p68r36L40J310n82
$$ plain form
4498 -1085 -642 678 274 -1037 -148 761 177 -997 -300 763 101 -1310 -650 984 65 -1286 -515
4515 -515 843 104 -1123 -574 812 -33 -890 -270 884 322 -1113 -515 1190 196 -1032 -563 831
4532 831 234 -1298 -598 835 275 -1157 -211 740 228 -1029 -612 986 104 -988 -503 695 469 -958
4550 -958 -533 784 334 -698 -539 1056 655 -571 -708 745 538 -522 -572 747 808 -680 -263 743
4568 743 689 -54 -602 766 936 -349 -490 694 1066 23 -378 788 862 -547 -778 841 937 -291
4586 -291 -852 580 1121 -257 -405 539 1106 -477 -642 376 673 -487 -753 819 885 -528 -360 743
4604 743 865 -391 -792 400 487 -424 -732 73 627 -274 -849 499 644 -363 -893 -194 529 -202 -972
4623 -972 131 574 -255 -868 -172 439 -42 -821 176 488 -339 -710 -234 783 15 -921 -581 729 147
4642A47j023J016Q27j021j128O47J345r26j049O16J499r69j377J018J107o52j131
4659a054O94J239p59j359J068J043q84j002R09J157j106q70Q10R01o30p92L76
4676b59Q08m02r38P01R85n24r60J51J046j64j224N01J392n50q34K8Q90m27p26
4695e06L24J185j49j311J98R57Q3j045J57O68J84j193R4J035n4j098J14J142J65
4714I50j497Q5J165J88j505J35R57O69j564k72J174L26j239l33J249M35j282j66
4732e25J095J39j213J23J040R2j318K3J205J43j273j73J295N7j209R0O36L75p19
4751a17p70J103M34r37j86N41M06o82n94J030N48q89p30J052O16p82q42O12P88
4770F01m16r94O20P68o78j294J120O25m11q14Q26O72r27o40R52R80j139q40O98
$$ plain form
4642 147 -876 140 967 -54 -1182 -535 810 -116 -1165 -549 950 -19 -1396 -378 729 77 -1054
4659 -1054 -360 879 120 -1239 -171 872 -12 -1014 -105 1052 -54 -924 -114 787 157 -635 -259
4676 -259 549 147 -791 -90 895 371 -589 -438 608 444 -780 -279 1113 563 -271 -243 647 220 -506
4695 -506 -182 1003 854 -457 -259 698 781 -264 -107 561 745 -448 -354 681 627 -471 -357 785 950
4714 950 -547 -462 703 891 -614 -479 478 1147 -417 -689 485 811 -428 -761 488 923 -359 -525
4732 -525 570 709 -504 -381 659 751 -567 -544 661 804 -469 -642 653 710 -499 -409 227 602 -117
4751 -117 -887 216 650 -287 -473 68 474 -208 -802 228 776 -113 -843 209 825 43 -799 -187 601
4770 601 185 -809 -189 579 -99 -1393 -273 352 -59 -873 -47 625 -302 -942 10 990 -149 -989 -291
4789b91J105l38j687J159P86p38q18O43J050o16j179Q83P36n59r51O92Q03n02
4807A78p52L24O95l84p65P75O54o15n02M21P16l74q39O08N22l21r12L09P04k29
4827B13p53K31Q66M4j025K04J151n58r36qJ311L2j040j04J036m4p44k21R24N8
4847F37j063L75P88j17j159O6Q73J74j219j27J422O6j268K6J118r6p40k23J020
4866E53J61j001k2R80j76j046mJ038J3r20k51R72L27r76l42J166P7o94m46N59
4886c2K68o31k31N12O87r28n81J117L40r09m43J004L09p13n53Q81L19m23n83O75
4906H5O19j058p78J069O17p60p55Q55O34n43q14Q97P83j125l79M51J131r17j014
4925a002R11P27p07q42P00R50m51j230J157M52n75q47O13R86q62n86N48Q46o22
$$ plain form
4789 -291 814 476 -1211 -52 734 -4 -822 -179 871 255 -924 -41 695 136 -815 -123 680 178
4807 178 -574 -250 445 61 -704 71 725 110 -392 29 745 371 -468 140 662 341 -571 -262 442 213
4827 213 -540 -309 557 601 -424 -220 931 373 -563 -571 740 772 -268 -372 664 620 -124 -345 579 637
4847 637 -426 -51 737 620 -539 -473 400 574 -645 -772 650 716 -552 -526 592 496 -244 -467 553
4866 553 714 -287 -309 671 495 -551 -555 483 496 -424 -675 297 624 -352 -694 472 549 -145 -591 -32
4886 -32 236 -395 -626 -114 573 -355 -936 181 521 -388 -831 173 482 -231 -784 97 416 -7 -590 85
4906 85 704 -354 -1132 -63 554 -206 -961 -106 528 -15 -829 68 851 -274 -653 -202 929 12 -1002
4925 -1002 -91 636 -71 -913 -213 737 286 -944 213 665 90 -757 -144 842 -20 -606 -58 788 166
4944A66p76O34P80p99l79M98P38r16q51R07P66o67m32J02O94k23n45k4J017J19
4964H09j174J77P75K19j457N8J336o7j133p6J398o07q15K77R82j10q03n46J636
4983H79k74j132q1R47L66j082j97Q47L0p38N5J037l59j058M39L39N37j106K18
5002c33Q00l02o68k79J483l75j042O2R21R0m67o74J370j79r07m07J287Nj080J03
5022e92P11N86j439L43O56L55q60m21Q41K71r64M7N38L50o55n38O77O40p14n83
5042g51P08Q28j382k40R46L25p14l66L43J024j062m32J065M53q98r35J227P34
5060H73q57q47Q85O79o66p77N73M43n35j04M90N12r14j91M38O90n46p22R83M19
5080H26q84m68L45Q23l60o11O30P06r11k66J28O70k86q42N58P28m34n59J65Q07
$$ plain form
4944 166 -610 24 804 5 -374 124 862 -54 -905 2 768 101 -331 -229 465 242 -303 -327 690 809
4964 809 -365 -188 587 806 -651 -593 743 676 -457 -533 865 258 -557 -280 702 592 -211 -757 879
4983 879 605 -527 -608 339 705 -377 -574 273 303 -435 -380 657 298 -760 -321 18 555 -551 -333
5002 -333 467 165 -503 -782 701 326 -716 -654 267 357 -110 -784 586 407 -500 -907 380 385 -695 -592
5022 -592 119 705 -734 -391 265 620 -240 -661 180 451 -513 -466 72 422 -233 -771 -94 546 -168 -751
5042 -751 -43 785 -597 -837 109 434 -280 -646 -303 721 -341 -773 292 745 -153 -1088 139 873
5060 873 16 -831 54 733 67 -710 -137 306 -229 -333 157 669 -245 -436 2 692 146 -576 407 826
5080 826 -58 -526 -181 642 282 -329 301 1007 96 -170 -42 628 342 -500 58 786 352 -207 -42 765
5100G65m80n35j42J192k06j310K45J070j05p51J47N66J53p32k3R54m00j127N29
5119a90J045n30p16QP18L23j077MJ026l4r28J33P57o4j075QJ048m5r29J29O97
5140C08q4q16r5R25J38r08M03mO42j148K18O56K22j061l16J066J47o39k95O75
5160C4K27o61k53Q48R2l72m67N31O53r59n36O25O17q10j73N80O12q60k70O93O94
5181H45j258k57O62M79p94l75N79P91j010m04Q14L49o79l29M77O46n42q16Q95
5200G3P63j060j18N32L10o83l00P68P2m80j74N86K62n20l47L34N07n05l66J29
5220b17O70k88k39K38N93m92n66L07M41k7m87Q7O67l05p60J94M30J68o20K10R16
5241I20l06j102P61jj5o35P6Q07k17o81R7R58j30j084K47J160q21n71K79O43P9
$$ plain form
5100 765 285 -250 -392 800 594 -716 -471 599 494 -257 -110 456 609 -123 -146 808 408 -719 -190
5119 -190 855 325 -391 -383 335 658 -419 -415 611 577 -351 -218 539 475 -600 -592 456 411 -518 -389 308
5140 308 224 -592 -687 238 376 -532 -129 -133 509 -639 -421 235 457 -604 -920 146 293 -346 -641 34
5160 34 261 -400 -653 195 287 -85 -552 -21 632 -327 -863 -238 379 -431 -604 -24 588 -272 -542 151 845
5181 845 -413 -670 -8 471 -323 -698 -119 672 -338 -742 72 421 -258 -587 -110 536 -6 -822 73
5200 73 836 -224 -342 190 500 -183 -483 285 357 -123 -297 289 551 31 -316 18 525 20 -346 -217
5220 -217 453 165 -74 164 757 265 -301 6 447 420 -67 20 687 382 -378 -184 246 414 -206 4 920
5241 920 614 -488 273 272 257 -378 -302 505 288 -393 -296 662 532 -552 -305 855 34 -537 -258 385 464
5262D64j048J59J006m10l85k3N65J41j220L64P13j32q69L81O80k12q30J67O10
5281A21R5p64M36N68m46k36k70L22J28k60l41N71M08p24O3N70m3n99K6N53J00
5302B78n34l24Q70L91j115k50O78L51p51l08Q47O01q06m69M54Q16r93j68Q01J31
5322E00p51k70Q21K84q91k81P93J65m75l12P22N44r69j86O98q7o27k12P58N02
5342G26o52n20N10N13o15o79Q30O05n67m45N50K89m77n8J62M74m40n30L02K34
5362B12M9p90Q50N44p85l51L20P71m13r78O74R42m61j071M72J59J71n45M16L09
5382D95m14m25q8R84l04r85O08O54k74p36K97N35r5q20K76P55n35p12M60M60k3
5403A13n88M04L19k8p48J94P84l91o85L27O52Oq18O0P22k87n32J24Q76o04k30
$$ plain form
5262 464 -584 -425 581 171 -214 -237 328 469 -751 -387 326 194 -675 -294 386 174 -656 -489 121
5281 121 216 -548 -112 456 10 -226 -496 -174 -46 -306 -647 -76 332 -392 -329 241 198 -401 -375 178 278
5302 278 -256 -580 290 681 -434 -684 -6 345 -406 -714 133 734 -72 -541 -87 729 -264 -432 369 500
5322 500 -251 -521 300 584 -307 -588 205 370 -105 -417 305 849 -120 -306 392 305 -322 -534 224 726
5342 726 74 -446 64 577 -38 -717 113 718 151 -294 256 545 68 10 172 646 206 -324 -22 212
5362 212 261 -529 321 865 80 -271 49 820 407 -571 103 1045 584 -487 -15 144 315 -230 186 495
5382 495 81 -344 -432 552 248 -737 -129 525 251 -485 -188 347 252 -568 -292 463 -72 -784 -324 136 113
5403 113 -475 -71 248 220 -528 -334 450 59 -626 -299 353 359 -459 -399 323 36 -496 -372 504 -100 -330
5424c30K4L00l3k30l68P03M36r59P9N12K83o92J3J53L11k52m62N56M10p24l18
5445e88P30M33o96o57J004N2n75l11P71M48j029J62N27L09j040k1M44K89l68k90
5465d06P04J84n14l58J070j91m45m91Q66o4j04k44N44R0o05l70L64O39r16q2O74
5486C45J97l55n11N79L68m59n22M99K66m32q2q7O74n24j34N1P12p81k31J40M00
5507A13J87n41J63N74j98n69M86L4J17o38O4Q05n08n83K72M38o40j28M06P81o13
5528B2o38L05N37k06n15L46L97k02n74K96P64o31k74j05P71k25o08K33N57o5o37
5549d52K47M84l62m22K07O94p06k40OP50k88l23m29J002m8m53kN11j31k69r2M15
5571I9K26n41Q0M62N4q49O7N35J69o75P0O08Rn66k04N17L30n49K97Q4K69p10L9
$$ plain form
5424 -330 -306 -6 -39 -269 -637 66 502 -457 -378 134 417 -275 -262 -109 202 -50 -512 44 454 -270 -588
5445 -588 142 575 -121 -778 226 278 -297 -608 163 611 -418 -256 271 580 -460 -481 -37 252 -116 -406
5465 -406 298 482 -32 -390 680 489 44 -447 419 355 251 7 551 641 36 -334 30 669 -247 -329 345
5486 345 542 187 -324 255 623 164 -358 141 407 -25 -107 -194 480 -44 -178 -127 585 -196 -427 -287 113
5507 113 300 -241 -78 496 298 -271 215 249 366 -272 -208 597 89 -494 -222 216 -424 -552 -146 635 22
5528 22 -616 -311 226 20 -495 -149 248 46 -528 -232 532 -99 -373 -478 293 68 -540 -307 250 185 -452
5549 -452 -205 279 -83 -505 -298 396 -310 -550 -544 206 -82 -405 -834 168 120 -333 -335 176 45 -224 -316 99
5571 99 325 -216 -136 326 380 -469 -402 133 302 -373 -303 305 314 -252 -456 61 391 -158 139 223 492 -218 -179
5594a79N80o0n92k43Q53R5n74l58Q69K66r55oK82L36l25N9M82O9o08j80P61k8
5616E44q42j4N55J49k22m94O22K96o87J7L13J97l29j94K84K94l59l92K04M01j20
5637B23n13L46K69j26o24K62Q07l72q72O76K01m2p95M56M03l52n40K61N93k63
5657bn47K24M97j61o73O16L92j00m96M0O81m40o46N25M16k77n44K78O39m78k83
5678c39P3O26n48j80L13J56mn37L78N35o31J0r8N52p1n00J84N39m49k99l42P13
5700H1P5l01m4M66J42q43J05L93J57o63K90P11l79q31K72L92K15o49R5N33J25
5721C42o37N8N78k26j01j74M57R4p54m2P87K27p76J07O07k41l56k76L71M85o26
5742i6p8L07r0o8l27O49N4m84j57N74L60q53LL45q3j32o7L63o9L0j76K03J62l43
$$ plain form
5594 -179 401 341 -251 -494 359 454 -120 -478 391 657 -298 -304 -22 314 -11 48 530 599 -9 -189 572 544
5616 544 -298 -312 243 392 170 -324 298 594 -93 -76 237 434 105 -89 195 489 130 -262 -58 343 223
5637 223 -290 56 325 199 -425 -163 644 272 -600 76 277 235 -560 -104 299 -53 -593 -332 261 -2
5657 -2 -549 -325 172 11 -662 -46 346 246 -250 -210 471 31 -615 -90 326 49 -495 -217 422 -56 -339
5678 -339 -266 360 -188 -368 -55 101 97 -440 -62 473 -158 -148 -246 306 235 -265 -81 458 9 -290 -632 81
5700 81 156 -145 -189 277 419 -424 -319 74 231 -432 -142 569 190 -641 -369 23 238 -411 -316 217 342
5721 342 -295 -237 341 115 14 -160 297 391 -363 -405 382 609 -167 -60 547 306 -50 -326 45 530 -96
5742 -96 -174 133 43 -25 -352 297 351 -133 -290 284 644 -209 -206 139 56 -76 -143 220 151 181 5 208 370 27
5766B7k68K20M59m50n03M38M19m16j81M83r9P7n48L01L98m33k41L34O12o76m48
5787d95N23Q0j70j77j04P01m16k44L83M90m54o61M95N94j000R3K59J97k28k95
5807d29L23K87k87l68N98O2j91n44K33M51j14m87q2N72J61n76K29N57j07m85N4
5828a43K96j35k91n9N01j14k48j53L43J3k23O3K87j50m00M0O27j28k52M3N19k43
5850A93n71N6N20L15q05K05P76n00k33K5L97Kp00J03N91j56m85J60O33k96o75
5871d45M82L27R9p17OO67k50l25K22K56j66k27K34L90m18P2m24L49J31k36k41
5892b14L49K45k90k50L19N7j95k5J44J32j51n33K84N44m35m58M54M19l09l86L01
5913BJ83l06j71J30N83o42k89L84N28o68l90O18N27n16l16L06J78m30O5P4L85
$$ plain form
5766 27 -241 -21 438 -12 -515 -77 342 -74 -255 228 129 206 -342 -41 357 -76 -317 17 629 -47 -495
5787 -495 28 108 -62 -239 -343 358 -58 -302 81 571 117 -544 -49 545 -455 -362 -103 94 -134 -429
5807 -429 -106 181 -106 -474 124 186 -5 -549 -316 135 21 -466 -548 24 185 -391 -162 395 288 -197 -143
5828 -143 153 18 -273 -332 169 55 -193 -346 -3 10 -213 -150 137 -13 -413 -373 254 126 -126 -83 436 193
5850 193 -378 -322 198 513 -292 -87 689 189 -44 -19 378 380 -320 -217 374 218 -267 -107 526 230 -445
5871 -445 37 364 463 -254 -248 419 169 -156 66 322 156 -71 163 553 135 207 -217 132 263 27 -214
5892 -214 135 380 90 -160 159 216 21 -4 140 272 121 -412 -128 416 -19 -477 -23 396 87 -299 2
5913 2 185 -121 -292 -162 421 -221 -510 -126 402 -266 -656 -38 489 -27 -343 -37 141 -289 -224 -150 235
5934B35n04l33Q05K66n38l52K24N10m90l10K90L13k36m32P93l6k52m06Q0N44j00
5955G1k29j49M32l25m07L44L59l69k01K70N15j92m82L75K66j25n68K77L72j13
5975A21l18J28M32Ko96L47L01J37p88Q1O14q0l61q3O82j12o66K07O14m14k03J08
5997E3K13N8n42K56M44m9o01pM87J62o23k05P83k78n53K19N51l18k58K85J65R3
6019C35l77k33O21o5o06J92N66n2n65J31KL78R9l62R1M4K01n47L09J32o35K26
6041a15M33k04l88O2kN68o51k79O31j5j54k6K28N34r73J4P0P57j003j09M69L89
6063B36m6p59N47J48m52O3K72j02j6l02M71R5j65k73K97J94k48j82M07j95j80
6084a90M8J28r2K33n16M23J78l53k3J11K93l08J21j61L97m78j88J91M44j69l76
$$ plain form
5934 235 -269 -602 203 469 -69 -421 -197 313 -177 -487 -197 116 -120 -552 241 205 -47 -453 -373 171 71
5955 71 -158 -307 125 -200 -607 -263 96 -273 -474 -204 311 119 -363 12 278 153 -415 -138 234 121
5975 121 -197 -69 363 365 -331 16 317 454 -334 -253 361 281 -80 -163 519 407 -259 -52 562 148 -55 53
5997 53 266 324 -218 38 482 433 -168 -175 312 474 -149 -354 429 151 -402 -183 368 50 -208 77 242 335
6019 335 -42 -275 346 281 -325 -133 433 381 -184 -53 -51 327 426 64 155 199 400 -147 162 294 -341 -115
6041 -115 318 114 -274 -212 -214 354 -297 -576 55 40 -114 -140 88 622 -351 -337 -267 490 -513 -622 -153 236
6063 236 190 -569 -22 126 -326 -263 9 -93 -109 -411 60 155 -10 -283 14 208 -40 -222 185 -10 -190
6084 -190 -142 -14 -106 127 -389 34 212 -141 -164 -53 240 -68 53 -108 289 -189 -377 -186 258 89 -287
6105b87K78N02l85r3m8L56l5m27K27L02j35n86M7M96l7m90K28L23p0l00J22N00
6127D88l68j40l1K36m7m50L85O25p26j44k6N03k05k18k7N40k98k14j8O87m16k06
6149g0J34P8J98m57pK12K52m94l2K52L64o45K06J39O7j36n11P74r3p12L0M68J24
6172A41j26p0j15K95m46j16P46l22j59j08N26q1l85q4N70J6m73k68M75J08m85
6193c61j26M07n4m6l36P27n6m51N4L39kn66J88K56K60l42m95O19r1j87K42k74
6215b95P27o13QK64qk32m43O57K32m82J25q8J10Kj11J08M21m40j10N1N15l12j13
6238b7q4M20m90j7J66M8K33o26K98L97k99k31J05N97k09o16K32M37p5l37K61J04
6260B87j31m70O92K7m61k42L89J6J43k20Q6M95k78n60K78J32J36n82L09L54J68
$$ plain form
6105 -287 -9 493 108 15 -33 323 288 -139 88 390 255 -331 -284 212 175 -315 -87 236 166 -134 -12 488
6127 488 120 -20 -51 185 138 -312 73 698 -28 -172 -198 305 100 -118 -145 395 97 -117 -135 552 136 -70
6149 -70 64 142 340 -117 -124 88 340 -154 -186 66 430 -215 -9 130 197 61 -450 324 231 -481 -451 17 141
6172 141 15 -55 -170 125 -321 -437 309 -13 -172 -280 246 165 -220 -304 266 282 -191 -459 16 124 -361
6193 -361 -487 -80 -134 -180 -516 211 155 -296 -242 97 95 -471 -283 -27 233 -109 -604 15 -76 -263 -21 -295
6215 -295 432 -181 -173 91 83 -149 -592 65 297 -185 -60 -148 -38 -36 -147 -39 382 -58 -168 -117 398 86 -27
6238 -27 -111 309 -181 -198 -32 16 249 -377 -79 318 19 -212 -107 490 281 -335 -103 334 259 -78 183 287
6260 287 156 -314 378 405 -56 -298 91 107 250 30 116 611 333 -227 51 183 319 -263 46 400 568
6281E68m16j64J71k14J43o5N7K29l75j09M65m16k66P2K66L97l60l80M26L05l94
6302f0l77M35jj07l46L05M07l26j71M22j33j99k44M97J52n95q4M22K02n14K0L00
6324EJ09k06q6O7M16o51M2M72l3k54l27L26N85k57m81L53n3N2m62K26L97k61m7
6347f8j86L72j68o6K0M22m26k07K22J99k3l29L16K33j07m87N03j0l13j38j54O77
6369B82m33J18kK99k56j0o9J52Mo90R11M5n27K47n4M93n08j64N7K70j93J23m09
6392c14P73l66j0n8L71m95j84K00M44J76m86J01P1j19l85K94O34l30l69m1L54
6413B61j03k02R2J86k20l77L87L23r3o90N33m5M48m06m15M25K40o58J60N48n94
6434b00n5J71J43R3l00k02L16J06n80M02M01M0n03k26M22K36m25l4K92lk58j19
$$ plain form
6281 568 152 -12 159 -55 88 23 80 309 -66 -175 290 -126 -392 -320 -54 343 -17 -397 29 334 -60
6302 -60 -437 -2 -3 -110 -456 -151 256 -70 -241 181 48 -151 -395 102 254 -341 -425 -3 199 -315 -295 5
6324 5 114 -92 -178 -111 305 -346 -304 168 135 -119 -446 -120 465 208 -273 80 27 79 -383 -157 240 -21 -68
6347 -68 -254 118 -50 -116 -96 326 -100 -307 -85 114 91 -238 78 311 204 -283 220 210 -103 -241 -395 282
6369 282 -151 -33 -35 264 8 -2 -71 81 85 -605 306 351 -176 71 17 510 2 -162 -105 165 -28 95 -314
6392 -314 459 93 83 25 396 -99 -283 -83 361 537 51 152 223 104 -281 13 647 317 -52 -93 261
6413 261 158 -44 48 234 14 -363 24 347 254 -436 97 52 500 94 -321 104 344 -314 -154 394 -200
6434 -200 -255 -84 59 152 -148 -350 -34 72 -508 -106 295 335 -168 -394 28 264 -161 -195 97 94 -164 -283
6456b83J90J58k18k03O01j85k23j35M62m51l8L41j95M41m63j85K70L05l04r0K09
6477Do9j89J16L80k03r4r4J77J60q9k49RM59l52q5J79J95j02m54P31k53k45n3
6500a21k2N81l80l58K46K95k0l33j27O12l31j47j65P01j26o14K55L92n43j07J22
6521a90N43k36m74L76K81p8j72J3L38m24K72j25K97m67k10M77j87J95l80J39m1
6542e3J08k52K42J32q7n46N82J25pp38L55J47p9l19L21K97o6k85j42N28l95o2
6564a94J08N98n01j19K1m6PQ8l15L76Q8o51k4M59J35m64j67N26M28p53j87O40
6586E3k00n2P4L16j24j92k63L37R2j99l17M71K3k07J11M17l62l3p5K33J74l47
6608g0J8K30j62j63q2M40k3k97K7L3O0M8m4M14n12j65l1L51J07j62j51L10j03
$$ plain form
6456 -283 -93 65 -153 -356 245 60 -163 -298 164 -287 -325 16 -179 262 -201 -386 -116 189 -115 -205 4
6477 4 -65 -254 -138 242 39 -55 -149 28 188 99 -150 -141 318 -34 -119 60 255 153 -301 430 177 -68 -121
6500 -121 -143 438 58 -300 -54 241 221 -112 -239 373 42 -105 -270 431 305 -309 -54 338 -205 -312 -190
6521 -190 353 117 -357 19 300 222 50 63 401 -23 249 124 421 -46 -256 221 34 229 -151 -12 -53
6542 -53 55 -197 45 177 90 -456 126 251 244 -494 -139 8 -71 -390 -69 228 162 -123 -265 263 -132 -194
6564 -194 -86 512 11 -108 -87 -133 -126 -38 -353 23 111 -540 -564 -105 30 -434 -601 -75 353 -400 -587 53
6586 53 -147 -199 -125 191 67 -125 -388 -51 41 -158 -475 -4 19 -188 -77 340 -22 -55 -130 103 277 -70
6608 -70 -52 178 16 -147 -229 211 188 -109 -82 -49 11 59 15 429 -83 -248 -279 72 179 17 -134 176 73
6631G3o5l04N38J27l29Q0j13N32n03J20n1J33k16j63L81J88l47m02J44M81j49
6652A55m73M18K84l53l84M62L77l23l60M22L5l57j68M85J3k1m69j2L87R7l40K48
6674A23j5k13K05pM7l02j06J30P9j72K4MK74j09k3q7L63l08l31J94J38K68k21
6697d5J14N1r0m7l20L85l04j58M06j15P1q1J98k8J43m54K41J31L08n74k37N55
6719A50j61j65nP4M7j95K51K94k2m33Q1K20R6k36k21M73j49l89R7L8J56j72J58
6742a3J73k64Jj34O12l28j10M3J82j13j03J77j72Pr6L63j4J0J7n79J02O03k30
6765A34l84N76k69J57n5k04K10j08k8p4J24K6j03L13ml23J39M41q8m89k49J82
6787g6J56Q1k58L50j07k28o7O34k27k80m26N38J92k55J6j32Q6k14K09K88J23m40
$$ plain form
6631 73 8 -296 242 369 40 120 7 539 36 156 105 238 22 -141 240 428 81 -321 -177 304 155
6652 155 -318 100 384 31 -353 109 486 163 -197 225 260 -97 -265 220 233 212 -257 -269 118 215 -125 123
6674 123 108 -105 100 93 140 -162 -268 -138 -59 -231 -207 -203 71 -38 -61 -148 215 -93 -424 -230 -92 176 -45
6697 -45 69 120 30 -17 -337 48 -256 -414 -8 -123 -52 -133 65 37 180 -274 -33 98 406 -168 -405 150
6719 150 -11 -176 -181 -107 -60 -255 -4 290 268 -165 -84 136 232 -4 -225 248 99 -290 -193 -155 1 -171 -13
6742 -13 160 -104 -103 -237 375 47 -63 -20 162 49 -54 123 -49 -42 -138 225 211 221 238 -341 -239 364 134
6765 134 -250 326 57 214 159 -45 165 57 29 -45 79 105 2 315 311 -12 127 568 480 -9 -258 -76
6787 -76 80 161 -97 253 146 -82 -149 485 258 -22 -448 90 282 27 43 -89 -3 -217 -8 280 403 -37
6809c7m42N04J44j95k26K86J4J00j73J10L3j61o5J42M54j86m55J44j5n2k08J84
6831a00N41l39o63M89l4J04l83L61L03o1m87R1K17K24m73PJO9l1m3K77k34j33
6854b97J62J64M97q72r5M54J09l32r4L67q2m35L05M30j88j32j32P7j14m1N7N76
6876C84k97l28L8N34l29j83J62M7J15j6j28J88j17K04j75K5J70m93J42L36r5m10
6898b26K38N8l1R4k22J09M59n69K54j24L21k80k65N87k21l05j18P2M32l59l01
6919c97O08j52J3k27K28K07n06M3L63l1k79J2j3L86l48K7J43K44j50l20L85q8
6941A48k24m1J86L66m95l74L72M30k21n22K94J17M7O7m16O22j04k72M7k23j94
6962c90Q4K17J69j14l55J23N17l40l16K13J76R8k62j13J81L3k64O77m43K08k63
$$ plain form
6809 -37 -479 25 169 -26 -252 34 48 148 -25 85 118 -43 -108 34 488 302 -153 -9 -24 -76 -284 -100
6831 -100 441 102 -561 -72 -106 -2 -385 -24 279 218 -269 -178 39 263 -210 -203 -202 -133 -164 -207 70 -164 -297
6854 -297 -135 29 526 -346 -441 13 122 -210 -304 63 -19 -454 -149 281 93 -39 -171 -94 -208 -249 -192 384
6876 384 87 -241 -203 331 2 -181 -19 28 143 127 -1 187 70 274 99 124 294 -199 -57 279 184 -226
6898 -226 12 70 39 133 -89 20 479 -90 164 40 361 81 -184 403 182 -123 -241 -169 263 -96 -397
6919 -397 211 59 72 -155 73 280 -226 -183 180 149 -130 -118 -131 255 -93 -66 77 321 171 -149 236 148
6941 148 -76 -117 69 435 -60 -434 -62 368 147 -375 -81 36 83 150 -266 356 252 -20 27 -196 -390
6962 -390 -306 -89 80 -34 -389 -266 251 -89 -405 -192 -16 82 -180 -293 -112 -79 -343 334 -109 99 -164
6983a64J59k21J91m32M75N1j35J49k60N03k55k89J72N1M6j33j84M21J04o30L76
7004eM13k22rk79O21j89k61l02K99K43k10k10J07K35o4l73L69Q2m67J19j27M12
7026A82j21j14K99j77k58L94N7k47M3l29N44R9m10k37L13J67l83L64j41J19j3
7047A51l29L63o7K6k53K23L71n14j83K40P3k18LL65j09k51J78j26K70n87M22n8
7069a0j18j15n4N24J37l63q7k24J88J39R0r0l1J2l25K11J00j07k28M60j5o78L39
7092b45n8M08o4j85K25m5J48n18K23K68j2n50M21J57k76j18O4N24l93k44J02L41
7114A73m46j63L40M46j88l03j62K85J14m44N48j82p7k30J56J58mp5Q6K00r0n74
7136d32L53K59J6k16j18K01l4l97N11j0J1j46k25m8M77m66N7N20R1m52J21K69
$$ plain form
6983 -164 -5 -226 -35 -467 8 59 -76 73 -187 316 61 -228 -56 -5 41 -92 -276 145 249 -381 -5
7004 -5 408 186 177 -102 519 330 69 -233 66 309 99 -111 -4 231 167 -206 163 245 -222 -103 -230 182
7026 182 61 -53 246 69 -189 205 262 15 58 -271 273 372 -38 -275 38 205 -178 186 45 164 151
7047 151 -178 185 118 144 -109 114 485 -29 -212 28 101 -117 -114 251 142 -109 69 -57 213 -374 48 -10
7069 -10 -128 -243 -297 227 364 1 -86 -310 -122 17 107 17 -14 -2 -327 -116 -16 -123 -351 109 94 -584 -245
7092 -245 -303 105 41 -144 81 36 184 -334 -111 157 145 -405 16 173 -103 -221 -157 367 -26 -270 -168 173
7114 173 -273 -436 -96 350 162 -141 -303 -18 96 -348 200 18 -59 -289 -133 25 21 -54 32 232 142 -432
7136 -432 -79 180 196 -20 -138 63 29 -368 143 133 144 -2 -227 -275 202 -264 -207 313 404 -48 73 342
7158C42j36l41j8n5M71k51m1M15l48j79K48P7r0J1n53M29K46n2Q3l10K64m02J46
7181d4P0J53j35k11L99j77J70l59L23l6m49J67K11J40l57j24M76l0m19K96K02
7202B66l91k74O8J89J1K00k24J03J28j45k8R3L13n34j6M30j09J16m94L89K81k8
7224C44o5k11N7l95J54l8j83J01j72n2M30K25l87L2L57l87r2L16j35j6k93M81
7246G1rj06l8mJ22l4j21J83M09o11k0K74P2m25k5P7N86l34j26K28j21K72l52j38
7270a70L19j57k5J7J52P7l64J45K60k83k31K05J17R1j91J0J88P6j93L1M1K70m04
7293a9k2J72k08P29p33L14R0l02O9P9m2j70k31K16Q2N9j86m5J59j93J32J42Nj74
7317g7l0M34k80m46L14K70L25o11m0K99L5l51R0j10o7N6J17J47l2l8m0L3L41m22
$$ plain form
7158 342 206 -135 -153 -208 263 12 -29 386 38 -141 107 184 94 105 -448 -19 227 175 258 -52 212 -190 -44
7181 -44 26 179 44 -167 232 55 225 -134 189 153 -296 -129 82 222 -135 -259 217 187 -232 64 266
7202 266 -125 -399 -331 -142 -131 69 -155 -52 76 -69 -97 -4 309 -225 -241 189 80 196 -298 91 372 344
7224 344 279 68 125 -270 -116 -154 -337 -236 -408 -460 -30 195 -192 -160 197 -190 -282 34 -101 -117 -410 71
7246 71 62 -44 -82 -86 36 2 -119 64 473 -138 -158 116 188 -237 -262 -185 401 67 -59 169 48 320 -32 -170
7270 -170 149 -8 -33 -16 136 213 -151 -6 254 -29 -260 -55 62 153 -38 -28 160 236 43 74 115 385 -19
7293 -19 -41 131 -77 652 -81 233 323 21 90 169 127 -43 -274 -58 24 83 -103 -148 11 -182 -50 92 97 -77
7317 -77 -107 327 47 -399 -85 185 510 -101 -141 158 193 -158 -68 -178 -245 -189 -72 75 43 5 -35 -2 339 -83
7341h3r0R5j0n9n4M78k49k11j4M23k26M8n7j05K36m44R5N93m46J57k13j6L57m58
7365b53R5L89p1k2o14N46j02j90o8K92J1j50k26M15M43m13l46N5L71M0m41L7O16
7388D14p13L98l59L55j51j59K74j78L25k21NK21l64J58R2m81K67l19K57J74O9
7409F4m04L99j17m2K15k07M33m24J13j52K44K03k72O1K34l49lN1J61j90j33R3
7431b2J0J47J47k49L69l71m64O65j26J09m87J4L41j55J51k87N32l63k98M2O33
7452C38l35j25J4Q9Q3j38qL75n7j85j88K18mk37K36R1l01K07n7O9J12k34j03J91
7476E1j67k87N0L73N4k37L7R4J86l32K03j13j35m0K56j72K03K3j91O5J75J05j98
7499Ck2N7p1r2K90J03r8m92K89J8J24l31l1J86K44l41L16K5m53K43k5K67j49k25
$$ plain form
7341 -83 -173 -78 -88 -147 -201 277 28 -183 -197 226 0 48 -9 -114 122 -322 -227 366 -80 77 -136 -152 205 -253
7365 -253 -158 231 160 138 -476 70 -32 -222 -290 2 13 -137 -363 52 495 82 -264 -209 162 202 -239 -202 414
7388 414 -299 99 -260 95 -56 -215 59 -119 206 -15 -10 211 -153 5 97 -384 -117 -436 -179 -5 64
7409 64 -340 59 -58 -100 115 -92 341 -83 30 -122 122 325 53 114 348 -1 -4 47 208 18 -115 -22
7431 -22 -12 135 282 33 402 31 -433 232 106 215 -272 -258 83 -72 79 -208 324 -39 -337 -295 338
7452 338 3 -122 -108 -19 64 -74 -82 293 236 51 -137 81 77 -160 76 167 -134 73 16 85 197 -37 -140 51
7476 51 -116 -403 -353 20 74 -163 -126 -32 154 -178 25 -88 -223 -263 -7 -179 24 47 -144 -79 96 201 3
7499 3 -19 38 -33 -125 165 268 170 -322 -33 -15 109 -222 -253 -67 177 -164 152 177 -276 -33 -58 209 60 -165
7523a65j1K83J01m45K89J18K5l33J76J41m06K5L91j35j54J20j52O0J13o7J67O5
7545B06k21j26OmJ8j83L41N20l88l84L79Lj81K4P5k7J45k90m1M23j45l3n7K5O1
7570A46l42M10l41L87j04j00J82J11p02J63K18j06J78l03L11j39m6o7K90k5n82
7591d61M98j15p5J48l91M54n2l18L08M5l26K7P2J35j4Mn0MO3j27q1M17R2j10k75
7616a28J03j54n3k7M19J04l31o6K65l00J0J32J05k82N16m55J72J55l01l34M49
7637aN9j85k88O64k42j85K56N9j05j90k56M30J24k19k73M50p0q8n9j02L15k02
7659a08L9J69l1j09l0K78o3P8j09n0j01O7l46L38L9j32K53k50L80J93o01n3K00
7682E1Rn4JJ51M8kj92L51l62J30j48J15r8m6L47n3l39K2J73j00K99n59J58n2P8
$$ plain form
7523 -165 -176 107 208 -237 52 170 195 -138 38 179 -227 -202 189 54 -100 20 -132 -72 41 -26 141 206
7545 206 -15 -141 -135 -139 -121 -304 37 557 169 -215 164 167 -14 10 85 58 203 -87 -128 295 150 117 60 85 146
7570 146 -196 214 -127 260 156 56 238 349 -353 -190 28 -78 100 -203 108 -31 -77 -144 146 121 -461
7591 -461 37 -78 -153 -5 -396 58 6 -312 -4 41 -285 -258 -186 -51 -65 -61 -111 -107 -44 -171 -252 165 257 147 -128
7616 -128 -25 -179 -232 -259 160 264 -67 -133 132 -168 -158 -26 79 -203 313 -142 30 185 -116 -450 -1
7637 -1 58 -127 -415 249 7 -178 78 137 32 -158 -414 16 140 -79 -352 98 28 -60 -119 -221 94 -108
7659 -108 -69 100 69 -40 -70 208 145 223 114 64 -37 30 -316 22 61 -71 182 -68 312 505 -96 -149 51
7682 51 60 6 7 158 206 204 12 363 1 131 -17 98 0 -46 301 248 -91 -69 104 4 303 -256 -98 -150 -72
7707g2R0j73J29L05k08m54O41o56j11O73j70Q4j74J63j50L06m18J31K06k71j5
7728a44R7J27j33m4K75p2j64qK20J36n16K02m2N2o0J8M5r4J26j13j5O8k6r6j11
7753b72K19K41l48j48O24m37k50K99j04J67k43K59r4K35n7j11J19r7r0kQ7M28
7775D25o09j2j34K80J50k76J32J10j14J03k8m8J06j89J91L05j88k31J41k1o9k9
7797eo8L13l13m5KM91l33k35L66rJ01J15j63L0k17j33L48n5m16K55J60k41k61
7820c13K06M2J40m0l5J04M6M8l62K16k0J93n77L97J87k01j6k15N26m02j35M8K32
7843F9j53pq2M07k17J21k11L75j54R8j30r3l5J24k73K98k71J4J57L6O8k40j3K66
7867A54j35j47%O8o6K24lJ29M3j00l05K15j45j00J72N6j89J54L02j80r8k67NL37
$$ plain form
7707 -72 18 -155 -26 279 71 -383 258 -398 -509 164 -6 78 -96 67 -83 223 -195 -64 142 -129 -144
7728 -144 -47 80 -53 -97 178 106 -58 -66 154 290 -226 -24 -66 -14 -74 -56 -11 -105 21 -92 -107 -39 -65 -161 -272
7753 -272 -53 188 -160 -308 316 -121 -371 -72 -176 -9 -252 7 -87 148 91 -20 99 2 -88 -90 -3 425
7775 425 -184 -196 -330 -50 100 -176 -44 66 -48 55 27 -21 85 -104 87 392 204 -27 114 93 24 -5
7797 -5 -73 240 -73 -118 -116 375 42 -193 173 164 265 380 217 247 30 -103 245 190 -226 29 189 -52 -313
7820 -313 -107 -65 75 35 0 104 150 198 -164 52 32 225 -352 45 232 31 15 -200 326 -76 -211 -163 69
7843 69 -84 -91 -173 234 17 138 -73 302 148 246 116 23 -12 112 -161 137 -134 -120 37 73 141 -99 -112 154
7867 154 19 -128 -128 -60 -126 98 95 224 267 167 -138 77 -68 -168 4 60 -129 25 327 147 49 -218 -213 124
7891A24l18LQ0L13q0q0o3j23K42k08j15k3o9K93j74J84L49L1l20KN6K8k98L93
7915B27k30k06J17M58j25k33k16K94K18l95K2ML88l82j78O01k46Q3m84J65N94
7936D76j93l11L0Q5l07J06L47J39k6r6n4j16J11L2k33P8J45l53J65J00j29k71
7958b75N75k78M7m56M30K46k45p9P4j94K08k03j20J12J14o1R0J68l07K59k24o2
7980a81L16k48Q7J06j01k75L72M1l86J60j73N68m07O7j52J72K69l55p8J39J19
8001F0l34L0M22j64j86MK15j59j8L18l43K50j2k05Q7l11J28K99q3J9o2n8j88L34
8025D3J57j18K2k30K64j47j54L55P9m46J52J25k9j82K16j61j32k44L73j24J20
8046f1L66l68J20q6l20O33j7l23m3R3K28ql76L11j0j38r2K81j28J94k73N5J47
$$ plain form
7891 124 -194 -191 -111 202 122 42 -21 -144 98 -110 -225 -248 -317 -24 -198 -14 335 366 46 48 104 132 -166 227
7915 227 -3 -209 -92 366 241 8 -208 86 304 -91 -69 -65 323 -59 -237 364 118 201 -283 -118 476
7936 476 283 -28 2 87 -220 -114 233 372 346 250 196 80 191 223 -10 68 213 -140 25 125 -4 -275
7958 -275 300 22 69 -387 43 289 44 -35 39 -155 53 -150 -270 -158 -44 -105 -15 153 -154 105 -119 -181
7980 -181 135 -113 -26 80 -21 -296 76 117 -269 -109 -282 286 -121 -54 -206 -34 235 -120 -198 -59 60
8001 60 -274 -244 178 14 -172 -168 47 -112 -130 188 -155 95 83 -122 -35 -346 -218 81 -2 17 -45 -103 -291 43
8025 43 200 82 104 -126 138 -9 -163 192 271 -175 -23 102 73 -109 107 -54 -186 -430 -57 -181 -61
8046 -61 305 -63 57 -29 -349 284 267 -56 -99 -6 222 214 -162 149 139 1 -91 190 62 256 -17 38 185
8069A85n0k21O7K42l51J4J49R5l70L64k65L56jj66J57q4j83K79j90J05L3l83M33
8092B15j32Q2m08K5N5K35k39J13j31l2O63o82J73j69p8K7M53k80k0J15m3q1l7
8115a76K61o0j95k01K58J54Q9k67p5M33k47j67Q4kK97n13K85P9L6R1l40L31J76
8138C31n62j01L85j38n51N19p8J37m5J15J08J30l12o8L99j74k43k45L40P2J6k21
8160a86k7NO3j00J64o4R8J69K3j21j0k29L81l11p1L4M35j49N8k08p3K48N9j83
8184EK82l08J49q8j04K25l69
$$ plain form
8069 185 135 -86 -19 223 -128 -114 35 130 -240 124 -141 215 214 48 205 121 -62 217 27 132 165 -218 215
8092 215 83 165 -243 -218 -163 72 -167 -54 -185 -217 446 -236 -63 -232 -310 -283 170 -110 -130 -15 -58 -139 -176
8115 -176 85 25 -170 -371 -113 41 130 -137 -212 221 -26 -193 -109 -111 186 -327 -42 37 73 164 -176 155 331
8138 331 -231 -332 53 -85 -636 -117 -195 -58 -103 12 120 250 -62 -130 269 95 -148 -393 -53 19 35 -186
8160 -186 -213 -208 -145 -245 -81 -145 -47 122 145 24 14 -215 166 -145 -216 -182 253 104 162 -46 -119 129 188 5
8184 5 287 -21 128 40 -64 161 -208
8191b08
$$ Imaginary data points
##PAGE= N=2
##DATA TABLE= (X++(I..I)), XYDATA
0@%%%%%%%Qj6J6j6K4l2L2m0M8n6O4p2Q9j06J22j41J65j91K15k44K81l18L57m02
31b13M53n07N65o31P05p83Q66r61J068j181J303j445J604j776J968k189K442k730
49a442L068l470L952m547N304o302P682r718J3024j9273L5013j42622k68683L90589
63B575K16630l54037k48673L31383K27464l02797k28637K92051K24198k50295
73i0138k00671K52307J98636k21773j78645K26423J84263k00449j76125J91413
83a4759J72841j75490j72989J62425J73968j45691j76194J31269J77293j15051
93A7622j74251J14195J89336r4242j86117R5034K03805p6810k00270Q1965K19195
104A89462o8628k26237O1993K34199n5781k40568M7893K40235n4391k55300M2571
$$ plain form
0 0 0 0 0 0 0 0 0 8 -8 8 -8 16 -16 16 -24 24 -32 32 -40 49 -57 65 -76 89 -102 113 -131 150 -168 189 -213
31 -213 240 -267 298 -333 372 -411 455 -506 562 -619 684 -761 843 -933 1035 -1154 1288 -1442
49 -1442 1626 -1844 2108 -2439 2865 -3437 4245 -5473 7551 -11722 23291 -119331 -388014 2575
63 2575 219205 -134832 -383505 -52122 175342 -127455 -356092 -64041 160157 -90138
73 -90138 -290809 -38502 160134 -61639 -240284 -13861 170402 -30047 -206172 -14759
83 -14759 158082 -17408 -190397 -27972 145996 305 -175889 -44620 132673 17622
93 17622 -156629 -42434 146902 52660 -133457 -38423 165382 88572 -111698 -29733 189462
104 189462 120834 -105403 -43410 190789 135008 -105560 -57667 182568 128177 -127123 -84552
115h4552K50244m8564k57319M2839K48890n5592k57476N7684K57508o1731k60248
126a68317O0921K58105o5087k58075O7098K59592o3855k57821N8322K50853n4661
137H7075k43536N1864K37008m7179k30099M0457K20500l3684k10476L0695K04541
148A07166k3278j98150J5942J94528l237j85174l632J82350J5682j77222k5010
159a00035J74298L8473j66479m4929J64218N1463j63293n8367J64463O6953j64881
170c8116p3656J64967P7390j69762q3456J75505R0059j79871r9433J80236J01405
181A45268j82491j05131J85004J08386j88681j12617J85998J13349j86018j11741
191a48674J85674J10089j86903j11318J85022J11148j82026j09872J79080J07532
$$ plain form
115 -84552 165692 117128 -140191 -97352 151538 95946 -161530 -103846 153662 91931 -168317
126 -168317 -107396 150709 85622 -172453 -105355 154237 90382 -167439 -109117 141736 87075
137 87075 -156461 -104597 132411 85232 -144867 -104410 116090 82406 -128070 -97375 107166
148 107166 83888 -114262 -98320 96208 92971 -92203 -95835 86515 102197 -75025 -100035
159 -100035 74263 112736 -53743 -98672 65546 117009 -46284 -104651 59812 126765 -38116
170 -38116 -111772 53195 130585 -39177 -122633 52872 142931 -36940 -136373 43863 145268
181 145268 -37223 -142354 42650 151036 -37645 -150262 35736 149085 -36933 -148674
191 -148674 37000 147089 -39814 -151132 33890 145038 -36988 -146860 32220 139752
201A39752j76722j08175J71835J09603j65287j09078J56546J07121j50474j07371
211a32250J42990J08141j34877j08507J26200J07848j19764j08644J13719J12705
221A07561j05798j15462R8178J18492r0233j20215Q6574J25032q0063j29340P3972
232c1302J34053o7824j36498O4665J39763o2597j44899N9064J48957n5410j51133
243a03161N3821J53142n3456j57397N2722J61927m9932j62627M8367J64187m7159
254F0434j65066M7662J66262m5003j67260M3192J64636m1999j63357M1207J61888
265A02596m0004j60739L6697J58034l4001j55396L2716J53275k9139j51391K5694
276f1658J48921k0832j45104J7724J43049j3932j40477Q810J38328l665j35882
$$ plain form
201 139752 -36970 -145145 26690 136293 -28994 -138072 18474 125595 -24879 -132250
211 -132250 10740 118881 -15996 -124503 1697 109545 -10219 -118863 -5144 107561
221 107561 1763 -113699 -15521 102971 12738 -107477 -20903 104129 24066 -105274 -31302
232 -31302 102751 34927 -101571 -36906 102857 40260 -104639 -45575 103382 47972 -103161
243 -103161 -49340 103802 50346 -107051 -54329 107598 57666 -104961 -56594 107593 60434
254 60434 -104632 -56970 109292 64289 -102971 -59779 104857 62858 -100499 -59292 102596
265 102596 62592 -98147 -61450 96584 62583 -92813 -60097 93178 64039 -87352 -61658
276 -61658 87263 66431 -78673 -60949 82100 68168 -72309 -63499 74829 71164 -64718
287f4718p27J32678N056j32250j0253J30465J5077j29647j9532J27353K3557j28003
299e0944k7765J28079L2581j27740l7714J26884M0864j26444m4135J26673M7436
310H7775j26958n1769J26324N4255j25987n6747J26067N8087j26009o0550J25407
321B9895O2848j24788o3770J23438O4857j22016o6321J21118O8334j19252o9181
332i4838J16974P0330j14971p1276J13319P2054j10136p3279J07664P3829j04544
343a4874p5263J01604P6295r8476p7814R5334P8702r1892q0671Q8624Q2718q5999
355a712q4495Q1984Q5687p8915q6732P6158Q8323p2964r1071P0397R2223o6597
367A2286r4062O4023R6288o1662r7866N9361J00019n6648j01174N4648J02433
$$ plain form
287 -64718 -65445 67233 72289 -59961 -70214 60251 75328 -54319 -73851 53502 77059 -50944
299 -50944 -78709 49370 81951 -45789 -83503 43381 84245 -42199 -86334 40339 87775
310 87775 -39183 -90952 35372 89627 -36360 -93107 32960 91047 -34962 -95512 29895
321 29895 92743 -32045 -95815 27623 92480 -29536 -95857 25261 93595 -25657 -94838
332 -94838 22136 92466 -22505 -93781 19538 91592 -18544 -91823 15841 89670 -14874
343 -14874 -90137 11467 87762 -10714 -88528 6806 85508 -6384 -87055 1569 84287 -1712
355 -1712 -86207 -4223 81464 2549 -84183 -8025 80298 7334 -83737 -13340 78883 12286
367 12286 -81776 -17753 78535 16873 -80993 -21632 78387 21739 -79435 -24787 77646
378G7646n2032j03789N0728J05699m8671j06172M6097J07549m4079j07848M2560
389c2312J08717l9912j09551L8587J10385l6325j10982L4983J10831l2658j10989
400f9226L1282J10576k9098j10152K6769J10309k4719j09791K2318J09241k0335
411D7174j08941J8137J07978j5343j07688J2602J07368j0548j06526P814J05509
422E7536n551j04826K846J03951l45j02871k753J02378N006j01742q168J00850
434D6311J0660j00618j3911J00051J6588r9618j9143R8559K1018r8145k3921R7631
446C5462K6521r6840k9131R5954L1311r5535l3841R4524L5788r4202l7730R3566
458B5847L9385r2957m1258R2108M2727r1743m4145R0553M5744q9257m7584Q7867
$$ plain form
378 77646 25614 -78175 -27447 78252 29581 -76591 -30494 77055 32976 -74872 -32312
389 -32312 76405 36493 -73058 -34471 75914 39589 -71393 -36410 74421 41763 -69226
400 -69226 -37944 72632 43534 -66618 -39849 70460 45741 -64050 -41732 67509 47174
411 47174 -61767 -43630 64348 49005 -58683 -46081 61287 50739 -55787 -47973 57536
422 57536 51985 -52841 -49995 53956 53611 -49260 -52013 50365 55371 -46371 -54539 46311
434 46311 56971 -43647 -57558 42493 59081 -40537 -59680 38879 59897 -38248 -62169 35462
446 35462 61983 -34857 -63988 31966 63277 -32258 -66099 28425 64213 -29989 -67719 25847
458 25847 65232 -27725 -68983 23125 65852 -25891 -70036 20517 66261 -22996 -70580 17287
470A7287M9027q6447n0045Q4680N1707q3352n3203Q2035N3921p9913n4556P7995
482I136N6072p6403n6980P4670N8446p2680n9750P0730O1182o8216o2542O6326
494iO3838o3597o5884O1803O7628n9736o8130N7040O9723n5142p0156N3396P1658
507F2432n1346p3115M9746P4736m7620p6335M6788P7850m4920p9237M3026Q0588
519F2593m1179q1176L9073Q2481l7330q2911L6172Q2957l4388q3178L3317Q3861
531F0292l2433q4316L1275Q4668k9639q4065K7991Q4440k6751q5117K4747Q5015
543E6107k2296q4226J9949Q2935j7635q2792J5779Q1719j3450q1138J1056Q0609
555D6617j0071p9740P913P9966o042q0381K841P9760J33p9531k616P9713M906
$$ plain form
470 17287 66314 -20133 -70178 14502 66209 -17143 -70346 11689 65610 -14303 -68859 9136
482 9136 65208 -11195 -68175 6495 64941 -7739 -67489 3241 64423 -3793 -66335 -9
494 -9 63829 232 -65652 -3849 63779 4043 -64087 -7047 62676 7534 -62622 -9226 62432
507 62432 11086 -62029 -12283 62453 14833 -61502 -14714 63136 18216 -61021 -17995 62593
519 62593 21414 -59762 -20689 61792 24462 -58449 -22277 60680 26292 -56886 -23569 60292
531 60292 27859 -56457 -25182 59486 29847 -54218 -26227 58213 31462 -53655 -28908 56107
543 56107 33811 -50415 -30466 52469 34834 -47958 -32179 49540 36090 -45048 -33992 46617
555 46617 36546 -43194 -35281 44685 38643 -41738 -38897 40863 40996 -38535 -41151 38562 43468
568D3468p9610q397P8792J1136p8527j2865P7789J4389p8141j6413P8301J7785
580D7707p8509j9035P8481K0195p8997k2489P9314K4545p9321k5870P8720K6651
592E1392p8007k7940P7485K9552p6501l0642P5083L0206p3988l0196P3551L1050
604E1045p2441l2270P0805L2908o9487l3569O8968L4977o7152l7083O4331L9036
616E0068o1902l9489N9598M0715n8071m1835N5440M3773n2844m4468N0610M6177
628D7772n0344m7449M8970N0393m7181n2149M5564N3767m4600n5300M3467N8134
640E1044m1931n9606M0119O0730l8941o1495L9091O2315l7704o4167L7451O4027
652E0933l6694o3772L7154O5270l7789o6023L6271O7126l5124o6534L4672O6484
$$ plain form
568 43468 -36142 -44539 34253 45389 -33138 -46003 31786 46175 -31966 -48379 29922 47707
580 47707 -30802 -49837 28644 48839 -30158 -52647 26667 51212 -28109 -53979 24741 51392
592 51392 -26615 -54555 22930 52482 -24019 -54661 20422 50628 -23360 -53556 19995 51045
604 51045 -21396 -53666 17139 50047 -19440 -53009 15959 50936 -16216 -53299 11032 50068
616 50068 -11834 -51323 8275 48990 -9081 -50916 4524 48297 -4547 -49015 1595 47772
628 47772 -2572 -50021 -1051 49342 2161 -49988 -4424 49343 4743 -50557 -7090 51044
640 51044 9113 -50493 -10374 50356 11415 -50080 -10989 51326 13622 -50545 -13094 50933
652 50933 14239 -49533 -12379 52891 15102 -50921 -14650 52476 17352 -49182 -14510 51974
664E1974l4540o5999L2404O6087l0048o4851K8858O3480k8386o2992K7172O2791
676D5950k4780o1925K2310O0903k1549o0410J9633O1294j6653o1599J3193O0624
688C6991j0542o0271Q023O0888n483o0777J442O0350J050o0351j673O0103L246
701C2996o1358o480O2391Q170o2516r739O3182J0743o5569j2272O6066J5242o6300
714b5444j6247O5749J6252o6595j7002O7180J7765o5899j8399O4890J7342o4835
726b5243j6909O5387J7626o5277j8425O3843J8022o2769j8333O2805J9193o1555
738b1635k0997N9156K1958n6022k1737N4076K2075n2837k3677N0521K5033m7359
750a1445k5691M6171K6266m5614k8567M4778L1785m2551l3909M0666L5231l9618
$$ plain form
664 51974 17434 -48565 -16161 49926 19878 -44973 -16115 47365 18979 -44013 -16841 45950
676 45950 21170 -40755 -18445 42458 20909 -39501 -19868 41426 24773 -36826 -23633 36991
688 36991 26449 -33822 -25799 35089 29606 -31171 -29729 30621 31671 -28680 -30353 29750 32996
701 32996 -28362 -34842 27549 35719 -26797 -36536 26646 37389 -28180 -40452 25614 40856 -25444
714 -25444 -41691 24058 40310 -26285 -43287 23893 41658 -24241 -42640 22250 39592 -25243
726 -25243 -42152 23235 40861 -24416 -42841 21002 39024 -23745 -42078 20727 39920 -21635
738 -21635 -42632 16524 38482 -17540 -39277 14799 36874 -15963 -39640 10881 35914 -11445
750 -11445 -37136 9035 35301 -10313 -38880 5898 37683 -4868 -38777 1889 37120 -2498
762b498l7212L8438M1259l6442m2518L3532M3761l3151m4469L3485M6699l3313
774G571m8203L2810M8878l2462m9866L4485N1079l4606n3063L3690N4254l2887
786A1680n3345L3055N3225l2779n4185L2161N3527l0469n1804L0448N0498l1940
798A0072m9807L1438N0173k9845m9674K8959M7675k7531m8087K6724M8543k4226
810A4414m8254K0249M7147j8627m5749J6928M6113j4924m5969J1857M4806r783
822A8208m4734Q912M5323p374m7242M402M7907j534m8468m66M9656J533n1472
835b5349m093N2219O812n1767q280N1510Q288n2669q622N3538J0108n4187j0351
848c2843N3958R529n5197r337N6712J0440n6870j1831N5961J1707n5063j1325
$$ plain form
762 -2498 -39710 -1272 39987 3545 -38973 -5441 38320 5169 -39300 -5815 40884 7571
774 7571 -40632 -7822 41056 8594 -41272 -6787 44292 9686 -43377 -9687 44567 11680
786 11680 -41665 -8610 44615 11836 -42349 -10188 43339 12870 -38934 -8486 42012 10072
798 10072 -39735 -8297 41876 12031 -37643 -8684 38991 11460 -36627 -9903 38640 14414
810 14414 -33840 -13591 33556 14929 -30820 -13892 32221 17297 -28672 -16815 27991 18208
822 18208 -26526 -17614 27709 20335 -26907 -22505 25402 23868 -24600 -25066 24590 26123 -25349
835 -25349 -29442 22777 29589 -22178 -30458 21052 29340 -23329 -31951 21587 31695 -22492 -32843
848 -32843 21115 30644 -24553 -33890 22822 33262 -23608 -35439 20522 32229 -22834 -34159
860c4159N5280J1153n4309j2536N2938J1790n0411j1017M9409J1402m9225j2530
872c2215M8010J3772m6329j3659M4849J4374m4388j5981M2790J8449m0280j9710
884c0318L8651K0280l6930k2328L6105K4245l3881k5771L2816K6233l2095k7779
896c0772L2446L0618l2344l2515L1331L3763l0420l5005L0643L7175l0344l8898
908c4322K9629L9718k8678m0054K9188M0430k9584m1148K9428M1749k8651m1414
920c3709K9337M0535k9574m1480K9583M1817k8108m1404K7392M0577k7383l9909
932c2326K6635M0214k5267l9536K3184L8584k2888l7202K1437L7842k0564l7651
944b7538J8394L6506j6346l6483J5697L6707j3955l7362J1301L7780r627l7723
$$ plain form
860 -34159 21121 32274 -22035 -34571 18367 30157 -20254 -31271 18138 29540 -19685 -32215
872 -32215 15795 29567 -16762 -30421 14428 28802 -15586 -31567 11223 29672 -10608 -30318
884 -30318 8333 28613 -8317 -30645 5460 29705 -4176 -29947 2869 29102 -2993 -30772
896 -30772 1674 32292 -52 -32567 -1236 32527 2107 -32898 -2255 34920 4576 -34322
908 -34322 -4693 35025 6347 -33707 -4519 35911 6327 -34821 -5393 36356 7705 -33709
920 -33709 -4372 36163 6589 -34891 -5308 36509 8401 -33003 -5611 34966 7583 -32326
932 -32326 -5691 34523 9256 -30280 -7096 31488 8600 -28602 -7165 30677 10113 -27538
944 -27538 -9144 27362 11016 -25467 -9770 26937 12982 -24380 -13079 24701 15074 -22649
956b2649Q171L7562o868l8229M590L8960l159l8695J287L9434r38m0567n70M1560
970A9889K222m2104k865M1611L190m3027l648M3949M860m4262n839M3786N965
983B3727m3658o098M4303N893m4343o644M3441P061m2818p149M3307O687m2890
996a9181p449M2314P906m1020q269M0298Q572l9794q979L8606J0372l7430j0802
1009b4856L6419J1195l5344j2082L4544J3424l3352j4255L2246J4807l1247j5809
1021b4310L0890J7519k9561j8890K8636J9872k8182k0940K8895K1899k8102k3261
1033b5535K7326K4368k6576k4911K6616K6123k7008k6669K6203K8283k5837k8589
1045b6206K6056K8632k5770k9568K5903L0247k5701l0060K4870L0458k4907l0514
$$ plain form
956 -22649 -14478 23084 16216 -22013 -17423 21537 18378 -20317 -19030 20404 19466 -21101 -21671 19889
970 19889 22111 -19993 -22858 18753 21943 -21084 -24732 19217 24077 -20185 -26024 17762 23727
983 23727 -19931 -26029 18274 24167 -20176 -26820 16621 23682 -19136 -26285 17022 23709 -19181
996 -19181 -26630 15684 23590 -17430 -25699 14599 23171 -16623 -25602 13004 23376 -14054 -24856
1009 -24856 11563 22758 -12586 -24668 9876 23300 -10052 -24307 7939 22746 -8501 -24310
1021 -24310 6580 24099 -5462 -24352 4284 24156 -4026 -24966 3929 25828 -2274 -25535
1033 -25535 1791 26159 -417 -25328 1288 27411 403 -26266 -63 28220 2383 -26206
1045 -26206 -150 28482 2712 -26856 -953 29294 3593 -26467 -1597 28861 3954 -26560
1057b6560K4707L0717k4378l0630K3611L0673k3130l0509K2461L0615k1757l0372
1069b4552K0416L0093j9502l0224J9134L0036j8315k9865J6692K9932j6323k9662
1081b2140J4955K9737j3510l0146J2199L0389j0909l1116J0135L0755r054l1756
1093b0461Q149L1603o605l2205N963L2125n224l2461L811L3239l125l3357K225
1106a6323L3301j530l3736P05L4550m85l4762j57L4853Q62l5168j404L5169J505
$$ plain form
1057 -26560 -1853 28864 4486 -26144 -2533 28140 5010 -25499 -3038 27577 5820 -24552
1069 -24552 -4136 25957 6455 -23769 -4635 25401 7086 -22779 -6087 23845 7522 -22140
1081 -22140 -7185 22552 9042 -21104 -8905 21484 10575 -20541 -10406 20349 11295 -20461
1093 -20461 -12312 19291 12686 -19519 -13556 18569 13345 -19116 -15305 17934 14809 -18548 -16323
1106 -16323 16978 15448 -18288 -17583 16967 16482 -18280 -18437 16416 17278 -17890 -19294 15875 17380
$$ [...]
8191B37
##END NTUPLES=NMR FID
##END=
