##TITLE=1H_SAM_22.BBSX1_THF 2.2 TFA4
 CDCl3, 64 sc, 
 8.5.2019
##JCAMPDX= 6.0         $$ Bruker NMR JCAMP-DX V2.0
##DATA TYPE= NMR FID
##DATA CLASS= NTUPLES
##ORIGIN= UXNMR, Bruker Analytische Messtechnik GmbH
##OWNER= root
$$ XWIN-NMR		Version 3.5
$$ Wed May  8 14:06:12 2019 Russian Standard Time (UT+4h)  she@DPX200
##.OBSERVE FREQUENCY= 200.1315
##.OBSERVE NUCLEUS= ^1H
##.DELAY= (6, 6)
##.ACQUISITION MODE= SIMULTANEOUS
##.ACQUISITION SCHEME= undefined
##.AVERAGES= 64
##.DIGITISER RES= 18
##SPECTROMETER/DATA SYSTEM= spect
##.PULSE SEQUENCE= zg30
##.SOLVENT NAME= CDCl3
##.SHIFT REFERENCE= (INTERNAL, CDCl3, 0, 15.7039)
##AUDIT TRAIL= $$ (NUMBER, WHEN, WHO, WHERE, WHAT)
$$ ##TITLE= Audit trail, XWIN-NMR		Version 3.5
$$ ##JCAMPDX= 5.01
$$ ##ORIGIN= Bruker BioSpin GmbH
$$ ##OWNER= she
$$ F:/spectra/data/she/nmr/H-F/1/audita.txt
$$ ##AUDIT TRAIL=  $$ (NUMBER, WHEN, WHO, WHERE, WHAT)
(   1,<2019-05-08 14:02:50.81 +0400>,<she>,<DPX200>,
      <continue with go, POWCHK disabled, PULCHK disabled
       configuration hash MD5:
       00 E9 B6 7A A2 85 ED C7 34 08 36 98 17 FE 4E 26
       data hash MD5: 16K
       D3 96 2F C1 32 48 AD B0 72 1C 2A 1E B0 EA E4 57>)
$$ ##END=
$$ 
$$ hash MD5
$$ 82 E0 62 A2 46 25 1A 52 46 7A 32 FC 06 CC F3 C9
##$RELAX= 
##$RELAX= 
##$RELAX= 
##$RELAX= 
##$RELAX= 
##$RELAX= 
$$ Bruker specific parameters
$$ --------------------------
##$DU= <F:/spectra>
##$EXPNO= 1
##$NAME= <H-F>
##$PROCNO= 1
##$TYPE= <nmr>
##$USER= <she>
##$AMP= (0..31)
100 100 100 100 100 100 100 100 100 100 100 100 100 100 100 100 100 100 
100 100 100 100 100 100 100 100 100 100 100 100 100 100 
##$AQSEQ= 0
##$AQ_mod= 1
##$AUNM= <au_zg>
##$AUTOPOS= <>
##$BF1= 200.13
##$BF2= 200.13
##$BF3= 200.13
##$BF4= 200.13
##$BF5= 200.13
##$BF6= 200.13
##$BF7= 200.13
##$BF8= 200.13
##$BYTORDA= 1
##$CFDGTYP= 0
##$CFRGTYP= 5
##$CHEMSTR= <none>
##$CNST= (0..31)
1 1 145 1 1 1 1 1 1 1 1 1 1 1 1 1 1 1 1 1 1 1 1 1 1 1 1 1 1 1 1 1 
##$CPDPRG= <>
##$CPDPRG1= <>
##$CPDPRG2= <>
##$CPDPRG3= <>
##$CPDPRG4= <mlev>
##$CPDPRG5= <mlev>
##$CPDPRG6= <mlev>
##$CPDPRG7= <mlev>
##$CPDPRG8= <mlev>
##$CPDPRGB= <>
##$CPDPRGT= <>
##$D= (0..31)
0 1.2 0 0 0 0 0 0 0 0 0 0.03 0 0 0 0 0 0 0 0 0 0 0 0 0 0 0 0 0 0 0 0 
##$DATE= 1557309517
##$DBL= (0..7)
120 120 120 120 120 120 120 120 
##$DBP= (0..7)
150 150 150 150 150 150 150 150 
##$DBP07= 0
##$DBPNAM0= <>
##$DBPNAM1= <>
##$DBPNAM2= <>
##$DBPNAM3= <>
##$DBPNAM4= <>
##$DBPNAM5= <>
##$DBPNAM6= <>
##$DBPNAM7= <>
##$DBPOAL= (0..7)
0.5 0.5 0.5 0.5 0.5 0.5 0.5 0.5 
##$DBPOFFS= (0..7)
0 0 0 0 0 0 0 0 
##$DE= 6
##$DECBNUC= <off>
##$DECIM= 24
##$DECNUC= <off>
##$DECSTAT= 4
##$DIGMOD= 1
##$DIGTYP= 9
##$DL= (0..7)
0 120 120 120 120 120 120 120 
##$DP= (0..7)
150 150 150 150 150 150 150 150 
##$DP07= 0
##$DPNAME0= <>
##$DPNAME1= <>
##$DPNAME2= <>
##$DPNAME3= <>
##$DPNAME4= <>
##$DPNAME5= <>
##$DPNAME6= <>
##$DPNAME7= <>
##$DPOAL= (0..7)
0.5 0.5 0.5 0.5 0.5 0.5 0.5 0.5 
##$DPOFFS= (0..7)
0 0 0 0 0 0 0 0 
##$DQDMODE= 0
##$DR= 18
##$DS= 0
$$ [...]
##$SUBNAM2= <"">
##$SUBNAM3= <"">
##$SUBNAM4= <"">
##$SUBNAM5= <"">
##$SUBNAM6= <"">
##$SUBNAM7= <"">
##$SUBNAM8= <"">
##$SUBNAM9= <"">
##$SW= 24.9337058887773
##$SWIBOX= (0..15)
0 0 2 0 0 0 0 0 0 0 0 0 0 0 0 0 
##$SW_h= 4990.01996007984
##$TD= 16384
##$TD0= 1
##$TE= 0
##$TE2= 300
##$TE3= 300
##$TEG= 300
##$TL= (0..7)
0 120 120 120 120 120 120 120 
##$TP= (0..7)
150 150 150 150 150 150 150 150 
##$TP07= 0
##$TPNAME0= <>
##$TPNAME1= <>
##$TPNAME2= <>
##$TPNAME3= <>
##$TPNAME4= <>
##$TPNAME5= <>
##$TPNAME6= <>
##$TPNAME7= <>
##$TPOAL= (0..7)
0.5 0.5 0.5 0.5 0.5 0.5 0.5 0.5 
##$TPOFFS= (0..7)
0 0 0 0 0 0 0 0 
##$TUNHIN= 0
##$TUNHOUT= 0
##$TUNXOUT= 0
##$USERA1= <user>
##$USERA2= <user>
##$USERA3= <user>
##$USERA4= <user>
##$USERA5= <user>
##$V9= 5
##$VALIST= <valist>
##$VCLIST= <CCCCCCCCCCCCCCC>
##$VD= 0
##$VDLIST= <DDDDDDDDDDDDDDD>
##$VPLIST= <PPPPPPPPPPPPPPP>
##$VTLIST= <TTTTTTTTTTTTTTT>
##$WBST= 1024
##$WBSW= 4
##$XGAIN= (0..3)
0 0 0 0 
##$XL= 0
##$YL= 0
##$YMAX_a= 3069011
##$YMIN_a= -3459371
##$ZGOPTNS= <>
##$ZL1= 120
##$ZL2= 120
##$ZL3= 120
##$ZL4= 120
##$ABSF1= 10
##$ABSF2= 0
##$ABSG= 5
##$ABSL= 3
##$ALPHA= 0
##$AQORDER= 0
##$ASSFAC= 0
##$ASSFACI= 0
##$ASSFACX= 0
##$ASSWID= 0
##$AUNMP= <proc_1d>
##$AZFE= 0.1
##$AZFW= 0.1
##$BCFW= 1
##$BC_mod= 2
##$BYTORDP= 1
##$COROFFS= 0
##$CY= 11.3945322036743
##$DATMOD= 1
##$DC= 2
##$DFILT= <>
##$DTYPP= 0
##$F1P= 18.9103706918063
##$F2P= -1.10871071338519
##$FCOR= 0.5
##$FTSIZE= 0
##$FT_mod= 4
##$GAMMA= 1
##$GB= 0.15
##$INTBC= 1
##$INTSCL= 1
##$ISEN= 128
##$LB= 0.24
##$LEV0= 0
##$LPBIN= 0
##$MAXI= 10000
##$MC2= 0
##$MEAN= 0
##$ME_mod= 0
##$MI= 1.114404
##$NCOEF= 0
##$NC_proc= 0
##$NLEV= 6
##$NOISF1= 3.799351
##$NOISF2= 2.8
##$NSP= 1
##$NTH_PI= 0
##$NZP= 0
##$OFFSET= 15.70392
##$PC= 1
##$PHC0= -8852.634
##$PHC1= 10.00026
##$PH_mod= 1
##$PKNL= yes
##$PPARMOD= 0
##$PSCAL= 0
##$PSIGN= 0
##$REVERSE= no
##$SF= 200.130013532006
##$SI= 16384
##$SIGF1= 3
##$SIGF2= 2
##$SINO= 400
##$SIOLD= 16384
##$SREGLST= <1H.CDCl3>
##$SSB= 0
##$STSI= 0
##$STSR= 0
##$SW_p= 3612.71676300578
##$SYMM= 0
##$S_DEV= 0
##$TDeff= 0
##$TDoff= 0
##$TI= <>
##$TILT= no
##$TM1= 0
##$TM2= 0
##$TOPLEV= 0
##$USERP1= <user>
##$USERP2= <user>
##$USERP3= <user>
##$USERP4= <user>
##$USERP5= <user>
##$WDW= 1
##$XDIM= 8192
##$YMAX_p= 0
##$YMIN_p= 0
$$ End of Bruker specific parameters
$$ ---------------------------------
##NTUPLES= NMR FID
##VAR_NAME=  TIME,          FID/REAL,        FID/IMAG
##SYMBOL=    X,             R,               I
##VAR_TYPE=  INDEPENDENT,   DEPENDENT,       DEPENDENT
##VAR_FORM=  AFFN,          ASDF,            ASDF
##VAR_DIM=   8192,          8192,            8192
##UNITS=     SECONDS,       ARBITRARY UNITS, ARBITRARY UNITS
##FACTOR=    0.0002004,     1,               1
##FIRST=     0,             0,               0
##LAST=      1.6414764,     0,               0
##MIN=       0,             -3459371,        0
##MAX=       1.6414764,     3069011,         0
$$ Real data points
##PAGE= N=1
##DATA TABLE= (X++(R..R)), XYDATA
0@%%%%O4j28J28j28J92k56L20m48N76p04Q32r60J152j408J664j982K364k748L146
23A676l633M212m833N511o276P142q089R112j0253J1531j2914J4411j6075J7916
37I438j9917K2098k4507K7170l0091L3301l6869M0853m5284N0246n5890O2351
49C2899o9784P8461q8796J01333j16859J36728j63253K00611k57543L56059n73734
60c63878J878048r16779k716950L595926J592644l031875k281884K981633J810180
69B547065k680354k168165K414135J669221k288635j814792K223035J646329j969961
78d22122j652664J918129J529712j743775j567189J691052J581926j429725j564761
87a659417J320175J482519j245949j600862J086264J564524r81165j610911R15607
$$ plain form
0 0 0 0 0 0 64 -64 64 -64 128 -128 192 -256 320 -384 448 -512 640 -768 896 -1086 1278 -1470 1676
23 1676 -1957 2255 -2578 2933 -3343 3799 -4290 4822 -5431 6100 -6814 7597 -8478 9438
37 9438 -10479 11619 -12888 14282 -15809 17492 -19377 21476 -23808 26438 -29452 32899
49 32899 -36885 41576 -47220 54113 -62746 73982 -89271 111340 -146203 209856 -363878
60 -363878 1514170 597391 -2119559 1476367 3069011 37136 -2244748 736885 2547065
69 2547065 -133289 -2301454 112681 1781902 -506733 -2321525 -98490 1547839 -422122
78 -422122 -2074786 -156657 1373055 -370720 -1937909 -246857 1335069 -94656 -1659417
87 -1659417 -339242 1143277 -102672 -1703534 -617270 947254 -33911 -1644822 -729215
96g29215J634843q88444j783496P92640J901380o21115j876707O68727K069907
105A168520m98401k085427M70317K199450k99264k081412M28073K232550l63477
114A170929k275307L20053K266404l28505k238457M26070K311821m72621k426296
123a245909L66543K353324m00590k328797M43434K349460m44422k381441L33152
132i55246K254159l44742k170618L91628K158232l66687k145268K72027K021764
141A115249k65732j958726K47283J934409j72075j902960K9153J766183J3847
150H06631j702384q1722J658445J89142j587592k96018J486853L38440j443449
159f31654l82976J450308M89907j407940n51522J401080O14934j415725o95423
$$ plain form
96 -729215 905628 17184 -1766312 -973672 927708 306593 -1570114 -901387 1168520
105 1168520 670119 -1415308 -944991 1254459 955195 -1126217 -698144 1534406 1170929
114 1170929 -1104378 -784325 1482079 1153574 -1084883 -658813 1653008 1180387 -1245909
123 -1245909 -879366 1473958 1073368 -1255429 -811995 1537465 1093043 -1288398 -955246
132 -955246 1298913 954171 -1216447 -824819 1333413 966726 -1178542 -906515 1115249
141 1115249 849517 -1109209 -861926 1072483 900408 -1002552 -973399 792784 806631
150 806631 -895753 -977475 680970 870112 -717480 -1013498 473355 811795 -631654
159 -631654 -1014630 435678 925585 -482355 -1033877 367203 982137 -433588 -1129011
168a129011J452862Q24824j409398q74793J418921R29353j448018j004311J460290
177B20719J086167j416747j079587J442648J081833j507634j148002J513984J199854
186A393235j476987j176317J497142J169823j542806j240255J501536J270195
194A395566j421396j218307J399573J179129j410809j212851J340839J202760
202A254504j253945j130780J232251J099496j224911j136269J144047J136819
210A121212j049263j096331J002644J089672r68492j141486Q59141J137051p69452
219A84696j114079P12785J117831o71663j165264N77364J164603n13918j166815
228h74460M89188J207982m45953j259969L79003J285499l29639j302881L11695
$$ plain form
168 -1129011 323851 1148675 -260723 -1135516 283405 1212758 -235260 -1239571 220719
177 220719 1306886 -109861 -1189448 253200 1335033 -172601 -1320603 193381 1393235
186 1393235 -83752 -1260069 237073 1406896 -135910 -1376165 125371 1395566
194 1395566 -25830 -1244137 155436 1334565 -76244 -1289095 51744 1254504
202 1254504 559 -1130221 102030 1201526 -23385 -1159654 -15607 1121212
210 1121212 71949 -1024382 -21738 1067934 99442 -1042044 -182903 954148 184696
219 184696 -929383 -216598 901233 229570 -935694 -358330 806273 292355 -874460
228 -874460 -385272 822710 376757 -883212 -504209 781290 451651 -851230 -539535
237e39535J358318k60393j390002K10404J391826j93250j411100J83927J449765
246G99960j46633j463400J16307J448842j27556j470997J26898J506868q3900
255G06389j493065O5579J470497p2845j472267O4253J486510r543j440418p860
265g02770J386777r576j383659q030J378668N8008j330811q1620J278334P1474
275F56795j278419j04453J267379J69692j213169j95284J167734K07672j156671
284d78724k48057J146652L19661j087338l45039J057165L67655j052045m15423
293g35493J039338M73965j003293m99191R88689N24315r94601n78008R77257O24144
303H17122r47585o42946R39323O68813r42511p14454R24103P43434r02420p53029
$$ plain form
237 -539535 818783 558390 -831612 -621208 770618 577368 -833732 -649805 799960
246 799960 653327 -810073 -693766 755076 627520 -843477 -716579 790289 706389
255 706389 -786676 -721097 749400 676555 -795712 -731459 755051 745508 -694910 -702770
265 -702770 684007 674431 -709228 -717258 661410 719418 -611393 -693013 585321 656795
275 656795 -621624 -726077 541302 710994 -502175 -697459 470275 677947 -478724
284 -478724 -726781 419871 739532 -347806 -692845 364320 731975 -320070 -735493
293 -735493 303845 777810 -225483 -724674 264015 788330 -206271 -784279 192978 817122
303 817122 -130463 -773409 165914 834727 -107784 -822238 101865 845299 -57121 -810150
313h10150R06162P75246r06009q11948Q80467Q18302q64107q18236Q66783Q36064
323H72574q58678q63895Q19897Q57412q01320q51188P95061Q70810p76604q88063
333h23994P31735Q75356p10192q64593P03591Q85232o72568q96687O25445Q82849
343G36174n99693q76172N84393Q97228n44604r06304M94904Q96420m70177q98110
353f85941M49826R21494m05711r29681L61055R17562l42759r26485L20365R46542
363F26267k78366r50576K36972R43154k21503r56392J96123R73647j54643r76541
373e61858J22766R70332j12914r85443Q7874R99036n2801r93122L1122R88141
383D93133k0933r98848o143J003792L6619r88968n2404R85146O3585r93073q9282
$$ plain form
313 -810150 96012 871258 -34751 -846699 33768 852070 -12037 -830273 36510 872574
323 872574 13896 -849999 -30102 827310 25990 -825198 -30137 840673 64069 -823994
333 -823994 -92259 783097 72905 -791688 -88097 797135 124567 -772120 -146675 736174
343 736174 136481 -739691 -155298 741930 197326 -708978 -214074 682346 212169 -685941
353 -685941 -236115 685379 279668 -650013 -288958 628604 285845 -640640 -320275 626267
363 626267 347901 -602675 -365703 577451 355948 -600444 -404321 569326 414683 -561858
373 -561858 -439092 531240 418326 -567117 -479243 519793 466992 -526130 -495008 493133
383 493133 472200 -526648 -532791 471001 507620 -481348 -533752 451394 514979 -478094 -567376
394e67376R90179J18548r70079j27810R65855J37726r66788j63819R55163J91566
404E63165r30030j96775R21586K14982r19247k41821R02054K65873q76121k72424
414e68758Q70542K91289q63119l20979Q40791L42549q16437l49596Q08178L73041
424F07501p95997m02240P70099M19486p46880m31984P42167M58042p27147m86252
434e93205P00181N02312o81383n11669O76083N36891o61482n61620O34710N72312
444F13130o20484n84613O15038O10113n98226o28349N72277O36368n62894o48024
454e95664N54424O69172n37122o81759N13614O82337n04431o94049M93592P07550
464F07664m70468p12466M47105P07127m38157p18063M22797P29802l98958p30153
$$ plain form
394 -567376 422803 541351 -428728 -556538 409317 547043 -419745 -583564 371599 563165
404 563165 -366865 -563640 357946 572928 -346319 -588140 313914 579787 -296334 -568758
414 -568758 301784 593073 -270046 -591025 249766 592315 -224122 -573718 234460 607501
424 607501 -188496 -590736 179363 598849 -148031 -580015 162152 620194 -106953 -593205
434 -593205 106976 609288 -72095 -583764 92319 629210 -32272 -593892 40818 613130
444 613130 -7354 -591967 23071 633184 34958 -593391 -21114 615254 52360 -595664
454 -595664 -41240 627932 90810 -590949 -77335 605002 100571 -593478 -99886 607664
464 607664 137196 -575270 -128165 578962 140805 -577258 -154461 575341 176383 -553770
474e53770L77504P24054l67061p34812L47916P40459l18937p39882K96416P33686
484E05573k80838p40611K52303P45094k22862p37727K01116P34450j87020p43199
494d73721J59583P45857j31350p40480J14076P40059r6458p51130O7117P53454
504C87007l7281p46346J8596P48372l626p55353k4520P55193M7818p47085n9179
515d16404P47819P3816p54000r1358P51248J11131p45726j21774P46122J40016
525D40890p47354j59072P38898J75351p25866j84105P21808J99027p11891k13989
535d66303O99592K21579o86676k27833O83831K44115o70963k59407O56091K71644
545D65670o43245k85673O34712L10399o16137l25995N92788L37643n76270l50627
$$ plain form
474 -553770 -176266 547788 180727 -554085 -206169 534290 215353 -524529 -228113 505573
484 505573 224735 -515876 -263573 481521 258659 -479068 -277952 456498 269478 -473721
494 -473721 -314138 431719 300369 -440111 -326035 414024 317566 -433564 -366447 387007
504 387007 349726 -396620 -378024 370348 366722 -388631 -413151 342042 389860 -357225 -416404
515 -416404 331415 405231 -348769 -440127 311121 422252 -323474 -445248 300874 440890
525 440890 -306464 -465536 273362 448713 -277153 -461258 260550 459577 -252314 -466303
535 -466303 233289 454868 -231808 -459641 224190 468305 -202658 -462065 194026 465670
545 465670 -177575 -463248 171464 481863 -134274 -460269 132519 470162 -106108 -456735
555d56735N66270L70055n44592l81639N23569L89973n17564m04598N11385M29474
565D85598m92945m49720M77479M62136m67030m82853M58228N06877m38625n18893
575d59748M17806N21136m10328n30073M05484N41833l93861n49711L84425N50804
585D77767l83934n61385L79454N75058l66530n87498L51425N88238l39427n91591
595d58423L23347N91341l06439n87201K88868N78852k80212n72452K64899N68861
605D11441k54039n69431K40846N72371k23715n77569J99361N77036j77539n77421
615c78659J51150N79259j24062n72993R3524N59863p3549n54978O1705N57835
625B99095l9930n62853J7580N61149k659n68508j0961N84850L6373n94810o6158
$$ plain form
555 -456735 109535 479590 -65002 -446641 76928 466901 -50663 -455261 56124 485598
565 485598 -7347 -457067 20412 482548 15518 -467335 -9107 497770 59145 -459748
575 -459748 -41942 479194 68866 -461207 -55723 486110 92249 -457462 -73037 477767
585 477767 93833 -467552 -88098 486960 120430 -467068 -115643 472595 133168 -458423
595 -458423 -135076 456265 149826 -437375 -148507 430345 150133 -422319 -157420 411441
605 411441 157402 -412029 -171183 401188 177473 -400096 -200735 376301 198762 -378659
615 -378659 -227509 351750 227688 -345305 -251781 308082 234533 -320445 -258740 299095
625 299095 259165 -303688 -286108 275041 272382 -296126 -307087 277763 314136 -280674 -346832
636c46832N91298Q5691n88498r5890N93166J12178n91661j30896N81735J34938
646C45229n79190j29093N88489J35271n95460j49122N95873J56788n91827j60701
656c83743N95080J73155n91513j90237N76267J98133n53853j96941N40408J96533
666C63289n26260k02228N15515K06329n03384k05868M96052K14170m88417k28294
676c59096M78572K50825m59468k69458M35448K84946m10911k98180L90475L13006
686C56159l67470l25546L46622L32016l33062l37860L33008L55515l30929l79728
696c51275L17798M00983l07562m14862L02715M36865k92725m59342K72726M68598
706C73919k54716m64847K53837M66483k58877m77426K52505M79802k50040m74649
$$ plain form
636 -346832 244466 330157 -258341 -354231 238935 351113 -240548 -371444 210291 345229
646 345229 -233961 -363054 225435 360706 -234754 -383876 211997 368785 -223042 -383743
656 -383743 211337 384492 -207021 -397258 179009 377142 -176711 -373652 166756 363289
666 363289 -162971 -365199 150316 356645 -146739 -352607 143445 357615 -130802 -359096
676 -359096 119476 370301 -89167 -358625 76823 361769 -49142 -347322 43153 356159
686 356159 -11311 -336857 9765 341781 8719 -329141 3867 359382 28453 -351275
696 -351275 -33477 367506 59944 -354918 -52203 384662 91937 -367405 -94679 373919
706 373919 119203 -345644 -91807 374676 115799 -361627 -109122 370680 120640 -354009
716c54009K59061M79231k67488m96007K57157N02475k40654m95551K28454M88526
726C61195k24200m89213K10336M80492j93662m62493J84870M46879j86765m45561
736c18122J78482M46310j61507m43380J42128M39605j28090m40236J03429M44216
746B62835p4183m39629M3787M24569k2396m16547Q671M13761J0064m17190k9828
757b36086M15216M4323m16418n3904M26357O9170m42486r7411M48520J20578m44923
768a67064j34117M47471J44535m55619j58242M53661J69461m45896j64093M45053
778A35150J57261m57550j59282M64071J70372m60296j68604M59198J67798m63179
788a55061j75114M61826J88817m44040j88732M27010J79153m16599j76702M10182
$$ plain form
716 -354009 -94948 384283 116795 -379212 -122055 380420 139766 -355785 -127331 361195
726 361195 136995 -352218 -141882 338610 144948 -317545 -132675 314204 127439 -318122
736 -318122 -139640 306670 145163 -298217 -156089 283516 155426 -284810 -181381 262835
746 262835 188652 -250977 -207190 217379 194983 -221564 -212893 200868 210932 -206258 -236086
757 -236086 179130 223453 -192965 -246869 179488 248658 -193828 -291239 157281 277859 -167064
768 -167064 -301181 146290 290825 -164794 -323036 130625 300086 -145810 -309903 135150
778 135150 292411 -165139 -324421 139650 310022 -150274 -318878 140320 308118 -155061
788 -155061 -330175 131651 320468 -123572 -312304 114706 293859 -122740 -299442 110740
798A10740J83064l92739j83040L77795J78207l69088j82692L65443K01377l48860
808e9793k16683L27308K27163l08493k33338K94697K49179k75659k63121K54020
818d720K70919k37214k73203K30219K86567k23431l05671K14033L22276k03513
828G6262l33993J99204L48404j95662l68269J84142L82772j71160l84982J63722
838i9560L86067j67016l94811J65980M02075j60251m02620J58042L99432j67157
848A20181m06233J69780M14622j60471m15118J51669M04669j52968m01733J49497
858a26105M00810j37364l93826J23842L76290j20506l68317J18735L67940j06827
868A34672l67300Q8145L55779p7515l49193O7787L48280m9052l50005K6446L38826
$$ plain form
798 110740 293804 -98935 -281975 95820 274027 -95061 -277753 87690 289067 -59793
808 -59793 -276476 50832 277995 -30498 -263836 30861 280040 4381 -258740 -4720
818 -4720 266199 28985 -244218 -13999 272568 49137 -256534 -42501 279775 76262
828 76262 -257731 -58527 289877 94215 -274054 -89912 292860 121700 -263282 -99560
838 -99560 286507 119491 -275320 -109340 292735 132484 -270136 -112094 287338 120181
848 120181 -286052 -116272 298350 137879 -277239 -125570 279099 126131 -275602 -126105
858 -126105 274705 137341 -256485 -132643 243647 123141 -245176 -126441 241499 134672
868 134672 -232628 -144483 211296 133781 -215412 -147625 200655 151603 -198402 -171956 166870
879A66870q265l28729n169L27029K0546l30281m2334L27771N9314l24342o8591
890b06181L26151Q0702l34592r7350L39229J15242l39416j25932L38340J35260
900B31453l44705j44966L48080J58255l45524j64585L43660J65700l48152j66574
910b67358L53524J74203l52710j78420L48134J76656l46614j73563L48294J80625
920B62771l43867j83620L30656J83182l21732j78032L18965J80983l09431j87162
930b47287K96956J85873k83089j82946K77793J89307k68163j97954K51296K02847
940B24633k33320k02775K23794K10059k13924k21106J99935K29961j82878k34354
950a99975J74313K41676j68080k53527J58069K65732j45461k70221J37168K75720
$$ plain form
879 166870 158605 -170124 -175293 151736 172282 -157999 -200333 127438 186752 -137590 -206181
890 -206181 119970 200672 -133920 -231270 107959 223201 -116215 -242147 96193 231453
900 231453 -113252 -258218 89862 248117 -97407 -261992 81668 247368 -100784 -267358
910 -267358 86166 260369 -92341 -270761 77373 254029 -92585 -266148 82146 262771
920 262771 -81096 -264716 65940 249122 -72610 -250642 68323 249306 -60125 -247287
930 -247287 49669 235542 -47547 -230493 47300 236607 -31556 -229510 21786 224633
940 224633 -8687 -211462 12332 222391 8467 -212639 -12704 217257 34379 -199975
950 -199975 -25662 216014 47934 -205593 -47524 218208 72747 -197474 -60306 215414
960B15414j32222k87611J26950K98436j16167l05888J10777L08365j08311l16389
970b06646J07548L23462j02661l27641R6668L27794r6610l27853R4550L30742
980B19353r0513l33762Q5951L27911q0614l26305Q0626L24645p8408l24350O8298
991a27168L18532o1976l13179N9497L06920n4277l05760M2750L00082l2697k92119
1002a59395K3748K86196j7234k83958K603K80935Q494k74317j8075K68414K6037
1013A43448k68938l7848K67084N0965k61679o4473K60257P0759k59537q3865K60647
1024G6820R6034k58205j06522K56887J13627k58752j20709K60690J29333k59568
1034g0365j36393K58160J41971k58688j46131K60278J52583k60293j56912K56749
$$ plain form
960 215414 83192 -204419 -77469 220967 104800 -201088 -90311 218054 109743 -206646
970 -206646 -99098 224364 121703 -205938 -109270 218524 121914 -205939 -111389 219353
980 219353 128840 -204922 -118971 208940 128326 -197979 -117353 207292 128884 -195466 -127168
991 -127168 191364 129388 -183791 -124294 182626 128349 -177411 -134661 165421 132724 -159395
1002 -159395 -135647 150549 133315 -150643 -148040 132895 141389 -132928 -151003 117411 143448
1013 143448 -125490 -163338 103746 154711 -106968 -171441 88816 159575 -99962 -183827 76820
1024 76820 172854 -85351 -191873 65014 178641 -80111 -200820 59870 189203 -70365
1034 -70365 -206758 51402 193373 -65315 -211446 48832 201415 -58878 -215790 40959
1044D0959J62464k53991j63397K52488J65424k48952j69503K47635J70255k39944
1054c6562j69711K35881J70537k29483j73391K25561J75475k16369j76113K09972
1064A5797J79397k02831j82999J97073J86199j85149j88162J76333J89512j68157
1074A7013j92409J59972J98344j49495j99885J39920K03186j33066k07690J25161
1084c8949K15904j16312k20722J07990K23930j01983k29397R6251K36385q9269
1094H3828k39379Q1671K41866p5782k45808P0634K50963o6395k54088O0235K56303
1105A64048n7373k59013N2972K61333m9153k63861M5469K63295m2565k63531L7818
1116a10561K62745l4881k61178K8407K59585k3102k59696K0436K54113j5177k53792
$$ plain form
1044 40959 203423 -50568 -213965 38523 203947 -45005 -214508 33127 203382 -36562
1054 -36562 -206273 29608 200145 -29338 -202729 22832 198307 -18062 -194175 15797
1064 15797 195194 -7637 -190636 6437 192636 7487 -180675 -4342 185170 17013
1074 17013 -175396 -15424 182920 33425 -166460 -26540 176646 43580 -164110 -38949
1084 -38949 176955 60643 -160079 -52089 171841 69858 -159539 -63288 173097 83828
1094 83828 -155551 -73880 167986 92204 -153604 -82970 167993 101598 -152490 -92255 164048
1105 164048 106675 -152338 -99366 161967 112814 -151047 -105578 157717 115152 -148379 -110561
1116 -110561 152184 117303 -143875 -115468 144117 121015 -138681 -118245 135868 120691 -133101
1127a33101J0125K49543n242k47427n14K43988N386k40216j1936K35562J8674
1138A24842k32457k6536K27644L2816k24205m0970K21538M7427k18478n7000K15036
1149F9657O4332k12930p0021K09856P6677k06223q5221K03315R2495k02820r8527
1160a59410K01725J06175j99786j12046J97173J19257j95965j24784J94367J31317
1170A58023j92556j35919J91978J38773j89216j42438J89293J45486j85058j48822
1180a70456J82813J52551j80647j54370J79757J56903j75149j58909J70772J62830
1190A66095j67050j62346J61819J63432j56392j62115J50507J63838j46173j62454
1200a50839J40074J65492j33856j66709J28953J70230j22224j73129J15573J74627
$$ plain form
1127 -133101 -122976 126567 121325 -126102 -126616 117372 122758 -117458 -129394 106168 124842
1138 124842 -107615 -134151 93493 126309 -97896 -138866 82672 130099 -88379 -145379 69657
1149 69657 133989 -78941 -148962 60894 137571 -68652 -153873 49442 141937 -60883 -159410
1160 -159410 42315 148490 -51296 -163342 33831 153088 -42877 -167661 26706 158023
1170 158023 -34533 -170452 21526 160299 -28917 -171355 17938 163424 -21634 -170456
1180 -170456 12357 164908 -15739 -170109 9648 166551 -8598 -167507 3265 166095
1190 166095 -955 -163301 -1482 161950 5558 -156557 -6050 157788 11615 -150839
1200 -150839 -10765 154727 20871 -145838 -16885 153345 31121 -142008 -26435 148192
1210A48192j06140j77137R9528J79368r1164j79214Q3330J80787p7705j81374
1220a21529P1580J84392o6811j88149O0897J92375n5438j97601N1786K00971m5715
1231H6758k05729L9407K06688l2495k08585K7755K08103k3040k09420J7774K11064
1242A18280j6792k10645J3888K12402j4241k15014J0724K16166p649k15756K400
1253a06237K13884J721k13701o450K10178R984k06240j3603K01519J4130j97619
1264i2434j7669J95248J8844j93626k2597J91428K6950j89125l3969J86251M1258
1275A10559j83146m9589J76675N6599j71207o1227J65637O6355j61582p2227J58774
1286C5621P5426j56097q0800J57283Q5935j57506r3051J56005J02242j53980j08874
$$ plain form
1210 148192 42052 -135085 -35557 143811 52647 -126567 -43237 137550 59845 -121529
1220 -121529 -49949 134443 67632 -120517 -59620 132755 77317 -120284 -68498 132473 86758
1231 86758 -118971 -79564 127124 94629 -113956 -86201 121902 98862 -110558 -92784 118280
1242 118280 101488 -109157 -95269 117133 102892 -112122 -101398 114768 107119 -108637 -106237
1253 -106237 107647 109368 -104333 -110783 99395 109379 -96861 -110464 91055 105185 -92434
1264 -92434 -110103 85145 103989 -89637 -112234 79194 106144 -82981 -116950 69301 110559
1275 110559 -72587 -122176 54499 111098 -60109 -121336 44301 110656 -50926 -123153 35621
1286 35621 111047 -45050 -125850 31433 117368 -40138 -133189 22816 125058 -28922 -137796
1297a37796J51622J15951j48104j22448J44594J27045j40587j28049J39319J27916
1307A29463j39315j29720J41612J32941j41508j34490J43069J35936j41735j40560
1317a44307J40461J46072j35928j46300J30163J46217j23295j44101J19803J43628
1327A32413j15666j40754J12690J37368j09074j36691J08723J39355j05379j40489
1337a17504R7210J45266r0954j45022Q1053J49426p3786j49964O3797J49206n4843
1348E3885j47815N1383J47255m7935j50878M4662J53745l9565j56557L3805J62727
1359A04712l0758j67688K3350J72182j4194j75618Q301J76148o431j76304K794
1370h3506J77194l99j76916r89J75406o56j79574K065J81965J242j85972n333
$$ plain form
1297 -137796 13826 129777 -18327 -140775 3819 130864 -9723 -137772 1547 129463
1307 129463 -9852 -139572 2040 134981 -6527 -141017 2052 137988 -3747 -144307
1317 -144307 -3846 142226 6298 -140002 -9839 136378 13083 -131018 -11215 132413
1327 132413 16747 -124007 -11317 126051 16977 -119714 -10991 128364 22985 -117504
1337 -117504 -20294 124972 34018 -111004 -29951 119475 45689 -104275 -40478 108728 53885
1348 53885 -93930 -42547 104708 56773 -94105 -49443 104302 64737 -91820 -58015 104712
1359 104712 73954 -93734 -70384 101798 87604 -88014 -79713 96435 90004 -86300 -83506
1370 -83506 93688 93289 -83627 -84616 90790 90134 -89440 -87375 94590 95832 -90140 -95473
1382i5473J84369Q988j85386j1289J83189J5289j79933k0367J73827J9007j67315
1393g5094j8379J63371J8240j62206k2075J58589K4880j57046k5791J54287L1699
1404I0475j53176m0533J47872M8535j41168n3580J35238N7020j32021o1409J26659
1415B3912O7576j20821p1372J19364P2986j20249q0637J21925Q9823j20605r5925
1426a14023J17388J03927j18783j09544J19066J15173j13886j18301J09120J19389
1436A09526j08599j19772J12547J22334j13387j23063J11862J26001j14303j25238
1446a22092J15337J31192j14604j33342J10120J32268j04796j27772J02515J26305
1456A15131r8165j26543R4734J22911q7629j19868Q7247J19162q5776j21317Q1360
$$ plain form
1382 -95473 88896 97884 -87502 -98791 84398 99687 -80246 -100613 73214 92221 -75094
1393 -75094 -93473 69898 88138 -74068 -96143 62446 87326 -69720 -95511 58776 90475
1404 90475 -62701 -103234 44638 93173 -47995 -101575 33663 90683 -41338 -102747 23912
1415 23912 91488 -29333 -100705 18659 91645 -28604 -109241 12684 102507 -18098 -114023
1426 -114023 3365 107292 -11491 -121035 -1969 113204 -682 -118983 -9863 109526
1436 109526 927 -118845 -6298 116036 2649 -120414 -8552 117449 3146 -122092
1446 -122092 -6755 124437 9833 -123509 -13389 118879 14083 -113689 -11174 115131
1456 115131 16966 -109577 -14843 108068 20439 -99429 -12182 106980 21204 -100113 -18753
1467a8753J23176p4006j20327O7651J20955o1817j24420N4571J25046m4115j22479
1478g4518L6286J22070l4511j22880K9677J27854k3527j30733J8499J31525j5170
1489F4572j36517J1982J40876m139j45293k440J44594N559j46074o776J49519
1500G5863R638j52524j4917J52694J3767j53396j0637J55435J1777j59173j5981
1511h7454J58067J6167j55372j6917J54962J7528j55771k1635J52455K1164j44460
1522f1266k2990J41769K1216j41587k3312J37714K7247j33179k8627J28256K9307
1533G4548j26870l3862J22997M1650j17536m5711J10732M7637j08156n1575J05705
1544A9559N9144j01547o3844R5942O7049r5168p0532R5513P8779r3811q5230Q9552
$$ plain form
1467 -18753 104423 30417 -89910 -22259 98696 36879 -87541 -32970 92076 47961 -74518
1478 -74518 -38232 83838 49327 -73553 -43876 83978 60451 -70282 -51783 79742 64572
1489 64572 -71945 -59963 80913 76774 -68519 -70959 73635 79194 -66880 -73656 75863
1500 75863 85501 -67023 -81940 70754 84521 -68875 -79512 75923 87700 -71473 -87454
1511 -87454 70613 86780 -68592 -85509 69453 86981 -68790 -90425 62030 83194 -61266
1522 -61266 -84256 57513 78729 -62858 -86170 51544 78791 -54388 -83015 45241 74548
1533 74548 -52322 -86184 36813 78463 -39073 -84784 25948 73585 -34571 -86146 19559
1544 19559 78703 -22844 -86688 9254 76303 -18865 -89397 6116 84895 -8916 -94146 -4594
1556d594Q8744q8073r1174Q8696R9170q9907j03282Q6713J06738q6026j06842
1567i9837Q8711J09141q9240j13092Q7676J15441q5953j13388Q8233J13957q7939
1578A3710j17583Q6522J19099q2574j14910Q1268J12638q1472j13288Q0149J12894
1589I6453p4243j09266P0971J06730o9083j06680O6277J07494n7965j06978N3372
1600b2918J02866m8033j04109M4754J05929l7464j05663L1492J04147k7736j04588
1611f1323K4315J07570j8399j09853J0556J10518n789j10946K321J15105O11j18170
1623e3484p384J19365R694j18823j1351J22473J2362j26629j6449J26540J9791
1634G6105j26727j9624J27273J9646j30584k3320J31275K4601j29303k5460J28009
$$ plain form
1556 -4594 84150 -3923 -95097 -6401 92769 2862 -100420 -13707 93031 7005 -99837
1567 -99837 -11126 98015 8775 -104317 -16641 98800 12847 -100541 -12308 101649 13710
1578 13710 -103873 -17351 101748 19174 -95736 -14468 98170 16698 -96590 -16441 96453
1589 96453 22210 -87056 -16085 90645 21562 -85118 -18841 88653 30688 -76290 -22918
1600 -22918 79948 31915 -72194 -27440 78489 41025 -64638 -33146 71001 43265 -61323
1611 -61323 -37008 70562 52163 -57690 -47134 63384 57595 -53351 -51030 64075 64686 -53484
1623 -53484 -60868 58497 68191 -50632 -61983 60490 72852 -53777 -70226 56314 76105
1634 76105 -50622 -70246 57027 76673 -53911 -77231 54044 78645 -50658 -76118 51891
1645E1891K3756j28948k5598J29265K6085j25544k6858J21165K4832j19295k7174
1656g6423J18465L0976j14816l4132J09683L3622j07732l4224J04370L8608j00754
1667c2357m2510R4718M3676r0872m5708Q9819N0471q6821n5833Q2262N8514p8922
1679a3563o1796P7729O6296p6667p2495P4421P6709p1264p7724O9684Q2876p0773
1691C433q6697O9146Q8969o5791r0928O7427R2665o6173r7514O7135R9266o4562
1703A6376r9785O4722J00703o6586j00003O4688J03388o2069j02961O2019R9842
1714H0334n8965j01035N9964J01206n5768j00750N3698R8107n1295r7161N1222
1725b0443R7649m6557r6719M2056R4703l8493r3656L5906R3912l1499r3684K5670
$$ plain form
1645 51891 75647 -53301 -78899 50366 76451 -49093 -75951 45214 70046 -49249 -76423
1656 -76423 42042 73018 -41798 -75930 33753 67375 -40357 -74581 29789 68397 -32357
1667 -32357 -74867 19851 63527 -27345 -73053 16766 67237 -19584 -75417 6845 65359 -13563
1679 -13563 -75359 2370 68666 -8001 -80496 -6075 70634 -630 -78354 -8670 74206 3433
1691 3433 -83264 -14118 74851 9060 -81868 -14441 78224 12051 -85463 -18328 80938 16376
1703 16376 -83409 -18687 82016 15430 -84573 -19885 83503 21434 -81527 -19508 80334
1714 80334 21369 -79666 -19702 81504 25736 -75014 -21316 76791 25496 -71665 -20443
1725 -20443 77206 30649 -66070 -24014 70689 32196 -61460 -25554 68358 36859 -56825 -31155
1737c1155R3269k1728r1374J8654R2121j4295r4320R448R3607m785r4239K142
1749d2655R5655N33r7769m982R8411R439r8351j3258R9122J4559j00441j8201
1761e7938J02494K1259j03093k4842J05030K2066j03720k5848J05902K6900j05650
1772c7440k8744J04811K8773j06195k8479J03952L0871j02789l3423J01466L2881
1783F5684j00493l3313R8871L3142r6618l5933R3253L6586r1444l6087Q9264L8771
1795F1683q8306m0909Q3121M3178p9508m5611P8599M7372p6412n0645P2853N2029
1807E7444o9859n2517O6011N6780o5853n9855O3894O2222n8952o5419N7905O8429
1819F0230n7515p0369N4953P4411n2426p7050N1745P8295m9547q0859N0177Q3207
$$ plain form
1737 -31155 62114 40386 -50988 -32334 59787 45492 -48828 -39380 54227 49442 -44797 -42655
1749 -42655 53000 53533 -44236 -49218 49193 58632 -39719 -52977 46145 60704 -39737 -57938
1761 -57938 44556 65815 -37278 -62120 42910 64976 -38744 -64592 41310 68210 -37440
1772 -37440 -66184 38627 67400 -38795 -67274 36678 67549 -35240 -68663 32803 65684
1783 65684 -34809 -68122 30749 63891 -32727 -68660 24593 61179 -30265 -66352 22912 61683
1795 61683 -26623 -67532 15589 58767 -20741 -66352 12247 59619 -16793 -67438 5415 57444
1807 57444 -12415 -64932 1079 57859 -7994 -67849 -3955 58267 -685 -66104 -8199 60230
1819 60230 2715 -67654 -12701 61710 9284 -67766 -16021 62274 12727 -68132 -17955 65252
1831F5252m9704q3219M7321Q6005m7093q6725M7312Q7828m4886q8774M4015Q9618
1843F6950m3871q8884M3136R0600m2481q9775M0683Q9217l8692q6696L6324Q6559
1855F3070l2932q6866L1331Q5240k9260q3032K7258Q2731k3976q3547K1889Q4428
1867E6334j9894q1839J4509Q2531j1331q2680Q310Q1128m474q0466J159P9184
1879D2471K665q0218n276Q1559P840q2060j0395Q1767J2860q3267j5616Q4109
1891C6439J7831q3839k2803Q5008K3715q4336k6726Q4213K8515q5358k8625Q4326
1903B8360K9761q5452l0340Q4699L1721q6220l2299Q4672L2204q3464l4565Q2498
1915B1575L7018q2772l7997P9336L9138p8460l7674P4226L9249p4422l9121P1821
$$ plain form
1831 65252 15548 -67671 -20350 65655 18562 -68163 -20851 66977 22091 -66683 -22668 66950
1843 66950 23079 -65805 -22669 67931 25450 -64325 -23642 65575 26883 -59813 -23489 63070
1855 63070 30138 -56728 -25397 59843 30583 -52449 -25191 57540 33564 -49983 -28094 56334
1867 56334 36440 -45399 -30890 51641 40310 -42370 -34060 47068 42594 -37872 -36713 42471
1879 42471 45136 -35082 -40358 41201 49041 -33019 -43414 38353 51213 -32054 -47670 36439
1891 36439 54270 -29569 -52372 32636 56351 -27985 -54711 29502 58017 -27341 -55966 28360
1903 28360 58121 -27331 -57671 27028 58749 -27471 -59770 24902 57106 -26358 -60923 21575
1915 21575 58593 -24179 -62176 17160 56298 -22162 -59836 14390 53639 -20783 -59904 11917
1927A1917M0140p0871m0386O9166M1341o5549m5731O4705M7427o2099m8873N8282
1939e31N0992n4850n2574N1981N4475n0564n4179M7638N5965m5610n8292M5733
1951i816N9852m3738o2681M3152O5609m0674o8815L8247P2453l6319p2987L4843
1963b0874P3637l2508p4353L3427P4613l2325p4214L2185P5687l2584p6925L2312
1975b1922P8822l1640p9859K9846Q1748k7996q0516K6169P9078k3932p7039K1532
1987b5709P6018k0028p4831K0776P2670j9236p2043J7886P2976j5373p2883J2840
1999b6937P2873j0359p1546N210P2015k363p0210j044O8248L344o7232n380O5697
2012C2316Q342o6220r784O5565J2208o7222j4921O9279J7045p0478k1859P0807
$$ plain form
1927 11917 52057 -18814 -59200 9966 51307 -14242 -59973 4732 52159 -9940 -58813 -531
1939 -531 50461 -4389 -56963 -4982 49493 -1071 -55250 -7612 48353 2743 -55549 -9816
1951 -9816 50036 6298 -56383 -13231 52378 11704 -57111 -18864 53589 17270 -55717 -20874
1963 -20874 52763 20255 -54098 -20671 53942 21617 -52597 -20412 55275 22691 -54234 -21922
1975 -21922 56900 25260 -54599 -24753 56995 28999 -51517 -25348 53730 29798 -47241 -25709
1987 -25709 50309 30281 -44550 -23774 48896 29660 -42383 -24497 48479 33106 -39777 -26937
1999 -26937 45936 35577 -35969 -30759 41256 38893 -31317 -32361 35887 39231 -28001 -33381 32316
2012 32316 40658 -25562 -35346 30219 42427 -24795 -39716 29563 46608 -23870 -45729 25078
2024B5078K3812o8960k6672O8310K8665o9545l0794O8985L0681o7529l1522O8914
2036A9423L0759o9906l2980P0704L5895p3627l5036P1253L6126p0235l8287O8609
2048A2698L8202o6112l8218O3180L8089o2627l7772O0889L8087o0010l7244N7419
2060F581L8009n7169l9255N5622M1831n3553m2898M9769M4070m6158m5218M3141
2072e228M7071m0492m7718L6822M8320l5430m8841L5629N0194l2871n3874L2227
2084a4191N5898l0322n7463K8682O0432k6609o2597K4596O5269k3098o4917K1762
2096b2558O6093k1453o7402K1480O9385k1707o8520K1885O8820k1742p0059K1649
2108b4129P1706j9568p1404J8224P0893j6961o9742J5968O9569j4556o7241J3341
$$ plain form
2024 25078 48890 -20070 -46742 21568 50233 -19312 -50106 18879 49560 -17969 -49491 19423
2036 19423 50182 -19724 -52704 18000 53895 -19732 -54768 16485 52611 -17624 -55911 12698
2048 12698 50900 -15212 -53430 9750 47839 -14788 -52560 8329 46416 -13594 -50838 6581
2060 6581 44590 -12579 -51834 3788 45619 -7934 -50832 -1063 43007 -3151 -48369 -5228
2072 -5228 41843 1351 -46367 -9545 38775 3345 -45496 -9867 40327 7456 -46418 -14191
2084 -14191 41707 11385 -46078 -17396 43036 16427 -46170 -21574 43695 20597 -44320 -22558
2096 -22558 43535 22082 -45320 -23840 45545 23838 -44682 -22797 46023 24281 -45778 -24129
2108 -24129 47577 28009 -43395 -25171 45722 28761 -40981 -25013 44556 30000 -37241 -23900
2120b3900O5413j3319o3819J2389O4592j1051o3751Q883O1943o881o0279M477
2132b5303O0335j752n8769l228N7319M829n5814n774N5219Q356n5252j1355N4061
2145B2872J3453n4318j3974N4268J6841n6177k1749N7397K3922n5999k6409N6070
2157A6197K6993n7344k9414N7037L1895n7236l1523N6184L0823n8316l0966N7608
2169A1938L3284n6966l4809N7634L3758n8361l5528N7305L7233n6954l5690N3839
2181F683L5278n4110l4135N2976L4967n1796l6165M9446L5535m8197l4960M5860
2193A382L7072m3978l8903M2414L8764l8667l9393L7498L9666l4680m2823L2841
2205h807M2542k9021m2301K7563M4293k6920m6201K4567M7696k1190n0135K2041
$$ plain form
2120 -23900 41513 28194 -35625 -23236 41356 30305 -33446 -24563 37380 30499 -29780 -25303
2132 -25303 35032 33280 -25489 -28717 28602 33431 -22383 -28157 27062 35418 -19834 -31189 22872
2145 22872 36325 -17993 -31967 22301 39142 -17035 -38784 18613 42535 -13464 -39873 16197
2157 16197 43190 -14154 -43568 13469 45364 -11872 -43395 12789 43612 -14704 -45670 11938
2169 11938 45222 -11744 -46553 11081 44839 -13522 -49050 8255 45488 -11466 -47156 6683
2181 6683 41961 -12149 -46284 6692 41659 -10137 -46302 3144 38679 -9518 -44478 1382
2193 1382 38454 -5524 -44427 -2013 36751 -1916 -41309 -3811 35855 1175 -41648 -8807
2205 -8807 33735 4714 -37587 -10024 34269 7349 -38852 -14285 33411 12221 -37914 -15873
2217a5873N0908k0589n2603J7971N5103j6020n5502J5274N6748j4970n9191J5769
2229b2975O0978j4267o1319J4670O1047j4498o1195J4531O2910j3480o2427J1983
2241b4042O1303j1685o0364J2317O0306j1663n9287J0693N8336r771n6041Q945
2253b0953N7264p766n6729L955N5589k930n3639L049N2150j739n1272k250N0308
2266B5037M886m7042o381M6972O779m6978j1186M6833J4748m7179j4420M5298
2278A7367J7151m6384k0676M6744K2812m5834k4928M5359K4535m5571k7524M7327
2290A0378K9248m7303l0610M5971L1009m6852l1855M7884L2980m8480l4258M7052
2302E164L4169m7444l4019M7885L3992m6990l5650M5453L4158m3927l3074M3849
$$ plain form
2217 -15873 35035 14446 -38157 -20186 34917 18897 -36605 -21331 35417 20447 -38744 -22975
2229 -22975 38003 23736 -37583 -22913 38134 23636 -37559 -23028 39882 26402 -36025 -24042
2241 -24042 37261 25576 -34788 -22471 37835 26172 -33115 -22422 35914 26143 -29898 -20953
2253 -20953 36311 28545 -28184 -24229 31360 28430 -25209 -22160 29990 28251 -23021 -25271 25037
2266 25037 29923 -17119 -23500 23472 30251 -16727 -27913 18920 33668 -13511 -27931 17367
2278 17367 34518 -11866 -32542 14202 37014 -8820 -33748 11611 36146 -9425 -36949 10378
2290 10378 39626 -7677 -38287 7684 38693 -8159 -40014 7870 40850 -7630 -41888 5164
2302 5164 39333 -8111 -42130 5755 39747 -7243 -42893 2560 36718 -7209 -40283 3566
2314C566L3243m2974l5674M2112L4976m0345l2714L8413L3269l7948l5286L6516
2326b846L5314l3303l4593L0602L3951k8798l5294K6242L6805k3040l7020K2188
2338i792L6521k0101l9793J9916M1597j6674m2886J5331M2715j3600m3867J3287
2350a7346M6283j0850m8266R553M8763q989m9415R004N1875r096n1250P505N1903
2363B9674p006n1174P101N3262o164n5369O651N3838n775n3079O572N3619o068
2376B6082n3190L504N3234l353m9755L197M8833l273m9758K588M8523R78m7432
2389a9822l84M4536J477m5277k831M4983M518m0944r264M1568Q842m1287r700
2402b3585M0366J1623l8606j4280L7201J6016l7793j7856L8165J9950l7099k3498
$$ plain form
2314 3566 36809 -6165 -41839 273 35249 -5096 -37810 603 33872 -4076 -39362 -2846
2326 -2846 32468 -835 -35428 -4826 29125 327 -34967 -8725 28080 5040 -31980 -9792
2338 -9792 26729 6628 -33165 -13249 28348 11674 -31212 -15881 26834 13234 -30633 -17346
2350 -17346 28937 18087 -30179 -20626 28137 19148 -30267 -21263 30612 21516 -29734 -22229 29674
2363 29674 22668 -28506 -21405 31857 25693 -29676 -23025 30813 25038 -28041 -21469 32150 26082
2376 26082 -27108 -23604 29630 26277 -23478 -20281 28552 25279 -24479 -21891 26632 27610 -19822
2389 -19822 -20206 24330 25807 -19470 -22301 22682 27200 -13744 -23008 18560 27402 -13885 -23585
2402 -23585 16781 28404 -10202 -24482 12719 28735 -9058 -26914 11251 31201 -5898 -29396
2414b9396L6935K3838l6574k5568L7229K6368l7180k8677L7007K8947l6567k9527
2426c3165L7624K9712l8310l1370L7116L2508l8216l1830L8668L1780l8796l3119
2438c7398L7136L3980l6078l2820L3949L3581l5302l2488L3150L2895l2506l1580
2450c3481L0697L2026l0864l1836K9718L2071k7586l2149K4332L2786k4017l3106
2462c1409K3766L2952k0727l3014J8194L3908j6404l4729J5949L4872j3209l6782
2474b6633J2874L6477j0360l8029J0613L8749q898l8986O607M0236n816m1121
2486b4287N406M1643l058m3471L552M4236k540m4188K324M4534j299m6268J873
2499b1543M6402j202m5726R02M6543j416m5000N3M5212N87m3892j417M3506J180
$$ plain form
2414 -29396 7539 31377 -5197 -30765 6464 32832 -4348 -33025 3982 32929 -3638 -33165
2426 -33165 4459 34171 -4139 -35509 1607 34115 -4101 -35931 2737 34517 -4279 -37398
2438 -37398 -262 33718 -2360 -35180 -1231 32350 -2952 -35440 -2290 30605 -1901 -33481
2450 -33481 -2784 29242 -1622 -33458 -3740 28331 745 -31404 -7072 25714 1697 -31409
2462 -31409 -7643 25309 4582 -28432 -10238 23670 7266 -27463 -11514 23358 10149 -26633
2474 -26633 -13759 22718 12358 -25671 -15058 23691 14793 -24193 -17586 22650 16834 -24287
2486 -24287 -18881 22762 19704 -23767 -20215 24021 21481 -22707 -20383 24151 22852 -23416 -21543
2499 -21543 24859 23657 -22069 -21167 25376 23960 -21040 -20987 24225 24812 -19080 -20497 23009 24189
2513B4189m2532j887M2405L266m1979m288M0720N477m0888m477L9020O948l9212
2526a3238p056L6873Q209l6262r509L5120J1110l3221j3524L3431J2972l1864
2538f959j4962L1484J5948l1313j7417K9800J9467l0678k0300L0097K1993l0528
2550c368k4353L1179K4635l0066k5712K9562K6573k9846k7581K8866K8486k8478
2562a03k9059K9108K7382k8645k9420K8890K9629k7046l1486K8013L1156k7822
2574E97l1812K6672L1510k6394k9989K4995L0365k4921l0388K3322L0042k3315
2586F84k8851K2151K9028j9876l0934K0097L0318j7945l1061J6575L1347j5337
2598F196l1116J4481L0294j1130l1485R641L1444q171l1811P929L1543o513l2009
$$ plain form
2513 24189 -18343 -20230 22175 25441 -16538 -20826 19894 25371 -15517 -19994 19026 25974 -13238
2526 -13238 -20294 16579 24788 -11474 -20983 14137 25247 -7974 -21498 11933 24905 -6959
2538 -6959 -21921 9563 25511 -5802 -23219 6581 26048 -4630 -24930 5167 27160 -3368
2550 -3368 -27721 3458 28093 -1973 -27685 1877 28450 -1396 -28977 -111 28375 -103
2562 -103 -29162 -54 27328 -1317 -30737 -1847 27782 736 -30750 -2737 28419 597
2574 597 -31215 -4543 26967 573 -29416 -4421 25944 1023 -29365 -6043 23999 684
2586 684 -28167 -6016 23012 3136 -27798 -7701 22617 4672 -26389 -9814 21533 6196
2598 6196 -24920 -10439 19855 8725 -22760 -13119 18325 10154 -21657 -13728 17815 11302 -20707
2611b0707N335L3311m288l3862M612L4724k218l6494J839L6877m96l6801l90L7229
2625A8671J020l7143j491L7440K539l7019k897L7406K540l7524k208L8481K516
2638B2331l8813l170L8988L542l7679m124L6182M937l4398n948L4445N520l4485
2651a2672n286L3693N685l2205o193L1814Q135l2029r867L2103R911l0920j1652
2664a9483K9591J2440k8556j2931K7209J4135k5742j5659K4763J6033k4721j7066
2676a9987K3892J9308k6366j8578K5179J9298k3998k1668K2854K2721k2246k3967
2688b3558K2214K5261k2484k5744K1318K6864k2868k6760K1947K7120k1651k8330
2700b6671K2364K7592k1223k8450K1707K8607k1547k8929K0762K7915j9312k8882
$$ plain form
2611 -20707 -15372 17939 13651 -20211 -15599 19125 16907 -19587 -17748 19129 18633 -18168 -18558 18671
2625 18671 19691 -17452 -18943 18497 21036 -15983 -18880 18526 21066 -16458 -18666 19815 22331
2638 22331 -16482 -19652 19336 22878 -14801 -18925 17257 22194 -12204 -18152 16293 21813 -12672
2651 -12672 -17958 15735 21420 -10785 -16978 14836 22971 -9058 -18925 13178 23089 -7831 -19483
2664 -19483 10108 22548 -6008 -18939 8270 22405 -3337 -18996 5767 21800 -2921 -19987
2676 -19987 3905 23213 -3153 -21731 3448 22746 -1252 -22920 -66 22655 409 -23558
2688 -23558 -1344 23917 1433 -24311 -2993 23871 1003 -25757 -3810 23310 1659 -26671
2700 -26671 -4307 23285 2062 -26388 -4681 23926 2379 -26550 -5788 22127 2815 -26067
2712b6067J8869K8162j8169k7608J8011K7024j7634k7309J7417K6904j4985k7765
2724b3150J4610K7157j4025k6459J1514K8637j1326k7431J0512K5807o816k7295
2736a8265N916K7471n621k6786N562K6988l888k7335K536K8692j426l0075O22
2749a5609L0684J180l0952r03K9477K945l0557l399L1853L411l1081l295L1013
2762A4767M293l1447m737L2520N230l2387o021L3036O001l2308n781L1327O705
2775B1198l1829o162L1322O592l1327o197K9854O402k7775q053K8436P848k8478
2788h169q593K7454R823k6570j0600K6036J0993k5704j1061K3796J1592k3155
2800d158j2211K1590J4268k2371j3922J9607J6262k0812j6600K0874J7163k0313
$$ plain form
2712 -26067 -7198 20964 2795 -24813 -6802 20222 2588 -24721 -7304 19600 4615 -23150
2724 -23150 -8540 18617 4592 -21867 -10353 18284 6958 -20473 -9961 15846 9030 -18265
2736 -18265 -12349 15122 9501 -17285 -11723 15265 11377 -15958 -13422 15270 13844 -16231 -15609
2749 -15609 15075 16255 -14697 -15600 13877 16822 -13735 -17134 14719 18130 -12951 -16246 14767
2762 14767 19060 -12387 -17124 15396 20626 -11761 -17782 15254 21255 -11053 -16834 14493 21198
2775 21198 -10631 -16793 14529 21121 -10206 -16403 13451 19853 -7922 -15975 12461 20309 -8169
2788 -8169 -16762 10692 20515 -6055 -16655 9381 20374 -5330 -16391 7405 18997 -4158
2800 -4158 -16369 5221 19489 -2882 -16804 2803 19065 -1747 -18347 2527 19690 -623
2812f23j8407J9030J9031j7942k0516J8258K1364j8744k1926J6973K2378j6602
2824B274k3173J6096K4241j7888k3412J6914K4766j7754k4889J7280K6032j7367
2836C120k5662J6544K4908j5981k4816J5965K3377j3921k4777J4863K3752j3843
2848C529k4224J3382K3694j2743k4374J3016K3690j1052k3478R823K4235j0396
2860E102k2891P802K3853o921k2382N780K2304n044k2510M948K1902j525k4449
2873a4031K222K4397j69k5367j95K4522K256k5184k706K5999L453k5902l113K5519
2887A1701M102k6081m221K5900N846k6712n724K6047O396k6345p596K8835O558
2900A8706k7053o541K6160P161k6724p368K6392P948k5825p689K5151Q903k5972
$$ plain form
2812 -623 -19030 0 19031 1089 -19427 -1169 20195 1451 -20475 -3502 18876 2274
2824 2274 -20899 -4803 19438 1550 -21862 -4948 19818 2064 -22825 -5545 20487 3120
2836 3120 -22542 -5998 18910 2929 -21887 -5922 17455 3534 -21243 -6380 17372 3529
2848 3529 -20695 -7313 16381 3638 -20736 -7720 15970 4918 -18560 -8737 15498 5102
2860 5102 -17789 -9987 13866 6945 -15437 -9657 12647 7603 -14907 -9959 11943 10418 -14031
2873 -14031 -11809 12588 12419 -12948 -13143 11379 13635 -11549 -14255 11744 15197 -10705 -13818 11701
2887 11701 15803 -10278 -14499 11401 17247 -9465 -15189 10858 17254 -9091 -16687 12148 18706
2900 18706 -8347 -14888 11272 18433 -8291 -15659 10733 18681 -7144 -14833 10318 19221 -6751
2913f751p802K4051R472k4584r399K4365P904k2687r487K2343J0217k0949j1196
2926a4503K0206J1481k0472j1350J8983J1781j7082j4452J7313J4349j6788j4432
2938a4966J6098J5493j4728j9055J6389J7039j4426j8092J3965J8263j3976j9919
2950a7915J2835K1732j3649j9791J2538K1157j4172k1862J3552K2192j1601k4116
2962a9100J3603K1978j3307k2267J2378K3077j2483k2535J1203K3829j2855k2980
2974a9459J1154K2934r992k2814J1437K0547j0062k1367R301K2266q910k1224
2986a6189P905K0979p147j9929N442K1424n711k0755L680K0565k725k0737M857
2999h341J9225j827k0740L89J9932J698j9999j737K0965K296k2366k267K1335
$$ plain form
2913 -6751 -14553 9498 18970 -5614 -15013 9352 17256 -5431 -14918 7425 17642 -3307 -14503
2926 -14503 5703 17184 -3288 -14638 4345 16126 -956 -15408 1905 16254 -534 -14966
2938 -14966 1132 16625 1897 -17158 -769 16270 1844 -16248 -2283 15980 2004 -17915
2950 -17915 -5080 16652 3003 -16788 -4250 16907 2735 -19127 -5575 16617 5016 -19100
2962 -19100 -5497 16481 3174 -19093 -6715 16362 3879 -18656 -7453 16376 3521 -19459
2974 -19459 -8305 14629 4637 -18177 -6740 13807 3745 -17622 -8321 13945 5035 -16189
2986 -16189 -8284 12695 5548 -14381 -8939 12485 6774 -13981 -10301 10264 7539 -13198 -8341
2999 -8341 10884 9057 -11683 -11294 8638 10336 -9663 -11400 9565 11861 -10505 -12772 8563
3012H563M207k1032m846K1975N614k2078n815K2408O323k2183o247K1914O913
3025A5716k2942p170K3516P866k3003p447K2736P580k3123p625K3863Q327k4148
3038e854q052K1837Q506k1534q233K1918P918k1077q541K0298Q144j9703q147
3051a2520J9721R258j9132r889J7357J0060j6632j0610J6202J0321j4111j3659
3063a3634J4903J2480j3151j3328J3873J2678j2439j4718J2144J4325j0978j5504
3075a3349J1813J5544j1531j7279J0575J8373j0501j7642Q599J8745q742k0109
3087a5504J0426J9488r157k0713R336K0397j1053k0215J0097K1349j0522k0239
3099a6310Q301K1220r003k0354Q978J9981p909k0849Q788J8783p046j9269P232
$$ plain form
3012 8563 12770 -8262 -13108 8867 14481 -7597 -13412 8996 15319 -6864 -13111 8803 15716
3025 15716 -7226 -14396 9120 16986 -6017 -13464 9272 16852 -6271 -13896 9967 18294 -5854
3038 -5854 -13906 7931 16437 -5097 -13330 8588 16506 -4571 -13112 7186 15330 -4373 -12520
3051 -12520 7201 16459 -2673 -12562 4795 14855 -1777 -12387 3815 14136 25 -13634
3063 -13634 1269 13749 598 -12730 1143 13821 1382 -13336 -1192 13133 2155 -13349
3075 -13349 -1536 14008 2477 -14802 -4227 14146 3645 -13997 -5398 13347 4605 -15504
3087 -15504 -5078 14410 5253 -15460 -6124 14273 3220 -16995 -6898 14451 3929 -16310
3099 -16310 -8009 13211 4208 -16146 -7168 12813 4904 -15945 -7157 11626 4580 -14689 -7457
3112g457K0192p501j8841N777J8328n828j6749N331J7137m185j8778L521J8200
3125I147k381j7092K716J5953o50j7871R95J6614K020j7772k080J8554O13j6773
3139h007k299J7485L483j7136m320J7720N109j8468n365J8807O807j8486p101
3152a1771J8724O741j7906q559K0328P329j9810p020J9346P266j9673p513J9387
3165F869Q544j8805q557J8832P790j7960q792J7992R505j9828p577J7216R804
3178A5033j7352q948J7222Q328j5620j0490J6156J0173j5757r425J3715R945j3985
3191a005j0429J2688J0964j1775j1134J1298J1094j0604j2488J0079J2832r209
3203B311j3693R803J3007r501j4557Q635J6160r317j5448P983J5460p180j7032
$$ plain form
3112 -7457 12735 5234 -13607 -7830 10498 4670 -12079 -6748 10389 6204 -12574 -9053 9147
3125 9147 6766 -10326 -7610 8343 7693 -10178 -9183 7431 9451 -8321 -10401 8153 8766 -8007
3139 -8007 -10306 7179 10662 -6474 -10794 6926 12035 -6433 -11798 7009 13816 -4670 -11771
3152 -11771 6953 13694 -4212 -12771 7557 14886 -4924 -11944 7402 14668 -5005 -12518 6869
3165 6869 15413 -3392 -11949 6883 14673 -3287 -12079 5913 15418 -4410 -11987 5229 15033
3178 15033 -2319 -11267 5955 14283 -1337 -11827 4329 14502 -1255 -10680 3035 12980 -1005
3191 -1005 -11434 1254 12218 443 -10691 607 11701 1097 -11391 -1312 11520 2311
3203 2311 -11382 -1579 11428 1927 -12630 -3995 12165 2848 -12600 -4617 10843 3663 -13369
3216a3369Q126J6229o496j7535O290J7713p044j7206O588J7721o920j8354O876
3229g381J8959q017j7212N679J9113o750j8217M997J8535m908j7607N916J7098
3242A0205n817j6894L399J8689l884j7031L338J6896l356j7296M264J5612l192
3255D933j3871R92J5169j365j4793k48J6244R08j4712j139J3686J359j3567k389
3269h793J3835M608j5117l680J5030M563j5637n082J6290N522j6361n979J6306
3282E505O465j6061o813J6011P662j5334q298J5889Q400j6974p077J6460P263
3295A3098j5271q504J4738R529j4778r768J5401R465j4673r375J4097R395j5501
3308b147q464J3607R943j4220r468J4026Q479j2709r232J2853Q523j1028r771
$$ plain form
3216 -13369 -5243 10986 4490 -13045 -6755 10958 3914 -13292 -6704 11017 4097 -14257 -7381
3229 -7381 11578 3561 -13651 -7972 11141 4391 -13826 -8829 9706 4798 -12809 -6893 10205
3242 10205 4388 -12506 -9107 9582 5698 -11333 -7995 8901 5545 -11751 -7487 8125 4933
3255 4933 -8938 -7946 7223 5858 -8935 -9183 7061 7969 -6743 -7882 5804 7163 -6404 -8793
3269 -8793 5042 9650 -5467 -9147 5883 10446 -5191 -10273 6017 11539 -4822 -10801 5505
3282 5505 11970 -4091 -10904 5107 12769 -2565 -10863 5026 13426 -3548 -10625 5835 13098
3295 13098 -2173 -10677 4061 13590 -1188 -10956 4445 13910 -763 -10138 3959 13354 -2147
3308 -2147 -10611 2996 12939 -1281 -10749 3277 11756 -953 -10185 2668 11191 163 -9608
3321i608J1209R998j0568j0457J0499R739r497j1076Q823J1776q400j1427O935
3334b054J1095o748j1807O930J2287p266j3149O489J3077n455j4157N836J4103
3347I181n058j4784M651J5280n220j4651M885J4936n073j4950M245J5626n026
3360D042j6600N335J5803m500j5193K529J6944k626j7224L459J5865l621j4018
3373i805J837J6536m472j4508K723J5004k252j4778K429J4794k094j3854J042
3386g398J4733j325j2774p67J3977M8j2940p45J2431K128j2969j637J2889J848
3400G499j2169k734J2104L648j2377m491J2990M976j2672n614J3668N630j2255
3413a797p451J2314P672j2677p278J3078P055j2327p990J3145Q013j3575p238
$$ plain form
3321 -9608 1601 11599 1031 -9426 1073 10812 1315 -9761 -938 10838 2438 -8989 -2054
3334 -2054 9041 2293 -9514 -2584 9703 2437 -10712 -4223 8854 3399 -10758 -4922 9181
3347 9181 4123 -10661 -6010 9270 4050 -10601 -5716 9220 4147 -10803 -6558 9068 4042
3360 4042 -12558 -7223 8580 4080 -11113 -8584 8360 5734 -11490 -8031 7834 4213 -9805
3373 -9805 -7968 8568 4096 -10412 -7689 7315 5063 -9715 -7286 7508 5414 -8440 -7398
3386 -7398 7335 6010 -6764 -7531 6446 6494 -6446 -7191 5240 7368 -5601 -7238 5651 7499
3400 7499 -4670 -7404 4700 8348 -4029 -8520 4470 9446 -3226 -8840 4828 10458 -1797
3413 -1797 -9248 3066 10738 -1939 -9217 3861 10916 -1411 -9401 3744 11757 -1818 -9056
3426i056J3563Q372j3643q767J2056R628j3192q519J2746Q668j1326r604J2038
3439B964R093j2075r019J2133Q153j1342r319J2281Q057j1101q170J0343Q294
3452A0292q800r851Q907R277r463q534P169R889p600r675O480R715n274j0980
3466h448O430J0317n373j1604N868J1062n707j0859L578J2699n040j2314M220
3479e171J2595l867j2403K990J2772k618j3466J861J4917k222j4874L068J3517
3492G099k459j4412L174J4445k893j4611K185J4840k378j4743K570J2771q72j3871
3506i155J117J4769k132j2458K10J3536r47j2587J071J2613m36j1673j041J2416
3520E303Kj1779j035J0936L475j1511j891J0772K956j1589k569J1224L310j0536
$$ plain form
3426 -9056 4507 12879 -764 -9531 2525 12153 -1039 -9558 3188 11856 530 -9074 2964
3439 2964 12057 -18 -9037 3096 11249 -93 -9412 2869 10926 -175 -8345 1998 10292
3452 10292 1492 -8359 548 9825 362 -8172 -1003 8886 1286 -8389 -1909 7806 2532 -8448
3466 -8448 -2018 8299 2926 -8678 -2810 8252 2545 -8314 -4736 7963 2923 -9391 -5171
3479 -5171 7424 3557 -8846 -5856 6916 4298 -9168 -7307 7610 5388 -9486 -6418 7099
3492 7099 4640 -9772 -6598 7847 4954 -9657 -7472 7368 4990 -9753 -7183 5588 4716 -9155
3506 -9155 -8038 6731 4599 -7859 -7649 5887 4940 -7647 -6576 6037 5601 -6072 -7113 5303
3520 5303 5305 -6474 -7509 3427 6902 -4609 -6500 4272 7228 -4361 -6930 4294 7604 -2932
3534b932l957J0804L750j0320m781J1305M947r790o126R702O724j0584o781J0609
3548B570P130j0824o563J0606O521r628p539J0344Q146j0834q155J0860Q312j0926
3562B0q383J0422R018j0617q832R701Q455r310p980R411Q340j0190p522R003Q051
3577I587q457q676P299R977q699q409P890Q085p286q191O219R067o667q368N567
3592a062Q124n037q506M421Q953m692q868L844Q912l097j0109L431R198k465j1090
3607h043K367J1342k733j0402J640J1566j915j2304K240J2291j509j1911J061
3620f310J1963k160j0506L31J1909o79j2879J116J2436O3j2604l33J2527j65j1174
3635f465o12J1875O27j2007l6J1343J10j0742o41J0845J205j1213o33J0894K76
$$ plain form
3534 -2932 -6889 3915 7665 -2655 -7436 3869 8816 -974 -7100 2602 9326 -1258 -8039 2570
3548 2570 9700 -1124 -7687 2919 9440 -188 -7727 2617 10763 -71 -8226 2634 10946 20
3562 20 -8363 2059 11077 460 -8372 1329 9784 474 -7506 1905 10245 55 -7467 1536 9587
3577 9587 1130 -7546 -247 9730 1031 -7378 512 8597 1311 -6880 -661 8406 1739 -6629 -1062
3592 -1062 7062 2025 -6481 -2060 6893 2201 -6667 -2823 6089 2992 -7117 -3686 5512 3047 -8043
3607 -8043 -5676 5666 2933 -7469 -5829 5737 3822 -8482 -6242 6049 4540 -7371 -6310
3620 -6310 5653 3493 -7013 -6682 5227 4548 -8331 -7215 5221 5284 -7320 -7653 4874 4709 -6465
3635 -6465 -7077 4798 5425 -6582 -6618 4725 4835 -5907 -6548 4297 5502 -5711 -6344 4550 4826
3650D826r225k181J0693K033r689k002P670L756q499l887R582L465r019l333Q406
3665B596M526r199m527R314M784r270m918Q743O075q280o917Q750P039q805o560
3680f649P958P249p775q592R917O090p422p424Q225P549r391o043Q645P071q918
3695D90p745Q364P210p134p846P205Q542p518q432P234Q206o978q466P694P049
3710G875o882p695P026P174n458q355O459P178o435o684N200O614l369q398L666
3725b084P343l308q110L146Q764l711q585K540R436k849q479J525R017j036r728
3740f119Q24R938p51j0499J611R834q44j0649J155R568L5j0173n57J0160Q04j0369
3756f032r86J0990M56j0813n09J1878j034j0603n35J1782m65q732j697R969N16
$$ plain form
3650 4826 -4399 -6580 4113 6146 -3543 -5545 2125 5881 -2618 -6505 3077 6542 -2477 -5810 2596
3665 2596 7122 -2077 -6604 2710 7494 -1776 -6694 2049 8124 -156 -7073 1677 8716 -89 -6649
3680 -6649 1309 8558 783 -7809 2108 8198 776 -6648 1577 9126 -265 -6308 2337 9408 490
3695 490 -7255 1109 8319 1185 -6661 544 9086 1568 -6864 370 8576 1598 -6868 826 7875
3710 7875 993 -6702 324 7498 2040 -6315 144 7322 887 -5797 -597 6017 2648 -5750 -2084
3725 -2084 5259 1951 -6159 -3013 5751 2040 -6545 -4005 5431 2582 -5897 -4372 4645 3609 -6119
3740 -6119 -5295 4643 3892 -6607 -4996 4838 3994 -6655 -5500 4068 4103 -6070 -6627 3533 4337 -6032
3756 -6032 -7018 3972 4428 -6385 -6894 4984 3950 -6653 -7188 4594 4129 -4603 -6300 3669 4185
3771D185r269j425J0332M45r144j255R912L38q648p89R187J070q729j902R293
3786C601J084p975k847Q780L655q738k277O779M399q038l064O779M837p813m319
3801e157O145N376p772m267P095O753q033o172P333N277n931o231O726O727p119
3816G50p160P213P932p659p168P765P035q219p663Q196O627n760q108O573P507
3831G861o603p861P176O390n627o826N601P316p030n887O033O224n916o413N680
3846A18O154n130p554N577P127m466p444M004O848l197o775L173O320l275o659
3861e179J860P630j637p864J210Q059j735p339O27P702p13p343L47P885J00p815
3877d205j525R865o96q637P57P140N81q972K10R389n80q859o3Q941P35r322Q2
$$ plain form
3771 4185 -5084 -6509 3823 4268 -4876 -6131 3781 4119 -4529 -5318 3869 4939 -3790 -5692 3601
3786 3601 4685 -3290 -6137 2643 6298 -2440 -4717 2062 6461 -1577 -4641 2138 6975 -838 -5157
3801 -5157 988 6364 -1408 -5675 1420 8173 140 -6032 1301 6578 647 -5584 1142 7869 750
3816 750 -6410 803 8735 1076 -6092 1673 8708 489 -7174 1022 7649 1889 -6219 354 7861
3831 7861 1258 -6603 573 6963 1336 -5490 111 7427 397 -5490 543 6767 851 -5562 118
3846 118 6272 1142 -6412 -835 6292 1826 -5618 -1614 5234 2037 -4738 -1565 4755 1480 -5179
3861 -5179 -3319 4311 2674 -5190 -3980 4079 2344 -4995 -4368 3334 2621 -4722 -4375 3510 3610 -4205
3877 -4205 -5730 4135 3439 -5198 -4441 2699 3280 -5692 -5482 3907 3327 -5532 -5595 3346 4081 -5241 -5159
3894e159Q961O99r383q57Q429R38q553k97Q375K54p899j199Q537K010r245j42
3910d531Q313K53o639j997P064K051p548j384O994K036o601k461O359K551n563
3925a103l444O545K849o418k509M664M677n598m074N676N350o377m237N093M913
3940F007m328o673N339O802n985n964N373N924n115o647N495N428m636o696O201
3955E25O438n764o318M837P094n369p281N489O469m793o753N112O343m143o906
3970e020M406O873n042m883K626O207l560o233K878N810l114n429K970O660l829
3985A320n586K106N389j373o350J062P228k930m382P36O623j109q288K486N625
4000B557k4o411j70P188n70p183P99O845l12p096p00P183J311p950k20O536K321
$$ plain form
3894 -5159 3802 4501 -4882 -5739 2690 3628 -4925 -5222 3153 3407 -4492 -5691 2846 4856 -4389 -4531
3910 -4531 3782 4035 -2604 -4601 2463 4514 -3034 -4418 2576 4612 -1989 -4450 1909 4460 -1103
3925 -1103 -4547 1998 4847 -1571 -4080 584 5261 -337 -4411 1265 6615 238 -3999 1094 6007
3940 6007 1679 -4994 345 7147 1162 -4802 571 6495 1380 -5267 228 5656 1020 -5676 525
3955 525 6963 1199 -5119 -282 6812 1443 -5838 -349 6120 1327 -5426 -314 6029 1886 -5020
3970 -5020 -614 6259 1217 -3666 -1040 5167 1607 -4626 -1748 4062 948 -4481 -1511 5149 1320
3985 1320 -4266 -2160 3229 1856 -4494 -3432 3796 866 -3516 -2780 3843 2734 -5554 -3068 2557
4000 2557 2533 -3878 -4048 3140 2570 -4613 -3814 3031 2719 -4377 -5077 2106 3417 -4533 -4753 1783 4104
4017D104r072p44Q645J88p331l79P191M98p002j350P832O90q078p98Q223J092
4033C709p329j482P984J458p423j581O655K073p249r77O561J544n733j950N162
4048A422K798o625r06N270J945n229k493N587K160m135l300M450L560n045j911
4063b452L824M034n269m767N343M018m898l225L721O071o166m626N136M603m541
4078H06n037M126N668m660n472M827N092m032o051N367N482l976o216L477O653
4093F054m913n446L724O804m114o375N013M566l747o411M464N717m315n333L665
4108f47M677l048n153K408O097l106m218J257N120j735n164J540N603k011m596
4123b976P81M961p30n953J723M752o67n947N99N843M35n986j55N481Q73o376j586
$$ plain form
4017 4104 -4968 -5712 2933 3121 -4210 -4589 2602 3100 -3902 -5252 2580 3270 -4808 -5606 2617 3709
4033 3709 -3620 -5102 2882 4340 -3083 -4664 1991 4064 -3185 -4162 2399 3943 -1790 -3740 1422
4048 1422 4220 -2405 -3311 1959 3904 -1325 -3818 1769 3929 -206 -3506 944 4504 -541 -2452
4063 -2452 1372 5406 137 -4630 713 4731 -167 -3392 329 6400 234 -4392 744 5347 806
4078 806 -4231 -105 5563 903 -4569 258 5350 1318 -4733 634 6116 2140 -4076 -599 6054
4093 6054 1141 -4305 -581 6223 2109 -4266 747 5313 1566 -4845 -381 5336 1021 -4312 -647
4108 -647 4030 982 -4171 -1763 4334 1228 -2990 -1733 3387 1652 -3512 -1972 3631 1620 -2976
4123 -2976 -2195 2766 2036 -3917 -2194 2558 1891 -4056 -3457 2386 2821 -3165 -3320 2161 3034 -3342 -4928
4140d928O758J319o895NN715J046o244j185O577P13o557l96O372J911q041p20
4156d550P250O24o408j620P580J119o786k207P445Q42o076j463O633J801p030
4171b846j593N963J950o010j245N416K457n442k303N940R51m367k172M634K828
4186D161n436j048L648K289l924k449L923L305m854l510N276L502l764l842M058
4201A335K864k498m914L498M527l882m423M060L454k214n523L320N528k618o144
4216c630L441N849l881n504L525N916m346n143L043N647l104n582L252N425k969
4231A939o125L337N449k869n417K856N553l386m638K259N055k529n077K167M962
4246C536j884n659K119M362j137l722l40N051o00m751N20N110j044m760K01M728
$$ plain form
4140 -4928 1830 3149 -3746 -3741 1974 3020 -3224 -4409 2168 2881 -3676 -4072 2300 4211 -3830 -4550
4156 -4550 2700 3324 -3084 -4704 2876 3995 -2791 -4998 2447 3289 -2787 -4250 2383 4184 -2846
4171 -2846 -4439 1524 3474 -2536 -3781 1635 4092 -1350 -3653 2287 3238 -1129 -3301 1333 4161
4186 4161 -1275 -2323 1325 3614 -310 -2759 1164 4469 -385 -3895 1381 4883 1119 -2723 1335
4201 1335 4199 1701 -3213 285 4812 930 -3493 567 4021 1807 -3716 -396 5132 2514 -3630
4216 -3630 -189 5660 1779 -3725 -200 5716 1370 -3773 -730 4917 1813 -3769 -517 4908 1939
4231 1939 -4186 -849 4600 1731 -3686 -830 4723 1337 -3301 -1042 4013 1484 -3593 -1426 3536
4246 3536 1652 -4007 -1888 2474 1337 -2385 -2725 2326 1726 -3025 -2505 2605 1561 -3199 -2998 1730
4262A730K7n886J100M948J76n183l70M517J61l803j204N701P74n504j523N582
4278A243J268n385o87N122J231n484j616N444R88n213j521N828J658n168j986
4293d278N909K317o891j148N230L111o628j975N730J655m223k146M964K075n048
4308a346j691N130J148m125j769M446J611m018k272M372J641l547k817L921L057
4323C741l262k766L260K493k356l513K772L463l566k516K597K933k220l608J949
4338e99N326l702m093J937N559l036l819J893M705k337n613L475M287k637n622
4353d276L271N205j729n081J947M016j488n062J809N974l276l975J800N043k422
4368A756n062K072M473j694m975K205L655j134m949K294L555K78n515Q09M781
$$ plain form
4262 1730 1757 -4129 -3029 1919 2095 -3088 -3458 1059 1220 -2583 -3787 1914 2688 -2816 -4339 1243
4278 1243 2511 -2874 -3561 1561 2792 -2692 -4308 1136 2124 -3089 -4610 1218 2876 -2292 -4278
4293 -4278 1631 3948 -2943 -4091 1139 4250 -2378 -4353 1377 3032 -1191 -3337 1627 3702 -1346
4308 -1346 -3037 2093 3241 -884 -2653 1793 3404 -614 -2886 1486 3127 -420 -3237 684 3741
4323 3741 479 -2287 973 3466 1110 -2403 369 3832 266 -2250 347 3280 1060 -2548 -599
4338 -599 4727 1025 -3068 -1131 4428 1392 -2427 -534 4171 1834 -3779 -304 3983 1346 -4276
4353 -4276 -1005 4200 2471 -2610 -663 3353 1865 -3197 -1388 4586 1310 -2665 -865 4178 1756
4368 1756 -3306 -1234 3239 1545 -3430 -1225 2430 1296 -3653 -1359 2196 2474 -3041 -2232 2549
4383B549j758m051J725L171l77l526P53J838M45l465l90M597O2l590j636N115
4399A462J19m064n03N008o6m269j551N034J704m760j361M992J297m668j503M726
4415A597J065m620j769N264J084m480j146L543K589m628k202M490J757l888k076
4430c420M824J073k926k677M727J131m610j832M772K045m335k127L814K540l940
4445i41j479K243K792k732j703K552K437l387j583K474J965k109j759J559M110
4460D439l397k732J747L248k372m202L148K712p60m355J087N076j805l625J731
4475f0L867k749l721K590L568k124m617K664L907j831l774J189L741j5n211J214
4491a362N195k371m941K639M425j251n321J342L540j533l781J996M165j490l400
$$ plain form
4383 2549 791 -3260 -1535 1636 1259 -2267 -1514 324 769 -2696 -3086 1511 1573 -2017 -3653 1462
4399 1462 1581 -2483 -2986 2022 1956 -2313 -3864 1170 2874 -1886 -3247 1745 3042 -1626 -3129 1597
4415 1597 2662 -1958 -3727 1537 2621 -1859 -3005 538 3127 -1501 -3703 787 2544 -1344 -3420
4430 -3420 1404 2477 -449 -3126 1601 2732 -1878 -3710 1062 3107 -1228 -3355 459 2999 -941
4445 -941 -2420 -177 2615 -117 -1820 732 3169 -218 -1801 673 2638 529 -1230 329 4439
4460 4439 1042 -1690 57 3305 933 -3269 -121 2591 1831 -2524 -1437 3639 1834 -1791 -60
4475 -60 3807 1058 -2663 -73 3495 1371 -3246 -582 3325 1494 -2280 -1091 2650 2635 -2576 -1362
4491 -1362 3833 1462 -3479 -840 3585 2334 -2987 -1645 1895 362 -3419 -1423 2742 1252 -2148
4506b148J120L060o07k985l0L169m05l856K98M651r32l301J55L382N38l862p40
4523b493M196l68l221j39L898j81l655p00L572J465m531m94M255L18l950j472
4539c500M335J263l571k001L852J573m073q95M102J399l527k496M505J793l357
4554e98k597M288J077k986k266L774K184m416k186M095J758l499j175L293K419
4569C165l104j970K395K163k727k410L850J908l214k246K066L036k805j957J452
4584c98L433k443k199J954K508j569l103J488L224k366j730Q88K999j811k845
4599a970J984L508k394l269K340L197j878l928J898M072j592l679Q72M492k794
4614H59k901N24M811j304m512J924L700k245l392J295L575o72l872K33M262o65
$$ plain form
4506 -2148 -1028 2032 1425 -1560 -1590 1579 1174 -2682 -2384 2267 1335 -1966 -1811 1571 2109 -1753 -2493
4523 -2493 1703 1335 -1886 -2025 1873 1692 -1963 -2663 909 2374 -2157 -2651 1604 1922 -2028 -3500
4539 -3500 835 2098 -1473 -3474 378 1951 -2122 -3017 1085 2484 -1043 -3539 966 2759 -598
4554 -598 -3195 1093 2170 -816 -3082 692 2876 -1540 -3726 369 2127 -1372 -2547 746 3165
4569 3165 61 -1909 486 2649 -78 -2488 1362 3270 56 -2190 -124 2912 107 -1850 -398
4584 -398 3035 592 -1607 347 2855 1286 -1817 -329 2895 529 -1201 -313 2686 875 -1970
4599 -1970 14 3522 1128 -2141 199 3396 1518 -2410 -512 3560 1968 -1711 -839 3653 859
4614 859 -2042 -1518 3293 1989 -2523 -599 3101 856 -2536 -1241 2334 1662 -2210 -1977 2285 1620
4630A620l662O79M015j565l367J163K249k30k768K76L723n79l359q10L424J04
4646I13l346LL870j32l406O1L323J91l771n97K916J986m483K79K768N15k274j683
4664b867M167L13k680j739L400P16k790k025L463K258l317k420L059J846k739
4679a355k394M851J235k973k671L710K002m012j010L876P44k516j849L399J947
4694B984l380j525K515K492l085k128L268K178l284j908K557K521l652j423K839
4709I69J359j459k656K262J780k297j642K202K023k069j707J390K165j761j607
4724a048J003K541j870k185Q49L152n20l437J612K354r50l202J136K723j55l375
4740a372R48K860j157l301J354K612q07l103R52L352l2l712l86L404P19m340P04
$$ plain form
4630 1620 -2042 -1363 2652 1087 -2280 -1117 1132 902 -1866 -1590 2133 1554 -1805 -2615 809 913
4646 913 -2433 -2430 1440 1308 -2098 -2037 1286 1477 -2294 -2891 25 2011 -2472 -2193 575 1090 -1184 -2867
4664 -2867 1300 1613 -1067 -2806 594 1310 -1480 -3505 -42 2216 -1101 -3521 -462 1384 -1355
4679 -1355 -3749 1102 2337 -636 -3307 403 2405 -1607 -2617 1259 2003 -513 -2362 1037 2984
4694 2984 -396 -1921 594 3086 1 -2127 1141 3319 35 -1873 684 3205 -447 -1870 969
4709 969 2328 869 -1787 475 2255 -42 -1684 518 2541 472 -1235 155 2320 559 -1048
4724 -1048 -45 2496 626 -1559 -710 2442 1922 -1515 97 2451 1501 -1701 -565 2158 2003 -1372
4740 -1372 -424 2436 1279 -2022 -668 1944 1137 -1966 -1014 2338 2306 -1406 -1792 1612 2331 -2009 -1305
4757a305L352l83k876L95L377o96l535Q87K446l85l073R10K040o5k698j572M148
4774I67K87k474k25K689jl090n74L434N55k707q34K385P65l620Q72J052J800k024
4792g43j631K644J447k973l43K187N98l346J22K523O84k526j383L399J121l511
4808a731j362K916J176k525r84K603R86k151k063L032K149k112j065Q76K929m103
4824a429j108L119J213j350l142L198K071k657j735K356J412j677j828J068L199
4839B710k693j452J513K519j910j604J011J801j817j103P43J394o14k301K139
4854C36J482n17k940J236K639q67l103L96L640j894j681J428K597j359k495R89
4870a13J969l52k792J229J769p54k263O61L249p17l191J11L891n35m209J207K662
$$ plain form
4757 -1305 2047 1664 -1212 -817 2560 1864 -1671 -784 1662 1277 -1796 -886 1154 1089 -1609 -3181 967
4774 967 1254 -1220 -1445 1244 1243 -1847 -2421 1013 1568 -1139 -1973 412 1177 -2443 -1571 -519 1281 -743
4792 -743 -2374 270 1717 -1256 -1599 588 1186 -2160 -2038 485 1169 -1357 -2740 659 1780 -1731
4808 -1731 -3093 -177 999 -1526 -2510 93 1079 -1072 -3135 -103 2046 -66 -1131 -255 2674 -1429
4824 -1429 -2537 582 1795 445 -2697 501 2572 -85 -1820 536 1948 271 -1557 -489 2710
4839 2710 17 -1435 78 2597 687 -917 94 1895 78 -1025 -282 1112 498 -1803 336
4854 336 1818 1301 -1639 -403 2236 1369 -1734 -1338 2302 408 -1273 155 2752 1393 -1102 -113
4870 -113 1856 1504 -1288 -59 1710 956 -1307 -646 2603 1886 -1305 -1194 2697 2162 -2047 -840 1822
4887A822n26k649L23J671P40l012J148K368M80m460N82K581o75k105K18K278J080
4904A864l296j39K132K49k138n8K145m29j287j25K204O79j779l019L905M20k827
4921a499q25K754J120k245o35J447O09k459j053L346l00p21j793K092J340j163
4937A5k761K473J903k006j221J415K344k441j999K693P17j408q07k34L310l076
4953a083j254K401L092m298l66K177J375j580j938J273K029j453k686L208K5j66
4969G56k676K215K306k040k519J837J940n51j933M40J744l14l180K228J227J57
4985A637k398L23J261jj915R57J499J044k785o47K903q86k095J136J234P81l416
5002a368m1L219Nk508l59K623o43k743J38L365nl309J18K696j42k307J60L552
$$ plain form
4887 1822 1296 -1353 -1030 641 1381 -1631 -483 1885 2365 -2095 -1513 1068 393 -1712 -1494 784 1864
4904 1864 -1432 -1571 561 810 -1328 -1386 759 330 -957 -1082 1122 1801 22 -2997 908 1328 -1499
4921 -1499 -2324 430 1550 -695 -1330 117 726 -1733 -2786 560 260 -461 -2254 -162 1178 15
4937 15 -2746 -273 1630 -376 -1597 -182 2162 -279 -2278 415 1132 -276 -1083 -1317 1993 -1083
4953 -1083 -2337 64 3156 -1142 -1508 669 2044 464 -1474 -201 1828 375 -2311 897 922 756
4969 756 -1920 295 2601 561 -1958 -121 1819 1268 -665 -225 1519 1205 -1975 253 1480 1637
4985 1637 -761 -438 823 822 -1093 -136 1363 2407 -378 -1025 1878 992 -1103 33 1267 2048 -1368
5002 -1368 -1409 1810 1815 -693 -1052 1571 928 -1815 -1677 1688 1683 -1626 -1508 1188 1046 -1261 -1101 2451
5020B451j555j608j69J999m26k333J55K425J26k590m35K867j16k594p20K882O67
5037A026j873q99K190O48k706N05O13J578k052j008J983N14k098p00K522R04k161
5054a014n52J137P60j869o2J512J303j834j352K275K518k451k702J633J382r23
5070b39j573J277J352j349j684J760J641n53k416J471L003k693j283K023J122
5085A859k096j334K671J375k364k214K139J940k020j660J841J556k423j220K013
5100F3J808j797j354K029N94j015q64J217J133j412o37N14J396j264j298J109
5116B22J691n50j500m19J622r92j355Q32J851m5j876k51K138j47j514m03J920
5133A224n88j724M24K372J15k296k11J734k27j014j251K802m99k021L23J697K23
$$ plain form
5020 2451 896 -712 -881 1118 692 -1641 -1486 939 1065 -1525 -1960 907 791 -1803 -2523 359 1026
5037 1026 -847 -1746 444 1092 -1614 -1109 -496 1082 -970 -1978 5 519 -1579 -2279 243 1147 -1014
5054 -1014 -1566 -429 331 -1538 -1600 -88 1215 -619 -1971 304 2822 371 -2331 -698 684 -239
5070 -239 -1812 -535 817 -532 -2216 -456 1185 632 -1784 -313 2690 -3 -1286 737 1859
5085 1859 -237 -1571 1100 2475 111 -2103 36 1976 -44 -1704 137 1693 -730 -1950 63
5100 63 1871 74 -1280 749 1343 328 -536 681 1814 402 -235 279 1675 411 -887 222
5116 222 1913 1363 -137 -556 1066 74 -1281 -449 1402 1357 -519 -770 1368 1221 -293 -696 1224
5133 1224 636 -1088 -664 1708 1823 -473 -684 1050 823 -191 -1442 1360 861 -1160 -837 860 1083
5150A083j272j128L701j142j902l7J692%k539J334R91M27k510J15K361k57k147
5167a230o2J645J164k495m99J297J201k258K87K251N7k082q99J899N77j467p58
5184a372J466L70j907o46K233m1j188j030K102Q53p22k045K174R48j211k182J801
5201c97K081k178j520J945J393j537j046J730J172j650j684J965J128j316j974
5216a888K131J833k329j124J734N30m17k278J422J100j288o36J041J732p07j148
5232b92J094J446j948j532P97J607k65k333J599J855j428j425J727R16q57j155
5248a94O57J134j171j246N56K445j157j738j61K084r98p01o0J157o83p81O39J35
5266h3J864k661M80J171Q52k575n08K041N11k087m81K594L78k395l69K068L0k007
$$ plain form
5150 1083 -189 -1317 2384 1242 -660 -697 995 995 -1544 -210 781 1208 -1302 -1187 1174 917 -1230
5167 -1230 -1292 353 1517 -978 -1477 -180 1021 -1237 -950 1301 1358 -724 -1623 276 853 -614 -1372
5184 -1372 94 464 -1443 -2089 144 103 -1085 -2115 -13 840 118 -1927 247 1195 -16 -2198 -397
5201 -397 1684 -494 -2014 -69 1324 -213 -1259 471 1643 -7 -1691 274 1402 86 -1888
5216 -1888 243 2076 -253 -1377 357 887 470 -1808 -386 714 -574 -1210 -169 1563 856 -292
5232 -292 802 2248 300 -1232 -435 1172 907 -1426 173 2028 600 -825 902 1818 961 -194
5248 -194 463 1597 426 -820 -264 2181 1024 -714 -875 1209 211 -490 -550 607 -76 -857 -218 -83
5266 -83 1781 -880 -400 771 1623 -952 -1460 581 1092 -995 -1476 1118 1496 -899 -1268 800 830 -1177
5284a177l9K094k24j967o66L414j494j85j054K316j17j781K87J113L82j803k55
5301a156J222J177j873q89K072l1j400q16K166M95j538j133K614l40j415K20M41
5318a84M54m36j208J782O69j112j742J235R46j462J3M99J513r62j085J269L53
5335E42L56k425J386J619j161j561J929P55j456q36P38J926j325p34L05J238j370
5352g4j004P69J859j289j483J124J889k077q42J161J522m17k272J452J307o76
5368I49k314P29K238o58j471L57O95j37q86J056O81r01o5l38J780o03j885L32
5386d41J445j17j613N7J309Mr20k58J888j363j86l11K275j107l00n94J228n1j734
5405g89m62J699J197k785M17J530M34j530l60K103q6j581j129J758O18j100q90
$$ plain form
5284 -1177 -1216 878 654 -1313 -1979 1435 -59 -244 -1298 1018 901 -880 -593 520 902 -901 -1156
5301 -1156 66 1243 -630 -1519 553 522 -878 -1694 472 967 -571 -1704 910 570 -845 -625 -184
5318 -184 270 -166 -1374 408 1077 -35 -1777 -542 404 -1058 -1045 -546 967 5 -1080 189 542
5335 542 898 -1527 -141 1478 317 -1244 685 1440 -16 -852 -114 1812 487 -247 58 1296 -74
5352 -74 -1078 -309 1550 261 -1222 -98 1791 -286 -1128 33 1555 1138 -1134 318 1625 949
5368 949 -1365 -636 1602 944 -527 -170 525 388 -498 558 1239 338 273 -65 1715 1112 -773 -441
5386 -441 1004 887 -726 -669 640 644 -276 -534 1354 -9 -195 -506 1769 662 362 -232 996 945 -789
5405 -789 -1251 448 1645 -1140 -723 807 1241 -289 -649 1454 1368 -213 -1342 416 1034 -66 -956
5422i56J453M3r45p68J621M65k368O93Q75J045j737n73O09J507j663o83J165J136
5440I19j632o64J689J067j918q01J481K34j089k34J16J076q91o77J119J116n05
5457D06j495P26J511n70j567Q45O91n73r19O55J149j038m76O00Q48p55j512O30
5475h44K158j508J65l60J412k87j893M09K036j130j146J412O17q48p59M48R48
5492H30o49r02K81K104j253q82N06R08o58j566J806o74N58j256J374O66L6j824
5510e95m51K393m21j386J16J616k89p24n75J324l17j131k87J618K20j021l11J251
5528A030o70j181N3J498J143k933q7J923Q2j528k36Q64M04j499l82J184P67j45
5546B87j176J168J268k756N5Q20P20j346J72J293P9j233m14J199L86r30j110J075
$$ plain form
5422 -956 497 540 -405 -1173 448 913 -1455 -762 113 1158 -579 -1152 -543 964 -699 -1382 -217 919
5440 919 -713 -1377 312 1379 -539 -1340 141 375 -714 -948 -832 244 -647 -1324 -205 911 406
5457 406 -1089 -363 1148 578 -989 -144 547 -26 -945 -290 859 -179 -655 -55 793 38 -1474 -844
5475 -844 1314 -194 -29 -389 1023 736 -1157 -748 1288 158 -988 424 1041 193 -566 -118 830
5492 830 181 -721 -440 1664 411 -471 35 943 285 -1281 525 -149 409 -847 527 1193 1229 -595
5510 -595 -1046 1347 926 -460 -344 1272 983 259 -316 1008 691 -440 -727 891 1111 90 -221 1030
5528 1030 360 -821 -768 730 1873 -1060 -1147 776 858 -670 -906 -42 362 -1137 -1519 -335 432 287
5546 287 -889 279 1547 -1209 -1154 -334 386 -960 -788 505 584 -649 -1063 136 522 -408 -1518 -443
5564d43J527k722o79K677K38p37j118J003R95o56j144J077k4p97K33K72M23o43
5582e18k38O53J212q84j653K39J904o53j229J163K73o79r43K097l16l14q18k70
5600i74J217o80%J127N99n67j605L17J306o69p40O12J297n61j606J124L94j06
5618D85j617J001J895p82o84p8J046j476O15p87Q86m18r12O12J279j251j46J71
5636a61Q56m63p40O23O27J41m47q27J590k85o78n58J123j59j974N42J870j176
5654i6M8j9L8Q49j235J81J071K40l92n19N48j50j130o76J521J07l32r02J047J448
5674A647k058M63Q67O91j327o11M91K63j85l38j69Q03m58j153J128K91n65p66
5692i86J092N53m14j179O19J627j283m33k9P60n79n4K11N97j563J00K20Q14J54
$$ plain form
5564 -443 1084 -1638 -2317 360 598 -139 -1257 -254 741 85 -1059 18 -6 -803 -570 -298 125 -518
5582 -518 -756 -103 1109 225 -1428 -1189 715 62 -1167 -4 269 -410 -1353 744 428 114 -704 -974
5600 -974 243 -437 -437 690 1289 722 -883 -566 740 71 -669 -57 1240 679 -927 197 591 485
5618 485 -1132 -131 1764 982 298 220 1266 -210 405 -382 504 86 -826 -214 1065 -186 -332 -161
5636 -161 695 232 -508 115 742 883 436 -391 1199 914 236 -322 801 642 -1332 -790 1080 -96
5654 -96 -48 -67 -29 820 -415 -234 837 1077 685 166 714 564 -566 -1242 279 386 54 -848 199 1647
5674 1647 -411 52 919 1610 283 -328 163 426 241 -97 -266 537 79 -1074 54 345 -220 -986
5692 -986 106 659 245 -934 -315 1312 29 -404 -433 327 -252 -306 -95 502 -1061 -961 -741 73 227
5711B27j151m37K247p47k011K032J95p46o06O74O84p53j108M29J874l90j655J331
5729H9O36n09l30k00J364j00j540O10P85m98j205K37J801q94m53L35Q11j93j465
5748g19M60N54N48j458O29R08j68j621J287L46k23j641J563R18j97j689J061k12
5766C46M25l83j932J857J40k94r27K151K41j168m33N75L68j055k47J175o62k12
5784c5m17J097k72m09m51J083RK64j566K23J685k435J397j38K05j5p43P59O4p29
5804d24m32R15L58n04o53R45L92p95j057J335R06k002L53P15J256k089K18O50
5822H7K79m37j087J451K5k09j001J127O18j071J06Q45m02j032M34M3O68j63r68
5841f87Q66K13m10r08J037L48o8j451M52J153o38j072R89M53l5j370L95R26N53
$$ plain form
5711 227 -924 -1361 886 139 -1872 160 355 -391 -997 -323 361 -392 -1500 -1071 803 413 -1242 89
5729 89 725 216 -114 -314 1050 950 -590 20 805 307 -898 -661 1140 246 -207 128 939 746 -719
5748 -719 -259 295 843 -615 14 922 754 -867 420 766 543 -1098 465 1383 1186 -503 558 346
5766 346 771 388 -1544 313 453 159 -768 1383 1624 456 23 598 966 -89 -336 839 177 -35
5784 -35 -452 645 373 -36 -487 596 605 869 -697 -474 1211 -1224 173 35 240 225 -518 241 305 -424
5804 -424 -856 59 417 -87 -740 205 597 -198 -1255 80 986 -1016 -663 52 1308 -781 -563 87
5822 87 366 -71 -1158 293 318 109 -892 235 853 -218 -112 733 331 -701 -267 -224 444 281 -687
5841 -687 179 392 -18 -926 111 459 391 -1060 -608 545 -93 -1165 -176 277 242 -1128 -733 193 746
5860G46r74n56J281P3j450J258n30J8r28J131P94p6l56j204J829j363k45k3J630
5879A055k25j370M75P83m17k87l11J708k92j473Q47O53r73k89j70J218o20j151
5897h39L93P62P91j377J80P55J711k679Q0O54N6m83k95J809m59r59j1l0L15j38
5917B36k75m99M95j52k89J388J97r04k3R00q58r05K36Q04l05O27j175L3J043k93
5937B81n72K78L78o2j276R32J015p76o39P58Q24j919J84Q16Jm14o53J155m90l29
5957e08Q6J68k6k38p23R52L58M64j371J379Q7n38p18N37J42q62RJ196K63l94m47
5978a84n76O88p0q00O75J243o93r97Q21J017j599o43Q48J162p63l2K19R80q08
5997D88j127J20J942p79n24r9R48j8j486l8J140n6r59M66J102k94o53P38J44p5
$$ plain form
5860 746 -228 -784 497 570 -880 378 -152 -134 -1062 69 863 787 431 -773 1056 -307 -552 -575 1055
5879 1055 830 -540 -65 718 301 14 -297 1411 1119 -354 493 1146 173 -116 -286 932 312 -839
5897 -839 -446 316 1107 -270 -90 665 2376 -303 -223 431 487 4 -291 1518 1059 100 89 59 374 236
5917 236 -39 -538 -43 -195 -484 904 1101 197 174 1074 216 -689 -453 351 46 673 -502 -469 574 281
5937 281 -291 -13 365 303 -973 -41 974 198 -441 317 1141 -778 -594 222 223 -191 -844 311 -179 -508
5957 -508 -422 -254 -280 -518 -1241 -289 69 533 -838 541 628 90 -628 -91 51 -811 -802 394 657 263 -184
5978 -184 -760 -72 -142 -942 -267 976 283 -714 107 1124 -475 -1118 -270 892 129 97 316 1296 488
5997 488 -639 -519 1423 644 120 21 969 951 -535 -573 567 511 -448 18 1120 826 173 911 1055 980
6017I80r47o53P63P57j095J4N90p14O49m42J423j272R9K17N45J43j093l52Q66
6036D78K08k28n55K522k351p1L55j070Q83N8q05M41N52n14n24J042k1j275J35
6055g40J330m50n03q09P71R17o70l12j5p3N17p21J052l72p90L15N18J090l41r80
6075b66O36R17j523n26O05K26k38j098J745P20k108n16N23Q69j48p97K14J402
6093F37j109m08Q87l47P43q0j002R19j6o83M78M35q46l27R77L98l43j401P29k86
6113f45J585j032N23J8j49p39O73J62l36j144J004n5j98k83Q32O63n68n42N1O48
6133D68r67M55q9Q64l98l46l43R61o69l14J75L87m44J85m75J369L30j647N89P98
6153H89q29K91p32R07p37P01n31K82R00j869R30K25O69l07j208J090L75r99j0
$$ plain form
6017 980 33 -620 143 900 -195 -181 409 -305 344 -98 1325 53 152 369 914 1057 -36 -388 478
6036 478 686 458 -97 2425 74 3 358 -712 171 229 -576 -135 417 -97 -621 421 400 -875 -740
6055 -740 590 140 -363 -1172 -401 516 -154 -466 -481 -554 -37 -758 294 -78 -868 -553 -35 1055 714 -266
6075 -266 370 1287 -236 -762 -157 69 -169 -1267 478 1198 -910 -1426 -903 -34 -182 -979 -765 637
6093 637 -472 -880 7 -340 403 323 -679 240 224 -459 19 454 -392 -719 258 656 313 -1088 -359 -645
6113 -645 940 -92 431 449 300 -439 234 396 60 -1084 -80 -135 -333 -616 216 879 311 -231 -180 468
6133 468 -499 -44 -133 731 333 -13 -356 605 -64 -378 -203 184 -260 -75 -550 819 1149 -498 91 889
6153 889 60 351 -381 526 -211 490 -41 241 1141 -728 202 427 1096 789 -419 671 1046 47 37
6172C7n26N22K30l48Q59o50n8n97O21J033r69l14K19K82r4j105L78J702r34l39
6192e1L19O7p57O9M41J06n5k26M2Q11p11r83P53Q55j267p9M31O78r86m80J545
6213E22q42j26M2P47J44n10p53N73Q96q70j176J145k97J64Kn47J198o77m33N38
6233b60J500q21j206J231o53K44p27K34M27J45R6p49J077j070j23r4J091M85p61
6252F6o21R35M72j908R57L12J3M35l76m03N88j020J178K2j001L86j15O62K58p31
6272A09p12J846j154j038M51M32P99k109J817M2o85M14l46K54j08N47j420J347
6290D86q40P43r48P28k2j67k81O83K38j251M14J460m12k15m8p02M33o86n78J358
6310C93l5K7r83J088J190j624k07R90J5q19K34r4P9n51r45O72J168j176N55J46
$$ plain form
6172 37 -489 33 263 -85 774 124 66 -531 90 1123 154 -160 59 341 247 -858 -480 1222 288 -51
6192 -51 268 335 -422 -353 88 194 139 -87 -45 766 55 -928 -175 680 -587 -666 -235 443 -543 -1023 522
6213 522 -320 -446 -404 343 487 -23 -776 -203 693 -177 -1353 -208 -505 -341 -339 -886 312 -365 -798 -260
6233 -260 1240 419 -787 444 -209 35 -692 -458 -31 114 210 -539 538 -532 -655 -749 342 827 66
6252 66 -555 380 852 -1056 -99 213 226 661 285 -118 470 -550 628 650 -351 35 -80 582 840 109
6272 109 -603 1243 89 -949 -498 -66 733 -1376 441 483 -202 212 -134 120 12 559 -861 486
6290 486 -354 389 -559 169 147 -20 -301 382 620 -631 -217 1243 831 616 568 -134 299 -387 -965 393
6310 393 358 385 -598 490 1680 56 -151 839 854 35 269 175 254 -297 -1242 -570 598 -578 -23 123
6330A23J32j4q61j81J692j494k56Q9J655j518K97L89R8k77o40P43J037j039p5
6349a00k69J192M5j127l44J016l68k40K00J849j630r01O70k45J7o74J415p70L0
6368b34m07J002k33J07q47N27M37k3j079R48j93J17j282N76K31O68m79K61J76
6387B73j85l69K74P45j71j139L62P37R39j168m30M83O44j432J387p58K41m74l92
6406d33R43p40p33R07l17M93M25m57O77k17q56O65K04j058J100j031l85J420J77
6425G84m85O87o57p56M40N00l64j64j72N23l44l4r55J238j49p48J82R76l56p8
6445F8l3l1O62j018L49K87l4m44m25N66M52m40n16R01P5k05j427R38Q8M30o34
6466c91j39j90O67j017J155J40n01J64r93J473o95l74O70O40n65l09P46l88K70
$$ plain form
6330 123 255 241 -620 -801 891 -603 -859 -770 885 -633 -336 53 151 -126 -766 -23 1014 -25 -100
6349 -100 -369 823 868 -259 -603 413 45 -195 5 1854 224 -677 -7 -252 -235 -909 506 -264 -234
6368 -234 -641 361 128 235 -612 -85 352 329 -750 198 5 122 -1160 -584 -353 315 -164 97 273
6387 273 88 -281 -7 738 567 -572 -210 527 1466 298 -132 351 995 -437 950 192 433 -41 -433
6406 -433 510 -230 -963 -56 -373 120 545 88 765 548 -308 357 561 -497 603 -428 -813 607 784
6425 784 299 986 329 -427 13 513 149 -15 -187 336 -8 -42 -997 241 92 -656 -474 502 146 68
6445 68 35 4 666 -352 -3 284 250 -194 -619 -53 399 -41 -557 344 419 214 -1213 -275 -187 243 -391
6466 -391 -530 -720 -53 -1070 85 225 -276 -112 -1105 368 -327 -701 -31 609 44 -265 481 93 363
6485C63m72j10K64k48k17J41J106r83K27k9O51j293Q5M2R42Q06k316Q80K11K27
6505B77m16K33M56l52L11o04K94m7j013R73R4J68n98j32J80Q51q27n9J02J89o88
6526f08K59R01k33o71J38R24L07j082r64J050L13J28m77k20k51P85l62N42l60
6545A19l18J32N39j33j86n52M01P56j140R48q38M99p66Q85P97m47p60k43J416
6564A109j320L87O53l07q74k19J090l59J91j95q29Q00K24l82j31Q61o66K4n03
6583d46q67J553j56n05O76J12J53q78M49M07p86l27R62K68j336J75L10K33O77
6602F74r15O59q44l16L32L47o90J059r29J72oJ20M70k84O76r50K5L38k39Q74j464
6623h91ON40J31j98K82J11k21Q8j76O30l68k56R78j271J82O65j84k65P13l02l71
$$ plain form
6485 363 -109 -219 45 -203 -420 -279 827 -156 71 42 693 -600 -515 -473 469 1275 -1041 -161 50 277
6505 277 -139 94 550 198 509 -95 199 152 -861 112 206 374 -224 -356 -176 675 -152 -211 -109 80 -608
6526 -608 -349 552 319 -352 -214 710 1017 -65 -1029 21 334 462 -15 -235 -486 299 -63 479 119
6545 119 -199 -67 472 339 153 -399 2 758 -382 566 -272 227 -539 346 1143 696 -64 -307 1109
6564 1109 -211 176 829 522 -352 -571 519 160 351 156 -673 127 351 -31 -162 699 33 57 -446
6583 -446 -1313 240 84 -421 255 367 520 -358 91 498 -288 -615 347 615 -721 -546 -236 -3 674
6602 674 -241 418 -426 -742 -410 -63 -753 306 -623 -451 -457 -337 133 -151 525 -425 -400 -62 -301 573 -891
6623 -891 -885 -345 -214 -412 -130 -19 -240 -152 -328 302 -66 -322 656 -615 -433 232 48 -217 496 194 -177
6644a77Q12L67r10j00J105j21j603l0Q87p1l22m14J451o54j32L47k93Q91j377
6663c44P60p68N35N6k49K51k10o3p76P07N02k34K15l96N21r67Q59p3k42O28j065
6684c53K97Q84j5j334O49N95m42j51q5L91r90O64P4J17l88J12R8P71j92j342K13
6705d27Q06l14j76N71k0o39Q3K97j12p41J28O72m67o7K7J063J35j080O99j04o38
6726c04J06n35N94P58p46j80j93J660j011L79j204O64M02p71N62r79M74J79K28
6745H3k44n04J46P89R2m88n10L67N03n16l47R41L56n49M3Mr77Q51j80%P22j86
6767C96m49K35N82o68l22M92p5n4p70N62O47N80j693M04l27P81r45L5P99r42P44
6788A2o11J273k63p93K08K01J65L89j024N70J57J35p57l78J470m56M38m32M61
$$ plain form
6644 -177 635 1002 92 -8 1097 976 -627 -657 230 159 -163 -577 874 220 88 435 142 1033 -344
6663 -344 416 -352 183 239 -10 241 31 -32 -808 -101 401 167 382 -14 507 -460 399 326 84 712 -353
6684 -353 -56 828 813 -521 128 723 281 130 45 436 -554 110 184 301 -87 25 123 894 702 -640 -427
6705 -427 379 65 -111 460 440 -199 -116 181 69 -672 -544 128 -339 -406 -379 684 819 -261 438 334 -304
6726 -304 -198 -733 -139 619 -127 -307 -500 1160 149 528 -676 -12 390 -381 181 -798 -324 -145 83
6745 83 -161 -665 -519 270 362 -126 -636 -269 234 -282 -629 312 668 119 162 166 -811 40 -140 -140 582 396
6767 396 -53 182 764 96 -226 266 191 137 -633 -71 576 1156 -537 -133 -460 321 -624 -589 210 -732 12
6788 12 -599 674 411 -382 -174 27 192 581 -443 127 284 419 -338 -716 754 298 736 304 765
6807G65n06p19J511o56p15J42J26Q14r99R4Q37l1o19J16j230J509p9q41J016l54
6827A81K9n91J647j396J042r09l77N38j88q7n32J437l25j70K46n67J04j127Q82
6846a63L20k60k78Q33l55J82m49M47M90q86J75p24N06j25P50p62L37N22l79k33
6866e2R5j16k48m15J036j226P07K52L5j80r67N60N73J98j281N53J208j292J07
6885d53N72n46O12p39R75j40j61O49j097Q6P4J000j589N61M92l31l91J120p49
6904e5J064j051R39j110j38P80n94K53l3Q02n53P55q02m95Q1N07j151O76Q37j94
6924E18k94O03j220O55n44K52O51j068R14m28P75m42n07J77J057J15o43n43J096
6943A124p18o95J92J0M94j249Q09M42q95O88l66k82Q54J40o36M66k83Q1l85P2
$$ plain form
6807 765 259 -460 1051 395 -320 -178 -52 762 -237 -143 694 663 44 160 -1070 439 360 -481 535 181
6827 181 210 -381 1266 -130 912 3 -374 164 -24 -111 -643 794 469 299 545 -22 82 -1045 -163
6846 -163 157 -103 -381 452 97 279 -170 277 767 -119 56 -668 -162 -287 463 -299 38 560 181 -52
6866 -52 43 -73 -321 -736 300 -926 -219 33 68 -112 -1079 -519 54 252 -1029 -476 732 -560 -453
6885 -453 119 -427 185 -554 421 281 120 769 -328 -242 -168 832 -757 -196 296 -35 -426 694 -55
6904 -55 1009 -42 897 -213 -351 429 -165 88 55 857 304 1059 257 -238 -157 350 -801 -125 712 518
6924 518 224 827 -393 262 -282 -30 621 -447 467 39 814 372 -135 42 1099 1214 571 28 1124
6943 1124 406 -289 -97 -87 407 -842 -33 409 -486 202 -164 -446 408 548 -88 378 95 176 -209 -137
6963a37O86p74M29o35P87m94n95J133l53L39m10o25O98j18J69m22l37P10j77l22
6983d48O43o81J063j423J80M27k68Kk07K4j32M90j05n93J19P30K00K0O44q86L64
7004A63k0j343J053M34j452J038J001j174m14N3P26L61j117N5O82k24M0j63Q40
7023E39M1p85m63M58k39Q40o12Q02l22O96j258O92j102R92l61l65N0P94k65l08
7043a76k19R2O96o55M3k6Q10m47N42p81N69r13K56Q35r09L51N84j14p05P69j33
7064D69M24j9j168J20J079o76o29J037P72j849J24M11N39q23l92M48R66j062K85
7083E6m09K64N87n40M83R17p11m83O03L55j088L01l83J64k52q33J187K0p77P53
7103B14l54K73L68o79MO30M9j058M34M37O7r79K04M06J010o90m10N83p46L33j91
$$ plain form
6963 -137 549 -225 204 -431 356 -138 -733 400 47 386 -24 -649 49 -69 100 -322 -659 51 -126 -448
6983 -448 195 -486 577 -846 -666 -239 -507 -505 -712 -688 -820 -330 -435 -1028 -909 -179 21 41 685 -201 163
7004 163 143 -1200 -147 287 -1165 -127 874 -300 -714 -661 65 426 -691 -636 46 -178 -138 -301 539
7023 539 580 -205 -668 -210 -449 391 -221 581 259 955 -303 389 -713 279 -82 -447 -397 397 132 -176
7043 -176 -395 -303 393 -262 -219 -245 565 118 660 -121 448 -465 -209 626 -283 68 652 538 -167 602 469
7064 469 893 874 -294 -174 905 229 -400 637 1409 -440 -316 95 634 -189 -581 -133 833 -229 56
7083 56 -353 -89 498 -42 441 1358 647 164 767 1122 34 335 -48 116 -136 -969 218 238 -539 214
7103 214 -140 133 501 -178 -174 456 505 -553 -119 318 385 -594 -390 16 1026 336 -74 509 -237 96 -95
7124i5j71J095j936Q48J66O70m61j83l2m25R68j122J23L63j66J14P94m80k91P61
7144E40l44j022J404j296J270m62m80Q7Q74m30k3m26oN49j30n60k7O36l88r71
7164a205J026M02m80R10r07Q2J34m14J54O28q5j122J144K12j40J09p56J001p58
7183f5j67K20J40N42m23o27O06o67Q55k07R6J27M8n66J80j9o57L55J13Q58n6o22
7205F4O51k73j56m66o48P26J82kK96m93K1P95l48j2m87L19p04L47k34P43k77M88
7227E32o71K28k56l81N34k12M1pj9P12j89n46K55k00L19L06p57L28r94J214m93
7248b56j59O82n7n10K1J53l41O2M29N21p30p85P28K27O28p83n79P90p10P81J29
7269B41o96O08l96M87p75K91k54M02N92r83J091m36O3l27K2p4L98p86O68R54j313
$$ plain form
7124 -95 -266 829 -1107 -259 -93 577 116 -67 -99 -524 444 -678 -555 -192 -358 -244 550 70 -221 540
7144 540 196 -826 578 -718 552 90 -390 -303 571 141 118 -308 -314 235 105 -455 -482 154 -234 -1205
7164 -1205 -179 223 -257 653 -254 -172 -38 -452 -298 330 245 -877 267 479 339 448 -308 693 -65
7183 -65 -232 -12 128 670 247 -380 226 -441 414 207 303 430 478 -88 92 73 -584 -229 -116 742 686 64
7205 64 715 442 286 -180 -828 -102 80 78 374 -119 -98 697 349 337 -150 169 -535 -188 -422 321 44 532
7227 532 -139 89 -167 -548 -14 -226 -185 -192 -211 501 312 -234 21 -179 140 446 -311 17 -977 237 -256
7248 -256 -415 267 210 -300 -279 -126 -467 -405 24 545 -185 -970 -242 -15 613 -170 -749 41 -669 112 241
7269 241 -455 153 -243 244 -531 -240 -494 -92 500 -483 608 172 235 -92 -70 -144 254 -532 136 1090 -223
7290b23K62j45J09l92R47j334J124j019O95j16l21J115r22J18p23J022r04P9N54
7309g4O76l04j28j32l4k92P4P74j006O1R7l2M76m62R01q82Q91m55o84J99M73L32
7331D69o61Pq5P36q52L93M01K81q00K40M37L96l99K35J93l32o12m24M02Q0l06
7352b01K52J41R38j057j93Q0L07J150j419r62J563j041K27q9L9Ln27M89L38q59
7372h21Q90J39r21J65O85n73O10K67n43J36j17k2j51O36r7l77m5M82J37N14o18
7393C76n80l32K86L31n08l5P82o87k7R47k74q53J150j125J302o10o15J107o88
7412e3r1M02k89r6K06K15k75j091J207k34m26N19M43l00K77j163P23l64M5J107
7432G62r65L7O50J05M25k026J319o1o36O48p89Q46n58K93R53j049n77J105K79
$$ plain form
7290 -223 39 -106 3 -389 558 -776 348 -671 24 -92 -413 702 -220 -102 -825 197 -707 -628 -74
7309 -74 602 298 170 38 4 -288 -214 560 -446 -385 -288 -320 156 -306 595 -287 604 149 -535 -336 137 469
7331 469 -192 -185 -270 466 -386 7 408 689 -111 129 566 962 563 798 991 659 47 -377 25 105 -201
7352 -201 51 192 1130 73 -120 -40 267 1417 -2 -964 599 -442 -215 -304 -265 -262 -789 -300 38 -821
7372 -821 69 208 -713 -548 137 -436 174 441 -102 34 -83 -105 -256 380 283 -94 -139 343 480 994 376
7393 376 -204 -536 -250 81 -427 -462 320 -367 -394 553 279 -574 576 -549 753 143 -472 635 -53
7412 -53 -144 258 -31 -127 79 294 19 -1072 135 -99 -525 -6 437 137 414 -749 -26 -390 -345 762
7432 762 -203 -166 484 589 1014 -1012 307 246 -390 258 -531 315 -243 50 1003 -46 -623 482 761
7451G61l73o26l91q9jN09J86O29M27j696L46K77J89l6n83K48O41j81N03l30n53
7472a43K22o63L09N77n46k29L82O13m46j186J669P94j492O29q69Q36q65q9L23
7491a74L86j084K58J261j018N88q75r9N0N67j020R62K39M00l02J92j77k28q7R70
7511H09p59o2K24j154J708q5n25N24j19p49N90j165K02J43p4Q25p38K72k78R52
7531E41j573J133l91r30J434K58k58m17O64k0m20j39j0K8M67p61K32P65m35J01
7551B69L11p27p46O40Q81l61%J53k88j30l93n69J493n34P24j246R94n55m68J55
7571c97J28LJ333j184M04No0j16k73l22R20r94P57L82q77P25N3m38M0o35Q3N91
7593A28k95N48j05m84J80k70k56M08N01j380N37J030n39m36J37K32o53M03L07
$$ plain form
7451 761 388 -238 -629 -718 -719 -210 -24 605 1032 -664 -318 -41 148 112 -471 -223 418 237 740 410 -143
7472 -143 79 -584 -275 302 -244 -473 -91 522 76 -1110 559 1353 -139 490 -379 457 -408 -497 -174
7491 -174 212 -872 -614 647 -371 217 -658 -757 -707 -140 -1160 -198 41 441 139 331 154 -74 -161 809
7511 809 50 -12 212 -942 766 681 156 680 561 -188 402 -763 -561 -418 -492 333 -405 -133 -411 541
7531 541 -1032 101 -290 -1220 214 472 214 -203 461 441 21 -118 -128 -100 367 -394 -162 603 168 269
7551 269 580 -147 -893 -253 628 267 267 420 132 2 -391 -960 533 -1 723 -523 471 -84 -552 -397
7571 -397 -269 -266 1067 -117 287 292 232 116 -157 -479 441 -553 204 586 -291 434 487 49 89 -546 -463 128
7593 128 -167 381 276 -208 -28 -298 -554 -146 355 -1025 -488 542 3 -433 -296 -64 -717 -314 -7
7612gK95J50K37k39j37L36r43lO11k45m10K20n38N47j70l12L63J035o32K3r30
7633g49P23J40n03J133j032O24l74K86l88l47N63k84N24m24p05N28N14M7k03l61
7653b88j2O3l80Q35K24k51m02l99J151p76k33N24K04q73n8M19K91P19o96k10L42
7674A94O0k07n45Q33j029R3N37l46L69J47m38j89O11K14k77P20r35n5R49l60J1
7695C57K45q23M14m10P23k74J68n7l87K58J92o9J99q49P33r55K77M3O5J58l81
7716c73N65k84n6L60p4l98l22J36l57J066L01l07L11m45L20N82m37L30j195j40
7736d17L66L67K11j96m55O13k27j077J358j092K5R19n24L25J71j017j88J352o05
7755i1k30J179j149O30k68k70L30K73q09J130j9j89j682R91K94p32J7p6O9M62
$$ plain form
7612 -7 288 438 675 436 299 635 -308 -311 300 55 -355 -135 -673 -126 -296 -608 -245 790 158 181 -749
7633 -749 -26 114 -389 744 -288 336 -38 248 -140 -487 76 -208 316 -108 -813 -285 229 276 73 -288
7653 -288 -300 -237 -617 218 442 191 -211 -610 541 -235 -468 56 260 -613 -671 -252 39 758 62 -148 194
7674 194 254 47 -498 335 -694 -601 -64 -410 -41 106 -332 -521 90 304 27 747 -188 -243 706 346 357
7695 357 602 -221 193 -217 506 232 400 343 -44 214 406 337 536 -313 420 -535 -258 -215 -150 8 -373
7716 -373 192 -92 -148 212 138 -260 -582 -446 -803 263 564 257 568 123 443 1025 588 918 -277 -417
7736 -417 -51 316 527 331 -124 489 262 -815 543 -549 -524 395 -129 196 367 -650 -838 514 -91
7755 -91 -321 858 -291 339 71 -199 131 404 -405 725 706 517 -1165 -174 120 -612 -595 -671 -602 -140
7775a40L04q45J57J149r20N19k52K84p01o79J276k35m91n49Q10Q36j414P72L83
7794B64n95Q0K4J87l2R96r64n74J268k95k27k54n91m1J615j173j69O21r48Q56
7814D8k00L5R32q91M3k1J01m72Q35m08r5j32k4M06j68o96R80M8n92P09p69R44
7836F13j014Q13n01J81l93M73L57n28mk67j0q2q3K81l29J102l19j160J514r27
7856b83P41o27K51J46J06o82J11J163q18j3j61q9J21N49k01j19k70R49j099M47
7876B22o72Q54j8L51r29N30J56p25m68J49J026n2o98O22o96mO95J21j257P6Q97
7897A80p52J804j080J36p64R34k61j27m26NJ66r4N54o12r4K72O09p10P18l92K60
7918C26j006O83p0P3k34L2M41p79J91P67j036L3J426m31m88l76P03j059J211q8
$$ plain form
7775 -140 164 -681 -524 625 -295 224 -28 256 -445 -1124 152 -83 -574 -1123 -313 523 -891 -119 264
7794 264 -331 -251 -227 -40 -72 924 -40 -614 654 359 132 -122 -713 -754 861 -312 -481 140 -808 48
7814 48 -152 -117 815 -76 -33 -54 47 -425 410 2 -93 -225 -249 157 -11 -707 273 321 -271 438 -331 613
7836 613 -401 412 -89 92 -301 172 529 1 -3 -270 -280 -362 -445 -164 -493 609 290 -870 644 -283
7856 -283 458 -169 82 228 334 -348 -237 926 108 95 -66 -155 -34 515 314 195 -75 874 -225 222
7876 222 -450 404 386 737 -192 338 494 -231 -699 -550 476 424 -274 348 -348 -352 343 464 -793 -717 180
7897 180 -572 1232 152 288 -476 458 197 70 -356 -351 -185 -279 275 -337 -431 -159 450 -260 458 66 326
7918 326 -680 3 -67 6 -228 -196 245 -534 -343 424 -612 -579 847 416 -72 -448 255 -804 407 319
7938C19k98P94j506J86M61N79k5k33k22j15O02J78L1k96n33K72p81K57N34K20
7958D24k88m50P76k18l09Q44q27M1o21O12J15l72O30q27O52Pl18l97L98n84M44
7979b68p9L05m48Q31m09K12K49o34J5O24j491J396m12N08j031J423p93j74J135
7998I59k198J591J89m89j31L42o30R58r43M31k19J324l54o60r9j39j36K48P01
8017G45j362M29p52R35K20K15m32N36j51n20P87j101K99l22L77l48m7N24n64M25
8037a07M66n60k32M2L18J28P7K5M59r08j61J088j117R17m31K66o74K20K71l24
8057b37M82N8o65j07O25k95P70p4j011R3L71j67O91j53m91MN22n92q2Q2j1N78
8079C91j188O2L03L21P5N77l24o12k44K81Q72j129O69k28K07n09o42K040q84N09
$$ plain form
7938 319 21 815 -691 -505 -44 535 510 277 55 -60 542 720 751 455 -78 194 -587 -330 204 424
7958 424 136 -314 462 244 -65 779 -48 -7 -628 -16 99 -273 357 -470 182 189 -129 -526 -128 -712 -268
7979 -268 -347 -42 -490 341 -68 144 393 -241 -226 398 -1093 303 -109 399 -632 791 -2 -176 959
7998 959 -1239 352 541 52 -79 263 -367 591 -352 79 -140 1184 830 170 71 -68 -204 44 745
8017 745 -617 -188 -940 -5 215 430 -2 534 383 -137 650 -451 -152 -474 -97 -445 -492 32 -532 -107
8037 -107 359 -201 -433 -391 -73 55 132 157 616 -292 -453 635 -482 435 4 270 -404 -184 87 -237
8057 -237 245 303 -362 -469 156 -139 631 557 -454 -361 10 -157 534 381 -110 -106 416 -176 -258 -176 -187 391
8079 391 -797 -735 -432 -111 -36 541 217 -395 -639 -358 514 -615 54 -174 33 -476 -1118 922 38 547
8099E47k64n89P6N12o14L62p1P95n26j85k75K3M33K26L6k28l16o4O37j59m24P27
8121F59J79r80L48N52o48J75o54Q06o17j66J097m22p03R74o44M77q02RR90k59
8141C71q33J42M84m71N18k88m09J71P7o2q43J588R9J58q56P7l77P38r0o20J13
8162c13J35m44l6J440m06j61Q19j013Q6j003O69J130j823P05P19q29J24q29O83
8181c47M2O75l08M31M64j188k64J023m43J20
$$ plain form
8099 547 283 -306 -230 282 -332 30 -41 754 228 43 -232 -209 224 450 486 258 -58 -122 515 356 -68 659
8121 659 838 -142 206 758 110 285 -369 437 -180 -346 751 329 -374 600 -44 433 -369 -360 630 371
8141 371 -462 -320 164 -307 211 -77 -486 -315 -238 -300 -1143 445 544 702 -154 -77 -454 284 194 -426 -313
8162 -313 -178 -622 -658 782 376 215 1034 21 107 -896 -227 903 -920 -215 504 -325 -201 -1030 -347
8181 -347 -305 370 62 493 957 -231 -495 528 85 205
8191B05
$$ Imaginary data points
##PAGE= N=2
##DATA TABLE= (X++(I..I)), XYDATA
0@%%%%%%%O4j28J28j28J92k56K58l22M48n72O37p20Q96j070J213j392J623j861
25i90K109k405K754l119L504l944M445m979N546o189O914p688Q517r448J0488
40E515j1611J2839j4212J5755j7452J9343k1516K4000k6821L0106l4031L8765
52B0680m4560N1895o1576P4912r4479J26098j85501L33735j330398k350177L623246
63A63875J827142l245689k193953K984813J939084k723979j933381K715188J971614
72A504714k286310j799008K240227J702120k008820j542247K101680J677222j787390
81a97812j603302J652458J499377j558876j528055J471922J597484j246565j580460
90a493829J095342J509313j039505j530954J060472J738439q12821j684001Q16670
$$ plain form
0 0 0 0 0 0 0 0 0 64 -64 64 -64 128 -128 130 -192 256 -316 321 -399 497 -573 640 -752 871 -990
25 -990 1119 -1286 1468 -1651 1853 -2091 2354 -2625 2921 -3268 3646 -4042 4475 -4973 5515
40 5515 -6096 6743 -7469 8286 -9166 10177 -11339 12661 -14160 15946 -18085 20680
52 20680 -23880 28015 -33561 41351 -53128 72970 -112531 221204 -1109194 -3459371 163875
63 163875 1991017 -1254672 -3448625 -463812 1475272 -1248707 -3182088 -466900 1504714
72 1504714 -781596 -2580604 -340377 1361743 -647077 -2189324 -87644 1589578 -197812
81 -197812 -1801114 -148656 1350721 -208155 -1736210 -264288 1333196 86631 -1493829
90 -1493829 -398487 1110826 71321 -1459633 -399161 1339278 526457 -1157544 -340874
99c40874J799606p18946j847925P39894K082281n00532k062076M39436K067070
108A657934m52977k171080L81166K205730l55972k258627K79748K174812m21398
117A039336k317767L62934K303666m06882k346637M00166K331820m61167k401308
126a495839M11122K372106l84304k312661M05019K290571l98728k272788L39232
135a046270K180141l27043k089064L56276K073352l20182k053310K15693J946644
144I36237j66889j854444J54466J850170l6653j789326r4021J670189J70645j558564
154g18190j77202J569300L08137j509348m10997J419930M52860j372473m54814
163h92797J444657N82841j448378p11666J392643P55883j396109p96222J458077
$$ plain form
99 -340874 1458732 739786 -1108139 -368245 1714036 1213504 -848572 -409136 1657934
108 1657934 1204957 -966123 -584957 1620773 1264801 -993826 -714078 1460734 1039336
117 1039336 -1278431 -915497 1388169 981287 -1365350 -965184 1366636 905469 -1495839
126 -1495839 -1084717 1287389 903085 -1409576 -1004557 1286014 887286 -1385502 -1046270
135 -1046270 1133871 806828 -1282236 -925960 1147392 827210 -1226100 -1010407 936237
144 936237 769348 -1085096 -930630 919540 882887 -906439 -1000460 669729 840374 -718190
154 -718190 -895392 673908 982045 -527303 -938300 481630 934490 -437983 -892797
163 -892797 551860 1134701 -313677 -1025343 367300 1123183 -272926 -1069148 388929
172C88929R10988j462220j023193J404019J027825j422200j040873J474282J102094
181A359651j492418j161006J460480J139542j493650j156165J530049J204101
189A390584j522442j237227J478149J217938j474997j225403J450111J237457
197A314170j390229j212616J337625J166065j321428j159260J274919J153842
205A163088j202190j118109J155881J093334j130637j124698J047812J130590
$$ plain form
172 388929 1299917 -162303 -1185496 218523 1246348 -175852 -1216725 257557 1359651
181 1359651 -132767 -1293773 166707 1306249 -187401 -1343566 186483 1390584
189 1390584 -131858 -1369085 109064 1327002 -147995 -1373398 76713 1314170
197 1314170 -76059 -1288675 48950 1215015 -106413 -1265673 9246 1163088
205 1163088 -39102 -1157211 -1330 1092004 -38633 -1163331 -115519 1015071
$$ [...]
8191A7
##END NTUPLES=NMR FID
##END=
