##TITLE=1H_SAM_22.BBSX1_THF 2.2 TFA3
 CDCl3, 56 sc, 
 8.5.2019
##JCAMPDX= 6.0         $$ Bruker NMR JCAMP-DX V2.0
##DATA TYPE= NMR FID
##DATA CLASS= NTUPLES
##ORIGIN= UXNMR, Bruker Analytische Messtechnik GmbH
##OWNER= root
$$ XWIN-NMR		Version 3.5
$$ Wed May  8 13:41:54 2019 Russian Standard Time (UT+4h)  she@DPX200
##.OBSERVE FREQUENCY= 200.1315
##.OBSERVE NUCLEUS= ^1H
##.DELAY= (6, 6)
##.ACQUISITION MODE= SIMULTANEOUS
##.ACQUISITION SCHEME= undefined
##.AVERAGES= 64
##.DIGITISER RES= 18
##SPECTROMETER/DATA SYSTEM= spect
##.PULSE SEQUENCE= zg30
##.SOLVENT NAME= CDCl3
##.SHIFT REFERENCE= (INTERNAL, CDCl3, 0, 15.7039)
##AUDIT TRAIL= $$ (NUMBER, WHEN, WHO, WHERE, WHAT)
$$ ##TITLE= Audit trail, XWIN-NMR		Version 3.5
$$ ##JCAMPDX= 5.01
$$ ##ORIGIN= Bruker BioSpin GmbH
$$ ##OWNER= she
$$ F:/spectra/data/she/nmr/H-F/1/audita.txt
$$ ##AUDIT TRAIL=  $$ (NUMBER, WHEN, WHO, WHERE, WHAT)
(   1,<2019-05-08 13:40:17.25 +0400>,<she>,<DPX200>,
      <continue with go, POWCHK disabled, PULCHK disabled
       configuration hash MD5:
       00 E9 B6 7A A2 85 ED C7 34 08 36 98 17 FE 4E 26
       data hash MD5: 16K
       0A 0B 87 94 F6 77 0B CB 45 FA BF BE 66 51 87 21>)
$$ ##END=
$$ 
$$ hash MD5
$$ 20 54 AE 62 42 99 41 3C 9C 67 8F 21 3B F8 CF E4
##$RELAX= 
##$RELAX= 
##$RELAX= 
##$RELAX= 
##$RELAX= 
##$RELAX= 
$$ Bruker specific parameters
$$ --------------------------
##$DU= <F:/spectra>
##$EXPNO= 1
##$NAME= <H-F>
##$PROCNO= 1
##$TYPE= <nmr>
##$USER= <she>
##$AMP= (0..31)
100 100 100 100 100 100 100 100 100 100 100 100 100 100 100 100 100 100 
100 100 100 100 100 100 100 100 100 100 100 100 100 100 
##$AQSEQ= 0
##$AQ_mod= 1
##$AUNM= <au_zg>
##$AUTOPOS= <>
##$BF1= 200.13
##$BF2= 200.13
##$BF3= 200.13
##$BF4= 200.13
##$BF5= 200.13
##$BF6= 200.13
##$BF7= 200.13
##$BF8= 200.13
##$BYTORDA= 1
##$CFDGTYP= 0
##$CFRGTYP= 5
##$CHEMSTR= <none>
##$CNST= (0..31)
1 1 145 1 1 1 1 1 1 1 1 1 1 1 1 1 1 1 1 1 1 1 1 1 1 1 1 1 1 1 1 1 
##$CPDPRG= <>
##$CPDPRG1= <>
##$CPDPRG2= <>
##$CPDPRG3= <>
##$CPDPRG4= <mlev>
##$CPDPRG5= <mlev>
##$CPDPRG6= <mlev>
##$CPDPRG7= <mlev>
##$CPDPRG8= <mlev>
##$CPDPRGB= <>
##$CPDPRGT= <>
##$D= (0..31)
0 1.2 0 0 0 0 0 0 0 0 0 0.03 0 0 0 0 0 0 0 0 0 0 0 0 0 0 0 0 0 0 0 0 
##$DATE= 1557308136
##$DBL= (0..7)
120 120 120 120 120 120 120 120 
##$DBP= (0..7)
150 150 150 150 150 150 150 150 
##$DBP07= 0
##$DBPNAM0= <>
##$DBPNAM1= <>
##$DBPNAM2= <>
##$DBPNAM3= <>
##$DBPNAM4= <>
##$DBPNAM5= <>
##$DBPNAM6= <>
##$DBPNAM7= <>
##$DBPOAL= (0..7)
0.5 0.5 0.5 0.5 0.5 0.5 0.5 0.5 
##$DBPOFFS= (0..7)
0 0 0 0 0 0 0 0 
##$DE= 6
##$DECBNUC= <off>
##$DECIM= 24
##$DECNUC= <off>
##$DECSTAT= 4
##$DIGMOD= 1
##$DIGTYP= 9
##$DL= (0..7)
0 120 120 120 120 120 120 120 
##$DP= (0..7)
150 150 150 150 150 150 150 150 
##$DP07= 0
##$DPNAME0= <>
##$DPNAME1= <>
##$DPNAME2= <>
##$DPNAME3= <>
##$DPNAME4= <>
##$DPNAME5= <>
##$DPNAME6= <>
##$DPNAME7= <>
##$DPOAL= (0..7)
0.5 0.5 0.5 0.5 0.5 0.5 0.5 0.5 
##$DPOFFS= (0..7)
0 0 0 0 0 0 0 0 
##$DQDMODE= 0
##$DR= 18
##$DS= 0
$$ [...]
##$SUBNAM2= <"">
##$SUBNAM3= <"">
##$SUBNAM4= <"">
##$SUBNAM5= <"">
##$SUBNAM6= <"">
##$SUBNAM7= <"">
##$SUBNAM8= <"">
##$SUBNAM9= <"">
##$SW= 24.9337058887773
##$SWIBOX= (0..15)
0 0 2 0 0 0 0 0 0 0 0 0 0 0 0 0 
##$SW_h= 4990.01996007984
##$TD= 16384
##$TD0= 1
##$TE= 0
##$TE2= 300
##$TE3= 300
##$TEG= 300
##$TL= (0..7)
0 120 120 120 120 120 120 120 
##$TP= (0..7)
150 150 150 150 150 150 150 150 
##$TP07= 0
##$TPNAME0= <>
##$TPNAME1= <>
##$TPNAME2= <>
##$TPNAME3= <>
##$TPNAME4= <>
##$TPNAME5= <>
##$TPNAME6= <>
##$TPNAME7= <>
##$TPOAL= (0..7)
0.5 0.5 0.5 0.5 0.5 0.5 0.5 0.5 
##$TPOFFS= (0..7)
0 0 0 0 0 0 0 0 
##$TUNHIN= 0
##$TUNHOUT= 0
##$TUNXOUT= 0
##$USERA1= <user>
##$USERA2= <user>
##$USERA3= <user>
##$USERA4= <user>
##$USERA5= <user>
##$V9= 5
##$VALIST= <valist>
##$VCLIST= <CCCCCCCCCCCCCCC>
##$VD= 0
##$VDLIST= <DDDDDDDDDDDDDDD>
##$VPLIST= <PPPPPPPPPPPPPPP>
##$VTLIST= <TTTTTTTTTTTTTTT>
##$WBST= 1024
##$WBSW= 4
##$XGAIN= (0..3)
0 0 0 0 
##$XL= 0
##$YL= 0
##$YMAX_a= 3124719
##$YMIN_a= -3476533
##$ZGOPTNS= <>
##$ZL1= 120
##$ZL2= 120
##$ZL3= 120
##$ZL4= 120
##$ABSF1= 10
##$ABSF2= 0
##$ABSG= 5
##$ABSL= 3
##$ALPHA= 0
##$AQORDER= 0
##$ASSFAC= 0
##$ASSFACI= 0
##$ASSFACX= 0
##$ASSWID= 0
##$AUNMP= <proc_1d>
##$AZFE= 0.1
##$AZFW= 0.1
##$BCFW= 1
##$BC_mod= 2
##$BYTORDP= 1
##$COROFFS= 0
##$CY= 11.3945322036743
##$DATMOD= 1
##$DC= 2
##$DFILT= <>
##$DTYPP= 0
##$F1P= 18.9103706918063
##$F2P= -1.10871071338519
##$FCOR= 0.5
##$FTSIZE= 0
##$FT_mod= 4
##$GAMMA= 1
##$GB= 0.15
##$INTBC= 1
##$INTSCL= 1
##$ISEN= 128
##$LB= 0.24
##$LEV0= 0
##$LPBIN= 0
##$MAXI= 10000
##$MC2= 0
##$MEAN= 0
##$ME_mod= 0
##$MI= 1.114404
##$NCOEF= 0
##$NC_proc= 0
##$NLEV= 6
##$NOISF1= 3.799351
##$NOISF2= 2.8
##$NSP= 1
##$NTH_PI= 0
##$NZP= 0
##$OFFSET= 15.70392
##$PC= 1
##$PHC0= -8854.161
##$PHC1= 13.00026
##$PH_mod= 1
##$PKNL= yes
##$PPARMOD= 0
##$PSCAL= 0
##$PSIGN= 0
##$REVERSE= no
##$SF= 200.130013532006
##$SI= 16384
##$SIGF1= 3
##$SIGF2= 2
##$SINO= 400
##$SIOLD= 16384
##$SREGLST= <1H.CDCl3>
##$SSB= 0
##$STSI= 0
##$STSR= 0
##$SW_p= 3612.71676300578
##$SYMM= 0
##$S_DEV= 0
##$TDeff= 0
##$TDoff= 0
##$TI= <>
##$TILT= no
##$TM1= 0
##$TM2= 0
##$TOPLEV= 0
##$USERP1= <user>
##$USERP2= <user>
##$USERP3= <user>
##$USERP4= <user>
##$USERP5= <user>
##$WDW= 1
##$XDIM= 8192
##$YMAX_p= 0
##$YMIN_p= 0
$$ End of Bruker specific parameters
$$ ---------------------------------
##NTUPLES= NMR FID
##VAR_NAME=  TIME,          FID/REAL,        FID/IMAG
##SYMBOL=    X,             R,               I
##VAR_TYPE=  INDEPENDENT,   DEPENDENT,       DEPENDENT
##VAR_FORM=  AFFN,          ASDF,            ASDF
##VAR_DIM=   8192,          8192,            8192
##UNITS=     SECONDS,       ARBITRARY UNITS, ARBITRARY UNITS
##FACTOR=    0.0002004,     1,               1
##FIRST=     0,             0,               0
##LAST=      1.6414764,     0,               0
##MIN=       0,             -3476533,        0
##MAX=       1.6414764,     3124719,         0
$$ Real data points
##PAGE= N=1
##DATA TABLE= (X++(R..R)), XYDATA
0@%%%%O4j28J28j28J92k56L20m48N76p04Q32r66J162j414J668j982K363k756L155
23A678l642M226m850N532o301P175q117R138j0286J1568j2956J4456j6123J7971
37I469j9984K2173k4594K7267l0188L3404l6988M0985m5430N0408n6074O2557
49C3005p0008P8723q9094J01665j17251J37194j63805K01304k58461L57369n75974
60c65333J887345r12130k717982L624405J608414l063250k333938K942175J780509
69B450215k683326k105457K515690J725106k299157j850327K168987J545963k051938
78e84244j632053K013714J603814j707033j524101J704753J504384j538777j595200
87a754743J358961J500766j248079j553403J140915J537951j051253j611401R73132
$$ plain form
0 0 0 0 0 0 64 -64 64 -64 128 -128 192 -256 320 -384 448 -518 644 -770 898 -1084 1279 -1477 1678
23 1678 -1964 2262 -2588 2944 -3357 3818 -4299 4839 -5447 6121 -6835 7621 -8502 9469
37 9469 -10515 11658 -12936 14331 -15857 17547 -19441 21544 -23886 26522 -29552 33005
49 33005 -37003 41720 -47374 54291 -62960 74234 -89571 111733 -146728 210641 -365333
60 -365333 1522012 609882 -2108100 1516305 3124719 61469 -2272469 669706 2450215
69 2450215 -233111 -2338568 177122 1902228 -396929 -2247256 -78269 1467694 -584244
78 -584244 -2216297 -202583 1401231 -305802 -1829903 -125150 1379234 -159543 -1754743
87 -1754743 -395782 1104984 -143095 -1696498 -555583 982368 -68885 -1680286 -707154
96g07154J643006r22234j766953Q34196J851534p20074j873365P72662K120021
105A231639n19746k052518N42834K153777m53037k141294M97077K265383l96564
114A127551k221778M49838K271913m62208k297582M76260K289771n65451k391667
123a323353N17954K376115n23504k356400N41517K343069n63093k370255M81134
132h76816K270443m93230k213224M92646K166498m70922k111460M40718K044980
141A249633m19034k015502L31818J916688l05126j885165K19125J834489j11107
150H15819j753933J1904J654596L7026j625384j39168J572267K40972j492519
159f78420k82175J476413L50892j461818m09598J485577N00416j487257n82987
$$ plain form
96 -707154 935852 13618 -1753335 -919139 932395 212321 -1661044 -888382 1231639
105 1231639 711893 -1340625 -797791 1355986 902949 -1238345 -741268 1524115 1127551
114 1127551 -1094227 -644389 1627524 1165316 -1132266 -656006 1633765 1068314 -1323353
123 -1323353 -805399 1570716 1047212 -1309188 -767671 1575398 1012305 -1357950 -876816
132 -876816 1393627 900397 -1312827 -820181 1346317 875395 -1236065 -795347 1249633
141 1249633 830599 -1184903 -853085 1063603 758477 -1126688 -907563 926926 815819
150 815819 -938114 -926210 728386 765412 -859972 -999140 573127 814099 -678420
159 -678420 -960595 515818 866710 -595108 -1004706 480871 981287 -505970 -1088957
168a088957J505868O77117j490489p16463J545635Q11943j554626q92749J541128
177C38407R27847j545784r33351J592515R79915j614334j012411J621044J024927
186A378775j638072j037365J649979J050017j666554j077201J652809J099555
194A411943j609697j092357J565724J062213j551416j064853J503192J054993
202A279742j439013j019261J395049R92757j361053r97854J303702R96854j242040
211i1117r99929J168231R97564j112233j015409J039841J028595r68987j058293
220a011737Q76972J049721q22607j067433P68701J099234p11271j130688O50030
229b99078J150656o12859j183454N87950J244122n39547j284426M99592J322004
$$ plain form
168 -1088957 416911 1094028 -396461 -1112924 432711 1244654 -309972 -1202721 338407
177 338407 1266254 -279530 -1212881 379634 1359549 -254785 -1267196 353848 1378775
186 1378775 -259297 -1296662 353317 1403334 -263220 -1340421 312388 1411943
194 1411943 -197754 -1290111 275613 1337826 -213590 -1278443 224749 1279742
202 1279742 -159271 -1178532 216517 1209274 -151779 -1149633 154069 1150923 -91117
211 -91117 -1091046 77185 1074749 -37484 -1052893 -13052 1015543 46556 -1011737
220 -1011737 -134765 914956 92349 -975084 -206383 892851 181580 -949108 -299078
229 -299078 851578 238719 -944735 -356785 887337 347790 -936636 -437044 884960
238H84960m59663j347947M34848J378168m15282j415795L85021J438047l59107
247E23250j445280L52038J457861l51197j484340L35957J498214l13154j491600
256i18251L13764J499955k98947j496361K81590J491215k55250j468062K35371
265f14976J439620k22275j418009K05886J396445j80228j373779J47014J338004
274G17702j33066j319858J07470J305123o2893j273671K8774J244000J0285j218150
284e94284m3143J207488R6770j178648j39212J158060J87451j135699k20788J125907
294D63902K61800j123882l09941J111506L51517j098599l83470J096879M20259
303G89971j097072m65464J086626M99213j077566n28271J075810N56596j075216
$$ plain form
238 884960 425297 -922650 -487802 890366 475084 -940711 -555690 882357 523250
247 523250 -922030 -569992 887869 536672 -947668 -611711 886503 573349 -918251
256 -918251 -604487 895468 596521 -899840 -618250 872965 617715 -850347 -614976
265 -614976 824644 602369 -815640 -609754 786691 606463 -767316 -620302 717702
274 717702 584636 -735222 -627752 677371 614478 -659193 -630419 613581 623866 -594284
284 -594284 -637427 570061 666831 -511817 -651029 507031 694482 -441217 -662005 463902
294 463902 725702 -398180 -708121 403385 754902 -343697 -727167 369712 789971
303 789971 -307101 -772565 314061 813274 -264292 -792563 283247 839843 -235373
312b35373n83506J073603O09883j066750o34363J053907O42704j053510o59760
321h53165J047282O76827j034613o91417J014317O96290j004894p10342R85587
330A25872P22269r64176p28435R41841P37377r21117p41364Q96478P49437q74193
340e6011p57441Q45594P66057q13118p69707P87150P81139p56207p94393P20275
350d6662Q02639o89681q15050O61315Q30165o28549q43890N96207Q53340n67498
360A52336q68075N35631Q75607n08453q92487M79959R07113m49159r19817M19074
370b68271R29212l99330r46627L71736R59047l46457r71785L25394R81470l03116
380C31273r91762K81312R97443k60361j005271K39664J009803k18471j011069
$$ plain form
312 -235373 -818879 254724 864607 -202143 -836506 217401 860105 -193405 -853165
321 -853165 194117 870944 -163669 -855086 159231 855521 -149373 -859715 125872
330 125872 848141 -116035 -844470 97371 834748 -86369 -827733 68745 818182 -56011
340 -56011 -813452 32142 798199 -14919 -784626 2524 783663 27456 -766937 -46662
350 -46662 755977 66296 -748754 -87439 742726 114177 -729713 -133506 719834 152336
360 152336 -715739 -180108 695499 187046 -705441 -225482 681631 232472 -687345 -268271
370 -268271 660941 261611 -685016 -313280 645767 299310 -672475 -347081 634389 331273
380 331273 -660489 -379177 618266 357905 -647366 -407702 602101 383630 -627439
389f27439J99316J017884j78981j018825J57801J019666j38905j016425J22377
398d63531J017984j00516j010259Q3524J006517o3365r99340M2581R95964k0016
408D89543r84536J997R77377K3071r65640m4746R59870O4753r49964q7365R41644
419D26004J10512r26674j31329R15897J56365r04432j81405Q92449K06085q79695
429c16223k29925Q71018K54969q58317k77535Q47992L03608q37840l26516Q25108
439B56339L48834q15436l69433Q05078L92746p96222m12252P83362M33796p74618
449a47806m54139P62701M73644p53944m90905P43351N06857p35293n24026P23214
459A03654N36212p11751n52919O98761N63700o85237n76755O69843N84766o55934
$$ plain form
389 -627439 -428123 589761 410780 -608045 -450244 569422 430517 -585908 -463531
398 -463531 554453 453937 -556322 -472798 533719 470354 -528986 -486405 509559 489543
408 489543 -494993 -492996 484381 507452 -458188 -502934 456936 521689 -428275 -515640 426004
419 426004 536516 -390158 -521487 394410 550775 -353657 -535062 357387 563472 -316223
429 -316223 -546148 324870 579839 -278478 -556013 291979 595587 -242253 -568769 256339
439 256339 605173 -210263 -579696 225382 618128 -178094 -590346 193016 626812 -147806
449 -147806 -601945 160756 634400 -119544 -610449 132902 639759 -95534 -619560 103654
459 103654 639866 -71885 -624804 73957 637657 -47580 -624335 45508 630274 -25660
469b5660n97253O38231O03386o23806o13393O08619O19384n93731o28335N73624
479c8934O35708n56372o44693N34079O52246n14713o60547M91285O68272m67372
489I8959o75120M41822O79968m21711o86554L99228O93769l78592p01211L57643
499a91799P09221l37458p19397L17792P28179k94255p38700K69769P47130k48761
509B41721p53614K27808P61462k07600p67374J90409P71823j72981p72694J60035
519c21005P79938j45906p84279J29953P89126j12781p91192R9534P95297q2776
529C55909p94234O4003P94350m6423p84738L3788P78883k2086p70852Q600P66282
540C83482Q172p57586j7913P50780L3859p45905n1541P41609P6467p30885r7663
$$ plain form
469 -25660 -622913 15318 618704 -5102 -618495 -9876 609508 15777 -612558 -38934
479 -38934 596774 40402 -604291 -70212 582034 67321 -593226 -101941 566331 98959
489 98959 -576161 -134339 545629 123918 -562636 -163408 530361 151769 -549442 -191799
499 -191799 517422 179964 -539433 -221641 506538 212283 -526417 -256648 490482 241721
509 241721 -511893 -284085 477377 269777 -497597 -307188 464635 291654 -481040 -321005
519 -321005 458933 313027 -471252 -341299 447827 335046 -456146 -356612 438685 355909
529 355909 -438325 -374322 420028 373605 -411133 -377345 401538 379452 -391400 -382800 383482
540 383482 391654 -365932 -383845 366935 400794 -345111 -396652 344957 421424 -309461 -407124
551d07124P19482J21398p08064j40685O96735J63332o82823j82965O68620J96893
561D44799o58129k11648O53705K32734o48945k56433O42685K79069o38589k99826
571d60578O35182L25167o30813l49927O17523L67764o05603l80143N97387L88591
581E04550n92780m01254N85287M09845n81140m16744N81377M23178n84000m42217
591e13898N79107M56747n67836m67572N54214M71295n41042m78425N23332M81368
601D97290n04492m78526M84410M71937m76900m71634M65701M78529m51529m87092
611d72306M32821M91714m18930n02142L99236N17877l71218n28739L38011N29471
621D15795l11084n28075K88599N35037k68404n41424K46569N45827k32591n52599
$$ plain form
551 -407124 312358 433756 -274308 -414993 281742 445074 -237749 -420714 247906 444799
561 444799 -213330 -424978 228727 461461 -187484 -443917 198768 477837 -160752 -460578
571 -460578 174604 499771 -131042 -480969 136554 504318 -101285 -481428 115959 504550
581 504550 -88230 -489484 95803 505648 -75492 -492236 89141 512319 -71681 -513898
591 -513898 65209 521956 -45880 -513452 40762 512057 -28985 -507410 15922 497290
601 497290 -7202 -485728 -1318 470619 -6281 -477915 -12214 466315 14786 -472306
611 -472306 -39485 452229 33299 -468843 -69607 448270 77052 -451687 -113676 415795
621 415795 104711 -423364 -134765 400272 131868 -409556 -162987 382840 150249 -402350
631d02350K23940N70388k10947n95129J90947O11557j68840o19085J52748O28199
641C81428j36393o38581J16531O40275r9586o35113R6161O34518r8490o41815
651c81065R6441O51422q9280o54046Q6747O57360q3607o65651P4223O68642n1553
662C09633o57375L5205O39522k6478o24798K3114O16543j2741o00768M574N85765
673B92196o30n78537k307N81778K3161n80579m9419N66052P4886n49748r6360
684c19507N39432J24053n24915j53936N03678J73622m83620j81769M78590J94546
694C50174m82562k15338M82008K36602m78872k53534M84079K75023m90733l05502
704c98655M88307L33800m74003l48283M64513L51525m65315l60807M64912L67687
$$ plain form
631 -402350 -178410 391978 181031 -414098 -223151 388406 219566 -399519 -246771 381428
641 381428 245035 -393546 -277015 363260 263674 -371439 -275278 359240 260750 -381065
651 -381065 -284624 366798 277518 -376528 -289781 367579 283972 -381679 -307456 361186 309633
662 309633 -347742 -312537 326985 300507 -324291 -301177 315366 302625 -298143 -293569 292196
673 292196 291566 -286971 -289278 292500 315661 -264918 -314337 251715 326601 -223147 -319507
684 -319507 219925 343978 -180937 -334873 168805 342427 -141193 -322962 155628 350174
694 350174 -132388 -347726 134282 370884 -107988 -361522 122557 397580 -93153 -398655
704 -398655 89652 423452 -50551 -398834 65679 417204 -48111 -408918 55994 423681
714D23681m59596l66685M58166L61097m72499l64005M81918L76368m77650l86814
724d26019M65124L84302m58973l86734M52005L91877m33443l95171M09163L79963
734C82094l95549l67264L90927L64279l83347l68147L62527L69327l45771l69708
744c60632L33241L80865l16102m00564K82412M08804k49223m05764K26533M07728
754C07298k09391m18825J84530M26128j60944m26434J50264M29451j47103m54113
764c19139J36013M76633j13621m88852R5323M99227q7321n15504P7390N31000
774B91149n8254n31752M6038N25424m9935n25701N9062N37274n5697n40508N2039
785b50861N39310n6920n37760O2068N50035n5500n50320M0530N37304l1442n20382
$$ plain form
714 423681 -35915 -402600 55566 416663 -55836 -419841 62077 438445 -39205 -426019
724 -426019 39105 423407 -35566 -422300 29705 421582 -11861 -407032 2131 382094
734 382094 -13455 -380719 10208 374487 -8860 -377007 -14480 354847 9076 -360632
744 -360632 -27391 353474 37372 -363192 -80780 328024 78801 -326963 -100430 307298
754 307298 97907 -320918 -136388 289740 128796 -297638 -147374 282077 134974 -319139
764 -319139 -183126 293507 179886 -308966 -213643 285584 198263 -317241 -239851 291149
774 291149 232895 -298857 -252819 272605 222670 -303031 -243969 293305 237608 -302900 -250861
785 -250861 288449 231529 -306231 -244163 305872 250372 -299948 -259418 277886 246444 -273938
796b73938L4051N13712k8400n04910J7157M88269q822m67869J0973M62096m830
807B37489m60844j5077M53753L8432m35820n2777M25416O9852m21252r3138M11546
818A57580J20890l91569j36665L77326J47869l75651j64827L77025J89541l72299
828g0780k07091L66729K18245l73648k35878L80948K61673l78895k80290L68630
838D9643K87321l70526k94736L76038L07177l76596l18141L68308L14995l69817
848b6334l12129L79420L16030l85110l24856L77418L24695l74821l17444L73320
858C0189L16597l70976l24406L55873L21622l38477l11065L28523L03884l23450
868a1686l08685L08854L10380k89509l06638K74010L01588k64615l10354K49014
$$ plain form
796 -273938 -239887 273825 245425 -259485 -242328 245941 237119 -230750 -219777 242319 237489
807 237489 -223355 -238432 215321 253753 -182067 -234844 190572 260424 -160828 -253966 157580
818 157580 278470 -113099 -249764 127562 275431 -100220 -265047 111978 301519 -70780
828 -70780 -277871 88858 307103 -66545 -302423 78525 340198 -38697 -318987 49643
838 49643 336964 -33562 -328298 47740 354917 -21679 -339820 28488 343483 -26334
848 -26334 -338463 40957 356987 -28123 -352979 24439 349134 -25687 -343131 30189
858 30189 346786 -24190 -348596 7277 328899 -9578 -320643 7880 311764 -11686
868 -11686 -320371 -11517 298863 9354 -297284 -23274 278314 13699 -296655 -47641
878d7641L19362k23304l21472K00772L19938j86791l29508J71664L43025j50056
888I5989l49218J27571L51954j18199l59495J11912L76727r7560l89320P9460
898a70179L95307p0625m01667O7242M16616n7664m26873M3742M29748l5873m32718
909b42944L9149M40599l8310m49018L2095M49803k5719m43470L0274M43534l2891
920B03102m46354K6602M45741j7757m34996J6912M29331j7317m24971J0261M19746
931B10300L083m06489n585L93966Q058l87664j6571L81444L4281l68659m4457
942a98293L53990N3120l45646o3862L43109Q3561l34895r9976L23222J11767l17522
953i1425j22777L17322J39936l12740j58356L05016J69279k99817j79277L02492
$$ plain form
878 -47641 271721 48417 -273055 -72283 247655 60864 -268644 -96980 246045 95989
888 95989 -253229 -125658 226296 108097 -251398 -139486 237241 139681 -249639 -170179
898 -170179 225128 154503 -247164 -179922 236694 179030 -247843 -204101 225647 189774 -242944
909 -242944 -203795 236804 198494 -250524 -218429 231374 205655 -237815 -207541 235993 203102
920 203102 -243252 -216650 229091 211334 -223662 -206750 222581 205264 -219707 -209446 210300
931 210300 213383 -193106 -198691 195275 203333 -184331 -200902 180542 214823 -153836 -198293
942 -198293 155697 208817 -136829 -200691 142418 225979 -108916 -208892 114330 226097 -91425
953 -91425 -214202 103120 243056 -69684 -228040 76976 246255 -53562 -232839 69653
963F9653J94856l04513k10950K99311K21312k95689k27584K98347K34148l01570
973b2679k47828L01332K52444k95980k55774K96813K56661l01001k64013K97945
983A7920K68389k91478k67993K86711K65505k88668k67871K83499K71059k76273
993H00k69468K66736K63437k62395k64270K54937K65604k43144k66384K28636
1003b5511K62199k18831k64141K09450K67170j96277k71159J79321K71531j68808
1013D4944k72193J59562K76665j47849k83086J30578K87120j19265k90066J11086
1023a02504K96049j00139l04954Q7840L11615p5549l16575P0444L21719o3490
1033A24456l30171N4596L36558m6294l37758M2496L40817l9183l44918L4134L50650
$$ plain form
963 69653 264509 -40004 -250954 48357 269669 -26020 -253604 44743 278891 -22679
973 -22679 -270507 30825 283269 -12711 -268485 28328 284989 -16012 -280025 17920
983 17920 286309 -5169 -273162 13549 279054 -9614 -277485 6014 277073 800
993 800 -268668 -1932 261505 -890 -265160 -10223 255381 12237 -254147 -25511
1003 -25511 236688 17857 -246284 -36834 230336 34059 -237100 -57779 213752 44944
1013 44944 -227249 -67687 208978 61129 -221957 -91379 195741 76476 -213590 -102504
1023 -102504 193545 93406 -211548 -123708 187907 112358 -204217 -133773 187946 124456
1033 124456 -205715 -151119 185439 139145 -198613 -156117 184700 145517 -199401 -165267 185383
1044A85383k7165l51364K4031L53309k1423l54487J9565L56841j2372l54799R184
1055a73297L51070n771l46550K697L45950L418l40165q367L33594J4706l28101
1066a50816j7442L25235K6476l21108l4620L14144M2419l07370m8018L01711N8981
1077A89592k97298o7260K88877P8852k82327q7238K78287R5537k75497j05600
1087a84075K70259J17686k65511j26825K62363J35280k61455j46597K60024J56108
1097B17257k55435j64590K51358J71447k51065j80661K49786J87655k46614j95446
1107b16308K44636J98395k44278k04270K43430K08412k40883k14897K38368K15159
1117B27764k35639k18974K32012K21916k28509k26133K23608K25875k19329k27823
$$ plain form
1044 185383 158218 -193146 -169115 184194 162771 -191716 -172151 184690 172318 -182481 -173297
1055 -173297 177773 172002 -174548 -171851 174099 177517 -162648 -171015 162579 177285 -150816
1066 -150816 -168258 156977 183453 -137655 -172275 141869 184288 -123082 -171100 130611 189592
1077 189592 -107706 -174966 113911 192763 -89564 -176802 101485 197022 -78475 -184075
1087 -184075 86184 203870 -61641 -188466 73897 209177 -52278 -198875 61149 217257
1097 217257 -38178 -202768 48590 220037 -31028 -211689 38097 225752 -20862 -216308
1107 -216308 28328 226723 -17555 -221825 21605 230017 -10866 -225763 12605 227764
1117 227764 -7875 -226849 5163 227079 -1430 -227563 -3955 221920 2591 -225232
1127b25232K13760K28055k07460k30197K01309K30065j94994k31832J88167K30148
1137B01789j79348k33280J70922K33351j62948k34851J53618K37371j44763k40989
1147a99128J34806K43421j25785k45244J16264K47894j08035k49974R9126K52115
1157A65460q8837k55611Q1645K59391p2738k65201O6830K68157n7707k72976N2888
1168a18699K77103m5351k80951L8863K84920l2410k86254K8064K88259k2326k88507
1179a57289J8118K90732j3531k91286J1750K91660n860k92912L415K95062O14
1190A50473k93237n737K92793J0155k88064j5235K85668J9961k78927k4858K75172
1201A28164K9240k68947l4282K67051L7432k62451m2875K59542N1286k58266n5211
$$ plain form
1127 -225232 -11472 216583 9123 -221074 -19765 210300 15306 -216526 -28359 201789
1137 201789 22441 -210839 -39917 193434 30486 -204365 -50747 186624 41861 -199128
1147 -199128 -64322 179099 53314 -191930 -75666 172228 64193 -185781 -86655 165460
1157 165460 76623 -178988 -97343 162048 89310 -175891 -109061 159096 101389 -171587 -118699
1168 -118699 158404 113053 -167898 -129035 155885 123475 -162779 -134715 153544 131218 -157289
1179 -157289 -139171 151561 138030 -153256 -141506 150154 144294 -148618 -145203 149859 150473
1190 150473 -142764 -148501 144292 154447 -133617 -148852 136816 156777 -122150 -147008 128164
1201 128164 157404 -111543 -145825 121226 158658 -103793 -146668 112874 164160 -94106 -149317
1212a49317K52169O5769k48496p4529K43137Q2846k35528r1172K29610R8300k26001
1223e3212j04605K20992J12024k18231j19436K17593J24195k16434j33682K16498
1233D5702J41054k15210j50913K10887J59865k09007j66952K03480J71708k00137
1243i523j77268J97820J78562j97264j79650J96090J81423j97864j84967J96728
1253D087J87856j96790j91525J93612J94698j90040k00092J83817J99707j76047
1263I283j99931J68492J98517j64132j96538J58558J94994j55456j93243J50600
1273b8856J93342j47559j95969J40756K00912j31523k04066J19950K07168j10146
1283D4009k09469J00448K10720q9535k11071Q0298K10755p4417k10471O9907K14077
$$ plain form
1212 -149317 102852 168621 -79875 -154404 88733 171579 -63949 -155121 74489 172789 -53212
1223 -53212 -157817 63175 175199 -43032 -162468 55125 179320 -37114 -170796 45702
1233 45702 186756 -28454 -179367 31520 191385 -17622 -184574 18906 190614 -9523
1243 -9523 -186791 11029 189591 -7673 -187323 8767 190190 -7674 -192641 4087
1253 4087 191943 -4847 -196372 -2760 191938 1898 -198194 -14377 185330 9283
1263 9283 -190648 -22156 176361 12229 -184309 -25751 169243 13787 -179456 -28856
1273 -28856 164486 16927 -179042 -38286 162626 31103 -172963 -53013 154155 44009
1283 44009 -165460 -65012 145708 56173 -154898 -74600 136155 61738 -148733 -78826 135251
1294A35251o4453k19501O0136K25608n3721k30760M7830K38458l8970k43104K8909
1305a14317K46000j8917k46411J6747K45746j4574k45464J3278K47759j2654k47725
1316a30532J3734K51145j2417k56139J1536K58795m621k57253r59K56685O109
1327A36083k53681j0250K48904J6422k41539j7045K34240J6114k29179j5799K27202
1338A11472K0702k25886k5128K21590L2084k20227l8630K17096N0214k11513o2321
1349a30547K04475P0210j97257p4983J92722P9039j87591q8291J84228R2019j80818
1360c6794r8292J82542J06225j86536j16977J84939J26737j83097j35399J82127
1370B5475J41877j81378j50179J76524J55369j73899j54721J71149J53314j75626
$$ plain form
1294 135251 70798 -148703 -88567 137041 83320 -147440 -99610 138848 99878 -143226 -114317
1305 -114317 131683 112766 -133645 -116898 128848 114274 -131190 -117912 129847 117193 -130532
1316 -130532 -116798 134347 121930 -134209 -122673 136122 131501 -125752 -126711 129974 136083
1327 136083 -117598 -127848 121056 137478 -104061 -121106 113134 129248 -99931 -115730 111472
1338 111472 132174 -93712 -118840 102750 134834 -85393 -124023 93073 143287 -68226 -130547
1349 -130547 73928 144138 -53119 -128102 64620 143659 -43932 -132223 52005 144024 -36794
1360 -36794 -135086 47456 153681 -32855 -149832 35107 161844 -21253 -156652 25475
1370 25475 167352 -14026 -164205 12319 167688 -6211 -160932 10217 163531 -12095
1380a2095j55305J77116J58835j77678j62544J77391J62295j78452j67844J78970
1390F89J70103j73873j71026J63709J67873j59193j65130J55754J63918j49423
1400C401j63063J42615J58890j39746j56755J38039J59176j31190j65690J21485
1410c2838J67407j12634j66754J04632J69195r3580j74384Q2631J74613p2181
1420D6107j71756O5757J73919n9671j82832N6581J87624m7239j90759M3380J96765
1431A17876m1602k04520L5114K11931k4730k12741J8575K15468j7480k16976J5522
1442a03563K22701j1177k22276R595K22764j2852k24324J5551K29255j1815k29650
1453a15791Q216K26939p933k23379P252K25437l642k21242j168K12448M745k06300
$$ plain form
1380 -12095 -167400 9716 168551 -9127 -171671 5720 168015 -10437 -178281 689
1390 689 170792 -3081 -174107 -10398 157475 -1718 -166848 -11094 152824 3401
1400 3401 -159662 -17047 141843 2097 -154658 -16619 142557 11367 -154323 -32838
1410 -32838 134569 21935 -144819 -40187 129008 35428 -138956 -56325 118288 46107
1420 46107 -125649 -59892 114027 54356 -128476 -71895 115729 68490 -122269 -78889 117876
1431 117876 76274 -128246 -93132 118799 94069 -118672 -100097 115371 97891 -119085 -103563
1442 -103563 119138 107961 -114315 -104720 118044 105192 -119132 -103581 125674 113859 -115791
1453 -115791 -107575 119364 111431 -111948 -104696 120741 117099 -104143 -105311 107137 111882 -94418
1465i4418k050K04971L438k01656j0530J96615J4274j87894j8191J85398K2401
1476A12358j83633l3408J78466M3843j69983m9645J65654N3855j64185o3832J60673
1487E0163P4978j56437p9900J52250Q2829j54970r2631J56590J02746j53884j10690
1498a28956J52067J12666j54514j20423J57686J29259j57005j34854J53279J34728
1508A43933j57949j35479J61777J40188j62884j43258J57640J40789j57232j39577
1518a52052J60576J38928j58758j44930J55603J41677j51174j36965J49248J36883
1528A39036j47786j40428J40373J38838j33136j32867J29061J30574j25798j34834
1538a36967J17777J36849j06418j33838R7953J33815r4299j38380Q7995J44121
$$ plain form
1465 -94418 -96468 108503 111941 -89715 -100245 96370 110644 -77250 -95441 89957 112358
1476 112358 -71275 -104683 73783 117626 -52357 -102002 63652 117507 -46678 -110510 50163
1487 50163 125141 -31296 -111196 41054 123883 -31087 -123718 32872 135618 -18266 -128956
1498 -128956 23111 135777 -18737 -139160 18526 147785 -9220 -144074 9205 143933
1508 143933 -14016 -149495 12282 152470 -10414 -153672 3968 144757 -12475 -152052
1518 -152052 8524 147452 -11306 -156236 -633 141044 -10130 -147095 2153 139036
1528 139036 -8750 -149178 -8805 130033 -3103 -135970 -6909 123665 -2133 -136967
1538 -136967 -19190 117659 11241 -122597 -24644 109171 14872 -123508 -35513 108608
1548A08608p6895j43810O8745J43052o5534j46672N9167J55635m8672j58414M0445
1559f4345J60105l7801j64164L4657J75693l0170j78384K2421J82729k2578j83839
1570a05676K3688J91254k0250j95221J5702J95744j4685j93271J7064J98530j7292
1581I5587k02317J3859K00055j0153j95748J3352J95974j4288j97490J2471J93371
1592A04673p392j87399R249J82655q806j81443L596J79532K604j71042o175J64074
1604H4126P427j61936j3067J60707K1490j54804k8386J48355L0082j45415l6982
1615h8403J46167M7019j41913n7537J36189O1012j35929o5716J37954P4589j39109
1626b5677q3822J34499Q8960j34040r2691J37464R7184j40047j05754J37600J09018
$$ plain form
1548 108608 31713 -112097 -43352 99700 34166 -112506 -53339 102296 53624 -104790 -64345
1559 -64345 95760 57959 -106205 -71548 104145 73975 -104409 -81988 100741 78163 -105676
1570 -105676 -81988 109266 89016 -106205 -90503 105241 90556 -102715 -85651 112879 95587
1581 95587 -106730 -92871 107184 97031 -98717 -85365 110609 96321 -101169 -88698 104673
1592 104673 97281 -90118 -80869 101786 92980 -88463 -84867 94665 97269 -73773 -79948 84126
1604 84126 91553 -70383 -83450 77257 98747 -56057 -84443 63912 93994 -51421 -88403
1615 -88403 57764 104783 -37130 -94667 41522 102534 -33395 -99111 38843 113432 -25677
1626 -25677 -109499 25000 113960 -20080 -112771 24693 121877 -18170 -123924 13676 122694
1637A22694j37662j08510J38904J11928j43669j18061J42046J20078j40151j18753
1647a31156J40355J19014j43837j21651J42342J21690j38261j20196J36943J15198
1657A20441j35364j17780J31667J19540j25625j17664J20511J14764j19682j15308
1667a24500J16722J17420j07720j17329R8479J15494r3666j15872R0146J19364
1677I8538q1515j22395P2444J23122o7069j23755O4210J28764n7633j34432N1342
1688d8379J36202m5140j37647M3945J44076l9884j49405L3346J52759k7375j53802
1699i1304K5840J58125k4884j62420K2186J65290j7426j65023J8816J66195j9388
1710G6007j69985J9683J71938j3755j71267J3415J70149j4522j70039J2742J70487
$$ plain form
1637 122694 -14968 -123478 15426 127354 -16315 -134376 7670 127748 -12403 -131156
1647 -131156 9199 128213 -15624 -137275 5067 126757 -11504 -131700 5243 120441
1657 120441 -14923 -132703 -1036 118504 -7121 -124785 -4274 110490 -9192 -124500
1667 -124500 -7778 109642 1922 -115407 -16928 98566 4900 -110972 -20826 98538
1677 98538 17023 -105372 -32928 90194 23125 -100630 -36420 92344 34711 -99721 -48379
1688 -48379 87823 42683 -94964 -51019 93057 53173 -96232 -62886 89873 62498 -91304
1699 -91304 -65464 92661 67777 -94643 -72457 92833 75407 -89616 -70800 95395 76007
1710 76007 -93978 -74295 97643 83888 -87379 -73964 96185 81663 -88376 -75634 94853
1721I4853p019j68219N631J65872q032j61945O573J60167k022j56716k250J53276
1733H0169K348j48713m958J46980J0871j45216j7903J41164K1619j35902k6030
1744g5571J34069K9867j32204l7695J28777M3833j25705m8021J25447N0806j25573
1755c1970n9260J23123O5980j21914p0650J20857P4442j22577q0124J21860Q5724
1766A05491j21503q8874J19818Q9724j21638r3884J22894R5786j21404r8622J19704
1777G492R9897j22604j00753J22714J02258j20769j04771J17827J04120j16289
1787a0878j05637J16488J05253j13052j06010J09988J02512j05987j02429J02633
1797g119J03604j00327j04101R5464J05206r0586j05403Q7209J06310q3027j08293
$$ plain form
1721 94853 87834 -80385 -74754 91118 83086 -78859 -72286 87881 85859 -70857 -73107 80169
1733 80169 82517 -66196 -71154 75826 86697 -58519 -76422 64742 86361 -49541 -75571
1744 -75571 58498 88365 -43839 -81534 47243 91076 -34629 -82650 42797 93603 -31970
1755 -31970 -91230 31893 97873 -24041 -94691 26166 100608 -21969 -102093 19767 105491
1766 105491 -16012 -104886 14932 104656 -16982 -110866 12028 107814 -13590 -112212 7492
1777 7492 107389 -15215 -115968 6746 109004 -11765 -116536 1291 105411 -10878
1787 -10878 -116515 -27 105226 -7826 -113836 -3848 98664 -7323 -109752 -7119
1797 -7119 96485 -3842 -107943 -12479 92727 2141 -103262 -16053 90257 7230 -101063
1808a01063P8449J08498p0354j10750O8136J11061o2759j11624N5804J14986m8660
1819C1724j18128M6661J19691m3014j21811L9452J25788l4971j28243L2926J30111
1830H0186k8656j32591K4938J37909k1197j39185J9410J40374j7080j41218J4889
1841f2221J43653j2460j45126J2309J45102j0620j45610J1876J46447r953j46148
1852g2751P593J45862n367j45076M081J44378k632j41194k080J40183L478j36270
1864e9795m451J32923P220j31484r640J28005J2684j26695j4733J24082J8909
1875G7025j23983k2871J20023K9376j18696l3866J15205L8537j13332m3340J10853
1886C4931M6998j09714n0557J08840N1941j07199n7577J06303O2049j06993o6392
$$ plain form
1808 -101063 -22614 85884 15530 -95220 -27084 83977 21218 -90406 -34602 80384 31724
1819 31724 -86404 -39743 79948 36934 -84877 -45425 80363 45392 -82851 -49925 80186
1830 80186 51530 -81061 -56123 81786 60589 -78596 -59186 81188 64108 -77110 -62221
1841 -62221 81432 68972 -76154 -63845 81257 70637 -74973 -63097 83350 73397 -72751
1852 -72751 -65158 80704 75337 -69739 -65658 78720 76088 -65106 -67186 72997 76475 -59795
1864 -59795 -64246 68677 75897 -55587 -65227 62778 75462 -51233 -65966 58116 77025
1875 77025 -46958 -69829 50194 79570 -39126 -72992 42213 80750 -32582 -75922 34931
1886 34931 81929 -27785 -78342 30498 82439 -24760 -82337 23966 86015 -20978 -87370
1897h7370J04868P1274j06429p4792J05231P8847j05376q2894J03820Q4373j03675
1908a2123q5855J02421Q5922j02299q6210J01602Q7873j02651q9549J01386R2603
1919I3120j02622r2665J00304R3893r7489r5823R4906R6316r2774r4285Q8189
1930h930R2666q4710r2195Q2141R1451p9426r0359P6434R3442p3289r4699O8686
1942a8788R7473o4567r9370O0110J00901n3902j00499M8713J00790m3219j02616
1953g4974M1271J03071l6982j03499L5190J05843l1100j08894K8409J14192k6529
1964D5998j16544K3797J19813j9327j21906J6597J23611j2918j23638J0295J23733
1975F9511q482j24941J0637J24640q478j26420R002J27386o915j29550O353J30204
$$ plain form
1897 -87370 17498 88772 -17657 -92449 12782 91629 -13747 -96641 7179 91552 -12123
1908 -12123 -97978 4443 90365 -11934 -98144 3458 91331 -11320 -100869 517 93120
1919 93120 -9502 -102167 -1863 92030 -5459 -101282 -6376 89940 -2834 -97119 -8930
1930 -8930 83736 -974 -93169 -11028 80423 997 -89362 -12928 80514 7225 -87474 -18788
1942 -18788 78685 14118 -85252 -25142 75759 21857 -78642 -29929 70861 27642 -74974
1953 -74974 -33703 69368 32386 -71113 -35923 69920 38820 -70074 -41665 72527 45998
1964 45998 -70546 -46749 73064 53737 -68169 -51572 72039 59121 -64517 -54222 69511
1975 69511 61029 -63912 -53275 71365 62887 -63533 -54531 72855 65940 -63610 -57257 72947
1987G2947m546j29783L460J26171L99j24859k141J22213K685j17473n500J16016
1999E9589N688j14134p692J12240J0005j12498j1560J09405J6296j09007j9570
2010f1238J04708K5648j03181l0049J00082L2515r6661l7829R4762L8852r1697
2021b4088m4034R1865M7113r2853n0631R1747N4714r3073n8051R1305O3721r2330
2033a4595o8094R0643P1358q9633p3812Q8256P5198q8673p7446Q8786P8407q9160
2045h765p9364R0540P9309r0821q1483R0222Q3526q9808q3295Q6396Q2949q5441
2057f035q2979Q3490Q2229p9315q2246P7128Q1937p5219q1048P2969Q1311p1051
2069A171p9736O6367Q0799o2578q0691N9629Q2046n3563q4736M9175Q5344m3556
$$ plain form
1987 72947 68401 -61382 -57922 68249 68648 -56211 -58352 63861 66546 -50927 -56427 59589
1999 59589 65277 -48857 -56549 55691 65696 -46802 -58362 51043 67339 -41668 -61238
2010 -61238 43470 69118 -34063 -64112 35970 68485 -28176 -66005 28757 67609 -24088
2021 -24088 -68122 23743 70856 -21997 -72628 19119 73833 -19240 -77291 14014 77735 -14595
2033 -14595 -82689 7954 79312 -10321 -84133 4123 79321 -9352 -86798 1988 80395 -8765
2045 -8765 -88129 2411 81720 -9101 -90584 -362 83164 -6644 -89939 -3543 79406 -6035
2057 -6035 -89014 -5524 76705 -2610 -84856 -7728 74209 -1010 -82058 -9089 72222 1171
2069 1171 -78565 -12198 68601 6023 -74668 -15039 67007 13444 -71292 -22117 63227 19671
2081A9671q5131M0676Q6657l6906q8660L3956Q9754l0259r0143K7620R4250k6000
2093C5485r6430K1791J01574j8953j00479J4984J04722j3381j07481J2197J08970
2104F2999q668j10768Q784J10729p595j11689P510J13114n873j13076M999J12876
2116F3342m108j14591N046J13851k769j13398J547J11571j545j10545J889J08698
2128E8988Q22j06616l316J02846M185r9381m569R7299O887r6640j1829R3134J5370
2141E7180r0474j7309Q8448J9951q8011k5384Q4780K9775q2418l3513Q1306L4756
2153E9087q0864m0274P9127M6620p9773m8235P7472N0936p9580n5200Q0001N8742
2165F8059p8979o2982P9805O3341q1038o5827Q1270O8849q0792p1244Q0083P0257
$$ plain form
2081 19671 -65460 -24784 61873 24967 -63693 -29737 60017 29758 -60385 -32765 61485 35485
2093 35485 -60945 -39154 62420 43467 -57012 -42028 62694 49313 -58168 -45971 62999
2104 62999 54331 -56437 -47653 63076 55481 -56208 -48698 64416 58543 -54533 -49534 63342
2116 63342 59234 -55357 -50311 63540 60771 -52627 -51080 60491 58946 -51599 -49710 58988
2128 58988 59810 -46806 -50122 52724 56909 -42472 -47041 50258 57145 -39495 -51324 41810 57180
2141 57180 -33294 -50603 37845 57796 -30215 -55599 29181 58956 -23462 -56975 24331 59087
2153 59087 -21777 -62051 17076 63696 -16077 -64312 13160 64096 -15484 -70684 9317 68059
2165 68059 -10920 -73902 5903 69244 -11794 -77621 3649 72498 -8294 -79538 545 70802
2177G0802q0576p0737Q0483P3899q0925p5220Q0714P2317p8758p1366Q0109P0651
2189G1393p7480p3744P5813P1762p2202p1009P2157P0989p0191p1284O4627P2207
2201F3038n9898p0434N8685O8972n5215p1393N1867P2063m5757p0212M1498P2525
2213E5739m0112p4503L5369P8371l0091p8268K6196Q0798k4393q2708K1932Q8177
2225E6507j8567q8209J4140Q9401j3996r1238J3247R6359j0504r7790Q266R8305
2237E5921p286r9898Q582J02720p396j03803M827J04024n338j01844P331J01704
2249E9544n240j04626M536J02099l729j00040O163R8104m508r9847K606R6908
2261E1970j30r2821j353R1160J900r0426n859Q8192Q195q3368j0892Q0115J2279
$$ plain form
2177 70802 -9774 -80511 -28 73871 -7054 -82274 -1560 70757 -8001 -79367 742 71393
2189 71393 -6087 -79831 -4018 67744 -4458 -75467 -3310 67679 -2512 -73796 -9169 63038
2201 63038 3140 -67294 -8609 60363 5148 -66245 -14378 57685 11928 -58284 -16786 55739
2213 55739 15627 -58876 -23507 54864 24773 -53495 -27299 53499 29106 -53602 -31670 56507
2225 56507 37940 -50269 -36129 53272 39276 -51962 -38715 57644 47140 -50650 -42384 55921
2237 55921 48635 -51263 -42681 60039 52643 -51160 -46333 57691 52353 -49491 -42160 59544
2249 59544 54304 -50322 -45786 56313 52584 -47456 -41293 56811 52303 -47544 -44938 51970
2261 51970 51840 -40981 -42334 48826 50726 -39700 -45559 42633 50828 -32540 -43432 36683 48962
2274D8962q0185j5895P9164K0565p6396k4039P1688K5935p1781l0956P2965L5568
2286E5595p2182l9075O8114M2004o9486m5130P0875M9998p2144n4382O9391N4624
2298E8202o8069n6987P1300N9701p3594o2135P1196O3764p1651o2894P3492O2598
2310F4923p3095o6664P3127O5592p0535o4637P0558O4389p1337o5042O9686O4190
2322F1155o5176o3681O5449O1989o5139o2166O3159O3222n9112o0529N4077O0800
2334E4048n3401o1145N0410O4396m5717o3511M0284O3606l7603o4619L7735O6111
2346E0594l2716o6676K8060O6805k4126o8949K4394P1907k0484p4813J7600P5320
2358D6916j2507p8096J2951Q1998j1986q4305Q904Q5310o534q4569P640Q6670
$$ plain form
2274 48962 -31223 -47118 32046 52611 -23785 -47824 23864 49799 -21982 -52938 20027 55595
2286 55595 -16587 -55662 12452 54456 -15030 -60160 10715 60713 -11431 -65813 3578 58202
2298 58202 -9867 -66854 4446 64147 -9447 -71582 -386 63378 -8273 -71167 2325 64923
2310 64923 -8172 -74836 -1709 63883 -6652 -71289 -731 63658 -7679 -72721 -3035 61155
2322 61155 -4021 -67702 -2253 59736 -5403 -67569 -4410 58812 -300 -60829 -6752 54048
2334 54048 647 -60498 -10088 54308 8591 -54920 -14636 48970 11367 -53252 -15517 50594
2346 50594 17878 -48798 -20738 46067 21941 -47008 -22614 49293 28809 -46004 -28404 46916
2358 46916 34409 -43687 -30736 51262 39276 -45029 -36125 49185 42651 -41918 -34278 52392
2370E2392q652q9289P597Q9980n465q9621N475R0598p407r1535N754R2465k905
2383D9387r1210K765Q8536l121r0082M093Q8208k010q5145mQ1447l72q0848J49
2397c8207P9799L481p9066o115P5413P681p3419j0693P3086J2424p0287j7648
2409d3551O7172K0775o6259k1077O4513K5106o5898k9745O3116L2443o2280l4228
2421d9913O2278L7469o4828m1175O3222M4672o1808m6600O2135M7868o3438n1441
2433f1559O2786N3160o2011n3806O2200N4351o3909n5419O4407N7489o4485n7358
2445f4154O3288N6627o3234n7785O3957N8646o1543n7658N9494N5869n7839n5489
2457e9821N7725N5746n5225n6483N3041N5636n0825n3379M8753N5227m6564n7203
$$ plain form
2370 52392 43740 -45549 -37952 52028 46563 -43058 -37583 53015 45608 -45927 -40173 52292 49387
2383 49387 -41823 -39058 49478 46357 -43725 -39632 48576 46566 -38579 -38583 42864 42492 -38356 -38207
2397 -38207 41592 45073 -33993 -40108 35305 42986 -30433 -41126 31960 44384 -25903 -43551
2409 -43551 23621 44396 -21863 -42940 21573 46679 -19219 -48964 14152 46595 -15685 -49913
2421 -49913 12365 49834 -14994 -56169 7053 51725 -10083 -56683 5452 53320 -10118 -61559
2433 -61559 1227 54387 -7624 -61430 770 55121 -8788 -64207 200 57689 -6796 -64154
2445 -64154 -866 55761 -7473 -65258 -1301 57345 -4198 -61856 -2362 53507 -4332 -59821
2457 -59821 -2096 53650 -1575 -58058 -5017 50619 -206 -53585 -4832 50395 3831 -53372
2469e3372M5004N4703l8529n5667L7080N7558l5094n7861L0686O0522k7229o0341
2481d2540K5311O1036k2526o3635K0058O5812j8035o5473J6619O6371j3716p0925
2493d1643J4091P2353r759p4137Q370P5244q162p5478O410P9469o333p7765N266
2506c2074P7447n888p8688N666P9829m679p9750L882P8640l493p8203K796P9233
2519D4718k731p8924J344P6915M51p5516j223P3586O56p2236k724P0654L551o8340
2533b9819n307O7529N978o6110j0557O5312J2268o2837j4580O0541J7434o0957
2545b1105k0368N8737K3375n7426k5659N5700K6933n6182k9136N5625L2404n5698
2557a2800l4920N5040L6751n5272m0338N5562M2799n5884m4352N5126M4638n4928
$$ plain form
2469 -53372 -8368 46335 7806 -47861 -10781 46777 11683 -46178 -15492 45030 17801 -42540
2481 -42540 -17229 43807 21281 -42354 -22296 43516 25481 -39992 -23373 42998 29282 -41643
2493 -41643 -27552 44801 35042 -39095 -30725 44519 36357 -39121 -32711 46758 40425 -37340 -32074
2506 -32074 45373 39485 -39203 -33537 46292 41613 -38137 -34255 44385 40892 -37311 -34515 44718
2519 44718 41987 -36937 -35593 41322 41773 -33743 -34966 38620 39276 -32960 -35684 34970 38521 -29819
2533 -29819 -35126 32403 38381 -27729 -38286 27026 39294 -23543 -38123 22418 39852 -21105
2545 -21105 -41473 17264 40639 -16787 -42446 13254 40187 -15995 -45131 10494 42898 -12800
2557 -12800 -47720 7320 44071 -11201 -51539 4023 46822 -9062 -53414 1712 46350 -8578
2569h578m6422N5058M7525n4849m7826N3763M8860n4665m9349N5031M9800n4881
2581f533m9815N4762N0395n4055n0719N3541N1592n2381n0812M9275N1794m8621
2593a577m9492M5947N0175m4564m9340M3902M8441m0516m8853L8527N0885l7910
2605E625m9728L4613N2363l1275n1754K8408N2409k5446n3993K3458N5312k0576
2617A9416n5602J9226N6353j7050n7556J6652N9150j3480o1352J2080O2565j0960
2629B9442o3625R381O5225p693o5643N847O7063m840o8010N077O8186m668o8213
2642c2471M096O8145l649o8813L135O9737l730o9970L053P0048k241o8767l90
2655c1817O8390M33o7751n34O4902L078o5441k345O2835K929o2451m698N9877
$$ plain form
2569 -8578 -55000 58 47583 -7266 -55092 -1329 47531 -7134 -56483 -1452 48348 -6533
2581 -6533 -56348 -1586 48809 -5246 -55965 -2424 49168 -3213 -54025 -4750 47044 -1577
2593 -1577 -51069 -5122 45053 489 -48851 -4949 43492 2976 -45877 -7350 43535 5625
2605 5625 -44103 -9490 42873 11598 -40156 -11748 40661 15215 -38778 -15320 39992 19416
2617 19416 -36186 -16960 39393 22343 -35213 -18561 40589 27109 -34243 -22163 40402 29442
2629 29442 -34183 -24802 40423 32730 -32913 -27066 39997 35157 -32853 -27776 40410 35742 -32471
2642 -32471 -28375 39770 36121 -32692 -29557 40180 36450 -33520 -30467 39581 37340 -31427 -31817
2655 -31817 36573 37006 -30745 -31279 33623 36701 -28740 -31085 31750 34679 -27772 -32470 27407
2668B7407O617n8581q707N6983J0313n6676j2872N5962J4586n4233j7641N2810
2680A5968J9191n1796k1613N0117K3866n0183k6811M9396K7332m8181k9247M8270
2692F309L2283m9207l4734M8726L6663m8490l8792M8462M0537n0122m1172M9734
2704A97M0647m7431m2114M8535M2565m9162m3211M9135M3057m7415m2851M6525
2716a523M4084m6096m4891M5821M6520m6790m4938M4625M5190m3464m4548M2046
2728c964M4013l8635m4020L8851M2970l5573m3902L4175M5085l1796m4349K9981
2740g164M5070k8158m5381K7021M5735k3072m6438K0380M8210j8904m8919J7349
2752a4271M9801j4376n1109J3879N1723j1571n2904J0210N5611j0609n5270Q969
$$ plain form
2668 27407 34024 -24557 -33264 23719 34032 -22644 -35516 20446 35032 -19201 -36842 15968
2680 15968 35159 -16637 -38250 11867 35733 -14450 -41261 8135 35467 -12714 -41961 6309
2692 6309 38592 -10615 -45349 3377 40040 -8450 -47242 1220 41757 -8365 -49537 197
2704 197 40844 -6587 -48701 -166 42399 -6763 -49974 -839 42218 -5197 -48048 -1523
2716 -1523 42561 -3535 -48426 -2605 43915 -2875 -47813 -3188 42002 -1462 -46010 -3964
2728 -3964 40049 1414 -42606 -3755 39215 3642 -40260 -6085 39000 7204 -37145 -7164
2740 -7164 37906 9748 -35633 -8612 37123 14051 -32387 -12007 36203 17299 -31620 -14271
2752 -14271 35530 21154 -29955 -16076 35647 24076 -28828 -18618 36993 26384 -28886 -19917
2764a9917N6272p647n7157N814N9035n531n9572M286O0612l496o1446K602O1546
2777C5401l188o1142K383O1910k545o0964K402O0158l912n9132J030O0031j121
2790C1311n9299N9N6944K986n7678l052N5325M007n4238n727N2595N708n1495
2803b2554o696M9885P434m9147j0651M8719J1185m6560j3917M6334J6359m6450
2815a6059j9280M4239K2046m4252k2802M3399K3869m2653k7353M2596K7798m0560
2827i012k9784M1730L0429m2356l2751M2537L5010m2980l6089M2475L7109m2233
2839e915l9567M4094L9760m3611l8397M1637M0063m3322l8847M3586L9551m2867
2851c835l9104M1368L9711m0538l9444M0828L9128l8995l8832L7179L9014l5520
$$ plain form
2764 -19917 36355 28708 -28449 -22635 36400 30869 -28703 -24417 36195 32699 -28747 -26145 35401
2777 35401 32213 -28929 -26546 35364 32819 -28145 -25743 34415 30503 -28629 -27599 32432 31311
2790 31311 -27988 -27929 29015 32001 -25677 -28729 26596 30603 -23635 -29362 23233 28941 -22554
2803 -22554 -29250 20635 28069 -21078 -31729 16990 28175 -18385 -32302 14032 30391 -16059
2815 -16059 -35339 8900 30946 -13306 -36108 7291 31160 -11493 -38846 3750 31548 -9012
2827 -9012 -38796 2934 33363 -8993 -41744 793 35803 -7177 -43266 -791 36318 -5915
2839 -5915 -45482 -1388 38372 -5239 -43636 -1999 38064 -5258 -44105 -519 39032 -3835
2851 -3835 -42939 -1571 38140 -2398 -41842 -1014 38114 -881 -39713 -2534 36480 960
2863I60l7322L4022L8190l2626l8287L0939L8229k7899l7807K6216M0470k6627
2875H458l9476K2858M2043k0513m1578J8553M2449j8119m2014J5133M4999j3544
2887A9249m4649J2139M4055r823m6510Q959M8459p669m8942O947M8970n153n1788
2900b5756N208N3521n058n3597K819N3788l154n3807L605N4610l388n5340K008
2913b4541N4476j892n4007K890N3339k418n4292L35N3704j207n1303N35N1106
2926B6725o02n0308j738M7505L240m6290k966M4945M553m5464p164M4978Q131
2939B5545m2485j0467M1546R664m0330j3375M1095J5728l9819j7984L8066J7602
2951B4786l7046k0901L8082K3362l8197k4526L6378K6260l7091k7694L9732K8099
$$ plain form
2863 960 -36362 -2340 35850 3224 -35063 -4124 34105 6206 -31601 -5385 35085 8458
2875 8458 -31018 -8160 33883 13370 -28208 -9655 32794 14675 -27339 -12206 32793 19249
2887 19249 -25400 -13261 30794 20971 -25539 -16580 31879 24210 -24732 -17785 31185 26032 -25756
2900 -25756 -20548 32973 27915 -25682 -22863 30925 27771 -26036 -22431 32179 28791 -26549 -24541
2913 -24541 29935 28043 -25964 -23074 30265 27847 -26445 -26110 27594 26387 -24916 -24381 26725
2926 26725 26123 -24185 -25923 21582 24822 -21468 -24434 20511 25064 -20400 -27564 17414 25545
2939 25545 -16940 -27407 14139 23803 -16527 -29902 11193 26921 -12898 -30882 7184 24786
2951 24786 -12260 -33161 4921 28283 -9914 -34440 1938 28198 -8893 -36587 3145 31244
2963C1244l8145l0688L7149L1233l7839l0643L8539L2453l8882l2775L7351L4083
2975C3080l7764l4383M0328L4135l9479l5428L8998L5005l7175l4078L7505L3672
2987C4416l6837l2568L4136L4273l3465l2543L2013L2120l1393l2910L1820L3584
2999C2646k8761l2329K5982L2561k4434l3281K3562L3523k0472l3462J7950L4221
3011B7706j6739l4903J6035L7216j4101l8831J2865L8562j1483l8852J0379M1985
3023B9839j0273m2668P180M2536m030m4517O428M4756n134m7476L965M7358l590
3036B4374m6906L998M7539m341m9259K940N0316k908m8910K695M7955l729m7815
3049b4051K333M7386k053m6223J716M4425k482m3657J31M6105p31m4150j156M2722
$$ plain form
2963 31244 -6901 -37589 -440 30793 -7046 -37689 850 33303 -5579 -38354 -1003 33080
2975 33080 -4684 -39067 1261 35396 -4083 -39511 -513 34492 -2683 -36761 744 34416
2987 34416 -2421 -34989 -853 33420 -45 -32588 -575 31545 152 -32758 -938 32646
2999 32646 3885 -28444 -2462 30099 5665 -27616 -4054 29469 8997 -24465 -6515 27706
3011 27706 10967 -23936 -7901 29315 15214 -23617 -10752 27810 16327 -22525 -12146 29839
3023 29839 19566 -23102 -15922 26614 22584 -21933 -15505 29251 24117 -23359 -19394 27964 24374
3036 24374 -22532 -18534 29005 24664 -24595 -21655 28661 25753 -23157 -20462 27493 23764 -24051
3049 -24051 -21718 25668 23615 -22608 -20892 23533 21051 -22606 -22475 23630 22899 -21251 -22407 20315
3063B0315K40m2184j073M0813M293l9805p281L7677P971l7866q476L7857J0591
3076B3072l6845j3351L4313J4596l5250j3607L4944J5743l5028j9037L4025K0112
3088B3687l3293k1107L3871K3443l4670k5347L3933K6421l3392k6511L4383K7254
3100B8672l5360k8697L5923K9275l5316k7829L4275K9424l6077k9501L5638L0959
3112C1386l3898l1231L4297K9412l2980k9693L3029L0218l0623l0737L0333K8558
3124B8071k9266k8011K9947K8886k8382k8698K6029K9067k4562k8390K3284L0154
3136B8129k1546l1092K0701L0640j8390k9990J6731L1723j5797l2293J3302L3436
3148B5554j1577l2984J0661L4304j0747l5768R173L8082q152l7585O291L8118
$$ plain form
3063 20315 20555 -21629 -22702 18111 22404 -17401 -24682 12995 20966 -16900 -25376 12481 23072
3076 23072 -13773 -27124 7189 21785 -13465 -27072 7872 23615 -11413 -30450 3575 23687
3088 23687 -9606 -30713 3158 26601 -8069 -33416 517 26938 -6454 -32965 1418 28672
3100 28672 -6688 -35385 538 29813 -5503 -33332 943 30367 -5710 -35211 427 31386
3112 31386 -2512 -33743 554 29966 -3014 -32707 322 30540 -83 -30820 -487 28071
3124 28071 -1195 -29206 741 29627 1245 -27453 -1424 27643 3081 -25309 -2025 28129
3136 28129 6583 -24509 -3808 26832 8442 -21548 -4817 26906 11109 -21184 -7882 25554
3148 25554 13977 -19007 -8346 25958 15211 -20557 -11384 26698 18546 -19039 -12748 25370
3160B5370o613l9011N529M1267n384m0831M730L9616m141m1525M618M1877l000
3173B2502m2959K839M3049m884m2608J940M5095m060m2298J582M2448l058m1490
3186b1902L325L9914j011m0970R32L8520M84l8200p43L7917O27l7658k458L5352
3200A4129L714l4979m065L4295N575l3555p927L1529J0058l1211j0525L0770J0753
3213A8561l0796j3207L0694J4952l0130j5788K9914J6373k9631j8381K9405K1509
3225B3475l0669k0903K9927K1451k9863k2774K9858K4745l0098k5589L0710K5188
3237B5458l1053k4639L1446K6135l0497k5902K9935K4869k8617k6143L0900K6177
3249B8069l0188k5777K8248K6285k8019k4123K6376K5806k7346k5012K6185K4952
$$ plain form
3160 25370 18757 -20254 -14725 26542 21158 -19673 -14943 24673 20532 -20993 -16375 25502 22502
3173 22502 -20457 -17618 25431 20547 -22061 -20121 24974 20914 -21384 -19802 22646 19588 -21902
3186 -21902 -18577 21337 20326 -20644 -19712 18808 19292 -18908 -19651 18266 18893 -18765 -21223 14129
3200 14129 17843 -17136 -21201 13094 18669 -14886 -22813 8716 18774 -12437 -22962 7808 18561
3213 18561 -12235 -25442 5252 20204 -9926 -25714 4200 20573 -9058 -27439 1966 23475
3225 23475 -7194 -28097 1830 23281 -6582 -29356 502 25247 -4851 -30440 270 25458
3237 25458 -5595 -30234 1212 27347 -3150 -29052 883 25752 -2865 -29008 1892 28069
3249 28069 -2119 -27896 352 26637 -1382 -25505 871 26677 -669 -25681 504 25456
3261B5456k4211k4378K3111K5414k1445k6470K1597K5712j8769k6624J8006K6578
3273B3977j6169k8072J6036K8363j3174k9048J2454K8141j0208k9739J1162K9956
3285B3679q797l1419P218L1445o550l2252N423L4309n461l5803N071L5565m554
3298A7874l6060M565L5281k878l7446L181L6988k802l6722K263L6355j901l8263
3311a9565K308L8197l178l7058J973L6491k094l5995J209L5925k211l4030J70
3324a7858L5012r20l4268j051L3043K406l3652j404L0783L573l0887n296L0571
3337A0052N482k9360o304K8514P238k7855r300K7935J0333k7213j2453K7947J2872
3350A7888k6947j3697K5755J5518k5987j6965K6743J7187k5282j9135K6786J9308
$$ plain form
3261 25456 1245 -23133 -22 25392 3947 -22523 -926 24786 6017 -20607 -2601 23977
3273 23977 7808 -20264 -4228 24135 10961 -18087 -5633 22508 12300 -17439 -6277 23679
3285 23679 14882 -16537 -9319 22126 15576 -16676 -11253 23056 17595 -18208 -13137 22428 17874
3298 17874 -18186 -13621 21660 18782 -18664 -15483 21505 18703 -18019 -15756 20599 18698 -19565
3311 -19565 -17257 20940 17762 -19296 -17323 19168 17074 -18921 -17712 18213 16002 -18028 -17858
3324 -17858 17154 16234 -18034 -19085 13958 16364 -17288 -18692 12091 15664 -15223 -20519 10052
3337 10052 15534 -13826 -20130 8384 15622 -12233 -21533 6402 16735 -10478 -22931 5016 17888
3350 17888 -9059 -22756 2999 18517 -7470 -24435 2308 19495 -5787 -24922 1864 21172
3362B1172k7338j8843K7548J9147k5884k1791K6599K2633k7281k2178K6491K3529
3374B3804k5923k3831K6794K3947k6425k3695K6289K3380k6121k2962K5877K2787
3386B3921k4851k2786K4638K3456k3218k2980K2141K3714k1859k2731K0719K3181
3398B3345j8430k4710J9304K2964j6335k4045J6149K3072j4603k3721J3541K4835
3410B1366j2421k4736J0146K5635q295k7153R063K7172p689k8334O513K9071o927
3423A3411k8938N043K9507n316k9300M175L1522l974l0612J874L1559k201l2862
3436a6112J559L3398j996l3214Q82L3037j149l2858J502L2370j462l2904J232
3449a5715L2425j311l2099M11L2360j459l2036J112L0874P9l0943j391L0151K161
$$ plain form
3362 21172 -6166 -25009 2539 21686 -4198 -25989 610 23243 -4038 -26216 275 23804
3374 23804 -2119 -25950 844 24791 -1634 -25329 960 24340 -1781 -24743 1134 23921
3386 23921 -930 -23716 922 24378 1160 -21820 321 24035 2176 -20555 164 23345
3398 23345 4915 -19795 -491 22473 6138 -17907 -1758 21314 6711 -17010 -3469 21366
3410 21366 8945 -15791 -5645 19990 11695 -15458 -6395 20777 13088 -15246 -8733 20338 13411
3423 13411 -15527 -10484 19023 13707 -15593 -11418 20104 16130 -14482 -12608 18951 16750 -16112
3436 -16112 -14553 18845 16849 -16365 -15483 17554 16405 -16453 -14951 17419 15957 -16947 -15715
3449 -15715 16710 15399 -16700 -16289 16071 14612 -17424 -16312 14562 14641 -16302 -17693 12458 14619
3463A4619k9648k664K8003L433k7668l543K6511M229k6359n017K5642O417k5961
3476a2006o967K5077R263k4923j0886K4448J1307k3398j2017K2400J4660k2790
3488e832j4743K2256J5511k1949j6706K2732J6857k2474j8215K3465J9159k3808
3500c747k0165K4491K1200k4365k0330K2800K1441k2642k1265K3516K1369k3520
3512a217k0487K2974K0775k3058j9811K2107K1548k2022k0984K0171K2395k0913
3524A478k0559J9744K0618j8694k0489J7545K0635j6764j9812J5878K1711j5798
3536E493k1628J4777K0279j2209k0692J2138K2143j1419k4202J0545K3655r161
3548I719k2495O957K3663o400k5166O215K5432n299k6565M235K7122m211k7013
$$ plain form
3463 14619 -15029 -17693 10310 13743 -13925 -17468 9043 13272 -13087 -18104 7538 13955 -12006
3476 -12006 -18973 6104 15367 -9556 -20442 4006 15313 -8085 -20102 2298 16958 -5832
3488 -5832 -20575 1681 17192 -4757 -21463 1269 18126 -4348 -22563 902 20061 -3747
3500 -3747 -23912 579 21779 -2586 -22916 -116 21325 -1317 -22582 934 22303 -1217
3512 -1217 -21704 1270 22045 -1013 -20824 1283 22831 809 -20175 -4 22391 1478
3524 1478 -19081 663 21281 2587 -17902 -357 20278 3514 -16298 -420 21291 5493
3536 5493 -16135 -1358 18921 6712 -13980 -1842 20301 8882 -15320 -4775 18880 9719
3548 9719 -12776 -5819 17844 11444 -13722 -7507 17925 12626 -13939 -9704 17418 13207 -13806
3561a3806L167K7911l175k7792K069K8470k405k9755K652K9069k036k9515K168
3574a2978K9014j882k9411J166K9544o47l0628J088K8618K47k8943l90K8357m63
3588A2692k7448o74K6908J783k8346n87K6463J144k5964j821K5056L184k4594
3601a2204l658K4119L724k2829o272K2965O955k1431q859K2039Q143k0478j0240
3614a8026K1536R889k0519j1661K1466J1312k1203j1753K0686J4181j9991j5876
3626a9959K0039J6261j9598j7224K0177J8616k0898j7482K0895J8450k1242j8063
3638b0028K1316J8402k1757j7821K0769J9002k0629j8687K1702J8397k1107j8309
3650a8750K0275J8820j9284j8010J8484J7869j7822j8854J7848J8896j7223j7902
$$ plain form
3561 -13806 -10639 17272 14097 -13695 -11626 16844 14439 -15316 -12664 16405 14369 -15146 -12978
3574 -12978 16036 14154 -15257 -14091 15453 14806 -15822 -14734 13884 14131 -14812 -15202 13155 12692
3588 12692 -14756 -15430 11478 13261 -15085 -15672 10791 11935 -14029 -15850 9206 12390 -12204
3601 -12204 -15862 8257 11981 -10848 -17120 5845 12800 -8631 -17490 4549 12692 -7786 -18026
3614 -18026 3510 13399 -7120 -18781 2685 13997 -7206 -18959 1727 15908 -4083 -19959
3626 -19959 80 16341 -3257 -20481 -304 18312 -2586 -20068 827 19277 -1965 -20028
3638 -20028 1288 19690 -2067 -19888 881 19883 -746 -19433 2269 20666 -441 -18750
3650 -18750 1525 20345 1061 -16949 1535 19404 1582 -17272 576 19472 2249 -15653
3662a5653J6608J7411j5028j8832J4794J9199j2724j9270J1729J8230j0075j9533
3674a3144J0685J9583r619j9445P588K0208p761k0256P250K1264o852k1329M720
3687g108K2447n001k2055L413K4774m128k4821J597K6068k756k4505K570K4555
3700A5050j786k6713J764K5395j287k5621J595K5417j486k7183J187K6716l66
3713A2682k6651J776K4425p46k6779J670K5226J30k6197J513K3669j063k2933
3726a3278r36K3438K030k3043j751K1672J267k0732l640K1276M312k0470n552
3739a5407J9558N953j8319o829J8384Q231j8493q132J6938J0596j8343j0355J8720
3752B502J1559j8571j3213J7819J4799j8320j3951J9184J3289j8448j4653J8263
$$ plain form
3662 -15653 955 18366 3338 -15494 -700 18499 5775 -13495 -1766 16464 6389 -13144
3674 -13144 -2459 17124 7505 -11940 -4352 15856 8095 -12161 -4911 16353 9501 -11828 -7108
3687 -7108 15339 10338 -11717 -8304 16470 12342 -12479 -10882 15186 12430 -12075 -9505 15050
3700 15050 13264 -13449 -11685 13710 12423 -13198 -11603 13814 12328 -14855 -13668 13048 12682
3713 12682 -13969 -12193 12232 11486 -15293 -13623 11603 11733 -14464 -12951 10718 9655 -13278
3726 -13278 -14214 9224 11254 -11789 -13540 8132 9399 -11333 -14973 6303 10615 -9855 -15407
3739 -15407 4151 10104 -8215 -15044 3340 11571 -6922 -15054 1884 12480 -5863 -16218 2502
3752 2502 14061 -4510 -17723 96 14895 -3425 -17376 1808 15097 -3351 -18004 259
3764B59J5646j8048j5693J9477J5408j8904j6426J9917J6614j8319j6654J8851
3776B128J6688j9226j6522J9255J5901j7659j6019J7451J7139j8501j5929J7156
3788A862J5818j5533j5697J5133J5542j4931j5289J3924J6006j2789j5805J1348
3800d11J6437j1310j5724J0610J6520r445j8045Q889J7160p651j7091O794J7540
3813A4273o335j8896M875K0508o122j8317M108J9599l260k1973L073K1264k101
3826A0696k2106L062K2419k530k4081J945K3908k880k2645J145K4079k686k2967
3839a2641J495K3319j087k4366J459K2923o12k3664P85K4448j251k4086P78K1755
3853I255p58k2370J697K2170j245k0396k57J8746K420j9407j815J9415J815j9020
$$ plain form
3764 259 15905 -2143 -17836 1641 17049 -1855 -18281 1636 18250 -69 -16723 2128
3776 2128 18816 -410 -16932 2323 18224 565 -15454 1997 19136 635 -15294 1862
3788 1862 17680 2147 -13550 1583 17125 2194 -13095 829 16835 4046 -11759 -411
3800 -411 16026 4716 -11008 -398 16122 6677 -11368 -2479 14681 7030 -10061 -3267 14273
3813 14273 7938 -10958 -6083 14425 8303 -10014 -5906 13693 10433 -11540 -8467 12797 10696
3826 10696 -11410 -8348 14071 11541 -12540 -10595 13313 10433 -12212 -11067 13012 10326 -12641
3839 -12641 -11146 12173 11086 -13280 -11821 11102 10490 -13174 -12389 12059 10808 -13278 -12500 9255
3853 9255 8497 -13873 -12176 9994 8749 -11647 -11904 6842 9262 -10145 -11960 7455 9270 -9750
3867i750k975J7846M273j8207l988J7198M964j8143n555J7310P298j6426p817
3880a3972J5814Q959j6007r941J7077J0698j6443j2043J7422J0479j5727j1976
3892a5660J6280J3923j6585j2913J6276J3168j6547j4053J8023J3928j7352j4030
3904a5542J6694J5247j7632j3798J7904J4301j7604j4208J6102J4456j5369j4852
3916a4301J7032J3918j6275j3535J4739J4499j4023j3539J3047J4519j3822j4217
3928a1958J1681J5223j1552j2911R993J4126j0213j4465Q549J4486p825j4939
3940i805P210J5722p305j5858O690J6747o775j5960M313J7472m492j8248M289
3953f000J8104l208j9271L666J8027k782j9223K779J9793k489k1544K418K0737
$$ plain form
3867 -9750 -12725 5121 9394 -8813 -12801 4397 9361 -8782 -14337 2973 10271 -6155 -13972
3880 -13972 1842 10801 -5206 -15147 1930 12628 -3815 -15858 1564 12043 -3684 -15660
3892 -15660 620 14543 -2042 -14955 1321 14489 -2058 -16111 1912 15840 -1512 -15542
3904 -15542 1152 16399 -1233 -15031 2873 17174 -430 -14638 1464 15920 551 -14301
3916 -14301 2731 16649 374 -13161 1578 16077 2054 -11485 1562 16081 2259 -11958
3928 -11958 -277 14946 3394 -9517 476 14602 4389 -10076 -1527 12959 5134 -9805
3940 -9805 -2595 13127 5822 -10036 -3346 13401 6626 -9334 -5021 12451 7959 -10289 -6000
3953 -6000 12104 8896 -10375 -6709 11318 8536 -10687 -7908 11885 9396 -12148 -9730 11007
3966A1007r75k1088O58K2375k452k1454J204K0738j624k0513J686K0580j304k1029
3980a2191J046K0406j177j9489J370J9096r77j9784O36J8972p0j9099K73J8396
3994G408q61j6687j510J7375J641j6539j551J5367L319j5931l316J5112N199j5476
4008f450n411J5169N478j4132o553J4039Q702j5240q078J3576R637j3635j0533
4021a3431J5277J0004j3509j1013J3956J0760j4251j1196J5793J2192j5067j3178
4033a3663J5713J1895j4825j3472J6267J3124j5398j2167J4267J3338j5051j2734
4045a2706J3948J4604j4771j3399J4344J3392j4500j2823J3643J3094j4116j1563
4057a0853J2401J2358j1653j2097J0885J2105j1262j1341J0201J1199q865j1896
$$ plain form
3966 11007 10032 -11056 -10398 11977 9525 -11929 -10725 10013 8389 -12124 -10438 10142 8838 -12191
3980 -12191 -11145 9261 8084 -11405 -10035 9061 8084 -11700 -11064 7908 7838 -11261 -10988 7408
3994 7408 6547 -10140 -11650 5725 7366 -9173 -10724 4643 7962 -7969 -11285 3827 9026 -6450
4008 -6450 -11861 3308 8786 -5346 -11899 2140 10842 -4398 -12476 1100 10737 -2898 -13431
4021 -13431 1846 11850 -1659 -12672 1284 12044 -2207 -13403 2390 14582 -485 -13663
4033 -13663 2050 13945 -880 -14352 1915 15039 -359 -12526 1741 15079 28 -12706
4045 -12706 1242 15846 1075 -12324 2020 15412 912 -11911 1732 14826 710 -10853
4057 -10853 1548 13906 2253 -9844 1041 13146 1884 -9457 744 11943 3078 -8818
4069h818Q564J2393p791j3391P019J3568o042j4040N747J3629l940j5483M109
4082d476J5313l222j6301L009J6047l728j5684L178J5917k450j7579L132J7063
4095A0219k689j8279K023J8442k326j8342K084J8158j480j9093K072J8068q21
4108H036j8971J062J8396j306j9353L063J7065j554j7178J152J7348l77j7668
4121a0285pJ6785k9j6562lJ5082J568j5456n54J3889J608j4193j869J3996K828
4136F798j3953l511J5004L407j3908m516J3790M963j2469o667J2868O263j1878
4149c809p495J2816Q776j3552q726J4027Q742j3432r046J3622R398j2675j0275
4162a1629J2865J1813j3018j1233J3196J0785j3165j0635J2818J1295j2607j1531
$$ plain form
4069 -8818 -254 12139 4348 -9043 -2024 11544 5502 -8538 -2791 10838 6898 -8585 -4476
4082 -4476 10837 7615 -8686 -5677 10370 6642 -9042 -5864 10053 7603 -9976 -6844 10219
4095 10219 7530 -10749 -8726 9716 7390 -10952 -8868 9290 7810 -11283 -9211 8857 8036
4108 8036 -10935 -9873 8523 7217 -12136 -9073 7992 6438 -10740 -9588 7760 7383 -10285
4121 -10285 -10292 6493 6464 -10098 -10101 4981 6549 -8907 -9461 4428 6036 -8157 -10026 3970 6798
4136 6798 -7155 -10666 4338 7745 -6163 -10679 3111 8074 -4395 -11062 1806 8069 -3809
4149 -3809 -11304 1512 10288 -3264 -11990 2037 10779 -2653 -11699 1923 11321 -1354 -11629
4162 -11629 1236 13049 31 -11202 1994 12779 -386 -11021 1797 13092 485 -11046
4174a1046J2907J2310j3783j1278J3245J1605j3243j1376J3193J0315j1640j1191
4186i982J0768J2231j1631j0768J0730J1034j0306j1466J0995J0391r752j0471
4198h227R209J0072q636j0940Q676J0252o733j2091N909J2930n647j2548N046
4211b728J2485n462j1779L110J3514l818j3700L179J4673l059j4835K052J4732
4224H364k249j5676K298J5378k144j5659J878J5821k199j5839J141J7026j061
4237G079j6580P74J7140k002j7382K074J5955j63j7234K132J4949j222j5113O36
4251h957J5454l43j5240J59J4427m27j3653l55J4241O42j4035p78J2914J859j3162
4266g254j346J1925L322j2451l096J2808L794j2758l460J0289N847j1820n126
$$ plain form
4174 -11046 1861 14171 388 -10890 2355 13960 717 -10659 2534 12849 1209 -9982
4186 -9982 786 13017 1386 -9382 1348 12382 2076 -9390 1605 11996 2244 -8227
4198 -8227 982 11054 2418 -8522 154 10406 3673 -8418 -2509 10421 4774 -7774 -2728
4211 -2728 9757 4295 -7484 -4374 9140 5322 -8378 -5199 9474 6415 -8420 -6368 8364
4224 8364 6115 -9561 -7263 8115 5971 -9688 -7810 8011 5812 -10027 -8886 8140 7079
4237 7079 -9501 -8727 8413 6411 -10971 -8897 7058 6895 -10339 -8207 6742 5520 -9593 -8957
4251 -8957 6497 6154 -9086 -8927 5500 5073 -8580 -8935 5306 5948 -8087 -8865 4049 5908 -7254
4266 -7254 -8600 3325 6647 -5804 -8900 3908 7702 -5056 -8516 1773 7620 -4200 -9326
4279i326J1708N812j1793n496J1052O695j1575o751J2173P303j1912p790J1622
4292A722R333j1834r485J1168J0681j2116r268J2053R015j1082r328J1256J0000
4305A2115j2415r432J2709J0391j2655j0321J1474J0423j1921r223J1053J0046
4317A2244j0892q904J0205Q850r577r804J0614Q584j0476q882Q791J0372r047
4330B078j0073Q114R618o731j0953O674J0588o214j0385O034R521m476j0016M085
4344b136J0844m065j2332M236J1696m386j1412L785J1735k909j3321K300J2872
4357F907j654j3602K014J3526j526j3797O58J3617o72j4453J546J4268j150j4759
4371i077J101J3873m9j5176J153J4253o47j4783R33J4789j219j3631P67J3426
$$ plain form
4279 -9326 2382 8194 -3599 -9095 1957 8652 -2923 -9674 2499 9802 -2110 -9900 1722
4292 1722 11055 -779 -10264 904 11585 -531 -9799 2254 11269 187 -9141 2115 12115
4305 12115 -300 -9732 2977 13368 713 -9608 1866 12289 368 -8855 2198 12244
4317 12244 1352 -7552 2653 11503 1926 -7878 2736 11320 844 -8038 753 11125 2078
4330 2078 -7995 119 9737 3006 -7947 -1273 9315 3101 -7284 -1250 8271 3795 -6221 -2136
4344 -2136 8708 4643 -7689 -3453 8243 3857 -7555 -3770 7965 5056 -8265 -5965 6907
4357 6907 5253 -8349 -6335 7191 5665 -8132 -7474 6143 5471 -8982 -7436 6832 5682 -9077
4371 -9077 -7976 5897 5848 -9328 -8175 6078 5431 -9352 -8419 6370 5151 -8480 -7713 5713
4385E713j273j2074p18J4295r36j3288J337J1956l06j2613m55J2291J667j1119
4399e523j495J0782J180j0582r45R348L695j1567l210J0046M669r452m255R953
4413B644M646j0387n244J0572O454r623p180J0556O099r131p960J0882O866j0111
4427i17p090J0155Q522r806q891J0348Q761j0300q600J0869Q366j0690q871Q539
4441C95J0287r772r022R621R487j1225p964J0083Q764r853q021R178Q141r214
4455H85q758R115R055r342p481P152Q172o033r920O793R147o486r155O315Q157
4470G616m744r598M781R967m887j0074M487R620m067r298L191J0405k025j2091
4484f717J849J1515k029j1755J287J2794l244j1782J758J2333j424j1635J037
$$ plain form
4385 5713 4440 -7634 -8352 5943 5007 -8281 -6944 5012 4706 -7907 -8362 3929 5596 -5523
4399 -5523 -7018 3764 4944 -5638 -6583 2765 6460 -5107 -8317 1729 6398 -3054 -7309 2644
4413 2644 7290 -3097 -8341 2231 8685 -938 -8118 2438 8537 -594 -8554 2328 9194 -917
4427 -917 -8007 2148 10670 864 -8027 2321 11082 782 -7818 3051 11417 727 -8144 395
4441 395 10682 910 -8112 1509 10996 -229 -8193 1890 10654 801 -7220 1958 10099 885
4455 885 -7873 1242 10297 955 -6526 626 8798 2765 -7155 -362 8785 2299 -6856 -541 7616
4470 7616 2872 -6726 -1945 8022 3135 -6939 -2452 7168 3101 -6197 -3006 7399 5374 -6717
4484 -6717 -4868 6647 4618 -7137 -5850 6944 3700 -8082 -6324 6009 4585 -7050 -6013
4497f013J1490j022j2279R53J3287j966j3090J454J2638o56j3151J634J2228m32
4511E075j3129J186J1200q12j2013R76J2354J04j2612M82J2422n90j0833K10J0353
4526D373M47j0828j000J0714M82r153j232R975J651r978k620J0743K044r507k177
4541f066Q641L680q649m786Q686N741q810n038Q365N625r067n916R028O605q769
4556g30o299R263O738r395o911Q930P310r226o686R179O907r451p388R665Q698
4571A0604j0416p599J0067O245q325p000P882Q541q900q264R173P596r040o997
4585f433Q271P416q111q148Q534P004p569p480P944O847p769o506N489Q407n905
4600A991p491M259Q531n627o979L981Q536m147q799L029Q627l178q681L020R006
$$ plain form
4497 -6013 5477 4455 -7824 -6871 6416 4450 -8640 -7186 5452 4796 -8355 -6721 5507 5075
4511 5075 -8054 -6868 4332 3520 -8493 -7517 4837 4941 -7671 -7189 5233 4643 -6190 -5980 4373
4526 4373 4820 -6008 -7008 3706 4188 -4965 -6197 3778 5429 -4549 -7169 3574 5618 -3889 -6066
4541 -6066 2575 6255 -2394 -7180 1506 7247 -1563 -6601 1764 7389 -1678 -7594 1434 8039 -730
4556 -730 -7029 2234 8972 -423 -7334 1596 8906 -320 -7006 2173 9080 -371 -7759 1906 10604
4571 10604 188 -7411 2656 8901 576 -6424 1458 9999 1099 -7165 2008 9604 564 -6433
4585 -6433 1838 9254 1143 -7005 1529 8533 964 -6516 1428 8275 506 -6000 -511 7896 1991
4600 1991 -5500 -1241 7290 1663 -5316 -1335 7201 3054 -5745 -2716 5911 2733 -5948 -2928 6078
4615F078k436r164J073R175p83j1481K611J0410j064j1088J199J0993j365j1473
4629g315J696J0984n50j1426J88J0633J36j1607N24J1708j239j1513R72J1268
4643D459p41j1608J870J1728k169j0319Q31J0546m9j1803J089J0210J28j0400
4657f228M59Q471Q97q575k33Q300J314q432k002R005J387q237j792Q281K326p940
4673b999l641R215L233p646m531R249L242q289m637R241M625p330n511P671N336
4688G228q272n872R486N138p438o868Q480O608r091n744Q788N729q752n086O872
4703A206Q778r955n609P943N905p986o276Q449N649p602n860O861P015p391p399
4718f272P456P034p620o182P036O256o972n498N469N742m839o490M325O777m663
$$ plain form
4615 6078 3642 -5522 -4449 4726 3943 -7538 -4927 5483 4419 -6669 -5470 5523 4158 -7315
4629 -7315 -5619 5365 4815 -6611 -6423 4210 4346 -7261 -6737 4971 3732 -7781 -6809 4459
4643 4459 3718 -7890 -6020 5708 3539 -6780 -5949 4597 4548 -7255 -6166 4044 4172 -6228
4657 -6228 -5769 2702 3599 -4976 -5209 3091 4405 -4027 -6029 2976 4363 -3874 -5666 2615 4941 -2999
4673 -2999 -6640 2575 5808 -1838 -6369 2880 6122 -2167 -6804 2437 7062 -268 -5779 1892 7228
4688 7228 -1044 -6916 2570 7708 270 -6598 1882 8490 -601 -6345 2443 8172 -580 -5666 1206
4703 1206 9984 29 -5580 2363 8268 282 -5994 2455 8104 502 -5358 1503 8518 1127 -6272
4718 -6272 1184 8218 598 -5584 1452 7708 736 -4762 707 6449 1610 -4880 -555 6222 1559
4733A559p389N332O963m201p985M238P265l701p976K978Q523l260q458K800P886
4748D574k284q354K484Q768j905r611J448J0046k121r961K026R047n99j0150P23
4763e869J0858j146r936P64R743k033r237J301R696j023r651J441R498j265j0502
4778g361J431J0656k154r198J351R053Q0r194J21Q990m51q101j003R382k92p880
4794d570j69P191P28o793j090Q023J059p940j215P391J491o921k694P310K791
4809D592o247k612N699M470p352k916O431M343o897m532O987M811o789n978P664
4824A674O669p508o354P780M842o426n911O982N260o188n902O288O187o817n707
4839e131P175N389p951m859P364N351p004n369O966N654o806n719O383N418o138
$$ plain form
4733 1559 -5830 -498 6465 2264 -5721 -1483 5782 2081 -5895 -2917 5606 2346 -6112 -3312 4574
4748 4574 2290 -6064 -3580 5188 3283 -6328 -4880 5166 3045 -6916 -4890 4157 3558 -6592 -5869
4763 -5869 4989 3843 -6093 -5329 4414 2381 -6856 -5555 4141 3118 -6533 -5092 4406 3141 -7361
4778 -7361 -5930 4726 2572 -6626 -5275 3778 3858 -5336 -5215 3775 3324 -4777 -5780 3602 3310 -4570
4794 -4570 -4739 2452 3180 -3613 -4703 3320 4379 -3561 -4776 2615 4106 -2815 -5509 1801 4592
4809 4592 -1655 -4267 1432 5902 -1450 -4366 2065 6408 -489 -5021 1966 6777 -12 -5990 1674
4824 1674 8343 835 -5519 2261 7103 677 -5234 1748 7008 820 -5082 1206 7393 576 -5131
4839 -5131 2044 7433 -518 -5377 1987 7338 334 -5035 1931 7585 779 -4940 1443 6861 723
4854G23n059N861N646o720n300N352O288o121o300N543N449l675o599L905O009
4869E002l362o854L428N332j377p106K650P095k544o905P77Q241k880p199J478
4884d224Q797j731q357J209Q094j776p818O67Q659j023q984J677P854m10q417
4899e783Q68Q796p41r688J144Q696J00r163Q87Q927j882q425J850P875k51q024
4915d814M0P620K92p627K13P826L38q409K6Q352o7p304j093P422L38o166m23O582
4933C146L7n314j562O432K125o462l047O880L801p381l342O627K873o215k729
4948d131N698N097p295m118O496L781n228m719O029M992o532m437O601N008o298
4963I44n446N788O079p026n192O073N886p222m784O455M310n850m781O084N360
$$ plain form
4854 723 -4336 1525 7171 451 -4849 503 6791 670 -5630 -87 5362 1687 -4912 -1007 5002
4869 5002 1640 -5214 -1786 3546 2169 -4937 -2287 4808 2264 -4641 -3864 4377 1497 -5702 -4224
4884 -4224 4573 2842 -5515 -4306 3788 2012 -5806 -5139 3520 2497 -6487 -4810 3044 2634 -5783
4899 -5783 -4915 3881 3140 -6548 -5404 3292 3392 -5771 -4884 4043 2161 -6264 -4414 3461 3210 -4814
4915 -4814 -4774 2846 3138 -4489 -4276 3550 3888 -4521 -4495 3857 3790 -3514 -4607 2815 3153 -3013 -3436 3146
4933 3146 3183 -2131 -3693 2739 4864 -1598 -4645 2235 6036 -1345 -4687 1940 4813 -1402 -4131
4948 -4131 1567 6664 -631 -4749 1747 5528 300 -4419 1610 6602 70 -4367 2234 7242 944
4963 944 -4502 1286 7365 339 -4853 1220 7106 -116 -4900 1555 5865 15 -4766 1318 6678
4978F678n733n656O002N178o288m527N595N022n962m909N573N411o070m524N111
4993I01M841m386n735M244M889m049n949M372N612m421n155K476O218j856o635
5008d633K651O000l240n448J935O525j860o771J223P833k062p156J521O820j454
5023A884o938J035P513q49q108J160P705j618o761L95Q627k458o769R13P434n40
5039B625p765J4Q734r81q218J498P496p81p904J194O822P52q329O12P052M6p333
5056d466O93O632o1o064n10O551l25n291q0N042K209p325m33N269K212n847j622
5073c416N173L003n877k031N351K639n045l550O324K364n759l429N967L983n430
5088B67m267N989L254n712l665O118M187o073m826O451M571n779l844M927M487
$$ plain form
4978 6678 945 -4711 1291 6469 181 -4346 1249 6271 309 -4600 973 6384 314 -4210 901
4993 901 5742 1356 -4379 -135 4754 705 -5244 -872 4740 319 -4836 -2360 3858 2002 -4633
5008 -4633 -1982 4018 778 -4670 -2735 3790 1930 -4841 -3618 4215 2153 -5003 -3482 3338 1884
5023 1884 -5054 -4019 3494 2645 -5463 -4303 3402 1784 -4977 -4582 4045 1587 -5182 -4269 3165 2625
5039 2625 -5140 -5126 3608 2627 -5591 -4093 3403 2622 -5282 -4088 2734 3486 -4843 -4231 2821 2867 -4466
5056 -4466 -3773 2859 2798 -3266 -3776 2775 2450 -2841 -2921 2121 4330 -2995 -3428 1841 4053 -1794 -3416
5073 -3416 1757 4760 -1117 -3148 2203 4842 -203 -3753 2571 4935 -824 -4253 1714 5697 267
5088 267 -4000 1989 5243 -469 -4134 1984 6171 98 -4728 1723 6294 515 -3329 1598 6085
5103F085o248l780M535N075n568m451N802M042n288m578N510M778n680m455N354
5118A133L676m965m358M333M416m141m308M289M215l983m173L500M651k823n195
5133c733K759N152k838m914J743N465l896l848J527N565j626n522J608N515j693
5148A264n658K723M806j633n804m00P369j687n469j15P164p64o540J291O417j155
5164A809o238J041O677k119n427J1P456q87p715J698P242j700o239K77O290L72
5180B548o653N21O819j615n557O88O148J1n581r05O233j99o153Q34O338j56n448
5197b127o63N675J082o220R3M820J883n395j999M556K687m890k165N292J943n375
5213h03k385N589J775l908l626N589K766m596l624N300L744n938l591M639M083
$$ plain form
5103 6085 -163 -3943 592 5667 99 -4352 1450 5492 204 -4374 1136 5914 234 -4221 1133
5118 1133 4809 -156 -4514 -181 4235 94 -4214 75 4290 307 -3866 -366 4285 1462 -3733
5133 -3733 -974 4178 1340 -3574 -1831 3634 -262 -4110 -2583 2982 1356 -4166 -2558 2957 1264
5148 1264 -4394 -1671 3135 1502 -4302 -4702 2667 980 -4489 -4604 2560 1796 -4744 -3453 2964 1809
5164 1809 -4429 -3388 3289 1170 -4257 -4246 3210 2323 -5392 -3694 3548 1848 -4391 -4114 2176 2548
5180 2548 -4105 -3584 3235 1620 -3937 -3249 2899 2910 -2671 -3576 2657 2458 -3695 -2861 3477 3321 -2127
5197 -2127 -2790 2885 3967 -2253 -2160 2660 4543 -852 -2851 1705 4392 -498 -2663 2629 4572 -803
5213 -803 -3188 2401 4176 268 -3358 2231 4997 401 -3223 2077 5821 -117 -3708 931 5014
5228E014m786m216M727M586m394m004M478M108n695l470N047M228n536l886N032
5243A233L410m604m176N526L302m979l170L607L514l836m178N385K939l969m155
5258d151L455M685l587l894K388M293k568l899L108L519l810l695L088K777j034
5273F75m182O10N066q01n206K280L925k467m019J454O084l276n047P76O809j651
5289A030o583J338O958j088o740J057O861r44o490J456N299r44n980J306O583
5304C119j110o225M42O435m53o385J214N479J54n797n10O626k2n943Q27M656m62
5321B045m185o99N858j205m212l72N359K13m843k69N420q8l676k065M817J258
5337C356m425j674N087J894m876j285L677L378n546j871L826L270n440j751M981
$$ plain form
5228 5014 228 -3988 739 5325 931 -3073 1405 5513 -182 -3652 1395 5623 87 -3799 1233
5243 1233 4643 39 -4137 1389 4691 -288 -3458 149 3663 -173 -4351 1034 3973 4 -4151
5258 -4151 -696 3989 402 -3492 -1104 3189 621 -3278 -170 3349 -461 -4156 -1068 1709 675
5273 675 -3507 -2897 2169 1368 -3838 -1558 2367 -100 -4119 -2665 3419 143 -4904 -4128 2681 1030
5289 1030 -5553 -4215 2743 1655 -5085 -4028 2833 1889 -4601 -3145 2154 1210 -4770 -3464 3119
5304 3119 2009 -4216 -3774 2661 2208 -4177 -2963 2516 2670 -3127 -3637 2989 2967 -2976 -2149 2507 2045
5321 2045 -2140 -2839 3019 1814 -2398 -2770 2589 2802 -2041 -2310 3110 3022 -654 -2719 2098 3356
5337 3356 -1069 -2743 2344 4238 -638 -1923 1754 5132 -414 -2285 1541 4811 -629 -2380 2601
5352B601J857l939l122M162K769l886l032M435L402n465k726M085L360m702l516
5367c717N710L395m871m035M368L041m090k593L017L115m032k980M588L099m203
5382a88l155K680M484m013l637L707L080l364l186L856K911l665m077L449L880
5397B762l177l422K717L775k763l988K504L795k000l273J334L633q99n122K216
5412a908M088k069l904Q56N080j583m974J297N411n66n650J194N127j478m946
5427d025J865M257l05o123R81N057m9n645M72O036j300n081R92M365O89n402P89
5444b427N563j377m744O14M841p81m610R27M039j02l663k97N017n33l427q29M650
5461B861n98m592J354L703K27l445j509M136Q57l406j437L836J828l923j633L713
$$ plain form
5352 2601 4458 519 -2603 1559 4328 442 -2590 1845 5247 -218 -2944 1141 4501 -201 -3717
5367 -3717 1993 5388 517 -3518 850 3891 -199 -2792 225 3340 -692 -3672 916 4015 -188
5382 -188 -3343 -663 3821 -192 -3829 -122 2958 -406 -3592 264 3175 -490 -4567 -1118 2762
5397 2762 -415 -3837 -1120 2655 -108 -4096 -1592 2203 203 -3070 -1736 1897 998 -4124 -1908
5412 -1908 2180 111 -3793 -2937 2143 560 -4414 -3117 2294 1728 -3922 -2728 2399 921 -4025
5427 -4025 -2160 2097 1792 -4331 -3350 1707 1658 -3987 -3515 2521 1221 -3860 -2868 1497 2186 -3216 -2427
5444 -2427 3136 1759 -2985 -2371 2470 1689 -2921 -1994 2045 1943 -1720 -2017 3000 2467 -960 -1789 2861
5461 2861 2263 -2329 -975 2728 2955 -490 -1999 2137 2994 -412 -1849 1987 3815 -108 -1741 1972
5477A972K491m756j749M591J277l768k359M528J892l500k630L673L090m809l429
5492c486N589J694l567k598L630K611m192k250L875K359l658k567L724L736n869
5507i69l098N167K727l506l032L066L480m145k750L660K489m149k132L285K539
5522B632l204k615L167K495l059k277K085K721k100l237K231K968j644l420J512
5537a745L889k389l710K640K826r40m164J734L771j537l632P68M446n64n237J366
5553b478N042j803m399J053M731r89n247J912L549P67n895J343L962k94m904J853
5569a797N156k336m790J656M803o01m211J43M353p66l359J89M775j27m998n43
5585b453N978j338m076P15L537O24l614l56K991J165l770r82L321J231l587j256
$$ plain form
5477 1972 4463 -293 -2042 2549 3826 58 -2301 2227 4119 619 -2011 1662 4752 -57 -3486
5492 -3486 2103 3797 230 -2368 1262 3873 -319 -2569 1306 3665 7 -2560 1164 4900 -969
5507 -969 -4067 1100 3827 321 -2711 355 3835 -310 -3060 600 3089 -1060 -3192 93 2632
5522 2632 -572 -3187 -20 2475 -584 -2861 -776 1945 -155 -3392 -1161 1807 163 -3257 -1745
5537 -1745 2144 -245 -3955 -1315 1511 571 -3593 -1859 1912 375 -3257 -2489 1957 1393 -3844 -2478
5553 -2478 2564 761 -3638 -2585 2146 1157 -4090 -2178 1371 2138 -3757 -2414 1548 1254 -3650 -1797
5569 -1797 3359 1023 -3767 -2111 2692 2091 -2120 -1977 2376 1610 -1749 -1560 3215 3088 -1910 -2453
5585 -2453 3525 2187 -1889 -1174 2363 2987 -627 -983 2008 3173 -597 -1579 1742 2973 -614 -1870
5601a870M020J333m450q7L782P87l772o65L121R42l425j285K594J271k691j341
5617a736L368K683m520j743L862J469k178k956K587L406l807l307L695L353m561
5632c85k603L903J984k545l534L518L742m545k517L221L162m726k301M297J860
5647B531l023k727L715J900k637k712K829K528l099k487K053L304l288k259K968
5662d04K682k895k443J240L854j499l938K343J975j050k799J908K572r92l373
5677b819J888K823k091l783J845L807l71l845N6M554j662m471K432M214j814l494
5693b731o6M488r37l825J452L499l78l400L1M792k167l453R26M415j396m175Q60
5710b065M922p89l778Q20L094N24n154O90M261o96l104o24M722r50l483n0L322
$$ plain form
5601 -1870 2150 3483 -967 -1054 2728 3515 -257 -922 2199 3141 -284 -1569 1025 2296 -395 -1736
5617 -1736 1632 4315 -205 -1948 1914 3383 1205 -1751 836 4242 435 -2872 823 4176 -385
5632 -385 -2988 915 2899 354 -3180 338 4080 -465 -2982 239 3401 -1325 -3626 671 2531
5647 2531 -492 -3219 496 2396 -241 -2953 -124 2404 -695 -3182 -1129 2175 -1113 -3372 -404
5662 -404 2278 -617 -3060 -1820 2034 535 -3403 -1060 915 -135 -2934 -1026 1546 554 -2819
5677 -2819 -931 1892 -199 -3982 -2137 1670 1299 -2546 -2490 2064 402 -4069 -1637 2577 763 -2731
5693 -2731 -2797 1691 754 -3071 -1619 1880 1502 -1898 -1867 2925 758 -2695 -1769 2646 1250 -2925 -2065
5710 -2065 2857 2068 -1710 -890 2204 2728 -2426 -1736 2525 1829 -1275 -1899 2823 1873 -1610 -1660 1662
5727A662J67j913q49K410Q10k466k31J684J285l863P06K250J718l807j355L382
5743A590J311k656j679K505J818j536l895L511K403l585j806L192J871l721j256
5758a933K912K156l142j846K769K065l042k048L028K442l442k638L508J706l439
5773i44j905M573R97l075k662L113K515l710j444K346K260l184j407K049J745
5788A267j575k448K244J793j782l121L224J366p02k807J854K318k543j657K852
5803B83K074k723j765L80L253j313k800Q95L146j199l638K385K499j056l536J473
5819a642L096n84l854J083L680p95l648Q13L907j611k916Q05L444J17m824J199
5835a730L996j359k982O27L691n77m259J312M079j168l001kL623l37k941L79K593
$$ plain form
5727 1662 1829 -84 -933 1477 2287 -179 -410 1274 2559 -1304 -598 1652 3370 -437 -1792 1590
5743 1590 2901 245 -1434 1071 2889 1353 -2542 969 3372 -213 -2019 1173 3044 -677 -1933
5758 -1933 979 3135 -7 -1853 916 2981 -61 -2109 919 3361 -81 -2719 789 2495 -944
5773 -944 -2849 1724 2721 -354 -3016 97 2612 -1098 -2542 -196 2064 -1120 -2527 -478 1267
5788 1267 -308 -2756 -512 1281 -501 -3622 -398 968 266 -2541 -687 1631 -912 -2569 283
5803 283 2357 -366 -2131 -1751 1502 189 -2611 -1716 1430 231 -3407 -1022 1477 421 -3115 -1642
5819 -1642 1454 870 -2984 -1901 1779 984 -2664 -1851 2056 445 -2471 -1666 1778 1895 -2929 -1730
5835 -1730 2266 907 -2075 -1448 2243 1666 -2593 -1281 2798 1630 -1371 -1373 2250 1913 -1028 -649 1944
5852A944M01k931l11M087r42k773p67K141J916l331j0K562K20k063j257L119n83
5869A422k004p92K295J734k433k033K792J422k354j441L141M48k597r46L119Q13
5885B586l044j045K162K215l416j059L083R23k989j356K869K045m122j517L541
5900H76K241l167k809L735K141l069k583L219J874k993j487K522J269k235k079
5915b545K379K040k609j634J288K107j273k442K465J838j582k065J309J476j532
5930g80j779J605K024j506j690N95K798j634j186O97K725j684k962J568K049m4
5946G96k458J168J420j021k701J587L173q23l071K03L294k97l382J051K930p10
5962A159l205R90L540j586k301J68K547L87k175p85L116j217j738k97L875j295
$$ plain form
5852 1944 2345 -586 -897 3190 2248 -525 -1292 849 2765 -566 -576 1986 2206 143 -1114 2005 1422
5869 1422 -582 -1374 921 2655 222 -1811 981 2403 49 -1392 1749 2197 -400 -1346 1773 2586
5885 2586 -458 -1503 659 2874 -542 -1601 1482 2405 -584 -1940 929 2974 -1148 -2665 876
5900 876 3117 -50 -2859 876 3017 -52 -2635 584 2458 -535 -2022 500 1769 -466 -2545
5915 -2545 -166 1874 -735 -2369 -1081 1026 -247 -2689 -224 1614 32 -2033 -724 752 -780
5930 -780 -2559 -954 1070 -436 -2126 -1531 1267 -367 -1553 -856 1869 185 -2777 -1209 840 796
5946 796 -1662 -494 926 -95 -2796 -1209 1964 1141 -1930 -1727 1567 1270 -2112 -1061 1869 1159
5962 1159 -2046 -1056 2484 898 -1403 -1235 1312 1699 -476 -1261 1855 638 -1100 -1397 2478 1183
5978A183l437K402K063l14l131K30K962j109k724J126L317r88j921l75K955k93
5994A946l116J000J814R38l059k38K811p0k778n61K661Q73k281q74K202J095l052
6011f89o57K189J147k536j269K605J573k663o15K107N26j999j584L012J413l145
6027e85k067L397J508k197k208K235J654k005k002K288J630k623o99J581K037
6042A944k703k174J996K370l104q93K428J044j168j891J465J656j768j113J393
6057e18J747j927j367P11K251j257j338J287R50r85j789J653J189o18k333J599
6073g45R08q2k188J326J546j222j781J362K672q82k964P67L325m51l369N73L056
6090A851l30l185J091J813J65k295n65L187m96k693O76L078j112k061R81K552
$$ plain form
5978 1183 -2254 148 2211 1897 -1234 -1004 1958 849 -1875 -749 2568 1580 -341 -716 2239 1946
5994 1946 -1170 -170 1644 2582 -477 -715 2096 2026 -752 -1313 1348 2221 -60 -934 1268 2363 -689
6011 -689 -1346 843 1990 -546 -1815 790 2363 -300 -915 1192 1718 -281 -1865 1147 2560 -585
6027 -585 -2652 745 2253 56 -2152 83 1737 -268 -2270 18 1648 -975 -1674 -93 1944
6042 1944 -759 -2933 -937 1433 -1671 -2564 -136 908 -260 -2151 -686 970 -798 -1911 -518
6057 -518 1229 -698 -2065 -1354 897 -360 -1698 -411 539 -446 -2235 -582 607 -11 -2344 -745
6073 -745 163 81 -2107 -781 765 -457 -2238 -876 1796 914 -2050 -1283 2042 1591 -1778 -1205 1851
6090 1851 1521 -1664 -573 1240 1405 -890 -1455 1732 1236 -1457 -781 2297 1185 -876 105 2657
6106B657r06l073R83J781N04l302Q31K300l81k270o7L050M58k645q41K711O45
6123B435l254Q00J204P19j903q22K584J59k725RJ882N59k055o67L061k61j534
6140A91q46J156J831k611q26J760L86j120j559K747J150k840o69J990Q32k166
6156e94j045K488J570l626o10K411J421k538j469K292J477k300j273K126K77j445
6172h38j583J821K048k262j456K170J480j758j316J767J496k704j851K221J678
6187I13j300j677K065J190j669k369K273J077j334j308K175L87j078j819J543
6202i31J526J75k508M85J719j4l197K320J044p7l312J925K637j763k031R80K040
6219A018p62l030J473L010o42k322P50J627m88k659J400K449j414k250Q12K873
$$ plain form
6106 2657 1751 -1322 -339 1442 1946 -1356 -525 1775 1394 -876 -943 2107 2565 -80 -921 1790 2435
6123 2435 -819 -19 1185 1904 1 -821 1763 1922 -803 -794 1088 1647 -408 -1075 1986 1725 191
6140 191 -655 501 2332 -279 -1105 655 1041 -79 -1638 1109 2259 -581 -1250 740 1572 -594
6156 -594 -1639 849 2419 -1207 -1817 594 2015 -523 -1992 300 1777 -523 -1796 330 607 -838
6172 -838 -2421 -600 1448 -814 -2270 -100 1380 -378 -1694 73 1569 -1135 -2986 -765 913
6187 913 -387 -2064 1 1191 -478 -2847 -574 503 -831 -2139 36 423 -655 -2474 -931
6202 -931 595 770 -1738 -1253 466 452 -2745 -425 619 542 -2770 -845 1792 29 -2002 -1022 1018
6219 1018 256 -2774 -1301 1709 1067 -1255 -505 1122 634 -2025 -625 1824 410 -1840 -1028 1845
6235A845j340j629N57L166j796j783m81K867L84k190o08K796L9k210q25K502R08
6252B202k702K88J559N67k613j65K463K00j369k68J423r01k00j974K850j55j492
6269b87j115K201P51j731o17J008R43k506k19K406J258k261o78J307J962k833
6285d11j692K700N51k253p18K845M11j897j458K087J321k389j330K248J197k148
6301i36r21K416J051j888j304J866J85l78j955J910J042k330j313K344J860k022
6317c73j684J884J068q88j600J330O40j360j293P76K041p05j775J281J081o17
6333a94j644O72K383j082k146J219J030K04j980M09J972l55j842J295J260j418
6349b17j973J755J158J07k649Q17K293n35j083k32J927o62k211Q47J622L41k502
$$ plain form
6235 1845 505 -1124 -567 2599 803 -980 -1461 1406 1790 -400 -1008 1788 1827 -383 -1208 1294 2202
6252 2202 -500 -212 1347 1914 -699 -864 1599 1799 430 162 1585 684 484 -1490 1360 1205 -287
6269 -287 -1402 799 1550 -181 -798 210 1153 -1353 -1572 834 2092 -169 -847 460 2422 -411
6285 -411 -2103 597 1148 -1105 -1823 1022 1433 -464 -1922 165 1486 -903 -2233 15 1212 -936
6301 -936 -1857 559 1610 -278 -1582 284 469 91 -1864 46 1088 -1242 -2555 -211 1649 -373
6317 -373 -2057 -173 895 7 -1593 -263 377 -983 -2276 -1500 541 -164 -1939 -658 423 -194
6333 -194 -1838 -1166 1217 135 -2011 -792 238 442 -1538 -1129 843 488 -1354 -59 1201 -217
6349 -217 -2190 -435 723 830 -1819 -1002 1291 756 -327 -559 1368 706 -1505 -658 964 1305 -1197
6366a197Q15J367k21k193J283J528k08k952K101J573j069k216P35K732o31j472
6382b5r69K552r65j575J473J448l86k451J015J165Q56k134k47J756K85k498j35
6399h35K201N36k099j72J225J121j571j409K266q70j769k8K070J166j730j559
6415a457K593L44k089L89J239j27r83j307K390n14q77j499K934n64K1k245K126
6432C74Q26k651l71J213J750j798o32J024J370j951r04J817P89j020q74R72L72
6449C06r82q98J017J784k041j607J884K042k036k02L38J479k027p41Q78K508k262
6466e60j716J762K266j845j147N46J214K9k116Q83J876j445k42K14J000q10m91
6483e82L48J787o09j645l31K783q01j651k27J848k53j927O23K115j134j117O62
$$ plain form
6366 -1197 -382 985 764 -1429 -146 1382 1174 -1778 323 1896 827 -1389 -654 2078 1447 -25
6382 -25 -994 1558 593 -982 491 1939 1553 -898 117 1282 2138 4 -243 1513 1798 -700 -835
6399 -835 1366 1902 -197 -369 856 1977 406 -1003 1263 393 -1376 -1404 666 1832 102 -1457
6415 -1457 1136 1480 -609 -220 1019 892 -91 -1398 992 478 -399 -1898 1036 472 493 -1752 374
6432 374 1200 -1451 -1822 -609 1141 -657 -1289 -265 1105 -846 -1750 67 856 -164 -1038 -66 306
6449 306 -676 -1574 -557 1227 -814 -2421 -537 1505 -531 -733 -395 1084 -943 -1684 -806 1702 -560
6466 -560 -2276 -514 1752 -93 -1240 -694 520 549 -1567 -684 1192 -253 -495 -281 719 -91 -582
6483 -582 -234 1553 944 -701 -1032 1751 950 -701 -928 920 667 -1260 -637 1478 344 -773 -111
6500a11N93L08o68m24J013J13j552Q13J560m38j594L64J792o88j219N67J149N3
6518A631k721J236Q96j33j016PJ539k67j957N09K158m52j470m59J739r1r63m14
6536b28L75J526k111j372K223J007j974l03J310N71j561j99J232O77j192j878
6552a897K338N59j838j087J616J253k186K01Q99N88j596k99Q28J842k006j028
6568a813K287k90r27J34l41J137j963k4K154J06p96j217J715K83n53j460J845
6585B77Qo0j837K581m02l35j629M89J517l37j744N35K484j939n43o2J255n0j168
6604i60J7K932k243k97M2J768o64k116K253N68q40j359P17J183q21j020O73J104
6622I37r57p16Q43J540n44k000J302J206o69j708K96K462j364j295j3K314j428
$$ plain form
6500 -111 482 790 122 -302 711 824 -728 85 1645 1207 -387 -23 1769 1081 -138 429 1578 1631
6518 1631 -1090 146 1042 909 -107 -100 1439 1172 -785 -276 1882 1430 -40 -499 1240 1149 186 -228
6536 -228 147 1673 -438 -1810 413 1420 -554 -857 453 1024 -537 -736 496 1173 -19 -1897
6552 -1897 441 1000 -838 -1925 -309 944 -1242 -1041 -142 446 -1150 -1449 -621 1221 -785 -1813
6568 -1813 474 184 -743 -609 -950 187 -1776 -1800 354 460 -336 -1553 162 445 -108 -1568 277
6585 277 285 225 -1612 969 567 232 -1397 -908 609 272 -1472 -937 1547 -392 -935 -997 258 208 -960
6604 -960 -943 1989 -254 -551 -509 1259 595 -1521 732 1300 460 -899 -182 1001 180 -840 -167 937
6622 937 -20 -736 107 1647 1103 -897 405 1611 942 -766 -470 1992 628 -667 -680 1634 206
6639B06j63M8P22n90j26j06J133K13j906J43J467L03j669M33J695k94j841O50
6657C18P22J94j661M2J783n89j188j52J144L85j665k99J801m0j988P73J311j53
6675G38j030o08J781k44j035p16J436K59p14k023K167Q29k005P86J097j197L14
6692a65j145J854m88j602j45R76J281k045l82J675Q94k028p10J454J053q36k249
6709b608K957O26j324q02Q13J177j362m63Q88K91j035m78O46J086p85o05J077
6726I9L91p25p07O23M53l58r17Q85J237n75j803m08K915l63j190K29J144l15j120
6745e05K70L18J533k641J011J487j152m79m94K860k285j025J321J317l10j601
6761c75L40J329m33l90j47K011j531k042K570m87l7j044K44Q55k26j133M18J187
$$ plain form
6639 206 43 91 813 223 97 -9 1124 1337 -569 -426 1041 1344 -325 108 1803 1509 -332 318
6657 318 1040 1234 -427 -385 1398 809 -379 -531 613 998 -667 -966 835 795 -1193 -420 891 738
6675 738 -292 -900 881 637 -398 -1114 322 581 -133 -2156 11 840 -1165 -379 718 -479 -165
6692 -165 -1310 544 56 -1546 -1691 -715 566 -1479 -1861 -186 708 -1320 -2030 -576 477 -359 -2608
6709 -2608 349 975 -349 -1151 -338 839 -523 -986 -98 193 -842 -1320 -674 412 -373 -978 99
6726 99 490 -235 -942 -319 134 -224 -1141 -256 981 406 -1397 -1805 1110 747 -443 -214 930 615 -505
6745 -505 -235 83 1616 -1025 -14 1473 321 -158 -652 2208 -77 -1102 219 1536 1226 -375
6761 -375 -35 1294 861 471 324 2335 804 -1238 1332 845 808 -236 8 863 637 -496 -78 1109
6779A109n71q17K31O54r79L86m11K096j165r76J97J318M65k189p37J990M41j198
6797a56k60J224l37o58l02P08J037j852m3M04O83k76j426J426M49j533J59J251
6815D98q01q7r56J906M51j951r43J619J045k003k24J663P72j495j18k09K017j631
6833d47p03P30O85j767N88K66O80j106p55J705R94j365j312K337M95k199n55J965
6851B36j09q88n85J449k25k39q20J080R44r00r98O37J546j649o93R3K030j168
6869b59n02m22J511p8j007Q85M16Q31k737N99J928j244o00L90K045j407n18P0
6887i9J476l75j947N62J502R9j385O05R77M80j863K0J648l70k371J244J128r19
6905D12j057P33j65P30j547J010O83N25k751M56K443n29j535N39R01M62j957N36
$$ plain form
6779 1109 538 -279 -48 606 -373 13 -398 1698 533 -443 -246 1072 1537 -652 -1389 601 1042 -156
6797 -156 -416 808 471 -187 -489 219 1256 -596 -639 -235 448 172 -1254 172 621 -912 -753 498
6815 498 -303 -390 -1346 560 1011 -940 -1883 -264 781 -1222 -1446 217 989 -506 -624 -833 1184 -447
6833 -447 -1150 -420 265 -1502 -914 -648 32 -1074 -1829 -124 870 -495 -1807 530 1025 -1174 -1729 236
6851 236 127 -761 -1346 103 -122 -361 -1181 -101 843 -57 -1055 -418 1128 -521 -1214 -1121 909 -259
6869 -259 -761 -1183 328 250 -757 128 544 1375 -1362 -763 1165 -79 -679 -289 1756 349 -169 -99
6887 -99 1377 1002 -945 -383 1119 1218 -167 438 1415 1895 32 52 1700 1330 -1041 203 1331 412
6905 412 -645 88 -77 653 -894 116 799 1324 -1427 -971 1472 943 -592 -53 848 1310 -647 -111
6923a11J297p85r26L16J074rj620J27J340k91j262N97O79j25L84j133P49P17j213
6942a95j198O56J858k108p47J554J373j043m22l40Q80r14O9N83N10p39n67J435
6960F45J00o85j578J485o6j054k55J852k38j076J92R33J43j319n75J856j03o67
6978d10o62O49N26l37k14P46O99j628m86R01Q95n14r91M15O56L06q26J028m88
6997B65m75l61O87J68n58k36L92J053j026p52J384L66q38n94P7J045K50j024N23
7016C46K09Q87j968N92K067j533j854J903P20r51r99Q28R84k13j425L40J580n44
7034I69j649J450o03M90l20m06J370j048L88pL02k71j214N05R17L72j935P52R55
7053A017j733j16N04J411j067m72K76Q05K67j204m51M23J174j363k90Q34N07j303
$$ plain form
6923 -111 1186 401 -525 -209 865 856 -764 -637 703 412 -850 -253 426 301 685 -448 301 1018 -195
6942 -195 -1393 -737 1121 -987 -1734 -180 1193 150 -272 -612 268 -646 -577 6 516 -223 -790 645
6960 645 745 60 -1518 -33 -99 -1153 -1408 444 206 -870 -678 255 398 -921 -1496 360 257 -410
6978 -410 -1072 -423 103 -234 -448 298 997 -631 -1117 -216 679 165 -826 -411 245 551 -275 753 265
6997 265 -210 -571 116 284 -274 -510 -118 935 -91 -843 541 907 69 -525 -448 597 847 -177 346
7016 346 555 1442 -526 66 2133 600 -1254 649 1369 418 -581 247 1231 1018 -407 -67 1513 969
7034 969 -680 770 167 657 337 -69 1301 253 641 634 936 665 -549 -44 873 1245 -690 62 1017
7053 1017 -716 -832 -328 1083 16 -456 -180 625 892 -312 -763 -340 834 -529 -819 15 522 -781
7071g81l14J051N09j234j38M93J066j380L95R00m0j648K47R68k67O1j618K305
7089E75J0j549P67J07R95j691j72O00J332j011j178J82J879j441L81M21L52p05
7107a46m46J029K5q44j107K068P8j708k27J494r9k44m04Q79M36p29j611K136m6
7126E34n15j473K404r9r22J77N5M08r18Q86l95J98J7O4l64J625r21j283N44N36
7146E58o55P3K8R18n71p22O6J179j47j033Q98R59p69p66K61j45L30j002P90J164
7166A414j272p68O13J425l54k584J990Q09q16l75P34N24j372j007O65J053K5r06
7184b02k02R22m41n18K1J111n29J83K71n96P97j758J289J55R8p43q13K453r96
7203E02j372O42L37P25j224p37J365N57j168l37j4J323j207o46K204n46q9j096
$$ plain form
7071 -781 -1095 -44 465 -769 -907 -414 652 -728 -333 567 527 -1121 -874 94 -173 -112 -1730 575
7089 575 585 -964 -197 -90 905 -786 -958 -358 974 -37 -1215 -1033 846 -595 -214 207 559 -146
7107 -146 -592 437 462 -382 -1489 579 657 -1051 -1278 216 117 -127 -531 348 784 55 -1556 580 534
7126 534 19 -1454 950 851 -71 106 161 569 -349 537 142 340 357 421 57 1682 761 -522 22 558
7146 558 -97 -24 4 922 351 -371 -305 874 727 -306 592 1551 782 16 277 132 462 -540 250 1414
7166 1414 142 -626 -13 1412 1058 -1526 464 1273 457 82 816 1340 -32 -1039 -374 679 704 -202
7184 -202 -404 518 77 -441 -420 691 162 345 616 20 817 -941 348 503 601 -142 -955 1498 502
7203 502 -870 -228 109 834 -390 -1127 238 795 -373 -710 -724 599 -608 -1254 950 404 315 -781
7221g81N07N96n82j106J109J52J11j230R14N31j251R29k68L91q54R4O45P75j590
7240i08m84J483N16q38r89J640o90p2L55N32N12q21j047R12J45L10j271J288o70
7259i7k76P8q1J433q22j228P78J116o0j543P5J577m68j141J306l38K3j014M33
7278b49J004j51q08J48J414j41j102k40J300o32P12j173N47p58J34J161m7p63
7296C56j349J072O44l26r88M69J417q38j221O05J213r96l63n42J373m2Pp83L91
7315I9j14j02l44K88L91n12k68J206J31j436j41K97J082k025J612m95K98o10N98
7334d5N61m59p87l9J159pr95Q34m8j91o06L06M91l65l88q0M17L25M68j551J036
7355C6M76l31p05K83P65r50l13j67J262j416K06J431q09l00K67M34P60k355J622
$$ plain form
7221 -781 -274 322 -260 -1366 -257 -105 6 -1224 -310 221 -1030 -101 -369 22 -832 -738 -93 682 -908
7240 -908 -1392 91 607 -231 -1220 420 -270 -342 13 545 1057 236 -811 101 246 556 -715 573 -97
7259 -97 -373 -295 -376 1057 235 -993 -215 901 841 -702 -627 950 482 -659 647 309 332 -682 -249
7278 -249 755 604 -204 -56 1358 1217 115 -125 1175 543 1255 82 629 -129 5 1166 1119 356
7296 356 -993 79 723 397 -591 -122 1295 457 -764 -159 1054 58 -305 -847 526 484 491 -292 99
7315 99 -15 -117 -461 -173 218 -294 -562 644 775 -661 -802 -505 577 -1448 164 -331 -33 -643 -45
7334 -45 516 57 -730 -769 390 383 -612 222 174 -17 -623 -317 174 -191 -579 -659 -242 83 551 -1000 36
7355 36 512 181 -524 -241 524 -426 -739 -906 356 -1060 -854 577 -232 -532 -265 169 929 -1426 196
7374A96J33M09j313N85K52m2r89Q57l89J093j548K50M53K0k89r70J258Q36j45
7393F57q29K88K40K64j026P10N1K10r28Q85P32p32p83Q17O4m03m80L22L80r4n2
7414B93j49R41l90o60j23J168m98q75L24J264j456k50j11J356M12j378l78R10
7432D00n37J15O09N22j03j134N18l47Q89j826J499R5r07n22L61Q73p52K6K33M92
7452E04m91J43j137J656r76k54M78n66k32J035m66q8j62J78K50n1L06l39r93J893
7472F88p97q01M11N99Q9r35k99R03k75K50j096K359n22o70m83P61r2J83r25P35
7492H3k15j72n69J016O03j25j584J071nn12N46l92M7j505J571l85N77o32K67J69
7512a46J297q21j54l31N62j073M3J27M71K30m20J138l64j296P99K27M43j032k19
$$ plain form
7374 196 329 738 -575 10 262 220 -769 88 -301 792 -756 -506 -53 -33 -322 -1292 -34 802 657
7393 657 -172 116 356 620 -406 304 355 565 -363 522 1254 522 -261 556 620 217 -263 59 439 345 293
7414 293 144 1085 695 35 -88 1080 582 -293 31 1295 -161 -411 -522 834 1246 -132 -510 400
7432 400 -137 -22 587 1109 1006 -128 390 43 932 -894 605 700 -207 -729 -368 505 -247 -221 12 504
7452 504 13 156 -981 675 -301 -555 -77 -643 -875 160 -306 -394 -556 -378 -128 -179 127 -212 -1205 688
7472 688 -109 -910 -499 100 189 -746 -1045 -142 -417 -167 -1263 1096 574 -96 -579 182 90 273 -652 83
7492 83 -132 -304 -873 143 746 621 -963 108 103 -409 137 -255 -208 -1713 -142 -527 50 -582 -315 -146
7512 -146 1151 330 176 -155 407 -666 -623 -496 -25 205 -215 923 559 -737 62 289 732 -300 -519
7531e19N56Q25R7j838J761Q8q01q75R20K79n63J10N31N2r41J64Q23K85m72m98
7551a6P63n11J492k616J650k0l74o68N88K88k86p34R93n23M15j111O30J312k149
7570h77k42J248R10o01p05j54N80j03n85J62J204o48o70m01J131n48J77q35J234
7589B77J71o93O91n82M66j429J288m41L23r4o57L65L17o25r28J996o42q56J23
7608i30J384n92l56L1Q7O61k57m52N9P63k32j434J281L87m15p70J380j47o60j55
7628c67o58O25l28j03J133L3q39J6O00k72M47r63Q32m8rm14M39l16l72M48P08
7649E92n35P67j386P66m89n7l12J166k07n70N16q91J223o14J41m41Q40j00m6l23
7669D0j97J024j316j37J688j045J23N37m4m82L75M05l52l68k60K7M63j176K73
$$ plain form
7531 -519 37 862 959 -879 882 970 169 -706 214 493 -70 40 571 623 -318 -154 669 954 482 -16
7551 -16 747 236 1728 -888 762 742 368 -300 288 576 290 -444 549 26 441 -670 -40 1272 -877
7570 -877 -1119 129 1039 438 -267 -421 159 56 -529 -367 837 189 -481 -882 249 -299 -122 -957 277
7589 277 448 -245 446 -136 330 -1099 189 -252 71 -23 -680 -315 2 -623 -1551 445 -197 -1053 -930
7608 -930 454 -138 -494 -463 -376 285 28 -424 -365 398 166 -1268 13 400 -15 -785 595 448 -212 -367
7628 -367 -1025 -400 -728 -831 302 335 -504 -488 112 -160 287 -676 156 108 99 -315 124 -192 -564 -116 592
7649 592 57 824 -562 204 -285 -342 -654 512 305 -265 251 -640 583 -31 110 -331 509 409 363 40
7669 40 -157 867 -449 -586 1102 57 180 717 673 191 566 971 619 251 -9 18 481 -695 -422
7688d22l12J501l07j100K23Q39j038P58l07K89m3j513J552J46j25j095J124k75
7706a05L3p61J071n80O21p8n52M06M7p00j70J354q28q27J228o77K25o15l7Q44
7726a01m7n28L8J288q63m80l0O53m06N18n76R59N9p54j42K88R66q88o63L56n90
7747i43N14n20M20N74K15p12J33O38p96j4N87kn04m39J311K65p37j78M32k58m46
7768d60N95m57N75p4n97J102p30l5J66M77r95M66L40k81J027q46p0J107k32o72
7788D06k34J28K72k90n23Q40R8q57K81k9O37j139J14J245l41j032j53M16R56p86
7808Il03O66J31J37q98P41M52j231l59P78M48k24n38o4K63Q34j764R77j000K22
7828g23Q73N43k47r10J42L06n08J223j457O48M18L85j410Q43R4k87n92N22K02
$$ plain form
7688 -422 -734 767 460 -640 -417 422 -616 142 -165 124 81 -1432 120 266 141 -954 170 -105
7706 -105 -72 -833 238 -342 279 201 -351 55 102 -598 -768 586 -242 -1069 159 -518 -293 -908 -945 -101
7726 -101 -148 -676 -638 650 -213 -693 -723 -70 -476 42 -534 425 484 -270 -412 -124 842 -46 -709 -353 -943
7747 -943 -429 -949 -529 45 260 -452 -319 319 -477 -491 96 94 -410 -849 462 727 -10 -188 244 -14 -460
7768 -460 135 -322 253 179 -418 684 -46 -81 85 562 -433 33 373 92 1119 273 203 1310 1078 406
7788 406 172 300 572 282 -241 599 697 -160 121 92 729 -410 -296 949 608 -424 -577 -161 795 9
7808 9 -294 372 503 640 -258 483 935 -296 -655 123 571 347 -191 -255 8 842 -922 55 -945 -723
7828 -723 150 693 446 -464 -322 -16 -524 699 -758 -110 308 693 -717 126 220 -67 -659 -137 65
7847F5K58o94k41P08j82o17P43j064R01R3M04k4o27k62m50Q47r80K67Q29L99j80
7868A93j134K76J030q68r3K28J35O41r31P3Q70j393P5Q02J42O70r68K9N65m54
7888a12k97l30J59Q23N80p28L30k61o79O07Q37q50n26R1K2N16L0p49L45J81j491
7909a502J083Q61l17M15J10l61J20jr88J235m71O7n0J06j33K44o43J57J102r57
7929G7J74m5k06o04J14Q38p4lj27L04N18p33k95L62K70n86q68J78J083o97O44
$$ plain form
7847 65 323 -371 -612 96 -86 -703 40 -1024 -123 -30 374 350 -277 -539 -989 -142 -1122 -855 -26 373 193
7868 193 -941 -665 365 -503 -596 -368 -233 408 -523 -450 420 -973 -898 -96 46 716 -252 -223 342 -112
7888 -112 -409 -739 -580 243 823 95 425 164 -515 92 929 79 -447 -356 -334 182 212 -537 -192 -11 -1502
7909 -1502 -419 442 125 540 650 289 409 408 -580 655 184 251 201 307 174 418 -225 -68 1034 77
7929 77 251 206 0 -604 -490 348 274 271 144 448 966 233 -62 300 570 -16 -884 -706 377 -320 324
$$ [...]
8191D3
##END NTUPLES=NMR FID
##END=
