##TITLE=1H_SAM_22.BBSX1.THF 2.2 TFA
 CDCl3, 64 sc, 
 7.5.2019
##JCAMPDX= 6.0         $$ Bruker NMR JCAMP-DX V2.0
##DATA TYPE= NMR FID
##DATA CLASS= NTUPLES
##ORIGIN= UXNMR, Bruker Analytische Messtechnik GmbH
##OWNER= root
$$ XWIN-NMR		Version 3.5
$$ Tue May  7 16:38:47 2019 Russian Standard Time (UT+4h)  she@DPX200
##.OBSERVE FREQUENCY= 200.1315
##.OBSERVE NUCLEUS= ^1H
##.DELAY= (6, 6)
##.ACQUISITION MODE= SIMULTANEOUS
##.ACQUISITION SCHEME= undefined
##.AVERAGES= 64
##.DIGITISER RES= 18
##SPECTROMETER/DATA SYSTEM= spect
##.PULSE SEQUENCE= zg30
##.SOLVENT NAME= CDCl3
##.SHIFT REFERENCE= (INTERNAL, CDCl3, 0, 15.7039)
##AUDIT TRAIL= $$ (NUMBER, WHEN, WHO, WHERE, WHAT)
$$ ##TITLE= Audit trail, XWIN-NMR		Version 3.5
$$ ##JCAMPDX= 5.01
$$ ##ORIGIN= Bruker BioSpin GmbH
$$ ##OWNER= she
$$ F:/spectra/data/she/nmr/H-F/1/audita.txt
$$ ##AUDIT TRAIL=  $$ (NUMBER, WHEN, WHO, WHERE, WHAT)
(   1,<2019-05-07 16:35:26.79 +0400>,<she>,<DPX200>,
      <continue with go, POWCHK disabled, PULCHK disabled
       configuration hash MD5:
       00 E9 B6 7A A2 85 ED C7 34 08 36 98 17 FE 4E 26
       data hash MD5: 16K
       E9 F1 36 CB 80 35 6F F9 16 E8 95 E7 DA 27 B7 42>)
$$ ##END=
$$ 
$$ hash MD5
$$ 9C A9 D6 69 EC FB 66 92 E0 C0 95 FE 92 98 F8 41
##$RELAX= 
##$RELAX= 
##$RELAX= 
##$RELAX= 
##$RELAX= 
##$RELAX= 
$$ Bruker specific parameters
$$ --------------------------
##$DU= <F:/spectra>
##$EXPNO= 1
##$NAME= <H-F>
##$PROCNO= 1
##$TYPE= <nmr>
##$USER= <she>
##$AMP= (0..31)
100 100 100 100 100 100 100 100 100 100 100 100 100 100 100 100 100 100 
100 100 100 100 100 100 100 100 100 100 100 100 100 100 
##$AQSEQ= 0
##$AQ_mod= 1
##$AUNM= <au_zg>
##$AUTOPOS= <>
##$BF1= 200.13
##$BF2= 200.13
##$BF3= 200.13
##$BF4= 200.13
##$BF5= 200.13
##$BF6= 200.13
##$BF7= 200.13
##$BF8= 200.13
##$BYTORDA= 1
##$CFDGTYP= 0
##$CFRGTYP= 5
##$CHEMSTR= <none>
##$CNST= (0..31)
1 1 145 1 1 1 1 1 1 1 1 1 1 1 1 1 1 1 1 1 1 1 1 1 1 1 1 1 1 1 1 1 
##$CPDPRG= <>
##$CPDPRG1= <>
##$CPDPRG2= <>
##$CPDPRG3= <>
##$CPDPRG4= <mlev>
##$CPDPRG5= <mlev>
##$CPDPRG6= <mlev>
##$CPDPRG7= <mlev>
##$CPDPRG8= <mlev>
##$CPDPRGB= <>
##$CPDPRGT= <>
##$D= (0..31)
0 1.2 0 0 0 0 0 0 0 0 0 0.03 0 0 0 0 0 0 0 0 0 0 0 0 0 0 0 0 0 0 0 0 
##$DATE= 1557232287
##$DBL= (0..7)
120 120 120 120 120 120 120 120 
##$DBP= (0..7)
150 150 150 150 150 150 150 150 
##$DBP07= 0
##$DBPNAM0= <>
##$DBPNAM1= <>
##$DBPNAM2= <>
##$DBPNAM3= <>
##$DBPNAM4= <>
##$DBPNAM5= <>
##$DBPNAM6= <>
##$DBPNAM7= <>
##$DBPOAL= (0..7)
0.5 0.5 0.5 0.5 0.5 0.5 0.5 0.5 
##$DBPOFFS= (0..7)
0 0 0 0 0 0 0 0 
##$DE= 6
##$DECBNUC= <off>
##$DECIM= 24
##$DECNUC= <off>
##$DECSTAT= 4
##$DIGMOD= 1
##$DIGTYP= 9
##$DL= (0..7)
0 120 120 120 120 120 120 120 
##$DP= (0..7)
150 150 150 150 150 150 150 150 
##$DP07= 0
##$DPNAME0= <>
##$DPNAME1= <>
##$DPNAME2= <>
##$DPNAME3= <>
##$DPNAME4= <>
##$DPNAME5= <>
##$DPNAME6= <>
##$DPNAME7= <>
##$DPOAL= (0..7)
0.5 0.5 0.5 0.5 0.5 0.5 0.5 0.5 
##$DPOFFS= (0..7)
0 0 0 0 0 0 0 0 
##$DQDMODE= 0
##$DR= 18
##$DS= 0
$$ [...]
##$SUBNAM2= <"">
##$SUBNAM3= <"">
##$SUBNAM4= <"">
##$SUBNAM5= <"">
##$SUBNAM6= <"">
##$SUBNAM7= <"">
##$SUBNAM8= <"">
##$SUBNAM9= <"">
##$SW= 24.9337058887773
##$SWIBOX= (0..15)
0 0 2 0 0 0 0 0 0 0 0 0 0 0 0 0 
##$SW_h= 4990.01996007984
##$TD= 16384
##$TD0= 1
##$TE= 0
##$TE2= 300
##$TE3= 300
##$TEG= 300
##$TL= (0..7)
0 120 120 120 120 120 120 120 
##$TP= (0..7)
150 150 150 150 150 150 150 150 
##$TP07= 0
##$TPNAME0= <>
##$TPNAME1= <>
##$TPNAME2= <>
##$TPNAME3= <>
##$TPNAME4= <>
##$TPNAME5= <>
##$TPNAME6= <>
##$TPNAME7= <>
##$TPOAL= (0..7)
0.5 0.5 0.5 0.5 0.5 0.5 0.5 0.5 
##$TPOFFS= (0..7)
0 0 0 0 0 0 0 0 
##$TUNHIN= 0
##$TUNHOUT= 0
##$TUNXOUT= 0
##$USERA1= <user>
##$USERA2= <user>
##$USERA3= <user>
##$USERA4= <user>
##$USERA5= <user>
##$V9= 5
##$VALIST= <valist>
##$VCLIST= <CCCCCCCCCCCCCCC>
##$VD= 0
##$VDLIST= <DDDDDDDDDDDDDDD>
##$VPLIST= <PPPPPPPPPPPPPPP>
##$VTLIST= <TTTTTTTTTTTTTTT>
##$WBST= 1024
##$WBSW= 4
##$XGAIN= (0..3)
0 0 0 0 
##$XL= 0
##$YL= 0
##$YMAX_a= 3016327
##$YMIN_a= -3353636
##$ZGOPTNS= <>
##$ZL1= 120
##$ZL2= 120
##$ZL3= 120
##$ZL4= 120
##$ABSF1= 10
##$ABSF2= 0
##$ABSG= 5
##$ABSL= 3
##$ALPHA= 0
##$AQORDER= 0
##$ASSFAC= 0
##$ASSFACI= 0
##$ASSFACX= 0
##$ASSWID= 0
##$AUNMP= <proc_1d>
##$AZFE= 0.1
##$AZFW= 0.1
##$BCFW= 1
##$BC_mod= 2
##$BYTORDP= 1
##$COROFFS= 0
##$CY= 11.3945322036743
##$DATMOD= 1
##$DC= 2
##$DFILT= <>
##$DTYPP= 0
##$F1P= 18.9103706918063
##$F2P= -1.10871071338519
##$FCOR= 0.5
##$FTSIZE= 0
##$FT_mod= 4
##$GAMMA= 1
##$GB= 0.15
##$INTBC= 1
##$INTSCL= 1
##$ISEN= 128
##$LB= 0.24
##$LEV0= 0
##$LPBIN= 0
##$MAXI= 10000
##$MC2= 0
##$MEAN= 0
##$ME_mod= 0
##$MI= 1.114404
##$NCOEF= 0
##$NC_proc= 0
##$NLEV= 6
##$NOISF1= 3.799351
##$NOISF2= 2.8
##$NSP= 1
##$NTH_PI= 0
##$NZP= 0
##$OFFSET= 15.70392
##$PC= 1
##$PHC0= -8858.63
##$PHC1= 20.20026
##$PH_mod= 1
##$PKNL= yes
##$PPARMOD= 0
##$PSCAL= 0
##$PSIGN= 0
##$REVERSE= no
##$SF= 200.130013532006
##$SI= 16384
##$SIGF1= 3
##$SIGF2= 2
##$SINO= 400
##$SIOLD= 16384
##$SREGLST= <1H.CDCl3>
##$SSB= 0
##$STSI= 0
##$STSR= 0
##$SW_p= 3612.71676300578
##$SYMM= 0
##$S_DEV= 0
##$TDeff= 0
##$TDoff= 0
##$TI= <>
##$TILT= no
##$TM1= 0
##$TM2= 0
##$TOPLEV= 0
##$USERP1= <user>
##$USERP2= <user>
##$USERP3= <user>
##$USERP4= <user>
##$USERP5= <user>
##$WDW= 1
##$XDIM= 8192
##$YMAX_p= 0
##$YMIN_p= 0
$$ End of Bruker specific parameters
$$ ---------------------------------
##NTUPLES= NMR FID
##VAR_NAME=  TIME,          FID/REAL,        FID/IMAG
##SYMBOL=    X,             R,               I
##VAR_TYPE=  INDEPENDENT,   DEPENDENT,       DEPENDENT
##VAR_FORM=  AFFN,          ASDF,            ASDF
##VAR_DIM=   8192,          8192,            8192
##UNITS=     SECONDS,       ARBITRARY UNITS, ARBITRARY UNITS
##FACTOR=    0.0002004,     1,               1
##FIRST=     0,             0,               0
##LAST=      1.6414764,     0,               0
##MIN=       0,             -3353636,        0
##MAX=       1.6414764,     3016327,         0
$$ Real data points
##PAGE= N=1
##DATA TABLE= (X++(R..R)), XYDATA
0@%%%%O4j28J28j28J92k56L20m35N63p00Q22r54J152j408J660j920K248k650L083
$$ 0 0 0 0 0 64 -64 64 -64 128 -128 192 -243 320 -380 442 -512 640 -768 892 -1028 1220 -1430 1653
23A653l566M130m748N399o134O979p908Q911j0025J1270j2624J4093j5720J7517
$$ 1653 -1913 2217 -2531 2868 -3266 3713 -4195 4716 -5309 5961 -6663 7430 -8290 9227
37I227j9474K1604k3963K6574k9419L2549l6044L9938m4265M9118n4638O0959
$$ 9227 -10247 11357 -12606 13968 -15451 17098 -18946 20992 -23273 25845 -28793 32166
49C2166o8226P6713q6826R9093j14290J33739j59705J96304k52118L48780n62691
$$ 32166 -36060 40653 -46173 52920 -61370 72369 -87336 108968 -143150 205630 -357061
60c57061J846641q46751k702070L462160J613408k902927k281461K836692J785751
$$ -357061 1489580 642829 -2059241 1402919 3016327 113400 -2168061 668631 2454382
69B454382k563428k116400K338624J654062k214620j811881K116490J599926j899344
$$ 2454382 -109046 -2225446 113178 1767240 -447380 -2259261 -142771 1457155 -442189
78d42189j594816J897874J534212j688291j566979J592227J508581j394574j502069
$$ -442189 -2037005 -139131 1395081 -293210 -1860189 -267962 1240619 -153955 -1656024
87a656024J328977J488471j192092j573200J011813J466253r90573j555096R37968
$$ -1656024 -327047 1161424 -30668 -1603868 -592055 874198 -116375 -1671471 -733503
96g33503J642204q28681j719075P50776J780650o73024j831795P04201K064985
$$ -733503 908701 80020 -1639055 -888279 892371 219347 -1612448 -908247 1156738
105A156738m53346j991858M74120K083971l85097k062336M48455K209282l22136
$$ 1156738 703392 -1288466 -814346 1269625 884528 -1177808 -729353 1479929 1157793
114A157793k154806L59140K160980m21414k222706M33309K248427m60692k284515
$$ 1157793 -997013 -637873 1523107 1101693 -1121013 -687704 1560723 1100031 -1184484
123a184484M58058K272210n00881k321223M51947K265398m71630k250085M54774
$$ -1184484 -726426 1545784 1044903 -1276320 -824373 1441025 969395 -1280690 -825916
132h25916K212549m34812k160830L99073K061425m29212k037570M03223K004653
$$ -825916 1386633 951821 -1209009 -809936 1251489 822277 -1215293 -812070 1192583
141A192583l40872j940569K68635J836692k67045j826605J67169J770470n8586
$$ 1192583 851711 -1088858 -820223 1016469 749424 -1077181 -910012 860458 801872
150H01872j678375k8087J580434O5598j559260j63600J514784K74506j423554
$$ 801872 -876503 -904590 675844 741442 -817818 -981418 533366 807872 -615682
159f15682l14758J396852L58624j408579m31181J427357N44086j396681n89072
$$ -615682 -930440 466412 825036 -583543 -1014724 412633 956719 -439962 -1029034
168a029034J425494O75680j440562p50711J459228Q36605j450890q83093J471972
$$ -1029034 396460 1072140 -368422 -1119133 340095 1176700 -274190 -1157283 314689
177C14689R42976j467067r67481J483054R83169j519763j015208J543363J054538
$$ 314689 1257665 -209402 -1176883 306171 1289340 -230423 -1245631 297732 1352270
186A352270j533902j057184J542468J054775j574863j098040J553318J125313
$$ 1352270 -181632 -1238816 303652 1358427 -216436 -1314476 238842 1364155
194A364155j496520j101517J461814J067418j457892j078961J405210J069142
$$ 1364155 -132365 -1233882 227932 1295350 -162542 -1241503 163707 1232849
202A232849j335159j022138J300277R95445j278528j010521J214786J007829j143811
$$ 1232849 -102310 -1124448 175829 1171274 -107254 -1117775 97011 1104840 -38971
211c8971r94846J086720R93974j039130j023990R51269J023609q81742j036697
$$ -38971 -1033817 52903 1046877 7747 -1016243 -64974 958635 76893 -959804
220i59804Q10776J041000p50034j063778O82583J071558o38772j101310N89472
$$ -959804 -149028 891972 141938 -921840 -239257 832301 193529 -907781 -318309
229c18309J134364n38055j157317N12734J202563m77667j253111M33861J291936
$$ -318309 816055 278000 -879317 -366583 835980 358313 -894798 -460937 830999
238H30999l80418j305057L65728J331789l50314j377850L11626J391452k84590
$$ 830999 450581 -854476 -488748 843041 492727 -885123 -573497 817955 533365
247E33365j389232K86506J407665k85852j439115K62270J445159k42064j432342
$$ 533365 -855867 -569361 838304 552452 -886663 -624393 820766 578702 -853640
256h53640K49796J446082k33338j445592K08574J429395j86813j401380J79323
$$ -853640 -603844 842238 608900 -836692 -628118 801277 614464 -786916 -607593
265f07593J384008j61432j365948J37898J335571j24000j316104R6931J290026
$$ -607593 776415 614983 -750965 -613067 722504 598504 -717600 -620669 669357
274F69357p2601j262452M7832J240519j6721j219749k1514J192683O3949j153634
$$ 669357 596756 -665696 -617864 622655 605934 -613815 -635329 557354 621303 -532331
284e32331q5653J144221J34998j123507j86347J096319K27512j067577k50375
$$ -532331 -617984 526237 661235 -462272 -648619 447700 675212 -392365 -642740
293f42740J064275K92665j060821l43683J041651L77780j027893m06172J029940
$$ -642740 421535 714200 -346621 -690304 351347 729127 -298766 -704938 325002
302C25002M46752j027387m92965J010318N20814j000645n45755J001539N77541
$$ 325002 771754 -255633 -748598 261720 782534 -218111 -763866 237673 815214
311H15214r97559o05310R88811O23138r86108o45947R79183O60551r71594o73081
$$ 815214 -182345 -787655 201156 824294 -161814 -807761 171422 831973 -139621 -812702
321h12702R59467O82095r53627p00856R32775P07526r18495p11791R02758P23161
$$ -812702 146765 828860 -124767 -825623 107152 814678 -103817 -815608 87150 810311
331H10311q86443p36603Q60995P38355q39454p37144Q21811P48136p95220p58679
$$ 810311 -76132 -812735 48260 786615 -52839 -789983 31828 779964 -15256 -773935
341g73935P65339P58099p36677p59192P13726P72819o81176p84124O46067P88138
$$ -773935 -8596 749503 12826 -746366 -32640 740179 59003 -725121 -79054 709084
351G09084o18012p96482N91794Q12488n59259q24070N25326Q28578n01652q40856
$$ 709084 91072 -705410 -113616 698872 139613 -684457 -159131 669447 167795 -673061
361f73061M73688Q52424m43941q62601M15292Q71169l90405q88285L58668Q96350
$$ -673061 -199373 653051 209110 -653491 -238199 632970 242565 -645720 -287052 609298
371F09298l32713r07085L11759R18998k89867r34166K65789R37893k46162r43925
$$ 609298 276585 -630500 -318741 600257 310390 -623776 -357987 579906 333744 -610181
381f10181K29065R53912k06777r58163J83655R57615j67385r58902J49930R64837
$$ -610181 -381116 572796 366019 -592144 -408489 549126 381741 -577161 -427231 537606
391E37606j26230r63990J08779R63002r4146r61476P7048R65142n4507r55839
$$ 537606 411376 -552614 -443835 519167 425021 -536455 -459407 505735 451228 -504611
401e04611L9957R48893k3560r42314M443R37204K0409r23908l5200R16626N7156
$$ -504611 -464654 484239 460679 -481635 -477192 460012 480421 -443487 -478687 437939 495095
412D95095r07038p8977Q99213R9929q87057j17278Q79433J40684q67013j62242
$$ 495095 -411943 -490920 408293 508222 -378835 -496113 383320 524004 -343009 -505251
422e05251Q53483J82029q40504k01802Q31017K27234q18398k49170Q05058K72076
$$ -505251 348232 530261 -310243 -512045 318972 546206 -272192 -521362 283696 555772
432E55772p94060k94711P85397L18898p71990l40380P59915L59119p50565l78395
$$ 555772 -238288 -532999 252398 571296 -200694 -541074 218841 577960 -172605 -551000
442e51000P40041L99561p27788m19173P18641M34859p09519m55175O97018M72500
$$ -551000 189041 588602 -139186 -558359 160282 595141 -114378 -569553 127465 599965
452E99965o85958m87655O76291N00023o68688n17452O56035N30089o44591n41952
$$ 599965 -85993 -573648 102643 602666 -66022 -583474 72561 602650 -41941 -583893
462e83893O33005N50534o21744n63190O03869N70041n92974n79248N77354N87003
$$ -583893 49112 599646 -22098 -585288 18581 588622 -4352 -583600 -6246 580757
472E80757n63044n94410N46287N97073n32959o07150N14938O13969m95915o21548
$$ 580757 17713 -576697 -30410 566663 33704 -573446 -58508 555461 59546 -562002
482e62002M76650O24192m58367o32491M34085O39886m11613o43807L91640O45193
$$ -562002 -85352 538840 80473 -552018 -117933 521953 110340 -533467 -141827 503366
492E03366l73308o52510L51543O59048l31626o64091L11842O72443k93597o81779
$$ 503366 130058 -522452 -170909 488139 156513 -507578 -195736 476707 183110 -498669
502d98669K71927O89574k50277o95290K28856P02839k08497p09606J88836P13807
$$ -498669 -226742 462832 212555 -482735 -253879 448960 240463 -469143 -280307 433500
512D33500j69987p18284J54249P23393j37416p25243J26693P28507j12966p33196
$$ 433500 263513 -454771 -300522 422871 285455 -439788 -313095 415412 302446 -430750
522d30750R7932P38007q2005p37493O9068P43185n3542p41851L5941P38014j8823
$$ -430750 -332818 405189 323184 -414309 -345241 397944 344402 -397449 -361508 376506 357683
533C57683p28610Q917P22916K076p17226j2158P09289K9549p00976l7948O95726
$$ 357683 -370927 -362010 360906 362982 -354244 -366402 342887 372436 -328540 -366488 329238
544C29238N3973o92309p0483O86492R3865o73439j13683O62704J32840o50795
$$ 329238 383211 -309098 -379581 306911 400776 -272663 -386346 276358 409198 -241597
554b41597j50861O40269J69039o24301j84905O11064K00984o04078k15935N99014
$$ -241597 -392458 247811 416850 -207451 -392356 218708 419692 -184386 -400321 198693
564A98693K36169n94035k57630N87447K78962n82465k98101N77872L20614n71087
$$ 198693 434862 -159173 -416803 170644 449606 -132859 -430960 146912 467526 -103561
574a03561l42309N58083L55981n47071l64912N41340L74033n38148l85580N28478
$$ -103561 -445870 112213 468194 -78877 -443789 97551 471584 -66564 -452144 76334
584G6334L95101n26030m01650N25069M10358n27924m27375N20174M38206n07469
$$ 76334 471435 -54595 -456245 68824 479182 -48742 -476117 44057 482263 -25206
594b5206m45038M94398M48831m84191m54671M67195M52785m49147m49758M35241
$$ -25206 -470244 24154 472985 -11206 -465877 1318 454103 4956 -444802 -9561
604i561M43652m27506m46641M18274M52010m03290m60950L85710M65681l70772
$$ -9561 434091 6585 -440056 -21782 430228 26938 -434012 -48302 417379 46607
614D6607m74829L50927M85409l21956m93087K92013M90343k70320m89480K53194
$$ 46607 -428222 -77295 408114 86158 -406929 -114916 375427 105107 -384373 -131179
624a31179M94522k33548n02091K15229N04732k02911n14707J93700N33495j79003
$$ -131179 363343 129795 -372296 -157067 347665 144754 -369953 -176253 357242 178239
634A78239n53658J57457N65259j37603n69646J22561N77196j07403n85704R0261
$$ 178239 -375419 -217962 347297 209694 -359952 -237391 339805 232402 -353302 -263041
644b63041N84678p7780n78516P5971N81511p7950n90545P5380N98161o7142o02121
$$ -263041 321637 243857 -334659 -258688 322823 244873 -345672 -270292 327869 260727 -341394
655c41394O5048O04876n9266o10101M7373O09904k7063n96334J5447N79349j1068
$$ -341394 -276346 328530 269264 -340837 -293464 316440 289377 -306957 -291510 287839 276771
666B76771n65696P103N60191J135n45475q003N33722J1605n30473j6312N33807
$$ 276771 -288925 -281822 278369 279504 -265971 -273974 259748 271353 -259120 -275432 258375
677B58375L8726n26613o2824N09899Q5717m95950j02647M84733J28070m69895
$$ 258375 297101 -229512 -292336 217563 303280 -192670 -295317 189416 317486 -152409
687a52409j51891M49371J66065m34284j72227M33106J86220m35506k08154M33038
$$ -152409 -304300 145071 311136 -123148 -295375 137731 323951 -111555 -319709 113329
697A13329K28686m32011k42654M34890K65344m38178k92216M30311L14682m16577
$$ 113329 342015 -89996 -332650 102240 367584 -70594 -362810 67501 382183 -34394
707c4394l24125M09315L26497m12393l34103M10971L40805m10021l36281M11552
$$ -34394 -358519 50796 377293 -35100 -369203 41768 382573 -27448 -363729 47823
717D7823L31496m23954l39691M29598L51802m22972l58929M10923L57083m05971
$$ 47823 379319 -44635 -384326 45272 397074 -25898 -384827 26096 383179 -22792
727b2792l59095L95859L62466l77993l57344L56527L42875l49221l33567L47017
$$ -22792 -381887 13972 376438 -1555 -358899 -2372 340503 -8718 -342285 4732
737D732L34626l38956l40061L20329L38928l06310l39829K94141L52112k72966
$$ 4732 339358 402 -339659 -19330 319598 13288 -326541 -32400 319712 46746
747D6746l67738K40234L68923k11784l66414J95140L69017j79678l77670J57698
$$ 46746 -320992 -80758 288165 76381 -290033 -94893 274124 94446 -283224 -125526
757a25526L80974j39222l81939J30274L91980j27872m13937J12342M32703r1094
$$ -125526 255448 116226 -265713 -135439 256541 128669 -285268 -172926 259777 168683
767A68683m40868P6656M48986o9582m63105N9094M72031m1699m70578L6266M64966
$$ 168683 -272185 -195529 253457 183875 -279230 -220136 251895 210196 -260382 -224116 240850
778B40850m2036m68651M8135M80957m4290m83132M2104M82251m5672m85665M7584
$$ 240850 198814 -269837 -221702 259255 214965 -268167 -226063 256188 210516 -275149 -227565
789b27565M93640l5085m89004K2745M75602j9499m60711K2442M55180j6617m45231
$$ -227565 266075 230990 -258014 -235269 240333 220834 -239877 -217435 237745 221128 -224103
800b24103P182M30030k556m15539M867M12519N592m11357k6435M02309M5891l84817
$$ -224103 -216921 213109 210553 -204986 -200119 212400 217992 -193365 -219800 182509 228400 -156417
812a56417n5508L76045P2711l71514r4957L58575J17936l40796j26947L30981
$$ -156417 -211925 164120 236831 -134683 -229640 128935 246871 -93925 -220872 110109
822A10109J36622l30735j54800L30761J74920l24347j89555L23354J99166l29035
$$ 110109 246731 -84004 -238804 91957 266877 -57470 -247025 76329 275495 -53540
832e3540k19158L32980K40848l27208k55244L19876K59724l23024k66870L26944
$$ -53540 -272698 60282 301130 -26078 -281322 38554 298278 -24746 -291616 35328
842C5328K77506l25363k85076L20752K79276l25876k78072L33607K84500l35977
$$ 35328 312834 -12529 -297605 23147 302423 -23453 -301525 32082 316582 -19395
852a9395k92311L29237K88844l25664k84082L24298K85275l20971k89061L04582
$$ -19395 -311706 17531 306375 -19289 -303371 20927 306202 -14769 -303830 752
862G52K83665k91038k72861K84906K69656k80707k74819K65897K73328k49086
$$ 752 284417 -6621 -279482 5424 275080 -5627 -280446 -14549 258779 9693
872I693k69684K38727K67451k28970k77307K11931K82872j87485k84654J71099
$$ 9693 -259991 -21264 246187 17217 -260090 -48159 234713 47228 -237426 -66327
882f6327K82515j59455k92051J43943L03034j21861l07414J07107L08295j01390
$$ -66327 216188 56733 -235318 -91375 211659 89798 -217616 -110509 197786 96396
892I6396l17045R3444L32654q0326l40066O6107L44822n9188l52555N4171L65648
$$ 96396 -220649 -127205 205449 125123 -214943 -148836 195986 136798 -215757 -161586 204062
903B04062m4084l72258L2366L74396k9120l75954L2304L83723k8021l91737K2683
$$ 204062 159978 -212280 -179914 194482 165362 -210592 -178288 205435 177414 -214323 -191640
914a91640L89912k1066l84764K5684L86826k3177l88788J4906L86677j1607l74190
$$ -191640 198272 177206 -207558 -181874 204952 181775 -207013 -192107 194570 182963 -191227
925a91227J1635L70433r667l69216L945L63076O469l49739q031L40624J0373l35522
$$ -191227 -179592 190841 181174 -188042 -184097 178979 185448 -164291 -172322 168302 178675 -156847
937a56847k0228L29288L4241l14869m2730L04496N0539k99844o1111K95573P8452
$$ -156847 -177075 152213 186454 -128415 -171145 133351 183890 -115954 -177065 118508 196960
948A96960k86348r1181K76961J00593k73908j11387K72440J27892k66584j40836
$$ 196960 -89388 -180569 96392 196985 -76923 -188310 84130 212022 -54562 -195398
958a95398K58906J49178k57305j57418K59193J71013k57050j86515K53856J93102
$$ -195398 63508 212686 -44619 -202037 57156 228169 -28881 -215396 38460 231562
968B31562k51856j98496K55035K06699k58812k16423K55711K19695k53268k21038
$$ 231562 -20294 -218790 36245 242944 -15868 -232291 23420 243115 -10153 -231191
978b31191K54630K24438k56869k31000K51719K32883k46885k32034K45735K28668
$$ -231191 23439 247877 -8992 -239992 11727 244610 -2275 -234309 11426 240094
988B40094k45991k31911K39948K32976k32198k32193K26144K27410k23279k27803
$$ 240094 -5897 -237808 2140 235116 2918 -229275 -3131 224279 1000 -226803
998b26803K15211K28988k04777k28206J91793K25140j84880k25304J74239K30004
$$ -226803 -11592 217396 12619 -215587 -23794 201346 16466 -208838 -34599 195405
1008A95405j63683k32499J50008K31795j41057k33621J31417K38836j20957k43402
$$ 195405 31722 -200777 -50769 181026 39969 -193652 -62235 176601 55644 -187758
1018a87758J08038K44341r7900k47604R1534K52126q0153k61035O9929K65475
$$ -187758 -79720 164621 66721 -180883 -89349 162777 82624 -178411 -108482 156993
1028A56993n9827k69367N5566K74336m9632k81232M2696K84458l6253k84948L3157
$$ 156993 97166 -172201 -116635 157701 108069 -173163 -130467 153991 117738 -167210 -134053
1039a34053K90744l0492k94924K5287K98067j8311k98434J7138K98792j4005l00343
$$ -134053 156691 126199 -168725 -143438 154629 136318 -162116 -144978 153814 139809 -160534
1050a60534J1532L01092o324k96639L438K94994j102k92674l83K90703P236k85577
$$ -160534 -149002 152090 145766 -150873 -147435 147559 146457 -146217 -146600 144103 151339 -134238
1062a34238j0824K80513J5470k77196j8612K73695K6667k67580l3585K62275L9723
$$ -134238 -145062 135451 150921 -126275 -144887 128808 155475 -112105 -145690 116585 156308
1073A56308k56499m4678K52044N2345k45415o0834K39695O9476k35535p5035K30875
$$ 156308 -100191 -144869 107175 159520 -85895 -146729 92966 162442 -73093 -148128 82747
1084H2747Q5433k29287r3595K22917J02826k20249j09471K19074J17362k17155
$$ 82747 168180 -61107 -154702 68215 171041 -49208 -158679 60395 177757 -39398
1094c9398j27632K14809J33537k11067j40286K08244J45152k05739j54131K05779
$$ -39398 -167030 47779 181316 -29751 -170037 38207 183359 -22380 -176511 29268
1104B9268J58784k03506j64343K01291J68104k01310j74814K01010J77041j98750
$$ 29268 188052 -15454 -179797 21494 189598 -11712 -186526 14484 191525 -7225
1114g225j79793J94783J81421j93120j84691J89659J86425j86362j88634J81335
$$ -7225 -187018 7765 189186 -3934 -188625 1034 187459 1097 -187537 -6202
1124f202J89633j78977j91618J75069J90884j69026j92885J63603J92027j59487
$$ -6202 183431 4454 -187164 -12095 178789 9763 -183122 -19519 172508 13021
1134A3021j91104J52219J91672j46737j92342J37421J94826j31176j95861J23617
$$ 13021 -178083 -25864 165808 19071 -173271 -35850 158976 27800 -168061 -44444
1144d4444J97744j15817k01224J08702K02691j01298k03321R2106K05765q5484
$$ -44444 153300 37483 -163741 -55039 147652 46354 -156967 -64861 140904 55420
1154E5420k06840P6690K09447o9950k10834O3769K15019n7519k19122N1619K23236
$$ 55420 -151420 -74730 134717 64767 -146067 -82298 132721 75202 -143920 -92301 130935
1165A30935m4867k25336L8326K29478l3102k31548K8918K34152k3304k34718J8954
$$ 130935 86068 -139268 -100942 128536 95434 -136114 -107196 126956 103652 -131066 -112112
1176a12112K36910j5081k36836J1480K38275p735k37933N431K40071j840k39857
$$ -112112 124798 109717 -127119 -115639 122636 114901 -123032 -117601 122470 120630 -119227
1187a19227o80K39837N756k39587p702K37102J3337k34570j6213K31497K0523
$$ -119227 -119907 119930 125686 -113901 -121603 115499 128836 -105734 -121947 109550 130073
1198A30073k27184k3032K23040K6890k19231k8575K15478L4631k14426l8296K11318
$$ 130073 -97111 -120143 102897 129787 -89444 -118019 97459 132090 -82336 -120632 90686
1209I0686M5189k07793n2123K04494N8389j99042o4925J93630P2517j89199p7077
$$ 90686 135875 -71918 -124041 80453 138842 -60200 -125125 68505 141022 -48177 -125254
1220a25254J83498Q2126j81001q7673J77710R3264j77508r7761J74912J04899
$$ -125254 58244 140370 -40631 -128304 49406 142670 -34838 -132599 42313 147212
1230A47212j75342j12594J73735J19961j72586j25964J67696J30997j64301j37229
$$ 147212 -28130 -140724 33011 152972 -19614 -145578 22118 153115 -11186 -148415
1240a48415J61129J40268j59364j43605J56704J45107j57755j45775J57139J48981
$$ -148415 12714 152982 -6382 -149987 6717 151824 -5931 -151706 5433 154414
1250A54414j58905j52335J57329J54810j56027j59056J53845J58924j48600j60913
$$ 154414 -4491 -156826 503 155313 -714 -159770 -5925 152999 4399 -156514
1260a56514J42154J61257j37841j60784J32648J59376j30127j57702J26002J56456
$$ -156514 -14360 146897 9056 -151728 -19080 140296 10169 -147533 -21531 134925
1270A34925j23983j55838J18714J58690j14949j61421J07903J65321j00912j65102
$$ 134925 10942 -144896 -26182 132508 17559 -143862 -35959 129362 28450 -136652
1280a36652R1125J66027q2346j67659P4187J67893o6185j67240O0399J68084n7779
$$ -136652 -45527 120500 38154 -129505 -55318 112575 46390 -120850 -60451 107633 49854
1291D9854j70110N4696J74846m8980j79038M3839J82748l7003j87268L1438J91810
$$ 49854 -120256 -65560 109286 60306 -118732 -74893 107855 70852 -116416 -84978 106832
1302A06832k2272j95241J6612J94651j0273j93972J0283J94321q205j95444Q201
$$ 106832 84560 -110681 -94069 100582 90309 -103663 -93380 100941 92736 -102708 -94507
1313i4507J96740p542j99031R235K02097o137k05099K726K06029L596k03268o859
$$ -94507 102233 94691 -104340 -95105 106992 100855 -104244 -101518 104511 108107 -95161 -102020
1325a02020K00538J0862j97484j3082J93488J6172j87725j5163J83783J3292j80650
$$ -102020 98518 109380 -88104 -101186 92302 108474 -79251 -94414 89369 102661 -77989
1336g7989j5434J80241K0571j78816k5600J75856L1011j72393l8511J69394M7894
$$ -77989 -93423 86818 107389 -71427 -97027 78829 109840 -62553 -101064 68330 116224
1347A16224j63265n4534J55849N7872j51033o1360J47252O6245j45300p0560J42221
$$ 116224 -47041 -101575 54274 112146 -38887 -100247 47005 113250 -32050 -102610 39611
1358C9611P4387j42646q0593J45144Q9106j45398r9340J43768J04829j41065j11886
$$ 39611 113998 -28648 -109241 35903 125009 -20389 -119729 24039 128868 -12197 -124083
1369a24083J39241J17138j38592j20679J33425J22059j32530j21629J35265J19469
$$ -124083 15158 132296 -6296 -126975 6450 128509 -4021 -125650 9615 129084
1379A29084j37267j24398J37633J27105j38105j30034J37996J32063j37991j37683
$$ 129084 -8183 -132581 5052 132157 -5948 -135982 2014 134077 -3914 -141597
1389a41597J34768J38956j29432j35519J23037J31391j20910j30663J17854J29029
$$ -141597 -6829 132127 2695 -132824 -9787 121604 694 -129969 -12115 116914
1399A16914j12928j27414J10091J23399j08335j25737J06361J29650r9614j32167
$$ 116914 3986 -123428 -13337 110062 1727 -124010 -17649 112001 12387 -119780
1409a19780Q8752J34188q2391j33400P5286J35401o7141j35111N7397J34519n1230
$$ -119780 -31028 103160 20769 -112631 -37345 98056 30915 -104196 -46799 87720 36490
1420C6490j34068M8935J37572m4977j43559L8780J48919l3552j52028L2095J57097
$$ 36490 -97578 -48643 88929 43952 -99607 -60827 88092 54540 -97488 -65393 91704
1431I1704k6272j62683J8481J66541j1211j65456R281J66073p737j69438O903
$$ 91704 65432 -97251 -78770 87771 76560 -88896 -79615 86458 78721 -90717 -83814
1442h3814J72908o030j69440N390J73193p659j77508Q281J80304m209j77233R92
$$ -83814 89094 83064 -86376 -80986 92207 84548 -92960 -84679 95625 91416 -85817 -84825
1454h4825J75567k88j74421n37J73690N446j68815p514J62070N700j58340m422
$$ -84825 90742 90454 -83967 -84504 89186 94632 -74183 -81697 80373 86073 -72267 -76689
1466g6689J58146Q028j54669j4127J50940J4772j45698j7953J45656K3532j41001
$$ -76689 81457 89485 -65184 -79311 71629 86401 -59297 -77250 68406 91938 -49063
1477d9063l3432J34306L9763j29075m1588J26587M6272j24946n5462J21633O0776
$$ -49063 -82495 51811 91574 -37501 -79089 47498 93770 -31176 -86638 34995 95771
1488I5771j18769o3739J17968O7757j20439p6374J19416Q3562j16442q9120J16135
$$ 95771 -22998 -86737 31231 98988 -21451 -97825 21591 105153 -11289 -100409 15726
1499A5726R2259j18751r8987J17889J05398j15954j07136J15640J04871j19826
$$ 15726 107985 -10766 -109753 8136 113534 -2420 -109556 6084 110955 -8871
1509h871j07854J22875J10907j21252j13495J19049J10420j21298j10394J20817
$$ -8871 -116725 6150 117057 -4195 -117690 1359 111779 -9519 -119913 904
1519I04J14616j18860j15950J14444J11546j12805j08590J11376J10082j09134
$$ 904 115520 -3340 -119290 -4846 106700 -6105 -114695 -3319 106763 -2371
1529b371j10300J02785J06730r9052j04655R8352J03707r2512j07401Q5282J07298
$$ -2371 -112671 -9886 96844 -2208 -106863 -8511 95196 2684 -104717 -19435 87863
1540H7863p6659j05694P2658J06277o9345j08700O1880J11538n2937j11298M9359
$$ 87863 11204 -94490 -21832 84445 15100 -93600 -31720 79818 26881 -84417 -35058
1551c5058J12588m5572j17722L9444J22378l2713j21866K7857J25105k6691j29136
$$ -35058 77530 31958 -85764 -46320 76058 43345 -78521 -50664 74441 47750 -81386
1562h1386K2098J36883j6116j38257J2634J40278j3031j43842J3485J48165q779
$$ -81386 -59288 77595 61479 -76778 -64144 76134 63103 -80739 -67254 80911 72132
1573G2132j50096Q093J48738p131j50415J0054J53207p361j54691M483J51828
$$ 72132 -77964 -69871 78867 71736 -78679 -68625 84582 77221 -77470 -72987 78841
1584G8841m197j49836P767J50337n235j50882K455J47539k254j41379L583J39981
$$ 78841 74644 -75192 -67425 82912 77677 -73205 -70750 76789 74535 -66844 -63261 76720
1596G6720j524j39585l119J34057Q545j28876p746J24562J1016j24170j7730J21262
$$ 76720 75196 -64389 -67508 66549 75094 -53782 -61528 63034 74050 -50120 -67850 53412
1608E3412K3159j15700k5597J12193K7396j12176l3730J10562M1542j06460m6870
$$ 53412 76571 -39129 -64726 47467 74863 -37313 -71043 39519 81061 -25399 -72269
1619g2269J02904M9846j03950n5770J03178O3431j01744o8855R9835P0418j01861
$$ -72269 30635 80481 -23469 -79239 23939 87370 -14374 -83229 16606 87024 -14837
1630a4837p2871J02050Q0264j04447q4038J01394Q4761j02186q6768J05270Q9609
$$ -14837 -87708 14342 94606 -9841 -93879 7515 92276 -9910 -96678 8592 98201
1641I8201j05828r4123J04333R3075j03615r3861J06488R3869j06499r7276J04644
$$ 98201 -7627 -101750 2583 95658 -7957 -101818 4670 98539 -7960 -105236 -592
1652e92R4913j01197r3266J01525R1153j00247r4706R7258R3301r1636r0677Q9539
$$ -592 94321 -6876 -100142 1383 92536 -7711 -102417 -5159 88142 -3494 -94171 -4632
1664d632Q8912q7451r0473Q1960R2709p6105r0426P0981Q9803o8221r1188O3916
$$ -4632 84280 -3171 -93644 -11684 81025 4920 -85506 -14525 75278 7057 -84131 -20215
1676b0215R3190n6613r3779N0541R4277m7301r6796M4821J01780l8757j04581
$$ -20215 72975 16362 -77417 -26876 67401 20100 -76696 -31875 69905 31148 -73433
1687g3433L4365J04414k9896j07289K8465J11449k2659j15503J8757J16447j6314
$$ -73433 -39068 65346 35450 -71839 -43374 68075 45416 -70087 -51330 65117 48803
1698D8803j16846J6412J20913j3553j24517J0903J25700r354j25950J1257J29401
$$ 48803 -68043 -51631 69282 55729 -68788 -57885 67815 58461 -67489 -56232 73169
1709G3169j1477j30124Q465J30442n224j28838N675J29290o331j29050K518J29685
$$ 73169 61692 -68432 -59967 70475 65251 -63587 -57912 71378 65047 -64003 -61485 68200
1721F8200j439j24658K282J22124j540j22130j78J21391K595j17468m185J14299
$$ 68200 66761 -57897 -55615 66509 64969 -57161 -57339 64052 66647 -50821 -55006 59293
1733E9293N249j12354q581J11265J2620j07676j7465J04009J9372j01020k3057
$$ 59293 64542 -47812 -56393 54872 67492 -40184 -57649 46360 65732 -35288 -58345
1744e8345R9392K7653r7333l3662R5234L6094r4260l8524R3121M4575r3499n0232
$$ -58345 41047 68700 -28633 -62295 32939 69033 -25227 -63751 29370 73945 -19554 -69786
1756f9786R0948N2372q9569n6071Q9592N9288r0598o3971Q9174O7811q9091o9427
$$ -69786 21162 73534 -16035 -72106 17486 76774 -13824 -77795 11379 79190 -9901 -79328
1768g9328Q9430O9665r0262p3613Q9719P5361q9156p5959Q8515P6788q9767q0426
$$ -79328 10102 79767 -10495 -84108 5611 80972 -8184 -84143 4372 81160 -8607 -89033
1780h9033R0209Q0593q7479q1076Q5227Q0986q6239p9848Q3878Q0852q1706q0578
$$ -89033 1176 81769 -5710 -86786 -1559 79427 -6812 -86660 -2782 78070 -3636 -84214
1792h4214P7888P9829p7201p9911P5983Q0312p2919q0348O8870P9757o4011q1920
$$ -84214 -6326 73503 -3698 -83609 -7626 72686 -233 -80581 -11711 68046 4035 -77885
1804g7885O3454Q1773n9162q1965N3664Q3081m9459q4372M8377Q2889m1581q6261
$$ -77885 -14431 67342 8180 -73785 -20121 62960 13501 -70871 -22494 60395 18814 -67447
1816f7447L8312Q8136l4357q7733L1299R1172k8520r4394K6884R5268k2916r6063
$$ -67447 -29135 59001 24644 -63089 -31790 59382 30862 -63532 -36648 58620 35704 -60359
1828f0359K0863R9339j8620j00949J6102J03195j2860j03480J0791J04809r743
$$ -60359 -39496 59843 41223 -59726 -43624 59571 46711 -56769 -45978 58831 49088
1839D9088j05115P918J07069o084j07232O576J08709o637j09189O363J09642m584
$$ 49088 -56027 -48109 58960 52876 -54356 -47780 60929 54292 -54897 -48534 61108 56524
1851E6524j09274L844J06396m46j06698P76J04174K470j03099m205J02282M425
$$ 56524 -52750 -48906 57490 57044 -49654 -48878 55296 57766 -45333 -49538 52744 57169
1863E7169r9732n847R8804P129r7467r643R5674J1779r5032j3567R2296J7315
$$ 57169 -42563 -48410 50394 57523 -39944 -49587 46087 57866 -37166 -50733 41563 58878
1875E8878r0244k0569Q7332K3970q5927k8310Q4687L0934q3446l3622Q1284L4852
$$ 58878 -31366 -51935 35397 59367 -26560 -54870 29817 60751 -22695 -56317 24967 59819
1887E9819p9551l8275P9247L9601p8050m5171P8491M7550p8092n1795P7591N4806
$$ 59819 -19732 -58007 21240 60841 -17209 -62380 16111 63661 -14431 -66226 11365 66171
1899F6171p6901n9522P6920O1152p6699o2016P3785O3198p4491o3606P4496O5180
$$ 66171 -10730 -70252 6668 67820 -8879 -70895 2890 66088 -8403 -72009 2487 67667
1911F7667p5381o6226P5545O6074p4103o9079P4613O8452p1362p1491P0907P0797
$$ 67667 -7714 -73940 1605 67679 -6424 -75503 -890 67562 -3800 -75291 -4384 66413
1923F6413o8419p1235O6888O9935o4824o8969O2326O9539o2071o7269N9266O9406
$$ 66413 -2006 -73241 -6353 63582 -1242 -70211 -7885 61654 -417 -67686 -8420 60986
1935F0986n7851o9999N5316P0535n1939p1200M7407P3660m3904p4286M1166P4022
$$ 60986 3135 -66864 -11548 58987 7048 -64152 -16745 56915 13011 -61275 -20109 53913
1947E3913l5531p5127L5235P3191l1578p3184K7573P6837k6453p7124K4700P9454
$$ 53913 18382 -56745 -21510 51681 20103 -53081 -25508 51329 24876 -52248 -27548 51906
1959E1906k2510q1930J9343Q6627j6033q7697J3817Q7935j0807q8076J0023Q8688
$$ 51906 29396 -52534 -33191 53436 37403 -50294 -36477 51458 40651 -47425 -37402 51286
1971E1286q379q8160P071Q8891p240q9741P572R1958o196r3491N838R4098m265
$$ 51286 42907 -45253 -38182 50709 43469 -46272 -38700 53258 47062 -46429 -40591 53507 49242
1984D9242r5295K818R4737j063r2715j149R1614J631q8452k396Q6306L738q5270
$$ 49242 -46053 -43235 51502 50439 -42276 -43425 48189 49820 -38632 -41028 45278 49016 -36254
1997c6254m442Q3769M615q3703o195Q3548P458q2105j0838Q0321J5107p9282j7379
$$ -36254 -40696 43073 47688 -36015 -42210 41338 48796 -33309 -44147 36174 51281 -28001 -45380
2010d5380P4598K1079p4035k3292P1391K5376p0018k7144O7602K9003o7524l1567
$$ -45380 29218 50297 -23738 -47030 24361 49737 -20281 -47425 20177 49180 -18344 -49911
2022d9911O7607L3386o8099l8232O8971M1358o8676m4547O6821M8153o5696n1095
$$ -49911 17696 51082 -17017 -55249 13722 55080 -13596 -58143 8678 56831 -8865 -59960
2034e9960O3666N3693o4000n4579O4186N2984o4340n4702O5076N5743o6140n6379
$$ -59960 3706 57399 -6601 -61180 3006 55990 -8350 -63052 2024 57767 -8373 -64752
2046f4752O6757N7836o6674n9066O4488O0797o2839o1773O1071O1611o0271o0471
$$ -64752 2005 59841 -6833 -65899 -1411 59386 -3453 -65226 -4155 57456 -2815 -63286
2058f3286N7606N9461n5303n8648N4590N7945n4772n7802N3850N8575n0155n8938
$$ -63286 -5680 53781 -1522 -60170 -5580 52365 -2407 -60209 -6359 52216 2061 -56877
2070e6877M8000N7978m3980n9938M0984O1022l5598o0537L1365O2748l1244o1020
$$ -56877 -8877 49101 5121 -54817 -13833 47189 11591 -48946 -17581 45167 13923 -47097
2082d7097K8606O3528k6896o2914K3449O5216k2529o4915J9466O9521j7361p1455
$$ -47097 -18491 45037 18141 -44773 -21324 43892 21363 -43552 -24086 45435 28074 -43381
2094d3381J4359P2935j1336p4204J0112P6197p935p7676P322P8546p017p7571
$$ -43381 -29022 43913 32577 -41627 -31515 44682 36747 -40929 -33607 44939 37922 -39649
2106c9649P069P9616p421q0576N783Q1533m644q1151M967Q2007m330q2920K663
$$ -39649 -32580 47036 39615 -40961 -35178 46355 41711 -39440 -34473 47534 43204 -39716 -37053
2119c7053Q2141j624p9822J151P8674q89p8584J133P6268O28p4842p32P1849J926
$$ -37053 45088 43464 -36358 -35207 43467 42578 -36006 -34873 41395 42023 -32819 -33551 38298 40224
2133D0224p1141m157O9896P218o8689j0206O6859J1136o4490j4148O3183J6451
$$ 40224 -30917 -35074 34822 42040 -26649 -36855 30004 41140 -23350 -37498 25685 42136
2145D2136o1935j9623N9487K0526n8506k2658N8094K5549n7767k9597N4773L3242
$$ 42136 -19799 -39422 20065 40591 -17915 -40573 17521 43070 -14697 -44294 10479 43721
2157D3721n6327l4329N6795L7198n7779m1197N8062M1767n6860m3391N6449M5138
$$ 43721 -12606 -46935 9860 47058 -10721 -51918 6144 47911 -8949 -52340 4109 49247
2169D9247n7300m8319N8119M8301n6314m9816N5465N0854n8396n0048N7662N1878
$$ 49247 -8053 -56372 1747 50048 -6266 -56082 -617 50237 -8159 -58207 -545 51333
2181E1333n6888n2727N7241N1236n6996n1138N6129N1819n3316n1225N1576M9940
$$ 51333 -5555 -58282 -1041 50195 -6801 -57939 -1810 50009 -3307 -54532 -2956 46984
2193D6984n1579m8822N0689M9234m6507n0092M3466N0335m3575m8009M1520M9839
$$ 46984 -4595 -53417 -2728 46506 -1 -50093 -6627 43708 133 -47876 -6356 43483
2205D3483l8700n0534L4194N0812l1113n0155L0419N2080k6756n4679K3330N5625
$$ 43483 4783 -45751 -11557 39255 8142 -42013 -11594 40486 13730 -40949 -17619 38006
2217C8006k0514n4918J8742N8038j7830n9093J3966O2519j1902o2113J1059O3644
$$ 38006 17492 -37426 -18684 39354 21524 -37569 -23603 38916 27014 -35099 -24040 39604
2229C9604j1151o5799R197O8510o836o7710N410O9032n623p0372N088P2668l738
$$ 39604 28453 -37346 -28149 40361 33525 -34185 -28775 40257 34634 -35738 -30650 42018 38280
2242C8280p3044M298P1272n086p1890N734P2976l927p2067K848P0463m185o8881
$$ 38280 -34764 -30466 40806 35720 -36170 -30436 42540 38613 -33454 -30606 39857 35672 -33209
2255c3209L758O9340k704o7802J86O5470R39o4297j98O2262K032o1741n353N8523
$$ -33209 -29451 39889 37185 -30617 -30431 35039 35978 -28319 -28517 33745 35777 -25964 -31317 27206
2269B7206P326n6555p776N6326Q742n5653j3618N4208J5755n2238j7324N1019
$$ 27206 34532 -22023 -29799 26527 35269 -20384 -34002 20206 35961 -16277 -33601 17418
2281A7418J8769n1060k4434N1309K5966m9243k7378M7398L0289n0490l2000M8578
$$ 17418 36187 -14873 -39307 12002 37968 -11275 -38653 8745 39034 -11456 -43456 5122
2293E122L6250m8718l7134M7128L8054m8510m0388N0291M1490m9357m3556M9120
$$ 5122 41372 -7346 -44480 2648 40702 -7808 -48196 2095 43585 -5772 -49328 -208
2305b08M3878n1172m1607M9778M4886n0787m5390M9775M3894m9524m3680N0805
$$ -208 43670 -7502 -49109 669 45555 -5232 -50622 -847 43047 -6477 -50157 648
2317F48M4022m8987m5795M8007M3895m5578m2467M5621M2507m4924m3112M2044
$$ 648 44670 -4317 -50112 -2105 41790 -3788 -46255 -634 41873 -3051 -46163 -4119
2329d119M2716l8755m2114L8307M1890l5828m3017L3208M3299k9221m2652K7661
$$ -4119 38597 -158 -42272 -3965 37925 2097 -40920 -7712 35587 6366 -36286 -8625
2341h625M3247k6290m5439K6071M5149k1198m5445J8972M6135j7245m8647J6228
$$ -8625 34622 8332 -37107 -11036 34113 12915 -32530 -13558 32577 15332 -33315 -17087
2353a7087N1615j2725n1707J0144N3003r467n5383R598N8173p993n7978O373N6867
$$ -17087 34528 21803 -29904 -19760 33243 23776 -31607 -22009 36164 28171 -29807 -23434 33433
2366C3433n732n7431O007O1161o759o1173N202O0677m327o0725M160O2680m755
$$ 33433 27701 -29730 -23723 37438 30679 -30494 -25292 35385 31058 -29667 -25507 37173 32418
2379C2418o2422L216O1624k322o0669K700N9902l192n9694K359N7537j307n5966
$$ 32418 -30004 -26788 34836 32514 -28155 -25455 34447 31255 -28439 -26080 31457 30150 -25816
2392b5816J121N5640j209n5808j341N5044K137n1156n158N0674M849n0109p704
$$ -25816 -24695 30945 29736 -26072 -27413 27631 29768 -21388 -26546 24128 28977 -21132 -28836
2405b8836M8300J0910m6857j2279M5643J1877m4362j4982M3631J9126m5002j9543
$$ -28836 19464 30374 -16483 -28762 16881 28758 -15604 -30586 13045 32171 -12831 -32374
2417c2374M1574K1984m2256k4741M4411K5619m2943k9459M2123K9980m1977l1376
$$ -32374 9200 31184 -11072 -35813 8598 34217 -8726 -38185 3938 33918 -8059 -39435
2429c9435M3161L2780m3181l3966M2331L4608m1924l6118M2825L7610m4208l7701
$$ -39435 3726 36506 -6675 -40641 1690 36298 -5626 -41744 1081 38691 -5517 -43218
2441d3218M2754L8050m2841l7467M2831L7863m2834l8470M0946L9319m0160l7706
$$ -43218 -464 37586 -5255 -42722 109 37972 -4862 -43332 -2386 36933 -3227 -40933
2453d0933L9913L6900l9419l7493L8113L7601l4784l7935L5685L6327l3986l7243
$$ -40933 -1020 35880 -3539 -41032 -2919 34682 -102 -38037 -2352 33975 -11 -37254
2465c7254L3340L7814l0544l7086K7617L8030k6374l7762K4078L9761k1901l8708
$$ -37254 -3914 33900 3356 -33730 -6113 31917 5543 -32219 -8141 31620 9719 -28989
2477b8989J8949L9469j7691m0417J7344M2142j5293m2725J3299M3239j1800m3990
$$ -28989 -10040 29429 11738 -28679 -11335 30807 15514 -27211 -13912 29327 17527 -26463
2489b6463J1625M6016j0658m7905Q689M8342o420m8739N990N0142m630n1646M236
$$ -26463 -14838 31178 20520 -27385 -18696 29646 23226 -25513 -19523 30619 25989 -25657 -21421
2502b1421N1983m580n1431N157N1211m238n2133L378N3418k636n3489K647N2438
$$ -21421 30562 25982 -25449 -20292 30919 26681 -25452 -22074 31344 28708 -24781 -22134 30304
2515C0304l544n1909J779N2841j402n1209K29M9604O49n0165J00M7721J537m7374
$$ 30304 26760 -25149 -23370 29471 28069 -23140 -22911 26693 27342 -22823 -22723 24998 26535 -20839
2529b0839j306M5171K533m5035m600M3838P091m4896p315M2121R317m1340j1280
$$ -20839 -22145 23026 25559 -19476 -24076 19762 26853 -18043 -25358 16763 26080 -15260 -26540
2542b6540L9869J3015l9113j4212L6760J5666l7501j7207L7671J9049l7899j9879
$$ -26540 13329 26344 -12769 -26981 9779 25445 -12056 -29263 8408 27457 -10442 -30321
2554c0321L7185K0790l5936k4129L6773K5123l6439k7488L6544K8063l6162k9524
$$ -30321 6864 27654 -8282 -32411 4362 29485 -6954 -34442 2102 30165 -5997 -35521
2566c5521L5351L0049l5982l0494L6164L1331l5476l2027L5547L2091l6901l1260
$$ -35521 -170 29879 -6103 -36597 -433 30898 -4578 -36605 -1058 31033 -5868 -37128
2578c7128L6479L3155l5592l3809L5566L3407l5089l4322L4955L3147l2122l2877
$$ -37128 -649 32506 -3086 -36895 -1329 32078 -3011 -37333 -2378 30769 -1353 -34230
2590c4230L0948L3208l1099l2305K9992L3113k7743l3818K8513L2347k6020l4177
$$ -34230 -3282 29926 -1173 -33478 -3486 29627 1884 -31934 -3421 28926 2906 -31271
2602c1271K5738L3895k3319l4203K1369L4983j8976l3741J7679L4165j5898l4659
$$ -31271 -5533 28362 5043 -29160 -7791 27192 8216 -25525 -7846 26319 10421 -24238
2614b4238J5165L5112j2760l6241J2046L7538j1576l7504R330M0380r204m0376
$$ -24238 -9073 26039 13279 -22962 -10916 26622 15046 -22458 -13128 27252 18048 -22328
2626b2328P730M1477n410m2875M775M3079m488m2891L977M3173k403m4709L629
$$ -22328 -14598 26879 21469 -21406 -16631 26448 21960 -20931 -16954 26219 23816 -20893 -17264
2639a7264M3752k753m5821L526M5618l573m4889K275M4067n42m5275N90M4857
$$ -17264 26488 23735 -22086 -18560 27058 23485 -21404 -19129 24938 24396 -20879 -20289 24568
2652B4568M25m5330O38M2224k37m1206j876M2799O3m0247k139L9286L009m0082
$$ 24568 24993 -20337 -19699 22525 22288 -18918 -20794 22005 22068 -18179 -20318 18968 21977 -18105
2666a8105k825L8366M918l8760o446L7370P830l5934j0519L5528J0547l2642j3724
$$ -18105 -20930 17436 22354 -16406 -22852 14518 22348 -13586 -24105 11423 21970 -10672 -24396
2679b4396L3521J2959l3753j2905L1732J6138l2837j6553L1494J7609l1223k0947
$$ -24396 9125 22084 -11669 -24574 7158 23296 -9541 -26094 5400 23009 -8214 -29161
2691b9161L1584K2918l1802k3094K9930K5856l1774k5572L1024K6365l1351k5911
$$ -29161 2423 25341 -6461 -29555 375 26231 -5543 -31115 -91 26274 -5077 -30988
2703c0988L0179K7324l1120k7609L2379K7298l0348k9452L0805K9163l1059k8760
$$ -30988 -809 26515 -4605 -32214 165 27463 -2885 -32337 -1532 27631 -3428 -32188
2715c2188L0227L0193l0602k9218K9179L0249k9593k7905K8096K8892k8115k7355
$$ -32188 -1961 28232 -2370 -31588 -2409 27840 -1753 -29658 -1562 27330 -785 -28140
2727b8140K5833K8061k5497k6639K3411K8833k2455k9923K2310K8671k0008k8595
$$ -28140 -2307 25754 257 -26382 -2971 25862 3407 -26516 -4206 24465 4457 -24138
2739b4138J8711K9267j7135k8775J5313L0334j3632l1541J4290K9145j0143l1219
$$ -24138 -5427 23840 6705 -22070 -6757 23577 9945 -21596 -7306 21839 11696 -19523
2751a9523J0899L1402q390l3265Q063L3977o723l4383N697L5557m986l6599M470
$$ -19523 -8624 22778 14388 -18877 -10814 23163 16440 -17943 -12246 23311 18325 -18274 -13804
2764a3804L6432l290l7100L425L7593l210l7919K648L8403k664l8399J046L9040
$$ -13804 22628 19338 -17762 -14337 23256 20046 -17873 -15225 23178 20514 -17885 -16839 22201
2777B2201q44l9757L10L9732l44l9843J698L8640l20l9206l93L7230J588l7238
$$ 22201 21357 -18400 -18090 21642 21298 -18545 -16847 21793 21473 -17733 -18126 19104 20692 -16546
2791a6546j533L6447O93l5268k081L4263L739l4919l561L3116M013l2289m782
$$ -16546 -18079 18368 19061 -16207 -18288 15975 19714 -15205 -18766 14350 18363 -13926 -18708
2804a8708L0635O468l0715q098L0547Q068k8899j0553K7700J3241k8701j3719
$$ -18708 11927 18395 -12320 -20418 10129 18197 -10702 -21255 6445 19686 -9015 -22734
2816b2734K7883J4364k8185j5786K8376J6481k7749j6716K5737J9359k5944k1126
$$ -22734 5149 19513 -8672 -24458 3918 20399 -7350 -24066 1671 21030 -4914 -26040
2828b6040K7768J9850k7344k0643K5700K3141k6858k2994K6759K4272k6878k4771
$$ -26040 1728 21578 -5766 -26409 -709 22432 -4426 -27420 -661 23611 -3267 -28038
2840b8038K7420K4464k6590k4789K6702K4540k5972k5673K6327K5447k4736k5102
$$ -28038 -618 23846 -2744 -27533 -831 23709 -2263 -27936 -1609 23838 -898 -26000
2852b6000K4413K6168k6662k3597K3971K5341k2576k5542K3308K3883k1371k4135
$$ -26000 -1587 24581 -2081 -25678 -1707 23634 1058 -24484 -1176 22707 1336 -22799
2864b2799K0258K5457j9434k4393J8421K4087j6467k4350J5308K5997j4311k6871
$$ -22799 -2541 22916 3482 -20911 -2490 21597 5130 -19220 -3912 22085 7774 -19097
2876a9097J3071K6537j2232k4810J0527K6936r758k7404P282K9094p662k8749
$$ -19097 -6026 20511 8279 -16531 -6004 20932 11174 -16230 -8948 20146 12484 -16265
2888a6265P141K9280n357k9634L759L0235l122l0984K839L3166l727l3053K254
$$ -16265 -9124 20156 14799 -14835 -11076 19159 16037 -14947 -12108 21058 17331 -15722 -13468
2901a3468L3854k361l4111K651L3235j818l4440J040L5280j579l4104Q90L3186
$$ -13468 20386 18025 -16086 -13435 19800 17982 -16458 -15418 19862 18283 -15821 -14931 18255
2914A8255j285l3583J224L4602k378l2598J23L2176n20l1963k40L1672J155k9466
$$ 18255 16970 -16613 -15389 19213 16835 -15763 -15640 16536 16016 -15947 -16187 15485 16640 -12826
2928a2826l586K9189K118k8292l022K8679M004k8557n164K6609O337k7576n299
$$ -12826 -16412 12777 14895 -13397 -16419 12260 16264 -12293 -17457 9152 15489 -12087 -17386
2941a7386K5027Q937k6545r374K4198J0927k4883r716K3311J2847k5102j4118
$$ -17386 7641 16578 -9967 -19341 4857 15784 -9099 -18815 4496 17343 -7759 -21877
2953b1877K3701J5571k3460j6205K3955J6429k3939j7911K4488J7983k2286j9148
$$ -21877 1824 17395 -6065 -22270 1685 18114 -5825 -23736 752 18735 -3551 -22699
2965b2699K3574J8875k3752j9743K3194K0948k3568k0672K3156K2121k4112k2236
$$ -22699 875 19750 -4002 -23745 -551 20397 -3171 -23843 -687 21434 -2678 -24914
2977b4914K4509K1765k3733k1248K3316K1224k3387k0421K3290K0548k1238k2309
$$ -24914 -405 21360 -2373 -23621 -305 20919 -2468 -22889 401 20949 -289 -22598
2989b2598K2422J9837k0057j9469J9652K0960j9389k0745J7901K0518j5874k1356
$$ -22598 -176 19661 -396 -19865 -213 20747 1358 -19387 -1486 19032 3158 -18198
3001a8198J7007K1359j5495k1599J4047K0560j0290k2025J1892K0855j0469k2750
$$ -18198 -1191 20168 4673 -16926 -2879 17681 7391 -14634 -2742 18113 7644 -15106
3013a5106R327K4175q528k3756Q837K2957o666k5649N873K6599m629k6560M338
$$ -15106 -5779 18396 9868 -13888 -5051 17906 11240 -14409 -8536 18063 13434 -13126 -8788
3026h788K5420l536k7689L549K8733l083k8084J096L0838m133k8696J919L0645
$$ -8788 16632 13096 -14593 -11044 17689 14606 -13478 -12382 18456 14323 -14373 -12454 18191
3039A8191k602l0136J773K9598j388k9725K049K8765j033k9794N18K8566p74k8289
$$ 18191 15589 -14547 -12774 16824 15436 -14289 -12240 16525 15492 -14302 -13784 14782 14008 -14281
3053a4281J848K7355n65k8224l17K7887l21k5951j607K6765J339k5573k992K3883
$$ -14281 -12433 14922 14357 -13867 -14184 13703 13382 -12569 -14176 12589 13928 -11645 -14637 9246
3067I246L387k3312l051K1744M589k2650o293K1968P061k1695p538K1951Q070
$$ 9246 12633 -10679 -13730 8014 12603 -10047 -16340 5628 12689 -9006 -16544 5407 13477
3080A3477k2670r406K1927J0411j9448j3361K1244J1894j9807j4520K1666J4836
$$ 13477 -9193 -18599 3328 13739 -5709 -19070 2174 14068 -5739 -20259 1407 16243
3092A6243j9640j6719J9717J6945k0237j7145K1886J7282k2261j7833K1576J7555
$$ 16243 -3397 -20116 -399 16546 -3691 -20836 1050 18332 -3929 -21762 -186 17369
3104A7369k0709j8049K1035J9056k0907j9874K1318J8820j9004j9423K0346J9398
$$ 17369 -3340 -21389 -354 18702 -2205 -22079 -761 18059 -945 -20368 -22 19376
3116A9376k0160j8850J8862J9107j9186j7477J8766J7106j8415j6561J7546J7881
$$ 19376 -784 -19634 -772 18335 -851 -18328 438 17544 -871 -17432 114 17995
3128A7995j6376j6805J4619J7071j4261j7914J4210J8581j1248j8771J0843J7662
$$ 17995 1619 -15186 -567 16504 2243 -15671 -1461 17120 5872 -12899 -2056 15606
3140A5606r681j8787R536J9307p534j9896P022J9684p234k0652O583K1926n369
$$ 15606 5925 -12862 -3326 15981 8447 -11449 -4427 15257 8023 -12629 -6046 15880 10511
3153A0511k1566L877K2337l773k3176L845K3559k115k5592L173K4775k597k4569
$$ 10511 -11055 -7178 15159 11386 -11790 -7945 15614 13499 -12093 -8920 15855 13258 -11311
3166a1311J926K4546j883k6081J640K5979j180k5449P89K6542k122k6978J622
$$ -11311 -9385 15161 13278 -12803 -11163 14816 13636 -11813 -11024 15518 13396 -13582 -11960
3179a1960K6134j691k5409J837K4633r41k5339P22K4080j71k3665m81K3762K31
$$ -11960 14174 12483 -12926 -11089 13544 12603 -12736 -12014 12066 11895 -11770 -12251 11511 11742
3193A1742k3003j871K2380K802k2638j993K1365J351j8793n248K0142N428j9462
$$ 11742 -11261 -13132 9248 12050 -10588 -12581 8784 10135 -8658 -13906 6236 11664 -7798
3206g798o828K0121N797j8067q632J9511P998j7858r469J7885R083j8096r563
$$ -7798 -14626 5495 11292 -6775 -15407 4104 12102 -5756 -15225 2660 11743 -6353 -15916
3219a5916J8073J0506j7212j3146J7312J3831j8075j3263J8943J4033j8309j5330
$$ -15916 2157 12663 -4549 -17695 -383 13448 -4627 -17890 1053 15086 -3223 -18553
3231a8553J7958J5881j8377j4342J8315J4670j8381j5605J8401J6963j8895j5496
$$ -18553 -595 15286 -3091 -17433 882 15552 -2829 -18434 -33 16930 -1965 -17461
3243a7461J7908J6355j7863j5637J7130J5962j7701j5427J6718J5640j6484j4703
$$ -17461 447 16802 -1061 -16698 432 16394 -1307 -16734 -16 15624 -860 -15563
3255a5563J6618J4826j5436j5514J5130J5538j4262j5723J3748J5857j2006j5276
$$ -15563 1055 15881 445 -15069 61 15599 1337 -14386 -638 15219 3213 -12063
3267a2063R960J6996j1070j5428R232J6962r047j6663P384J7868p157j7720P368
$$ -12063 -2103 14893 3823 -11605 -2373 14589 5542 -11121 -3737 14131 6974 -10746 -3378
3280c378J6978m945j8643M400J9076n144j8554M368J9737l617k1105L789K1070
$$ -3378 13600 8655 -9988 -5588 13488 8344 -10210 -5842 13895 10278 -10827 -7038 14032
3293A4032l158k1024K553K1205k347k1984K201K1609j325k3242K331K1864j695
$$ 14032 10874 -10150 -7597 13608 11261 -10723 -8522 13087 11762 -11480 -9149 12715 11020
3306A1020k2647K280K1872j163k2505M13K2982j172k3124Q31K2376r03k0713l54
$$ 11020 -11627 -9347 12525 11362 -11143 -10730 12252 11080 -12044 -11213 11163 10260 -10453 -10807
3320a0807K1014p10k0226P0J9398Q99k0820K38J9364N63j8236k023J8846J482
$$ -10807 10207 9497 -10729 -10659 8739 9638 -11182 -10944 8420 8983 -9253 -11276 7570 9052
3334I052j7973l940J6601M921j7169l729J6572N756j7114o118J6807N881j6469
$$ 9052 -8921 -12861 3740 8661 -8508 -12237 4335 10091 -7023 -13141 3666 9547 -6922
3347f922o660J5114Q635j4914r373J6352Q334j5180r895J5278J0890j5302j1579
$$ -6922 -13582 1532 10167 -4747 -14120 2232 10566 -4614 -14509 769 11659 -3643 -15222
3360a5222J5254J2475j5626j1647J4089J3566j5511j2857J5558J4915j6700j4560
$$ -15222 32 12507 -3119 -14766 -677 12889 -2622 -15479 79 14994 -1706 -16266
3372a6266J6001J4679j6289j3036J5862J3870j5541j4636J6126J4468j5065j4714
$$ -16266 -265 14414 -1875 -14911 951 14821 -720 -15356 770 15238 173 -14541
3384a4541J5291J4369j4780j3906J3489J3977j2711j4412J3460J4782j3355j3040
$$ -14541 750 15119 339 -13567 -78 13899 1188 -13224 236 15018 1663 -11377
3396a1377J1944J2533j0740j3216J0080J3919j0310j2653Q964J4514r220j4405
$$ -11377 567 13100 2360 -10856 -776 13143 2833 -9820 -856 13658 4438 -9967
3408i967Q579J3989o229j5916N126J6394m897j5637N788J4963l845j7947N343
$$ -9967 -1388 12601 6372 -9544 -4418 11976 7079 -8558 -2770 12193 8348 -9599 -4256
3421d256J5636k790j7518L374J7205k625j8019K275J8075k216j7626L57J9143
$$ -4256 11380 8590 -8928 -5554 11651 9026 -8993 -6718 11357 9141 -8485 -8128 11015
3434A1015j741j7952q24K0721j580j9828J599J9684j576j9765J931J8626p51j9190
$$ 11015 9274 -8678 -9502 11219 9639 -10189 -8590 11094 9518 -10247 -8316 10310 9559 -9631
3448i631L49J8984j527j8136l31J9342o85j8550M40J7237J201j7926q22J7191
$$ -9631 -9282 9702 8175 -9961 -10292 9050 8365 -10185 -9745 7492 8693 -9233 -10055 7136
3462G136J225j7021q43J5297K535j6500k501J5249L423j4582m842J5333M033j4161
$$ 7136 8361 -8660 -9503 5794 8329 -8171 -10672 4577 8000 -6582 -11424 3909 7942 -6219
3476f219n265J3885N837j3483o455J4269O850j4240p141J3365P781j3030q378
$$ -6219 -11484 2401 8238 -5245 -11700 2569 9419 -4821 -11962 1403 9184 -3846 -12224
3489a2224J3783Q997j4338r171J3459R748j3393j0649J3830J1226j3509j0301
$$ -12224 1559 10556 -3782 -12953 506 10254 -3139 -13788 42 11268 -2241 -12542
3501a2542J2865J1378j3227j1520J3781J1551j3663j1549J3838J1982j3145j2554
$$ -12542 323 11701 -1526 -13046 735 12286 -1377 -12926 912 12894 -251 -12805
3513a2805J4672J1383j3960j1939J3948J1531j2044j2342J2854J1913j2508j1223
$$ -12805 1867 13250 -710 -12649 1299 12830 786 -11556 1298 13211 703 -10520
3525a0520J1284J1144j0181j1704R856J2398r609j2505R261J1698p941j2350P929
$$ -10520 764 11908 1727 -9977 -121 12277 2668 -9837 -576 11122 3181 -9169 -1240
3538a240J2948r088j1269O365J3074o186j2875N581J3723n696j3317M657J4617
$$ -1240 11708 2620 -8649 -2284 10790 4604 -8271 -2690 11033 5337 -7980 -3323 11294
3551A1294m128j4999L194J3681j659j5484L138J4643j855j5153N99J6104j483
$$ 11294 7166 -7833 -4639 9042 7383 -8101 -4963 9680 7825 -7328 -6729 9375 7892
3564G892j6615J715J6678j854j5821J532J5805k028j5872O00J7866j543j6839
$$ 7892 -8723 -7008 9670 7816 -8005 -6473 9332 7304 -8568 -7968 9898 8355 -8484
3577h484n3J6729m88j6648N01J6088L7j6750M27J6075l68j5823R2J5662q69j5244
$$ -8484 -8537 8192 7704 -8944 -8443 7645 7682 -9068 -8641 7434 7066 -8757 -8665 6997 6128 -9116
3593i116j39J4793J467j4894j540J3754J510j3692j768J3546K921j2495m092J3325
$$ -9116 -9255 5538 7005 -7889 -9429 4325 5835 -7857 -9625 3921 6842 -5653 -9745 3580
3607C580L772j3308l899J1735N820j2850n554J2804O285j3519n239J1873P588
$$ 3580 7352 -5956 -9855 1880 7700 -5150 -10704 2100 8385 -5134 -10373 1500 9088
3620I088j1669q207J2030P843j2190p523J1223Q873j1345r435J1746R926j2985
$$ 9088 -2581 -10788 1242 9085 -3105 -10628 595 9468 -1877 -11312 434 10360 -2625
3633b625q699J2208R689j1783r493J1386J1073j2734r534J1849J0435j1371j1379
$$ -2625 -11324 884 10573 -1210 -10703 683 11756 -978 -10512 1337 11772 401 -10978
3646a0978J2354J0385j0451j0679J0542J0790j1408j0526J1478R837j0823j0191
$$ -10978 1376 11761 1310 -9369 1173 11963 555 -9971 1507 11344 521 -9670
3658i670J1160Q832r035j0337R836R420q168r900O759J1719p566r799N808J0469
$$ -9670 1490 10322 1287 -9050 786 10206 2038 -7862 -1103 10616 3050 -6749 -941 9528
3672I528o067j0071N916R875n031j0119K936J3092m810j2582M055J1793k700j2372
$$ 9528 3461 -6610 -694 9181 4150 -5969 -3033 10059 5249 -7333 -3278 8515 5815 -6557
3686f557K540J2904k978j3354K601J3372k279j3294J982J3728k694j3975J141
$$ -6557 -4017 8887 5909 -7445 -4844 8528 6249 -7045 -5063 8665 5971 -8004 -6863
3699f863J5061j488j4750J682J4026m22j6832K241J5380j172j4584L04J4343p18
$$ -6863 8198 6710 -8040 -6358 7668 7246 -9586 -7345 8035 6863 -7721 -7417 6926 6208
3713F208j4355K83J4570p19j4677O36J3876k73j3414Q09J3078o58j2851N54J2405
$$ 6208 -8147 -7864 6706 5987 -8690 -8054 5822 5549 -7865 -7056 6022 5364 -7487 -6933 5472
3728E472J76j2363q85J2183J785j2268j813J1958J394j0927k727J0107M192j1503
$$ 5472 5648 -6715 -7600 4583 6368 -5900 -7713 4245 5639 -5288 -8015 2092 6284 -5219
3742e219l104J0129M505j0197m492J0829L629r409o125J0146O683j0196o453J0505
$$ -5219 -8323 1806 6311 -3886 -8378 2451 6080 -3329 -9454 692 7375 -2821 -9274 1231
3756A231O317r695p612J0660P863j0699p680J0460R023j1607q738J1254R786j1174
$$ 1231 7548 -2147 -9759 901 8764 -1935 -9615 845 9868 -1739 -10477 777 10563 -611
3770f11r220J0918Q671r918r076J1425P912r724r851J0389Q704r350q504R634
$$ -611 -9831 1087 9758 -160 -9236 2189 10101 377 -9474 915 9619 269 -8235 1399
3784A399Q653r516q979R386Q639q225q031P074R519p669j0033Q599Q730p395q412
$$ 1399 10052 536 -8443 943 9582 1357 -6674 400 9919 2250 -7783 816 9546 2151 -6261
3799f261N925R715o444r861O564Q909m025q910M199R151n929r384N262R534m035
$$ -6261 -336 9379 2935 -6926 -362 8547 4522 -4388 -189 8962 3033 -6351 -1089 8445 4410
3814D410j0329L343R837k797j1573L100J1895k418j1342J647J2275l503j1468
$$ 4410 -5919 -2576 7261 4464 -7109 -4009 7886 5468 -5874 -4227 8048 4545 -6923
3827f923J983J2642k337j2675J451J3249k810j1992K323J1006r7j2818J77J2518
$$ -6923 -4940 7702 5365 -7310 -5859 7390 4580 -7412 -5089 5917 5820 -6998 -6821 5697
3841E697l59j3582J978J2695j324j2613O69J2893j452j1199O59J1345n26j2785
$$ 5697 5338 -8244 -6266 6429 5105 -7508 -6839 6054 4602 -6597 -5938 5407 4881 -7904
3855g904R63J1199Q04j1555P16J0300q34r369j799J1052J455j0620k444J0229
$$ -7904 -6941 4258 5062 -6493 -5777 4523 3689 -5680 -7479 3573 5028 -5592 -8036 2193
3869B193K111r264k297R211K764q697l716R681L875r619l444Q411M610p774o103
$$ 2193 4304 -4960 -7257 1954 4718 -3979 -7695 1986 5861 -3758 -7202 1209 5819 -1955 -8058
3884h058Q685O105q892n202Q663O275r430o573R826N382q050o245Q891O533q879
$$ -8058 627 6732 -2160 -7362 1301 7576 -1854 -8427 1399 6781 -1269 -7514 1377 7910 -969
3899i69o990R488P837j0008o486P500R286r931q353R654Q660r662p530R321P947
$$ -969 -7959 1529 9366 -642 -7128 372 9658 -273 -8626 1028 9688 26 -7504 1817 9764
3914I764r399p425Q961P382p992q560Q732O402p782o028P287P107o782p419P038
$$ 9764 365 -7060 1901 9283 1291 -7269 1463 7865 83 -5945 1342 8449 1667 -5752 1286
3929A286O857n772q442O300O988m214q376N035P452n145p302M529Q440n198q305
$$ 1286 8143 2371 -6071 229 7217 3003 -5373 -338 7114 1969 -5333 -804 7636 2438 -5867
3944e867L124Q983j971r010J958R904k684j0552K599J0842k832j0211K471R846
$$ -5867 -2743 6240 4269 -4741 -2783 7121 4437 -6115 -3516 7326 4494 -5717 -3246 6600
3958F600k086j0589J331J1110k280r915N02J0879l94j2534K085J1216j862j0736
$$ 6600 4514 -6075 -4744 6366 4086 -5829 -5327 5552 5158 -7376 -5291 5925 4063 -6673
3972f673J643J0432j243j0821K37J2091k043r677L20J0177N11j2231J508J0315
$$ -6673 -5030 5402 4159 -6662 -6425 5666 3623 -6054 -5734 4443 4954 -7277 -5769 4546
3986D546p33j0113M07J0072m00r757l88J0152N8r140n63Q437J295p917j910R177
$$ 4546 3813 -6300 -5893 4179 3779 -5978 -6366 3786 3844 -5296 -5859 2578 3873 -4044 -5954 3223
4002C223Q45p887l307R776J548q611j917P549L761p477m487Q138M108o611n571
$$ 3223 4068 -3819 -7126 2650 4198 -4413 -6330 1219 4980 -2497 -6984 1154 5262 -1349 -6920
4017f920R032M593q618m848P390N679p074n592Q001N157p963n237P240N992o842
$$ -6920 2112 6705 -1913 -6761 629 6308 -766 -6358 1643 6800 -1163 -6400 840 6832 -10
4032a0p457Q263P097r199m870P546O253q502n835P926O838q466o397Q623O244
$$ -10 -7467 796 7893 -1306 -6176 1370 7623 -879 -6714 1212 8050 -416 -6813 1810 8054
4047H054q292o077Q074O551p593o815P430N313n927n286N986N920o443n683N121
$$ 8054 -238 -6315 1759 8310 717 -6098 1332 6645 718 -4568 1418 7338 895 -4788 333
4062C33O689n824o406N094O847m991o391M570O825l648q140L764P237l176o771
$$ 333 7022 1198 -5208 -114 6733 1742 -4649 -79 6746 3098 -5042 -1278 5959 2783 -3988
4077c988K262Q249l419q437K962Q260j923r338K528Q795l162p920K022P893o94
$$ -3988 -1726 6523 3104 -5333 -2371 5889 3966 -5372 -2844 5951 2789 -5131 -3109 4784 4090
4092D090r348J911Q134p01j0097K659Q473j294r426J119R212k90j0430J423R349
$$ 4090 -5258 -3347 4787 4086 -6011 -3352 5121 3827 -5599 -4480 4732 4442 -5988 -4565 4784
4107D784j663r837J590Q782Q4r371J47R820r20r422J011Q628j436p235l74Q878
$$ 4784 3121 -6716 -5126 3656 3740 -5631 -5484 4336 3416 -6006 -4995 3633 2197 -5038 -5412 3466
4123C466l6r353J12Q495Q46p567n40P490N42p807j010Q617L75p649n18P035K032
$$ 3466 3430 -5923 -5811 2684 3530 -4037 -4577 2913 3455 -4352 -5362 3255 3630 -4019 -4537 2498 4530
4140D530p945k224P167L381q222j999O563L930o926m149P696L394o835m349O598
$$ 4530 -3415 -5639 1528 4909 -3313 -5312 1251 5181 -1745 -5894 1802 5196 -1639 -5988 610
4155F10M389o492m063O192N960p598m798O874N787p722n528P255O556q230m950
$$ 610 4999 -1493 -5556 636 6596 -1002 -5800 1074 6861 -861 -6389 866 7422 -808 -5758
4170e758P319M658o156n971P092O318p863n145O152O498o157o803O499O784o679
$$ -5758 1561 6219 63 -5908 1184 7502 -361 -5506 646 7144 987 -5816 683 7467 788
4185G88m690M739N811n665n970O380N102o145m061M693N156n409n629M616O104
$$ 788 -3902 837 6648 983 -4987 1393 6495 350 -3711 982 6138 729 -4900 -284 5820
4200E820l960n374K882O227l331o104L885M544k262o711L663N803k932o490K102
$$ 5820 1860 -3514 -632 5595 2264 -3840 45 4589 2327 -4384 -721 5082 2150 -4340 -2238
4215b238P580k598q068K810O873j012p746J568P176j342q480J567Q550j838q242
$$ -2238 5342 2744 -5324 -2514 4359 3347 -4399 -2831 4345 3003 -5477 -3910 4640 2802 -5440
4230e440N83Q955j103p830O74Q058j128p406P97P662q85r215J841Q459j050p685
$$ -5440 -4857 4098 2995 -4835 -4161 3897 2769 -4637 -3840 3822 2937 -6278 -4437 4022 2972 -4713
4246d713q20R338L4q965M73P975n54p077J76O531K30p344K28O786j038n548o89
$$ -4713 -5533 3805 3839 -5126 -4653 3322 2768 -4309 -4133 2398 2628 -4716 -4488 2298 1260 -4288 -4977
4263d977P249L70n935j042N623K753p937k38N446K066n494j968O036J534n345
$$ -4977 2272 2642 -3293 -4335 1288 4041 -3896 -4134 1312 3378 -2116 -4084 1952 3486 -1859
4278a859k958O294L019o715k768O662K971n786m336O566M236o063m346O204M822
$$ -1859 -4817 1477 4496 -2219 -4987 1675 4646 -1140 -5476 1090 5326 -737 -5083 1121 5943
4293E943o351m169O327L706n800l611N011N057o138m218N592M893o232n813P487
$$ 5943 -408 -4577 1750 5456 -344 -3955 1056 6113 -25 -4243 1349 6242 10 -5803 1684
4308A684M456o517l478N542M196n324n990O262N287n158o212O203N533n661m941
$$ 1684 6140 -377 -3855 1687 5883 559 -5431 831 6118 960 -5252 951 6484 823 -4118
4323d118M555M475l018n846M166N057n188l922L244N706m055m411L011M755l076
$$ -4118 437 4912 1894 -3952 214 5271 83 -3839 -595 5111 1056 -3355 -344 4411 1335
4338A335m892L074N018k340o205K002O084k587n543K381O253k152o368J436O434
$$ 1335 -3557 -483 4535 2195 -4010 -2008 4076 1489 -4054 -1673 4580 2428 -3940 -2504 3930
4353C930j632p056J252P358p13q052J592P421j184p679K018O210p24q423J079
$$ 3930 2298 -4758 -3506 3852 3139 -4913 -3321 4100 2916 -4763 -2745 3465 2741 -5682 -4603
4368d603P956o77p310J170O789j303p285J604O890p94o756N91O033j151o579J622
$$ -4603 3353 2676 -4634 -3464 3325 2022 -5263 -3659 3231 2437 -4319 -3728 2305 1154 -5425 -3803
4384c803P285j624o231K15O626o63n283n52O158P31n969r77O212K47n771j255
$$ -3803 3482 1858 -4373 -4158 2468 1805 -3478 -4030 2128 2859 -3110 -4087 2125 2372 -3399 -4654
4400d654P404m49n009j769O452R39n329k624P068J869n147k315M877L418n921
$$ -4654 2750 2301 -2708 -4477 1975 2914 -2415 -5039 2029 3898 -1249 -3564 1313 4731 -1190
4415a190l301O149L248o995j749M948M152n685l711M925N021n784m615O414L373
$$ -1190 -4491 1658 4906 -2089 -3838 1110 5262 -423 -4134 791 5812 28 -4587 1827 5200
4430E200n376m286O142M398n648l859M818M368n643l724M339M962m894m095N034
$$ 5200 -176 -4462 1680 6078 430 -3429 1389 5757 114 -3610 729 5691 797 -3298 1736
4445A736L501n002m386O135L375m517n136N348L973n067k799L307M761m712m193
$$ 1736 5237 235 -4151 1984 5359 842 -4294 1054 5027 -40 -2839 468 5229 517 -3676
4460c676M250M178l408l911J888M103k566l880K390L974k309m055K073M492k455
$$ -3676 574 4752 1344 -2567 -679 3424 858 -3022 -632 3342 1033 -3022 -949 3543 1088
4475A088l953J768M228j979m084J074N032j498n873J560N370j176n431J063N178
$$ 1088 -2865 -1097 3131 1152 -2932 -1858 3174 1676 -4197 -2637 2733 1557 -3874 -2811 2367
4490B367P53p287J052O338j681o084R63N987j33o896J065O491j060n779K11O700
$$ 2367 3120 -4167 -3115 3223 1542 -4542 -3579 2408 2275 -4621 -3556 2935 1875 -3904 -3693 3007
4506C007o09o425L47N860k68o749J758O010o18o004N23O388j322o093L64O174
$$ 3007 2398 -4027 -3680 2180 1912 -4837 -3079 2931 2313 -3691 -3168 3220 1898 -4195 -3831 2343
4522B343o96n782O40N545K75n323J15N335M06n363p43M339J382m596p55L924K362
$$ 2343 1647 -4135 -3495 2050 2325 -2998 -2883 2452 2858 -2505 -3248 1091 2473 -2123 -2878 1046 3408
4539C408n421j662M998J710m079j738L943J545m033k127N065K529n156k274M601
$$ 3408 -2013 -3675 1323 3033 -1046 -2784 1159 2704 -1329 -3456 1609 4138 -1018 -3292 1309
4554A309L354n009l850N429L559m677k738L372M112m811l323N386K940n001l001
$$ 1309 4663 -346 -4196 1233 4792 115 -2623 749 4861 50 -3273 2113 5053 52 -2949
4569b949L591M387n271k673M302L622n040l183M022M186l958m606M928K659k924
$$ -2949 642 5029 -242 -2915 1387 5009 -31 -3214 808 4994 1036 -3570 1358 4017 1093
4584A093m961L724M919m797l034M085K908l703l904M339K514l331l137L522M151
$$ 1093 -3868 -144 4775 -22 -3056 1029 3937 234 -3670 669 3183 -148 -3285 237 4388
4599D388l054n254K763M820l207k944J598M045k975l325J543N433k338m574Q07
$$ 4388 1334 -3920 -1157 3663 456 -2488 -890 3155 180 -3145 -1602 3831 1493 -3081 -2274
4614b274M431J04o473K409M569j649m775J125N682j282n839J484N025q52n167
$$ -2274 2157 2261 -4212 -1803 2766 1117 -3658 -2533 3149 1867 -3972 -2488 2537 1685 -3482
4629c482K39N497k62n244L88M499l74n183R60N059J34n710M40M872k79n980O27
$$ -3482 -3243 2254 1992 -3252 -2864 1635 1261 -3922 -2962 2097 2231 -3479 -3039 1833 1554 -4426 -3799
4646c799N421R3m181m57O179j136n370N71L690L55m690N46M403R3l571q62L801
$$ -3799 1622 1715 -2466 -2923 3256 2120 -3250 -2679 1011 1366 -3324 -2778 1625 1718 -1853 -2715 1086
4663A086Q63l884r50M747O79m014j604M180J611m694j169M596J151l577k145M738
$$ 1086 1949 -1935 -2885 1862 2541 -1473 -3077 1103 2714 -1980 -3149 1447 2598 -979 -3124 1614
4679A614K084m570k730M578K340l732l019M603L668n082k769L919L448l980k486
$$ 1614 3698 -872 -3602 976 3316 -416 -3435 1168 4836 -246 -3015 904 4352 372 -2114
4694b114L010L944m529l548L775M108m443l193M674K782l528m206M449K863m512
$$ -2114 896 4840 311 -3237 538 4646 203 -2990 1684 4466 938 -3268 1181 4044 -468
4709d68k045L100L262l754k720L298L877l935l403L102K892l316k394K447M057
$$ -468 -2513 587 3849 95 -2625 673 4550 615 -2788 314 3206 -110 -2504 -57 4000
4724D000l149m038L414L364l348k988J965L788k748k309K223K581k528l308K834
$$ 4000 851 -3187 227 3591 243 -2745 -780 3008 260 -2049 174 2755 227 -3081 -247
4739b47K606j058m376J488L362k161k467J594M211j074m438R74L577p19l870L54
$$ -247 2359 1301 -3075 -1587 1775 -386 -2853 -1259 2952 1878 -2560 -1586 1991 1272 -2598 -2244
4755b244M756m73m883O40M892r19n026M45M818K10n792P73M666l8n848J665M650
$$ -2244 2512 2039 -2844 -2204 2688 1769 -3257 -2812 2006 2216 -3576 -2803 1863 1825 -4023 -2358 2292
4772B292j062m627L75N172k24m719k12M684r74l062P2M493o11l870M1L841q5m065
$$ 2292 1230 -3397 -3022 2150 1926 -2793 -3005 1679 705 -2357 -2285 2208 1597 -2273 -2232 1609 1524 -2541
4790b541N65L235N89m015m15L889R67l690j898M781Q11m239N50L415N88m027j085
$$ -2541 -1976 1259 1848 -2167 -2582 1307 2274 -1416 -3314 1467 2278 -1961 -1411 2004 2592 -1435 -2520
4807b520M811N7l430j308K951K286l373j437L213K473l734k435L263K888m499
$$ -2520 2291 2348 -1082 -2390 561 2847 -526 -1963 1250 3723 -11 -2446 817 3705 -794
4822g94n51K374K322k981k329K784K254k756l588N302K436m063l407L624L294
$$ -794 -1345 1029 3351 370 -1959 825 3079 323 -3265 2037 4473 410 -2997 627 3921
4837C921l371k661L975J745l295l280L516K418k500l336L419K707l592j998L154
$$ 3921 550 -2111 1864 3609 314 -2966 550 2968 468 -2868 551 3258 -334 -2332 822
4852H22K673l619k377K331K301j802l441K726L339k257l217J908K694j926j961
$$ 822 3495 -124 -2501 -170 2131 329 -3112 -386 2953 696 -2521 -613 2081 155 -1806
4867a806Q47K942j879k670J727K727l58m391J285L365l81l155N85L568j748l007
$$ -1806 -959 1983 104 -2566 -839 1888 1530 -2861 -1576 1789 1408 -1747 -1162 2406 658 -2349
4883b349K58L931o71m738J307L358N54m014R39L368j175m218O90N343j337l842
$$ -2349 -2091 1840 1169 -3569 -2262 1096 1650 -2364 -1425 1943 768 -3450 -2760 2583 1246 -2596
4899b596K94M200r30l662Q48L843r95l519o8M617j23m771L91M763r83l612l2L978
$$ -2596 -2302 1898 968 -2694 -1846 1997 1002 -2517 -2585 2032 1909 -2862 -2471 2292 1309 -2303 -2335 1643
4917A643m34l543k03N037j026m355L61M073K76k516j058K913J494l970j31L125
$$ 1643 1209 -2334 -2537 2500 1474 -2881 -2520 1553 1829 -687 -1745 1168 2662 -1308 -1439 1686
4933A686J69k958q60L842Q11k570j480K441O67k150j064L642O87k818j961K717
$$ 1686 1855 -1103 -1963 1879 2690 120 -1360 1081 1748 -402 -1466 2176 2863 45 -1916 801
4949H01J966l741r71L669J034k134k086K784K556l881l007M477J954l358j693
$$ 801 2767 -974 -1945 1724 2758 624 -1462 1322 3878 -3 -3010 1467 3421 63 -1630
4964a630J212L856k953k878K347M001m375j917L064K269k640k216K075K660l739
$$ -1630 -418 3438 485 -2393 -46 3955 -420 -2337 727 2996 356 -1860 215 2875 -864
4979h64p12K505K111m227j355L326J077j318k731K953J848k240k152J727K016
$$ -864 -1576 929 3040 -1187 -2542 784 1861 543 -2188 765 2613 373 -1779 -52 1964
4994A964j510l004K679J933k059k377K255K932k377k248J128K416l90k547RL612
$$ 1964 454 -2550 129 2062 3 -2374 -119 2813 436 -1812 -684 1732 1342 -1205 -1196 2416
5010B416j369l821P41M107k130j535l38L746j061m173J241L449p04l696J463L181
$$ 2416 1047 -2774 -2033 2074 -56 -1591 -1929 1817 756 -3417 -2176 1273 569 -3127 -1664 1517
5026A517n32m799J607K819M0k586r0L888r37k820m73M008m27l176n04L689n95
$$ 1517 985 -3814 -2207 612 652 -1934 -2024 1864 927 -1893 -2366 1642 1215 -1961 -2465 1224 629
5043F29l377P91M512j379l380J36M160j505k463q9L318m26l174O88K699R72l418
$$ 629 -2748 -1957 2555 1176 -2204 -2068 2092 587 -1876 -1965 1353 927 -2247 -1559 1140 2112 -1306
5060a306o4K599k3k486O4K554j17k319m36L745J42k883j858M617O48l165j197
$$ -1306 -1370 1229 1206 -1280 -1216 1338 1221 -1098 -1534 2211 2353 -530 -2388 2229 2877 -288 -1485
5077a485L180N13k780r15L294R32k713j774L290J216k827j169J835K781l543j371
$$ -1485 1695 2208 -572 -1487 1807 2739 26 -1748 1542 2758 -69 -1238 597 3378 -165 -1536
5093a536K698K644l125k955K855K118k065l209L149K598l103k023K029K969k515
$$ -1536 1162 3806 681 -2274 581 2699 634 -2575 574 3172 69 -1954 75 3044 529
5108E29k457K334K187k223k004J922J734k460k103K622K147k264k408J945L000
$$ 529 -1928 406 2593 370 -1634 288 2022 -438 -2541 81 2228 -36 -2444 -499 2501
5123B501k254j827J319K083j616j792J106K475j213l034J999J323j043k190J109
$$ 2501 247 -1580 -261 1822 206 -1586 -480 1995 782 -2252 -253 1070 27 -2163 -1054
5138a054L055j398l022J691J802r41j945O77K270p60k903N80K938l6l003k19L348
$$ -1054 2001 603 -2419 -728 1074 133 -1812 -1135 1135 375 -2528 -1948 990 954 -2049 -2268 1080
5155A080j09l619J039L079n65l445N27L365r29k651J139K656n28l535P53L211
$$ 1080 971 -2648 -1609 1470 905 -2540 -2013 1352 423 -2228 -1089 1567 1039 -2496 -1743 1468
5171A468k65l173K20K960m7l626J067K177L81l571Q58L598j416l040O67K629M91
$$ 1468 1203 -1970 -1750 1210 1163 -2463 -1396 781 1162 -2409 -1551 2047 631 -2409 -1742 887 1378
5188A378k324m87L227M61l892J18L685M5l137J35K159K10k313J79K030l7k411
$$ 1378 -946 -1433 1794 2255 -1637 -1519 2166 2211 -926 -791 1368 1578 -735 -556 1474 1437 -974
5205i74o20K584N63j825j300K796R02k486j294J992J993k433j067K456J720l130
$$ -974 -1594 990 1553 -272 -1572 1224 2126 -360 -1654 338 2331 -102 -1169 1287 3007 -123
5221a23j209K657J024k412k190L890J47p18k125J181K326j783j872J907K450k617
$$ -123 -1332 1325 2349 -63 -2253 1637 1784 1066 -1059 122 2448 665 -1207 700 3150 533
5237E33k672K895J496l069j352L154J227k407j099J762J885k682j874K745K246
$$ 533 -2139 756 2252 -817 -2169 985 2212 -195 -1294 468 2353 -329 -2203 542 2788
5252B788l033k565J673L177k759n95J297J304j723j672J013J357l93k032K041
$$ 2788 -245 -2810 -1137 2040 -719 -1314 -17 1287 -436 -2108 -1095 262 -131 -2163 -122
5267a22J183j122k069J929K128j426j896M86K197j492j982R72L201j629k642J100
$$ -122 1061 -61 -2130 -201 1927 501 -1395 -909 1288 -204 -2186 -1214 1987 358 -2284 -1184
5283a184K166k52k504M17K666L04l245n4K936n06k191o33L298l87k945K11L400
$$ -1184 982 730 -1774 -1357 1309 1613 -1632 -1686 1250 744 -1447 -2080 1218 831 -2114 -1903 1497
5300A497n57l486J568K394n15k416n3K990l58k877J121K249j056k223P1L744p73
$$ 1497 940 -2546 -978 1416 901 -1515 -1568 1422 1064 -1813 -692 1557 501 -1722 -1651 2093 1320
5317A320k378k51K234N34l057O76K126O53k163p93L124m1l074k65J865P71j247
$$ 1320 -1058 -1309 925 1459 -1598 -922 1204 1857 -306 -1099 2025 1984 -1090 -1355 510 1281 34
5334C4j320K661J68j768j014L252k04j944l28K011O65k320q80K277J313k785n78
$$ 34 -1286 1375 1543 -225 -1239 2013 1809 -135 -463 1548 2213 -107 -987 1290 2603 -182 -760
5351g60J295J457j848j042J546J818j367k721K236J429j548j931K305J274k854
$$ -760 535 1992 144 -898 648 2466 1099 -1622 614 2043 495 -1436 869 2143 -711
5366g11p36K474J854k330j408J756P20j839j029J764J291j411k442L014N91j205
$$ -711 -1447 1027 2881 551 -857 899 1619 -220 -1249 515 1806 395 -2047 967 1558 353
5382C53j429J083P68j421j007J176J678k482l53J607K174k576p96L64J730M2l214
$$ 353 -1076 7 775 -646 -1653 -477 1201 -1281 -1634 -27 2147 -429 -1225 -861 869 911 -2303
5399b303J508K004k090j385J418K035j688j442J692J109M4k270L70K596p04j785
$$ -2303 -795 1209 -881 -2266 -848 1187 -501 -1943 -251 858 902 -1368 -998 1598 894 -891
5415h91N75R12q36j366m07L500L83m163K069J149q30j404q4K316p05k378Q75K848
$$ -891 -316 596 -240 -1606 -2013 1487 1870 -2293 -224 925 95 -1309 -1393 923 218 -2160 -1285 1563
5433A563j576q30j096L149j80l128J128J736j171r39L75K186k32k463O92K400
$$ 1563 -13 -843 -1939 1210 1030 -2098 -970 766 -405 -1344 -969 1217 985 -1478 -786 1614
5449A614l05k944O7K929j253m03k35J644o32j717L53K326k90j627K92J058N49
$$ 1614 1309 -1635 -1568 1361 108 -295 -530 1114 482 -1235 -882 1444 1154 -473 -181 877 1426
5466A426j451k194L025P96j709j19K138O90k633p08K610L06k766k46J850J327
$$ 1426 -25 -2219 806 1602 -107 -226 1912 2602 -31 -739 1871 2177 -589 -835 1015 2342
5482B342k457p16J146J032j409j366J627J461k253o36J894Q52j618j968K020J737
$$ 2342 -115 -831 315 1347 -62 -1428 199 1660 -593 -1229 665 1517 -101 -2069 -49 1688
5498A688j783j331J492J947l270j44K096P97j397q27J255J514k331o70Q37Q29
$$ 1688 -95 -1426 66 2013 -1257 -1401 695 1492 95 -732 523 2037 -294 -964 -127 702
5514G02j555k95J229N38j208j488J719J692k663q16J713Q60o09j877J366J705
$$ 702 -853 -1148 81 619 -589 -2077 -358 1334 -1329 -2145 -432 428 -181 -2058 -692 1013
5530A013j437r01P95J048p52r31J71K400j117o32m51J917j701n03J113K86k45
$$ 1013 -424 -1325 -530 518 -234 -1165 -994 1406 289 -343 -794 1123 -578 -1081 32 318 73
5547G3k019R6K332r2j840M0J874N62k724K25J951k39j192K66J380M81l013O61
$$ 73 -1946 -1850 482 390 -1450 -1410 464 1026 -1698 -1473 478 239 -953 -687 693 1174 -1839 -1178
5565a178K457j003k161J365J214o02r77oK134n33j785M83J657p53j088k47K795
$$ -1178 1279 276 -1885 -520 694 92 -885 -891 1243 710 -1075 -592 1065 312 -776 -1023 1772
5582A772j283j005K36J092N19k193m34K336K09j543L28J325L67j685n11J862k0
$$ 1772 489 -516 -280 812 1331 -862 -1296 1040 1249 -294 34 1359 1726 41 -470 1392 1372
5599A372j478k04J368J275k636k87J856L87j902l52M23J626j567R6J261J279k897
$$ 1372 -106 -310 1058 2333 -303 -590 1266 1653 -249 -601 -178 1448 -119 -23 1238 2517 -380
5616c80j114J979J709k563L45P3J796k883m58J816J101k097o78K696N23k440q61
$$ -380 -1494 485 2194 -369 -24 49 1845 -1038 -1496 320 1421 -676 -1354 1342 1865 -575 -1436
5633a436K357P38k531n18K037L19j511j400K250L31j178j497K174R27j694r85
$$ -1436 921 1659 -872 -1390 647 966 -545 -1945 305 636 -542 -2039 135 1062 -632 -1617
5649a617J195L83l57r89J368Q35q85j828J493J714j685j430J591O45j501k78N86
$$ -1617 -422 -39 -396 -1385 -17 818 -67 -1895 -402 1312 -373 -1803 -212 433 -1068 -1346 -760
5666g60J959p53j756J228Q01q79j383J221Q17J20k429J084R87Q31k414O4J392
$$ -760 1199 446 -1310 -82 719 -160 -1543 -322 495 615 -1814 -730 257 1088 -1326 -1262 130
5683A30n4j861M41J936M63j961P27O27l05j023J33P44M13k363J468J972k44k368
$$ 130 76 -1785 -1344 592 1055 -906 -179 448 143 -880 -747 -3 410 -1953 -485 1487 1243 -1125
5701a125O23J821j119j357J358J244r57j596j36K398l24j941M98J604%k502Q41
$$ -1125 -502 1319 200 -1157 201 1445 488 -1108 -1244 1154 830 -1111 -613 991 991 -1511 -670
5718f70J790m43j808j06K344m98o97l91J547j78j367K46J790M64k586m50J816
$$ -670 1120 677 -1131 -1237 1107 609 -88 -479 1068 890 -477 -231 1559 2023 -563 -1013 803
5735H03L54q12r56J201J027p92j179J000O78j148l37Q86l67k69r91J921k2p03
$$ 803 1157 345 -611 590 1617 825 -354 646 1324 176 -161 725 358 89 -902 1019 997 294
5753B94j654J904J125k496m17J027J573j359j271J775J040j804o23P04J346j760
$$ 294 -1360 544 1669 -827 -1244 -217 1356 -3 -1274 501 1541 -263 -886 -182 1164 -596
5769e96j083K912L70j773j084J380P90j140j058N25K614k316j268J029K334k823
$$ -596 -1679 1233 1603 -170 -1254 126 916 -224 -1282 -757 1857 -459 -1727 -698 1636 -1187
5785a187lJ306O32j480n11J405J296j063k170J121J716j856j094J353J912k410
$$ -1187 -1190 116 748 -732 -1243 162 1458 395 -1775 -654 1062 -794 -1888 -535 1377 -1033
5801a033o51J560P85o54k808K351J248p20p53m82J621J88j534L67J488p80j554
$$ -1033 -1684 -124 661 7 -2801 -450 798 78 -675 -1157 464 652 -882 -515 973 193 -1361
5818a361P27J299q0j379J58J428Q5k488K41K428m70p40k66K047j85l251R52K382
$$ -1361 -634 665 585 -794 -636 792 877 -1611 -1370 1058 588 -152 -418 1629 1444 -1807 -855 1527
5836A527k02k557J32K154j84j658O44Q64K6q66o33J766p85n51p06J643k34j036
$$ 1527 1325 -1232 -1100 1054 870 -788 -144 720 746 -120 -753 1013 228 -323 -1029 614 380 -656
5854f56L02J153l44q78J34J185j52r13m02J199J05j508K26N51J197j199q03J413
$$ -656 -354 799 455 -423 -289 896 744 -169 -571 628 733 -775 -549 2 1199 0 -803 610
5872F10L14o94p46J174P02j697k58P37J629p21o74K32J46K04j150Q21K52j677
$$ 610 924 230 -516 658 1360 -337 -595 142 1771 1050 376 608 754 958 -192 629 881 -796
5890g96L92P19N43o22k173J765K46k08p79J451N67j832M8J080J058j878n56J393
$$ -796 -404 315 858 236 -1937 -172 74 -134 -913 538 1105 -727 -679 401 1459 -419 -975 418
5908D18q4j40j347K12J661q38r97J31J489j208n10R28L77p0n58Q87p13o19K12
$$ 418 334 194 -1153 -941 720 -118 -1115 -984 505 -703 -1213 -285 92 22 -536 351 -362 -981 -769
5927g69J68J044j195n0P87R10j316m84r0J239J29r36P2P03l46j237J591l35q74
$$ -769 -601 443 -752 -802 -15 895 -421 -905 -995 244 373 -563 -491 212 -134 -1371 220 -115 -989
5946i89m74O19K304j229j389Q31J663p68k084J016J601j02k439J146J264j89j255
$$ -989 -1463 -844 1460 231 -1158 -327 1336 568 -1516 -500 1101 999 -1440 -294 970 781 -474
5963d74q1J563m65k228J681Q95K08r65p42K082p02j008n07J390K01j298J88K031
$$ -474 -555 1008 543 -1685 -4 891 1099 134 -608 1474 772 -236 -743 647 848 -450 -262 1769
5981A769q97j687L77K104m25j988j44J035M75p83n0J973p34j485j6Q69R10j043
$$ 1769 872 -815 -438 1666 1241 -747 -891 144 619 -164 -214 1759 1025 -460 -476 393 1303 260
5999B60n23J27J345j516J62R73J93p21j305R70O56q04j032J318J483j459q61O50
$$ 260 -263 -136 1209 -307 -145 828 1021 300 -1005 -35 621 -183 -1215 103 1586 127 -734 -84
6017h4J425j755j211J672J309j388j930K298L86j205m12P02J486j685o35J112
$$ -84 1341 -414 -1625 47 1356 -32 -1962 336 722 -483 -895 -193 1293 -392 -1027 85
6033H5M2m32j031J911L80j268m39J265O65j636l96K89J605k262L30O42M73r31
$$ 85 127 -305 -1336 575 955 -313 -752 513 1178 -458 -854 -565 1040 -1222 -892 -250 223 -708
6051g08P03l4Q04j002j087J047j54P36j396J132J005q76j943J283Q02m57r87J512
$$ -708 -5 -39 765 -237 -1324 -277 -431 305 -1091 41 1046 170 -1773 -490 312 -145 -1132 380
6069C80J71n01r82L54J467n56m09n08M83P11k361J695j63L46r13p0J576kj695
$$ 380 551 50 -932 -578 889 333 -76 -584 -101 610 -1751 -56 -219 127 -786 -856 720 718 -977
6088i77K68J346l68r78o7J273M08k135m58L117j325o21L20O20M9j513J040M29
$$ -977 -709 637 269 -709 -776 497 905 -1230 -1688 1429 104 -517 -197 423 472 -1041 -1 428
6106D28L80q86M02j70J032j466m6J449q25j023P82J428j347L02m9Q24l62q41l35
$$ 428 808 -78 324 154 1186 -280 -326 1123 298 -725 57 1485 138 440 391 1215 853 12 -323
6125c23J075r8r32l25J727l99p36J33Q42r24n60j14J091K05n22M64O79k86r09
$$ -323 752 654 -278 -603 1124 725 -11 122 964 40 -520 -634 457 662 140 604 1283 997 88
6144H8M3L38P19j000r06R37P07j104l94l6J617p56j091Q61J201j519l4N45k41
$$ 88 131 469 1188 188 -718 219 926 -178 -572 -608 1009 253 -838 23 1224 -295 -329 216 -25
6163b5m24k98P23M27k79j031Q32R28j354l09M09O61j177r82J890K9o00k73J064
$$ -25 -449 -747 -24 403 124 -907 -75 853 -501 -810 -401 260 -917 -1899 -9 20 -580 -853 211
6182B11j98J38q88J50J597j755n6J048j72o04K62k20J103j60r86k66J015p74N36
$$ 211 13 151 -737 -587 1010 -745 -801 247 75 -529 -267 -487 616 456 -530 -796 219 -555 -19
6201a9k70Q23q61l34k64J208m25o29J45J594q46j023J340J6j08m06j227J953o28
$$ -19 -289 534 -327 -661 -925 283 -142 -771 -626 968 122 -901 439 455 347 -59 -1286 667 39
6220C9j230J028J779q91j014m46N87P56r34L63J061j328p08P19J068o30k08j06
$$ 39 -1191 -163 1616 725 -289 -735 -148 608 -326 37 1098 -230 -938 -219 849 219 11 -95
6238i5O12k34o17N63N75m85m92j41M94l00K25N29R89j056p92Q27M1L3j07n08k54
$$ -95 517 283 -334 229 804 319 -173 -314 180 -120 105 634 1623 567 -225 602 643 676 569 61 -193
6259a93K54m26L83N09n8j080L63Q97P37j092j232J355J48k33o06J855j133k37
$$ -193 61 -365 18 527 469 -611 -248 649 1386 294 -938 417 565 332 -274 1581 448 211
6277B11j79Q95n3j007o21Q31K5m9j765J936O80p36j191R35R89j140l58P38O50
$$ 211 32 927 874 -133 -754 77 102 53 -1712 224 904 168 -1023 -88 901 -239 -597 141 791
6296G91j421o12J199N31o70n7o98K207k124N4P61j70l72j03K6K96k41j62L35N75
$$ 791 -630 -1242 -43 488 -182 -239 -937 1270 -854 -800 -39 -209 -581 -684 -658 -362 -603 -765 -430 145
6316A45N74j047K7J112j831k69J544Q9k81p62N14NL33q23k27J28J098j409J442
$$ 145 719 -328 -301 811 -1020 -1289 255 344 63 -699 -185 -180 153 -670 -897 -769 329 -1080 362
6335C62n1k21n19L40O71k91j048L85J318r42o62oJ563r26j87P23J1l23q65J275
$$ 362 311 90 -429 -89 582 291 -757 -372 946 4 -658 -664 899 -27 -214 509 520 197 -668 607
6355F07M27n45j287J106Q2q31m20J050M9n61j5m97J918n55o66J43J007p89j229
$$ 607 1034 489 -798 308 390 -441 -861 189 238 -323 -338 -835 1083 528 -138 5 1012 223 -1006
6374a006J284M59j023N0K05P5Q26j658J063N53L05j754O50J181j87j852J048l8
$$ -1006 278 737 -286 -236 -31 44 870 -788 275 828 1133 -621 29 1210 1023 -829 219 181
6392A81j71J94l78M20J71q77l55J378L40j203K05R60L33p92j815J160J309j015
$$ 181 10 204 -174 246 417 -460 -815 563 903 -300 -95 865 1198 406 -1409 -249 1060 45
6410D5Q7j05N13j273j1J232Pk1j065Q11m88l85o07J566l40K08j312Q85O75j297
$$ 45 132 27 540 -733 -744 488 495 474 -591 220 -268 -653 -1260 306 -34 174 -1138 -253 422 -875
6430h75K03R28m88J62j012Q24J295q37j366Q42J51K61j613J100K15J83q07L01
$$ -875 -672 256 -232 -70 -1082 -258 1037 200 -1166 -324 -173 88 -1525 -425 -210 -27 -834 -533
6448e33P22j93j57j032J280J04j414J000J124j518M02M07J72m54m43L76l07Q46
$$ -533 189 -4 -161 -1193 87 191 -1223 -223 901 -617 -215 192 364 -90 -533 -157 -464 382
6466C82j981J152J354q53m58l89N17k27o03N33J087m8m11k9R11p78l5l31J139
$$ 382 -1599 -447 907 54 -404 -793 -276 -503 -1106 -573 514 466 55 26 937 159 124 -207 932
6485I32l05j415P38J1Q08r97N93J17K57n08m46R75N03j069n16J310j93j395Q25
$$ 932 627 -788 -50 -39 769 -228 365 482 739 231 -215 760 1263 194 -322 988 795 -600 225
6504B25J217n34j373P68O18n83j492J562N69K8r81P63q33O3J08L92Q1o14p07l51
$$ 225 1442 908 -465 303 921 338 -1154 408 977 1005 24 787 -46 17 125 517 598 -16 -723 -1074
6524a074J905k35m60k07j00J329j125j24O10k78r5q12J314n04L16j224N88N00
$$ -1074 831 596 136 -71 -171 1158 33 -91 519 241 146 -666 648 144 460 -764 -176 324
6542C24n76o82Q53O21p32k60K9O60l25O05J71q53k79o63Q67J470j996K06M90J61
$$ 324 -252 -934 -81 540 -192 -452 -423 237 -88 517 688 -165 -444 -1107 -240 1230 -766 -560 -70 91
6562I1J53r85R61l91l66j40J155j013j52Q1j51M81J11m56K22P35j310K35J159
$$ 91 244 -741 220 -171 -537 -677 478 -535 -687 -606 -757 -276 -165 -621 -399 336 -974 -739 420
6581D20l52l50k58K69O85o36j25Jj40J99k92M98J98k44k65L37k12K32j32Q92j549
$$ 420 68 -282 -540 -271 414 -222 -347 -346 -486 -287 -579 -81 117 -127 -392 -55 -267 -35 -167 725 -824
6602h24J258q50J141l91j91J29K30o0j35p99P90L0n58N86m93Q36r63Q92p64N24
$$ -824 434 -416 725 334 143 272 502 442 307 -492 298 328 -230 356 -137 699 -264 628 -136 388
6622C88o19K06K45k10J95p37O19P23r22j61J9K68M32l50J62J70m20j78J007K82
$$ 388 -231 -25 220 10 205 -532 87 810 -112 -273 -254 14 446 96 258 428 8 -170 837 1119
6642A119j277L93k20M14O23j586J09J062q09p03L08J203j00j176m5J595m0j335
$$ 1119 -158 235 15 429 1052 -534 -425 637 -172 -875 -567 636 536 -640 -685 910 870 -465
6660d65k68J373j97q90P98q13J076l61l95j71o2O50K37o19j9n87L79p7O71l74
$$ -465 -733 640 443 -447 351 -462 614 253 -142 -313 -375 275 512 -107 -126 -713 -334 -411 260 -114
6680a14J323j512L29j494O20O31P56q32r9N44m8m77o02N09Q66j224M32R58j192
$$ -114 1209 -303 26 -1468 -848 -217 539 -293 -392 152 104 -373 -975 -466 400 -824 -392 566 -626
6699f26N13m61K81Q5L39j361K182j566P2M21J035l50j080j60k99J326j103J22
$$ -626 -113 -574 -293 -208 131 -1230 952 -614 -542 -121 914 564 -516 -676 -975 351 -752 -630
6717f30J172n18o87P96J93J25m71n55J06J212j033j080N20J550o23r64J311R2
$$ -630 542 24 -663 133 326 451 -20 -575 -469 743 -290 -1370 -850 700 77 -887 424 516
6735E16J74j416J442N21k76j57o20m4O19j510k53J774M7j684R16J086m39j146
$$ 516 690 -726 716 1237 961 804 184 140 759 -751 -1004 770 817 -867 49 1135 696 -450
6753d50J049Q5q24K16p51O96M56j341k49J624k70K1n27R11o83p53L05J526o31
$$ -450 599 684 -140 76 -675 21 477 -864 -1113 511 241 262 -265 646 -37 -790 -485 1041 410
6772D10j195J218l88N90n46p46K130r13j275J208m12m53M45k62L73K6m57j71J537
$$ 410 -785 433 45 635 89 -657 1473 560 -715 493 81 -372 73 -189 184 210 -247 -418 1119
6791A119n32l70m8N08N50k65j303Q80j02p75k09P64k41J2k56R17o06n15j33J320
$$ 1119 587 217 169 677 1227 962 -341 539 437 -338 -547 217 -24 -12 -268 649 43 -472 -605 715
6811G15p46J10o64J026k00m15K3l28P54n76l94L33O98o36n85J393j78q17k71j44
$$ 715 -31 79 -585 441 241 -174 -151 -479 275 -301 -695 -362 336 -300 -885 508 330 -487 -758 -902
6831i02P96q05K69k39J252j339n8J193N44r07j41k49O57k68j5l42L34P43r69K73
$$ -902 -106 -911 -642 -881 371 -968 -1026 167 711 -196 -337 -586 71 -197 -212 -554 -220 523 -446 -173
6851a73j17K17k95R0J313q16j88r82P00R9N58m81k21P42p88P17P50p66r41O25
$$ -173 -290 -73 -368 -278 1035 219 31 -951 -251 -152 406 -75 -296 446 -342 375 1125 359 -582 43
6871D3L36j077J00R10j62K8L70o09M83j342J122j7L88K9j246j70K426r21r17Q92
$$ 43 379 -698 -598 312 150 178 548 -61 422 -920 202 185 573 602 -644 -814 1612 691 -226 666
6891F66m32q1q0J43N54r34l39J461j28k93j28q71Q67K07n46M7P40N0n12n44K52
$$ 666 234 153 73 216 770 -164 -503 958 830 537 409 -462 405 612 66 113 853 903 391 -153 99
6912I9Ok31r5O74m59n8N85m36J60r37R42O27j904M16J97L03N7p53J42M75J337
$$ 99 105 -126 -221 453 -6 -64 521 85 245 -692 250 877 -1027 -611 -414 -111 -54 -807 -665 -190 1147
6933A147l40j189P36L31r64n23Q11M6m55J033Qp01j419N24N77J230j514R64k51
$$ 1147 807 -382 354 685 -279 -802 9 55 -400 633 641 -60 -1479 -955 -378 852 -662 302 51
6952E1N6Rj57k39k86j96k69J120M91j506J303l76j72J52J51Q7j079P7m13J192
$$ 51 107 116 -41 -280 -566 -762 -1031 89 580 -926 377 1 -171 -19 132 219 -860 -783 -1196 -4
6972dj48J52j24L88o31k64K22O06M95p50p38R11j7K06q58J075q29N33l58n96O42
$$ -4 -152 0 -124 264 -367 -631 -409 197 692 -58 -796 115 98 304 -554 521 -308 225 -133 -729 -87
6993h7N02o41J006J38m96p50k8P45J49o66k26M56n84K30O29L96o59J65r26R21
$$ -87 415 -226 780 918 422 -328 -356 389 538 -128 -354 102 -482 -252 377 773 114 279 -647 274
7013B74l85j83j28J310q1k96J28j241O15n1K5L1k41N17M73l11l5p19O94R96k98
$$ 274 -111 -294 -422 888 807 511 639 -602 13 -38 -13 18 -223 294 767 456 421 -298 396 1392 1094
7034A094j778J562n17P89j102l96M92j92J071j504P56M07j020P9P17R77j422K69
$$ 1094 -684 878 361 1150 48 -348 144 -48 1023 -481 275 682 -338 -259 458 1435 13 282
7052B82O04m33p24k8K68Ro6Q46m47K34j16m52K96J41o16j76R92l84p27J23M97
$$ 282 886 453 -271 -299 -31 -22 -88 758 311 545 429 -23 273 414 -202 -378 614 230 -497 -374 123
7073A23r3m43L23m60J131o69J14p62N54p94P67N05n1p86L49k13R70j372j83M65
$$ 123 30 -413 -90 -550 581 -88 26 -736 -182 -976 -209 296 245 -541 -192 -405 565 -807 -990 -525
7093e25K71k57K70K87J62k13k45J217p54n14m84J064l52K57j077J174N45j169
$$ -525 -254 -511 -241 46 208 -5 -250 967 213 -301 -785 279 -73 184 -893 281 826 -343
7111c43Q02K44o53O44p81M54l32o07K24L18J042l26p08O79N22k130M01N81P0j00
$$ -343 459 703 50 694 -87 367 35 -572 -348 -30 1012 686 -22 657 1179 -951 -550 31 101 1
7131Ao28O29p3l13N2N66N15r79j96N72k62P92o40n95P17k7l12K30N78q19m03J180
$$ 1 -627 2 -71 -384 -332 234 749 -230 -426 146 -116 676 36 -559 158 131 -181 49 627 -192 -595 585
7153E85m09R49o35o07jK9k53J26Q48l33M10j91m73j11K28j121J682l82p82Q57
$$ 585 176 1125 490 -117 -118 -89 -342 -216 632 299 709 518 45 -66 162 -959 723 341 -441 416
7173D16J85k26m34k65J461j15m50j105J146p73J59K47J03n99L5K99m78R6J11l38
$$ 416 601 375 -59 -324 1137 1022 572 -533 613 -160 -1 246 349 -250 -215 84 -394 -298 -187 -525
7193e25N72m6p04N74J19r3M21n18L9m72K47k97N46M59q95N00O23j204N34n83N92
$$ -525 47 1 -703 -129 -10 -103 318 -200 -161 -633 -386 -683 -137 322 -573 -73 550 -654 -120 -703 -111
7214a11J41j19M15K43l74o14K89o6p22P16j656K402o18J98j118J320L89j069M27
$$ -111 30 -89 326 569 195 -419 -130 -196 -918 -202 -1858 544 -74 124 -994 326 715 -354 73
7233G3k01O0o95J282n26R9o51L22m9J106l11r43M34n4O44k03n51L95K88j001K65
$$ 73 -128 -68 -763 519 -7 92 -559 -237 -286 820 509 -434 0 -54 590 387 -164 231 519 -482 -217
7254b17P7j05m76O18j68O93k65l4O00l73m23o42K90J098j055L97M84j65o57J26
$$ -217 -140 -245 -721 -103 -271 422 157 123 723 350 -73 -715 -425 673 -382 15 499 334 -323 -197
7274a97M72j127N49n0Q39n5j254Q79L14J08j59q52O33R9n76M59J42k00m44K99
$$ -197 275 -852 -303 -353 486 431 -823 56 370 478 319 -533 100 199 -377 82 224 24 -420 -121
7294a21M87P30j149M8k34J28o43N13M64K13n70L16L34m19n65J318j632J105q15
$$ -121 366 1096 -53 -5 -239 -111 -754 -241 223 436 -134 182 516 97 -468 850 -782 323 -492
7313d92J104J01o78l90R2j28N72o00j26M06O48q20K86Q69p38m6l97n2j25m68M93
$$ -492 612 713 35 -355 -263 -391 181 -419 -545 -139 509 -311 -25 844 106 60 -337 -389 -514 -982 -489
7334d89K69J112j410n87J399m03p76L84R78M30r08j054Q30O70k97o96K54M88q42
$$ -489 -220 892 -518 -1105 294 -109 -885 -501 477 907 -1 -1055 -225 445 148 -548 -294 194 -648
7353f48J78K85l40K90J47M62o05O28j073L78L67p94N40P77r10K10j14M49O70j129
$$ -648 -470 -185 -525 -235 -88 374 -231 397 -676 -298 69 -725 -185 592 -318 -108 -222 227 897 -232
7373b32M86j21K4o60Q53j307J194l46K15l36J186l47o52N54n30M53p50Q4J118
$$ -232 254 133 157 -503 350 -957 237 -109 106 -230 956 609 -43 511 -19 434 -316 -232 886
7392H86q22J80m91N96p78o53P95J080j627N89P42o20R90j159M48M04o64L46N9
$$ 886 64 244 -247 349 -429 -1082 -287 793 -834 -245 497 -123 867 -292 156 560 -104 242 301
7411C01k8nJ023j964N77M43J69q90P83l3O2m02M01q7J70n56m9j50M13j33l05K31
$$ 301 273 268 1291 -673 -96 347 516 -374 409 376 438 36 437 350 520 -36 -85 -235 178 45 -260 -29
7433b9N02n64qn54Q04o23Q77p17o23N46Rl58R93j546J652J17o38N35p51M10N4
$$ -29 473 -91 -99 -653 151 -472 405 -312 -935 -389 -380 -738 255 -1291 361 478 -160 375 -376 34 88
7454H8j165J544n86M89M3j77L09p50k95K17m68N13k00K71p05P93O74j130M84k93
$$ 88 -1077 467 -119 370 413 236 545 -205 -500 -283 -751 -238 -438 -167 -872 -79 595 -535 -51 -344
7474c44N66J52p08p12N68R54m85r47J029j20j68J96k25P76K18m92P0j83J74k85
$$ -344 222 374 -334 -1046 -478 476 -9 -956 73 -47 -215 -19 -244 532 750 258 328 145 319 34
7494C4n81P69m13L96r38J173j14R1o58Q04r77j28Q61k65p67J578r26J017L8j251
$$ 34 -547 222 -191 205 -733 440 326 417 -241 563 -414 -542 319 54 -713 865 -61 956 994 -257
7514b57k29J93M14L5q24J0Q87R57j586J031n34L99n52n12L60J08n49k43J715n48
$$ -257 -486 -293 121 156 -668 -658 229 1186 -400 631 97 496 -56 -568 -208 -100 -649 -892 823 275
7534B75k24O33o57o42J173k85K82J5o30P7J07K62m53P09q69N91q2l12n4m77L72
$$ 275 51 684 27 -615 558 273 555 570 -60 17 124 386 -67 642 -227 364 282 -30 -84 -561 -189
7555a89p94J326p46m87O16O77l71j57k01M15P41J26j160J41p5m95Q53O69p30q96
$$ -189 -983 343 -403 -890 -274 403 32 -125 -326 89 830 956 -204 -63 -138 -633 220 889 159 -737
7575g37M95O10j098J80R84k72j280Q49O65l69o22K72k05N59l04O10o83L01M2K95
$$ -737 -242 368 -730 -550 434 162 -1118 -269 396 27 -595 -323 -528 31 -273 337 -346 -45 -3 292
7595B92n40K39l44q7j52N24J22m80L88K49n10M46j330P03Q89l94m15L03K07m99
$$ 292 -248 -9 -353 -440 -592 -68 54 -426 -38 211 -299 147 -1183 -480 409 15 -400 -97 110 -389
7615c89L92l77n86Q98j111J389q35R79j727J172N34o82j73J060l3q14n80M96O93
$$ -389 3 -374 -960 -62 -1173 216 -619 360 -1367 -195 339 -343 -516 544 511 -303 -883 -387 306
7634C06m76N94o44N45N86j258P58J51m25K67J020j409Q0m18J049j53k64q1l54
$$ 306 -170 424 -220 325 911 -347 411 562 137 404 1424 15 95 -323 726 573 309 228 -126
7653a26M06m36M05l23L37M36j383L43l2M15p70R43L31o04j26O69n50M83O36j037
$$ -126 280 -156 249 -74 263 699 -684 -341 -373 42 -728 215 546 -58 -184 485 -65 418 1054 17
7673A7l59J79M63q18P41j064J442p48L71l16L24P78q79m27m09J49Q11J86j17j14
$$ 17 -342 -163 300 -518 223 -841 601 -147 224 -92 232 1010 131 -296 -705 -556 255 441 324 210
7693B10M24j111O83N82m59j68k92P09r80m77J190m45p02P00N64m29Q07o72k19
$$ 210 634 -477 206 788 329 161 -131 578 -402 -879 311 -134 -836 -136 428 -1 806 134 -85
7712h5j24K06L66j90j257J276M61l89p60M27L48o00K12n98R71n76M63k10l00J8
$$ -85 -209 -3 363 173 -1084 192 653 264 -496 -69 279 -321 -109 -707 264 -312 151 -59 -359 -341
7732c41J081r23p68J512j319N55N44j203P94o61P51K77j82L56J40o44j1M00l81
$$ -341 740 -183 -951 561 -758 -203 341 -862 -68 -729 22 299 117 473 613 -31 -42 358 -23
7751b3k35j17M01K99p76P26J8k04m46m28Q70m25M73l20j21K48o8J042q34O62o3
$$ -23 -258 -375 26 325 -451 275 293 89 -357 -785 85 -340 133 -187 -308 -60 -128 914 80 742 679
7772F79l74k72M98m36J59j38Q39r83k14L78M00o07M2K20o32m3Q69l88K78k70L10
$$ 679 305 33 531 95 254 116 955 -28 -242 136 536 -71 -29 191 -441 -484 385 -3 275 5 315
7793C15o58K70N26m20M03n6j2j308Q67L74K85k40K46RO6p27l2K1M14l40m20N24
$$ 315 -343 -73 453 33 436 380 368 -940 -73 301 586 346 592 601 667 -60 -92 -71 343 3 -417 107
7815A07l89J29K44m19R61m03n09O2K02l2M09j68m19L47p43RJ041o00J23J79l71
$$ 107 -282 -153 91 -328 633 230 -279 -217 -15 -47 362 194 -225 122 -621 -612 429 -171 -48 131 -240
7836b40K7P31l80p30J565k035Q78K11o95N59L11q21O47l34M14o73M7M79m53J53
$$ -240 -213 518 138 -592 973 -1062 -184 27 -668 -109 202 -619 28 -306 108 -565 -518 -39 -492 -339
7856c39l15M78J96L52J42o32o54J048o88J15N13m47L94J5m18J086q19N9Q20j550
$$ -339 -654 -176 20 372 514 -118 -772 276 -412 -297 216 -231 163 178 -240 846 27 86 906 -644
7876f44R81J85j095R46l38k02n62Q50n56k41Q88l40K21p15O77k0k29J163q49m5
$$ -644 337 522 -573 373 35 -167 -729 121 -435 -676 212 -128 93 -622 55 35 -194 969 120 75
7896G5j38R6K13J49Pq56J590k125J078J05p9J144j512m91J279j53j013P38K32
$$ 75 -63 33 246 395 402 -454 1136 -989 89 194 115 1259 -253 -744 535 382 -631 107 339
7915C39j113Q55P65q02K74m54N68p51L24K17l29P29r68J82J31K43J48l79q36O76
$$ 339 -774 81 846 44 318 -136 432 -319 5 222 -107 622 -346 -164 -33 210 358 -21 -857 -181
7935a81K74l67oM79K66m94J67k65J35O80j326N5P35J09o01m17J381m91l99l11
$$ -181 93 -274 -280 199 465 -29 138 -127 8 688 -638 -583 152 261 -340 -757 624 133 -266 -577
7955e77N51M73ll18j14l79j82M0M60L65j046J192m14k09l64M73L46R2j082P04
$$ -577 -26 447 444 126 12 -367 -549 -509 -49 316 -730 462 48 -161 -525 -52 294 386 -696 8
7975HN94k55j45k85m47L97M97q74M07l62J53j77l44K98K4l2P92K7q98P38k87J74
$$ 8 602 347 202 -83 -530 -133 364 -510 -103 -465 -312 -489 -833 -535 -511 -543 249 276 -622 116 -171 3
7997Cm40m28O45l1O54n86O12r83j90R18j07L36l18p31P12L9m73j04R39Q92o94
$$ 3 -437 -865 -220 -251 403 -183 429 -554 -744 174 67 403 85 -646 66 105 -368 -472 467 1359 665
8018F65o33J17nn88J42N77K21j714J781p71K73O26m99K92m83R59r11K77L53M5
$$ 665 32 149 144 -444 -302 275 496 -1218 563 -208 65 691 192 484 1 960 49 326 679 724
8038G24l74M17K52j372L35L70q20P89m86N39K27l06o31M45o17r3J96Q86j001L37
$$ 724 350 767 1019 -353 -18 352 -468 321 -165 374 601 295 -336 109 -508 -601 -405 481 -520 -183
8058a83M20k19J248j380L55l99Q46j124J36K37l42R16p75O56l33k09n88J038O09
$$ -183 237 18 1266 -114 241 -158 688 -436 -300 -63 -405 511 -264 392 59 -150 -738 300 909
8077I09q80K44k21N22p22K03o9M20K27j084Ll30J036k22k52K88n17M12L97l30
$$ 909 29 273 52 574 -148 55 -14 406 633 -451 -448 -778 258 36 -216 72 -445 -33 364 34
8097C4R9r19N51L8K49m95n74J547o56p97K22J86M05K99m45P72r76K70k47L78L97
$$ 34 133 -786 -235 -197 52 -443 -1017 530 -126 -923 -701 -515 -110 189 -256 516 -460 -190 -437 -59 338
8118C38l12N82l54l19n64j66J45N32O42n7o06L81q09Q61l14N55o58r04Q02l59
$$ 338 26 608 254 -65 -629 -795 -650 -118 524 467 -139 242 -567 294 -20 535 -123 -1027 -225 -584
8138e84P66l32J304j391r14K425j346L87o49N96n1p06P8R40q85K26l8K36N29p03
$$ -584 182 -150 1154 -237 -1151 1274 -72 315 -334 262 211 -495 -417 523 -362 -136 -174 62 591 -112
8158a12J217j058K15q45O22R7p89J274k7k4M17l75p40R4P32o22n87P33K89m22
$$ -112 1105 47 262 -583 39 136 -653 621 594 570 987 612 -128 -34 698 76 -511 222 511 89
8178H9j97n9Q8O47p89N12l39L89k0L90k95l36m31
$$ 89 -108 -167 -79 568 -221 291 -48 341 321 711 416 80 -351
8191c51
$$ Imaginary data points
##PAGE= N=2
##DATA TABLE= (X++(I..I)), XYDATA
0@%%%%%%%O4j28J28j28J92k56K56l20M48n14N78p04Q32r62J095j271J491j714
$$ 0 0 0 0 0 0 0 0 64 -64 64 -64 128 -128 128 -192 256 -258 320 -384 448 -514 581 -690 801 -913
25i13J940k206K526k863L212l611M073m566N089n676O335p040P798q653R607j0631
$$ -913 1027 -1179 1347 -1516 1696 -1915 2158 -2408 2681 -2995 3340 -3700 4098 -4555 5052 -5579
41e579J1751j3015J4430j5984J7717j9705K1984k4576K7594l1193L5544m0884
$$ -5579 6172 -6843 7587 -8397 9320 -10385 11599 -12977 14617 -16576 18968 -21916
53b1916M7644n6570O8899q7029J16390j71777L10659j246825k313111L444209
$$ -21916 25728 -30842 38057 -48972 67418 -104359 206300 -1040525 -3353636 90573
63I0573J847844l100454k166827K862021J921640k633084j932958K589464J950739
$$ 90573 1938417 -1162037 -3328864 -466843 1454797 -1178287 -3111245 -521781 1428958
72A428958k177426j737450K179270J671964j968176j547754K011016J649032j707200
$$ 1428958 -748468 -2485918 -306648 1365316 -602860 -2150614 -139598 1509434 -197766
81a97766j533389J628944J475088j535401j532465J387915J538633j192209j490014
$$ -197766 -1731155 -102211 1372877 -162524 -1694989 -307074 1231559 39350 -1450664
90a450664J115039J495000j025907j528895R82505J648603p95196j589387Q63678
$$ -1450664 -335625 1159375 133468 -1395427 -412922 1235681 440485 -1148902 -285224
99b85224J788255p02658j819070O83903J960693n42558j980876N09929K066210
$$ -285224 1503031 800373 -1018697 -334794 1625899 1083341 -897535 -387606 1678604
108A678604m33025k115298L52080K074020m27430k200743L42705K168785l92129
$$ 1678604 1245579 -869719 -517639 1556381 1128951 -1071792 -729087 1439698 1047569
117A047569k221855L69657K165213n07533k300290M62108K307716m49551k282539
$$ 1047569 -1174286 -804629 1360584 853051 -1447239 -985131 1322585 873034 -1409505
126a409505M65652K260371n07522k292770M56770K252386m07265k152302M31176
$$ -1409505 -943853 1316518 808996 -1483774 -1027004 1225382 818117 -1334185 -903009
135i03009K099364m45850k086265L93481K018701l53708j940363L37539J903254
$$ -903009 1196355 750505 -1335760 -942279 1076422 722714 -1217649 -880110 1023144
$$ [...]
8191C75
##END NTUPLES=NMR FID
##END=
