##TITLE=1H_SAM_22.BBSX1.THF 2.2 TFA
 CDCl3, 64 sc, 
 7.5.2019
##JCAMPDX= 6.0         $$ Bruker NMR JCAMP-DX V2.0
##DATA TYPE= NMR FID
##DATA CLASS= NTUPLES
##ORIGIN= UXNMR, Bruker Analytische Messtechnik GmbH
##OWNER= root
$$ XWIN-NMR		Version 3.5
$$ Tue May  7 16:20:00 2019 Russian Standard Time (UT+4h)  she@DPX200
##.OBSERVE FREQUENCY= 200.1315
##.OBSERVE NUCLEUS= ^1H
##.DELAY= (6, 6)
##.ACQUISITION MODE= SIMULTANEOUS
##.ACQUISITION SCHEME= undefined
##.AVERAGES= 64
##.DIGITISER RES= 18
##SPECTROMETER/DATA SYSTEM= spect
##.PULSE SEQUENCE= zg30
##.SOLVENT NAME= CDCl3
##.SHIFT REFERENCE= (INTERNAL, CDCl3, 0, 15.7039)
##AUDIT TRAIL= $$ (NUMBER, WHEN, WHO, WHERE, WHAT)
$$ ##TITLE= Audit trail, XWIN-NMR		Version 3.5
$$ ##JCAMPDX= 5.01
$$ ##ORIGIN= Bruker BioSpin GmbH
$$ ##OWNER= she
$$ F:/spectra/data/she/nmr/H-F/1/audita.txt
$$ ##AUDIT TRAIL=  $$ (NUMBER, WHEN, WHO, WHERE, WHAT)
(   1,<2019-05-07 16:18:02.28 +0400>,<she>,<DPX200>,
      <continue with go, POWCHK disabled, PULCHK disabled
       configuration hash MD5:
       00 E9 B6 7A A2 85 ED C7 34 08 36 98 17 FE 4E 26
       data hash MD5: 16K
       E9 4A 80 A1 8F 8A 81 5F 65 54 14 30 43 6E 35 0E>)
$$ ##END=
$$ 
$$ hash MD5
$$ 84 17 39 BC A3 5E 97 06 E0 7B D7 02 32 3A 61 E2
##$RELAX= 
##$RELAX= 
##$RELAX= 
##$RELAX= 
##$RELAX= 
##$RELAX= 
$$ Bruker specific parameters
$$ --------------------------
##$DU= <F:/spectra>
##$EXPNO= 1
##$NAME= <H-F>
##$PROCNO= 1
##$TYPE= <nmr>
##$USER= <she>
##$AMP= (0..31)
100 100 100 100 100 100 100 100 100 100 100 100 100 100 100 100 100 100 
100 100 100 100 100 100 100 100 100 100 100 100 100 100 
##$AQSEQ= 0
##$AQ_mod= 1
##$AUNM= <au_zg>
##$AUTOPOS= <>
##$BF1= 200.13
##$BF2= 200.13
##$BF3= 200.13
##$BF4= 200.13
##$BF5= 200.13
##$BF6= 200.13
##$BF7= 200.13
##$BF8= 200.13
##$BYTORDA= 1
##$CFDGTYP= 0
##$CFRGTYP= 5
##$CHEMSTR= <none>
##$CNST= (0..31)
1 1 145 1 1 1 1 1 1 1 1 1 1 1 1 1 1 1 1 1 1 1 1 1 1 1 1 1 1 1 1 1 
##$CPDPRG= <>
##$CPDPRG1= <>
##$CPDPRG2= <>
##$CPDPRG3= <>
##$CPDPRG4= <mlev>
##$CPDPRG5= <mlev>
##$CPDPRG6= <mlev>
##$CPDPRG7= <mlev>
##$CPDPRG8= <mlev>
##$CPDPRGB= <>
##$CPDPRGT= <>
##$D= (0..31)
0 1.2 0 0 0 0 0 0 0 0 0 0.03 0 0 0 0 0 0 0 0 0 0 0 0 0 0 0 0 0 0 0 0 
##$DATE= 1557231144
##$DBL= (0..7)
120 120 120 120 120 120 120 120 
##$DBP= (0..7)
150 150 150 150 150 150 150 150 
##$DBP07= 0
##$DBPNAM0= <>
##$DBPNAM1= <>
##$DBPNAM2= <>
##$DBPNAM3= <>
##$DBPNAM4= <>
##$DBPNAM5= <>
##$DBPNAM6= <>
##$DBPNAM7= <>
##$DBPOAL= (0..7)
0.5 0.5 0.5 0.5 0.5 0.5 0.5 0.5 
##$DBPOFFS= (0..7)
0 0 0 0 0 0 0 0 
##$DE= 6
##$DECBNUC= <off>
##$DECIM= 24
##$DECNUC= <off>
##$DECSTAT= 4
##$DIGMOD= 1
##$DIGTYP= 9
##$DL= (0..7)
0 120 120 120 120 120 120 120 
##$DP= (0..7)
150 150 150 150 150 150 150 150 
##$DP07= 0
##$DPNAME0= <>
##$DPNAME1= <>
##$DPNAME2= <>
##$DPNAME3= <>
##$DPNAME4= <>
##$DPNAME5= <>
##$DPNAME6= <>
##$DPNAME7= <>
##$DPOAL= (0..7)
0.5 0.5 0.5 0.5 0.5 0.5 0.5 0.5 
##$DPOFFS= (0..7)
0 0 0 0 0 0 0 0 
##$DQDMODE= 0
##$DR= 18
##$DS= 0
$$ [...]
##$SUBNAM2= <"">
##$SUBNAM3= <"">
##$SUBNAM4= <"">
##$SUBNAM5= <"">
##$SUBNAM6= <"">
##$SUBNAM7= <"">
##$SUBNAM8= <"">
##$SUBNAM9= <"">
##$SW= 24.9337058887773
##$SWIBOX= (0..15)
0 0 2 0 0 0 0 0 0 0 0 0 0 0 0 0 
##$SW_h= 4990.01996007984
##$TD= 16384
##$TD0= 1
##$TE= 0
##$TE2= 300
##$TE3= 300
##$TEG= 300
##$TL= (0..7)
0 120 120 120 120 120 120 120 
##$TP= (0..7)
150 150 150 150 150 150 150 150 
##$TP07= 0
##$TPNAME0= <>
##$TPNAME1= <>
##$TPNAME2= <>
##$TPNAME3= <>
##$TPNAME4= <>
##$TPNAME5= <>
##$TPNAME6= <>
##$TPNAME7= <>
##$TPOAL= (0..7)
0.5 0.5 0.5 0.5 0.5 0.5 0.5 0.5 
##$TPOFFS= (0..7)
0 0 0 0 0 0 0 0 
##$TUNHIN= 0
##$TUNHOUT= 0
##$TUNXOUT= 0
##$USERA1= <user>
##$USERA2= <user>
##$USERA3= <user>
##$USERA4= <user>
##$USERA5= <user>
##$V9= 5
##$VALIST= <valist>
##$VCLIST= <CCCCCCCCCCCCCCC>
##$VD= 0
##$VDLIST= <DDDDDDDDDDDDDDD>
##$VPLIST= <PPPPPPPPPPPPPPP>
##$VTLIST= <TTTTTTTTTTTTTTT>
##$WBST= 1024
##$WBSW= 4
##$XGAIN= (0..3)
0 0 0 0 
##$XL= 0
##$YL= 0
##$YMAX_a= 3098708
##$YMIN_a= -3383937
##$ZGOPTNS= <>
##$ZL1= 120
##$ZL2= 120
##$ZL3= 120
##$ZL4= 120
##$ABSF1= 10
##$ABSF2= 0
##$ABSG= 5
##$ABSL= 3
##$ALPHA= 0
##$AQORDER= 0
##$ASSFAC= 0
##$ASSFACI= 0
##$ASSFACX= 0
##$ASSWID= 0
##$AUNMP= <proc_1d>
##$AZFE= 0.1
##$AZFW= 0.1
##$BCFW= 1
##$BC_mod= 2
##$BYTORDP= 1
##$COROFFS= 0
##$CY= 11.3945322036743
##$DATMOD= 1
##$DC= 2
##$DFILT= <>
##$DTYPP= 0
##$F1P= 18.9103706918063
##$F2P= -1.10871071338519
##$FCOR= 0.5
##$FTSIZE= 0
##$FT_mod= 4
##$GAMMA= 1
##$GB= 0.15
##$INTBC= 1
##$INTSCL= 1
##$ISEN= 128
##$LB= 0.24
##$LEV0= 0
##$LPBIN= 0
##$MAXI= 10000
##$MC2= 0
##$MEAN= 0
##$ME_mod= 0
##$MI= 1.114404
##$NCOEF= 0
##$NC_proc= 0
##$NLEV= 6
##$NOISF1= 3.799351
##$NOISF2= 2.8
##$NSP= 1
##$NTH_PI= 0
##$NZP= 0
##$OFFSET= 15.70392
##$PC= 1
##$PHC0= -8852.88
##$PHC1= 12.00026
##$PH_mod= 1
##$PKNL= yes
##$PPARMOD= 0
##$PSCAL= 0
##$PSIGN= 0
##$REVERSE= no
##$SF= 200.130013532006
##$SI= 16384
##$SIGF1= 3
##$SIGF2= 2
##$SINO= 400
##$SIOLD= 16384
##$SREGLST= <1H.CDCl3>
##$SSB= 0
##$STSI= 0
##$STSR= 0
##$SW_p= 3612.71676300578
##$SYMM= 0
##$S_DEV= 0
##$TDeff= 0
##$TDoff= 0
##$TI= <>
##$TILT= no
##$TM1= 0
##$TM2= 0
##$TOPLEV= 0
##$USERP1= <user>
##$USERP2= <user>
##$USERP3= <user>
##$USERP4= <user>
##$USERP5= <user>
##$WDW= 1
##$XDIM= 8192
##$YMAX_p= 0
##$YMIN_p= 0
$$ End of Bruker specific parameters
$$ ---------------------------------
##NTUPLES= NMR FID
##VAR_NAME=  TIME,          FID/REAL,        FID/IMAG
##SYMBOL=    X,             R,               I
##VAR_TYPE=  INDEPENDENT,   DEPENDENT,       DEPENDENT
##VAR_FORM=  AFFN,          ASDF,            ASDF
##VAR_DIM=   8192,          8192,            8192
##UNITS=     SECONDS,       ARBITRARY UNITS, ARBITRARY UNITS
##FACTOR=    0.0002004,     1,               1
##FIRST=     0,             0,               0
##LAST=      1.6414764,     0,               0
##MIN=       0,             -3383937,        0
##MAX=       1.6414764,     3098708,         0
$$ Real data points
##PAGE= N=1
##DATA TABLE= (X++(R..R)), XYDATA
$$ plain form
0 0 0 0 0 0 64 -64 64 -64 128 -128 192 -231 320 -383 442 -512 640 -768 892 -1027 1220 -1421 1651
23 1651 -1915 2208 -2520 2861 -3263 3712 -4189 4709 -5303 5951 -6650 7416 -8275 9219
37 9219 -10235 11344 -12590 13949 -15430 17079 -18921 20971 -23248 25810 -28758 32127
49 32127 -36018 40605 -46117 52853 -61284 72263 -87205 108782 -142867 205153 -356015
60 -356015 1484034 620865 -2045550 1468152 3098708 182447 -2111315 696637 2416086
69 2416086 -209107 -2324521 57136 1734482 -472442 -2258461 -130945 1427312 -524228
78 -524228 -2114478 -176928 1374430 -298286 -1812968 -171844 1309975 -148131 -1670452
87 -1670452 -325365 1154094 -56261 -1599816 -535162 928274 -111055 -1696482 -763543
$$ packed form
0@%%%%O4j28J28j28J92k56L20m23N51p03Q25r54J152j408J660j919K247k641L072
23A651l566M123m728N381o124O975p901Q898j0012J1254j2601J4066j5691J7494
37I219j9454K1579k3934K6539k9379L2509l6000L9892m4219M9058n4568O0885
49C2127o8145P6623q6722R8970j14137J33547j59468J95987k51649L48020n61168
60c56015J840049q63169k666415L513702J630556k916261k293762K807952J719449
69B416086k625193k115414K381657J677346k206924j786019K127516J558257j951540
78e24228j590250J937550J551358j672716j514682J641124J481819j458106j522321
87a670452J345087J479459j210355j543555J064654J463436j039329j585427R32939
$$ plain form
96 -763543 852932 2290 -1683433 -871150 923888 228297 -1591338 -864034 1167009
105 1167009 654474 -1324797 -778850 1336953 932179 -1125639 -648914 1533338 1134393
114 1134393 -1047160 -648709 1537308 1109652 -1094342 -631395 1583107 1049728 -1245257
123 -1245257 -742262 1534401 998865 -1292938 -768907 1495668 947602 -1327405 -822397
132 -822397 1403661 921687 -1243995 -781729 1308261 836615 -1224656 -800316 1193075
141 1193075 798811 -1145716 -816128 1042767 736331 -1092635 -878363 885468 751741
150 751741 -953055 -916205 707159 742863 -830787 -948546 587122 804648 -668655
159 -668655 -957568 469672 818834 -578821 -965675 466116 948365 -480727 -1032545
$$ packed form
96g63543J616475q50642j685723Q12283J795038o95591j819635P27304K031043
105A167009n12535j979271N45947K115803m04774k057818M76725K182252l98945
114A134393k181553L98451K186017m27656k203994M62947K214502n33379k294985
123a245257N02995K276663n35536k291803N24031K264575n48066k275007N05008
132h22397K226058m81974k165682M62266K089990m71646k061271M24340J993391
141A193075l94264j944527L29588J858895l06436j828966K14272J763831j33727
150G51741j704796L6850J623364L5704j573650j17759J535668K17526j473303
159f68655k88913J427240L49162j397655l86854J431791M82249j429092n51818
$$ plain form
168 -1032545 407925 1041513 -398086 -1072551 415444 1176803 -329872 -1164260 350979
177 350979 1249555 -257079 -1169620 365531 1304422 -261773 -1236911 340951 1342094
186 1342094 -234695 -1238504 348893 1351116 -261451 -1287357 316565 1360807
194 1360807 -214931 -1259991 280642 1305576 -212501 -1234470 245551 1261329
202 1261329 -165585 -1166173 201890 1174001 -153304 -1112366 165967 1124686 -94432
211 -94432 -1058878 85695 1035955 -57339 -1020304 12113 991716 21185 -994067
220 -994067 -114630 902613 82274 -950123 -187806 866828 158488 -931115 -282937
229 -282937 832281 236358 -894881 -322192 851660 310390 -906751 -398245 864433
$$ packed form
168a032545J440470O33588j439599o74465J487995P61359j506675q34388J515239
177C50979Q98576j506634r12541J535151R38891j566195r75138J577862J001143
186A342094j576789j003809J587397J002223j612567j025906J603922J044242
194A360807j575738j045060J540633J024934j518077j021969J480021J015778
202A261329j426914j000588J368063R72111j327305r59062J278333R58719j219118
211i4432r64446J144573R50260j093294r62965J032417R79603r70531j015252
220i94067Q79437J017243q20339j032397P62317J054634p08340j089603O48178
229b82937J115218n95923j131239N72689J173852n41270j217141N08506J262678
$$ plain form
238 864433 397702 -893552 -452319 866609 441681 -914058 -513175 874065 499976
247 499976 -903885 -550069 859381 509780 -914585 -571767 870269 545829 -892879
256 -892879 -575097 863804 555390 -877178 -572469 862360 581076 -839934 -580525
265 -580525 818158 572183 -807594 -580852 778882 576104 -766359 -598418 709456
274 709456 565752 -711467 -588134 669735 578277 -656364 -601120 610014 595481 -581834
284 -581834 -591823 575486 630881 -518497 -619865 514459 666904 -440934 -628232 464887
294 464887 687492 -401133 -666607 414028 722590 -346508 -692048 366775 741571
303 741571 -318602 -728067 330774 778394 -273529 -754201 293118 798412 -248191
$$ packed form
238H64433m66731j291254M41233J318928m24928j355739M00883J387240l74089
247D99976j403861L53816J409450l49601j424365L42818J442036l24440j438708
256h92879L17782J438901l08414j432568L04709J434829k81284j421010K59409
265e80525J398683k45975j379777K26742J359734k02778j342463J67941J307874
274G09456j43704j277219J23333J257869r1458j234641N5244J211134j4533j177315
284e81834r989J167309N5395j149378j01368J134324J52445j107838j87298J093119
294D64887K22605j088625k65474J080635L08562j069098l45540J058823L74796
303G41571j060173m09465J058841M47620j051923m80672J047319N05294j046603
$$ plain form
312 -248191 -779053 268646 825479 -221513 -804083 229596 823766 -205076 -813605
321 -813605 208392 828432 -187438 -823617 173553 814734 -169665 -822210 150952 812754
331 812754 -144939 -818236 118316 801369 -115455 -801019 94884 788209 -83469 -784789
341 -784789 61844 772297 -43465 -755858 30744 750074 -11133 -744120 -11384 735609
351 735609 36664 -721621 -52538 715698 72039 -710245 -96569 698124 112001 -696917
361 -696917 -141408 677390 147552 -684383 -183807 661288 185628 -677079 -231369 643095
371 643095 220998 -666606 -269020 631426 253924 -660451 -305545 619259 283115 -650438
381 -650438 -334224 608319 313179 -635305 -360228 594044 339705 -619335 -382431 580928
$$ packed form
312b48191n30862J047699N56833j046992n82570J033679N94170j028842o08529
321h13605J021997O20040j015870o36179R97170O41181r84399o52545R73162O61802
331H12754r57693o73297R36552O83053r16824o85564Q95903O93325q71678p01320
341g84789Q46633P10453q15762p12393P86602P19330p61207p32987P32736P46993
351G35609o98945p58285O69083P68236o43659p82284O13676P94693n86123q08918
361f96917N55509Q18798n29838q31935N00576Q45095m75660q62707M45710Q74464
371F43095m22097q87604L97586R00446l77502r14375L54906R24804l36144r33553
381f50438L16214R42543k95140r48484K75077R54272k54339r59040K36904R63359
$$ plain form
391 580928 363895 -602371 -403157 567254 387996 -580283 -414668 554033 407940 -557913
401 -557913 -426795 535737 426442 -528163 -435910 515305 444202 -496103 -444312 493019
411 493019 462842 -465384 -456848 465495 477343 -435012 -467499 440401 494265 -401796 -476532
422 -476532 409078 506134 -366776 -485781 376801 520207 -333192 -496205 348253 537098
432 537098 -297588 -510363 315452 551745 -266137 -523823 284423 565298 -236277 -536064
442 -536064 256187 575056 -208625 -549265 224395 585860 -177858 -559513 194846 593899
452 593899 -152180 -570426 166149 598033 -131495 -579327 142188 601314 -113917 -586312
462 -586312 118481 602188 -92640 -591311 89227 597514 -71166 -592577 60344 590840
$$ packed form
391E80928k17033r66266J99214R70411j79258r68279J65615R68701j46093r65853
401e57913J31118R62532j09295r54605R2253R51215p1103r40305N1791R37331
411D93019l0177r28226Q536R22343J1848r12355l2487R07900N3864q96061p4736
422d76532Q85610R7056q72910j19005Q62582J43406q53399j63013Q44458J88845
432E37098q34686k12775Q25815K36293q17882k57686Q08246K80875q01575k99787
442e36064P92251L18869p83681l40640P73660L61465p63718l81655P54359L99053
452E93899p46079m18246P36575M31884p29528m47832P21515M59126p15231m72395
462e86312P04793M83707o94828m98671O80538N08287o68680n21411O52921N30496
$$ plain form
472 590840 -49086 -590544 31493 579206 -29663 -583688 7145 566800 -10116 -580098
482 -580098 -20717 554838 13135 -570520 -48325 543965 40780 -561252 -81094 530218
492 530218 71056 -548853 -112698 516543 100917 -537024 -143826 500582 126876 -523458
502 -523458 -168642 489680 151733 -515778 -194745 482496 179885 -508055 -223783 475094
512 475094 209795 -499616 -251470 467330 240443 -481931 -272618 453431 258434 -468033
522 -468033 -286196 444963 275542 -456342 -297438 438216 291806 -444353 -307744 434593
532 434593 313036 -431947 -326825 416742 329905 -405806 -332531 399793 342836 -379955
542 -379955 -338781 375877 350278 -351237 -336577 359258 357456 -331781 -347251 338798 372697
$$ packed form
472E90840o39926n41458O22037N47713o08869n54025N90833N59655n76916n69982
482e80098N59381N75555n41703n83655N22195N92290n03185o02032M80158O11312
492E30218m59162o19909M36155O29241m15626o37941L93198O44408l73706o50334
502e23458L54816O58322l37947o67511L21033O77241l02611o87940K84272O98877
512D75094k65299p09411K48146P18800k26887p22374K09313P26049j94997p26467
522d68033J81837P31159j69421p31884J58904P35654j46410p36159J36609P42337
532D34593j21557p44983J05122P43567q6837p35711P3275P32324n6957p22791
542c79955M1174P14658k5599p01515J4660O95835j802o89237j5470O86049L3899
$$ plain form
553 372697 -305602 -357849 316577 389344 -279522 -375576 286626 408431 -240985 -385466
563 -385466 251361 413292 -214502 -394499 228956 427599 -187637 -402406 207208 435099
573 435099 -176901 -420333 195970 459809 -156932 -442981 165657 468917 -134302 -452947
583 -452947 144787 477787 -114792 -462355 118362 468900 -103099 -457823 113575 469719
593 469719 -101297 -467772 97975 471450 -86874 -465970 83927 468957 -76478 -472973
603 -472973 55486 461171 -46385 -454781 31176 440356 -32779 -444781 9554 425836
613 425836 -9351 -426136 -9107 407260 526 -426324 -31819 408370 35905 -418055
623 -418055 -70295 393175 63523 -410534 -100269 389616 101886 -400765 -139164 367195
$$ packed form
553C72697o78299n2247O74426P2767o68866r6054O62202J21805o49416j44481
563c85466O36827J61931o27794j79997O23455J98643o15236k14769O09614K27891
573D35099o12000k43432O16303K63839o16741k86049O08638L03260o03219l18645
583d52947N97734L33000n92579l47563N80717L50538n71999l54724N71398L56144
593D69719n71016l66475N65747L73475n58324l79096N49897L85030n45435l96495
603d72973N28459M05685n07556m08396M85957M09180m73135m12002M54335M16282
613D25836m35187m16785M17029M16367m06734m26850L94505M40189l72465m53960
623d18055L47760M63470l29652m74057L10265M89885k87730n02651K61601N06359
$$ plain form
633 367195 121348 -388594 -150185 371624 142421 -394736 -178539 366362 162397 -392015
643 -392015 -191263 377027 185433 -400635 -223356 371472 211443 -383989 -229658 367804
653 367804 216647 -384035 -241633 361351 229285 -365362 -234650 354025 221370 -369240
663 -369240 -239608 353324 237782 -346992 -241546 335204 238752 -334489 -249221 323068
673 323068 258904 -300181 -253104 288114 252719 -273703 -246532 275022 265713 -245546 -256877
684 -256877 240637 267959 -221322 -259551 230771 292467 -198500 -289833 194433 310258 -163843
695 -163843 -296103 177676 327429 -148113 -323020 147042 343936 -117292 -321747 138692
705 138692 351969 -118554 -350344 124637 373494 -100152 -357672 116659 378221 -107111
$$ packed form
633C67195k45847n09942K38409N21809k29203n37157K16197N44901k03965n54412
643c92015K00752N68290j91594n86068J77279N94828j60029n95432J54331N97462
653C67804j51157o00682J42402O02984j32066n94647J30712N88675j32655n90610
663c69240J29632N92932j15542n84774J05446N76750r6452n73241Q5268N72289
673C23068o4164n59085M7077N41218l5395n26422K7171N21554r309n11259j1331
684b56877M97514K7322m89281l8229M90322O1696m90967r1333M84266J15825m74101
695a63843j32260M73779J49753m75542j74907M70062J96894m61228k04455M60439
705A38692K13277m70523k31790M74981K48857m73646k57520M74331K61562m85332
$$ plain form
715 -107111 -378099 111785 396490 -88778 -380438 97343 383816 -93260 -381886 94469
725 94469 389368 -78527 -374552 77692 365001 -83911 -365653 83581 368876 -72254
735 -72254 -364269 56339 346671 -61550 -349801 48575 343406 -39517 -345080 10582
745 10582 317014 -12561 -317633 -3384 304988 2836 -318602 -38294 291960 34835
755 34835 -298671 -53224 286847 48293 -312064 -90129 288263 88931 -299881 -116090
765 -116090 281754 105381 -310045 -145704 288320 142188 -299180 -164649 277761 142761
775 142761 -309217 -170671 296749 162597 -310204 -180875 294514 162255 -316700 -180849
785 -180849 312656 183166 -314491 -196877 295266 182319 -299441 -182740 298738 186109
$$ packed form
715a07111k70988M89884K84705m85268k91660M77781K86473m77076k88626M76355
725I4469K94899m67895k96025M52244K87309m48912k81742M49234K85295m41130
735g2254k92015M20608K90332m08221k88251L98376K94831l82923l05563L55662
745A0582L06432l29575l05072L14249L08372l02152l21438K80308L30254k57125
755C4835l33506K45447L40071k38554l60357K21935L78392j99332l88812J83791
765a16090L97844j76373m15426J64341M34024j46132m41368J34531M42410j35000
775A42761m51978J38546M67420j34152m72801J29329M75389j32259m78955J35851
785a80849M93505j29490m97657J17614M92143j12947m81760J16701M81478j12629
$$ plain form
795 186109 -291706 -188433 277048 179879 -267490 -165936 277517 177675 -266091 -179515
805 -179515 256926 189885 -231315 -173348 240471 194551 -216582 -191439 211530 213336 -174156
816 -174156 -187706 184555 206917 -161291 -199546 170632 231765 -130350 -209073 146546 234610
827 234610 -126078 -229887 141557 270709 -103297 -256870 111282 276293 -91055 -268031
837 -268031 106478 298648 -77328 -284187 84894 294940 -76589 -283709 96187 308338
847 308338 -83334 -307276 83931 312710 -77073 -304809 88204 317757 -80520 -319534
857 -319534 69537 311195 -64238 -298528 66765 294009 -71458 -298241 58031 285788
867 285788 -56105 -279169 50057 267423 -58338 -280891 33920 267489 -29145 -267832
$$ packed form
795A86109m77815J03273M65481r7169m47369J01554M43453r9842m43766Q6576
805a79515M36441o7041m21200N7967M13819m5920m11133K5143M02969J806l87492
816a74156j3550L72261K2362l68208l8255L70178O1133l62115p8723L55619Q8064
827B34610l60688j03809L71444J29152l74006j53573L68152J65011l67348j76976
837b68031L74509J92170l75976k06859L69081K10046l71529k07120L79896K12151
847C08338l91672k23942L91207K28779l89783k27736L93013K29553l98277k39014
857c19534L89071K41658l75433k34290L65293K27244l65467k26783L56272K27757
867B85788l41893k23064L29226K17366l25761k22553L14811K33569k96634k38687
$$ plain form
877 -267832 8189 245357 -16356 -259070 -10872 242237 11635 -247212 -40352 220726
887 220726 25715 -238746 -49070 227180 49961 -243120 -79856 221737 68528 -241377
897 -241377 -92808 233112 93042 -248590 -123421 227883 113169 -239959 -126879 232560
907 232560 122041 -249244 -144008 234907 134627 -244017 -141055 240049 133382 -255303
917 -255303 -149959 246484 148857 -242839 -147831 238889 143553 -244367 -152434 237079 155230
928 155230 -224424 -147269 221218 144717 -215772 -139810 219002 153754 -199632 -144859 197565
939 197565 149219 -182592 -141168 190346 163294 -163573 -152682 162787 166372 -139139 -153244
950 -153244 153395 177770 -125997 -168115 130812 187400 -104243 -168937 121865 196808 -97462
$$ packed form
877b67832K76021K37168k61713k42714K48198K53109k30602k58847K06860K61078
887B20726j95011k64461J89676K76250j77219k93081J63264L01593j53209l09905
897b41377J48569L25920j40070l41632J25169L51304j14714l53128J13080L59439
907B32560j10519l71285J05236L78915j00280l78644J02962L81104j06667l88685
917b55303J05344L96443r7627l91696R5008L86720r5336l87920R1933L89513q1849
928A55230l79654P7155L68487p6501l60489P5962L58812o5248l53386N4773L42424
939A97565m8346l31811M1424L31514k7052l26867J0891L15469L585l05511j4105
950a53244L06639K4375l03767m2118K98927N6588k91643o4694K90802P4943k94270
$$ plain form
961 -97462 -189736 105552 212449 -78820 -196963 95977 220410 -76654 -213249 85990
971 85990 235370 -63770 -219184 78995 236234 -66900 -230502 75231 245597 -59121
981 -59121 -234788 66306 241515 -60540 -238220 64607 246247 -53749 -240074 53653
991 53653 236871 -54168 -235914 52405 234643 -48840 -235204 37036 222504 -40828
1001 -40828 -225397 30802 215344 -33296 -223755 12409 205700 -19847 -213641 3163
1011 3163 198129 -10411 -213269 -13964 191519 6076 -203228 -28521 185143 17934
1021 17934 -204396 -47244 183175 37759 -198932 -60938 179939 49203 -199238 -76097
1031 -76097 182691 66830 -197273 -87876 180195 74031 -199350 -94286 186675 87800
$$ packed form
961i7462r2274K95288J06897k91269j18143K92940J24433k97064j36595K99239
971H5990J49380k99140j55414K98179J57239l03134j63602L05733J70366l04718
981e9121j75667L01094J75209l02055j77680L02827J81640k99996j86325K93727
991E3653J83218k91039j81746K88319J82238k83483j86364K72240J85468k63332
1001d0828j84569K56199J84542k48640j90459K36164J93291k25547j93794K16804
1011C163J94966k08540k02858J99305K05483j85443k09304J74707K13664j67209
1021A7934k22330J57152K30419j45416k36691J37994K40877j30736k48441J23141
1031g6097K58788j15861k64103J09397K68071j06164k73381J05064K80961r8875
$$ plain form
1041 87800 -197505 -103995 185208 95851 -196647 -109060 189423 106350 -194831 -114257 186711
1052 186711 110547 -188814 -111275 187608 114514 -184570 -114987 183297 117717 -175439 -112479
1063 -112479 178752 120929 -167666 -116647 170443 127944 -154776 -117447 162034 129510 -145551
1074 -145551 -120397 152493 135878 -130776 -121787 140444 139027 -121213 -127316 129914 147799
1085 147799 -107521 -133814 116384 152869 -98220 -142164 107265 162592 -86314 -150909 95310
1096 95310 167476 -77741 -157269 86324 173738 -70294 -166229 76951 178763 -63644 -172847
1107 -172847 71441 185057 -59673 -181549 63292 188849 -55535 -185397 57023 190963
1117 190963 -52463 -189994 50894 189955 -47963 -191184 43405 188770 -44671 -191317
$$ packed form
1041H7800k85305R3510K89203q9357k92498Q7587K98483q3073l01181Q0574L00968
1052A86711p6164k99361P7539K98883p3094k99084O9583K98284o5580k93156O2960
1063a12479K91231n7823k88595N1019K87090m2499k82720L7329K79481l2524k75061
1074a45551K5154K72890j6615k66654Q989K62231j417k60240o103K57230J7885
1085A47799k55320k6293K50198L6485k51089m3944K49429N5327k48906o4595K46219
1096I5310P2166k45217p9528K43593Q7414k44032r5935K43180J01812k42407j09203
1107a72847K44288J13616k44730j21876K44841J25557k44384j29862K42420J33940
1117A90963k43426j37531K40888J39061k37918j43221K34589J45365k33441j46646
$$ plain form
1127 -191317 36596 185849 -38828 -190517 28962 181492 -33974 -189340 21877 177899
1137 177899 -27010 -185748 12025 172535 -19009 -183180 1845 167174 -9323 -179496
1147 -179496 -9060 163299 -55 -175592 -19636 159824 11306 -172490 -31228 156613
1157 156613 22077 -169553 -39969 155527 33812 -166378 -50674 154135 45574 -164174
1167 -164174 -61417 154204 56216 -162004 -69600 154614 65950 -160975 -76822 155248
1177 155248 74456 -158774 -81702 154730 82175 -155909 -84891 154747 87901 -153969 -87685
1188 -87685 154198 94425 -149776 -90923 153799 97626 -145411 -92314 149892 102510 -137448
1199 -137448 -94112 144389 105113 -129311 -94448 138143 108207 -122252 -96991 132113 111635
$$ packed form
1127a91317K27913J49253k24677j51689K19479J52530k15466j55366K11217J56022
1137A77899k04909j58738J97773J60510j91544j64171J85025J65329j76497j70173
1147a79496J70436J72359j63354j75537J55956J79460j48518j83796J41262J87841
1157A56613j34536j91630J29584J95496j21715k00190J15704K04809j08561k09748
1167a64174J02757K15621r7988k18220R2404K24214q8664k26925Q4153K32070
1177A55248q0792k33230P7072K36432p2555k38084P1018K39638o6846k41870O6284
1188h7685K41883n9773k44201N8853K44722n6173k43037N3097K42206m7382k39958
1199a37448M3336K38501l9276k34424L4863K32591k9936k30459K5261K29104k0478
$$ plain form
1210 111635 -114431 -99262 124424 116008 -104903 -104075 115304 120844 -95284 -109271 104067
1221 104067 125160 -85562 -113824 93952 129844 -76848 -118870 86228 133782 -70995 -126144
1232 -126144 78098 139889 -65535 -134944 70097 145855 -59507 -142968 61607 151255 -52375
1243 -52375 -148268 53405 151714 -47936 -151826 47957 153796 -45853 -155789 43737
1253 43737 153764 -47419 -158487 41522 155568 -44895 -163706 33800 155065 -38469
1263 -38469 -163203 26067 153149 -32886 -160056 19307 146148 -28616 -154779 14995
1273 14995 140639 -26293 -152268 10091 139344 -19440 -150680 1878 137441 -9518
1283 -9518 -150621 -10440 134468 4524 -145279 -22585 128535 13878 -140313 -29830
$$ packed form
1210A11635k26066J5169K23686q416k20911Q28K19379N540k16128j3987K13338
1221A04067K1093k10722k8262K07776L5892k06692m2022K05098M7554k04777n5149
1232a26144K04242O1791k05424o9409K05041P5758k05362q3461K04575Q9648k03630
1243e2375r5893K01673R8309j99650j03890J99783J05839j99649j09936J99526
1253D3737J10027k01183j11068K00009J14046k00463j18811J97506J21265j93534
1263c8469j24734J89270J27082j86035j27170J79363J26841j74764j26163J69774
1273A4995J25644j66932j25975J62359J29253j58784j31240J52558J35563j46959
1283i518j41103J40181J44908j29944j49803J22694J51120j14657j54191J10483
$$ plain form
1293 -29830 125672 22334 -135098 -36418 124616 27939 -136687 -42240 130780 42126 -138510
1304 -138510 -54488 132085 53798 -138000 -62251 134917 64859 -134515 -68937 129764 67522
1315 67522 -128565 -66061 131726 68436 -130905 -66144 136014 72865 -129652 -67196 139205
1326 139205 78510 -130992 -74259 136585 85938 -121310 -74510 127225 84708 -111964 -72932
1337 -72932 121477 84856 -102916 -68811 114333 81315 -101543 -72101 113289 89947 -95212
1348 -95212 -79550 103268 96085 -85921 -87305 93453 105275 -72249 -94124 77645 104162
1359 104162 -63128 -92218 72548 107593 -59592 -101414 66835 113162 -57873 -110792 65899
1370 65899 123746 -56387 -126073 54840 132162 -46439 -128124 46254 131083 -44540 -133150
$$ packed form
1293b9830J55502j03338j57432R8680J61034r6677j64626R4447J73020q8654j80636
1304a38510Q4022J86573p8287j91798P5749J97168p0058j99374O5578J98701o2242
1315F7522j96087O2504J97787o3290j99341O4761K02158o3149k02517O2456K06401
1326A39205o0695k09502N6733K10844n0647k07248M6800K01735m2517j96672L9032
1337g2932J94409l6621j87772L4105J83144l3018j82858K9442J85390k3342j85159
1348i5212J5662J82818p183j82006j384J80758J1822j77524k1875J71769K6517
1359A04162j67290k9090J64766L5045j67185m1822J68249M6327j71035n2919J76691
1370F5899N7847j80133o9686J80913P7322j78601q1685J74378Q4829j75623q8610
$$ plain form
1381 -133150 40782 130118 -42199 -130235 41372 128074 -49742 -137561 44163 133239 -48122
1392 -48122 -141339 37502 131566 -47135 -144001 30633 131273 -36159 -137164 22106
1402 22106 118609 -34215 -129381 21504 115508 -31622 -127124 14372 109897 -28352 -124471
1413 -124471 12178 114242 -17781 -127624 -4774 110384 -2940 -118932 -14043 107172
1423 107172 9098 -118078 -27112 102954 19380 -110554 -27766 105050 21747 -118584 -35665
1434 -35665 113397 35611 -117212 -41693 116859 43205 -121610 -52622 120389 57387 -116514
1445 -116514 -57060 116267 56041 -116725 -54659 121117 60457 -114889 -53130 120792 56916
1456 56916 -116749 -50047 128602 63920 -115208 -56866 119915 65206 -107839 -53519 117909
$$ packed form
1381a33150J73932Q9336j72317q8036J71607Q6702j77816q7819J81724Q9076j81361
1392d8122r3217J78841R4064j78701r6866J74634J00640j67432j01005J59270
1402B2106R6503j52824r5166J50885R4004j47130r5502J41496R5525j38249r6119
1413a24471J36649J02064j32023j09843J22850J15158j13324j15992J04889J21215
1423A07172r8074j27176R0966J30066q3574j29934Q2788J32816q3303j40331Q2919
1434c5665J49062p7786j52823P5519J58552p3654j64815O8988J73011o3002j73901
1445a16514N9454J73327o0226j72766O2066J75776o0660j75346O1759J73922o3876
1456E6916j73665O6702J78649o4682j79128N8342J76781n4709j73045N4320J71428
$$ plain form
1467 117909 67452 -100564 -57150 105277 64902 -90996 -49501 103249 63689 -90126 -56385
1478 -56385 95262 69654 -77522 -57832 88229 73179 -75626 -70698 77613 83520 -59848
1489 -59848 -73454 66516 82766 -58128 -81262 61258 92322 -49868 -86926 54546 93317
1500 93317 -52583 -96579 54680 106630 -47537 -107729 44638 107141 -48359 -111734 46475
1511 46475 113886 -44895 -118526 37595 110614 -46789 -115148 44367 112683 -49555 -121505
1522 -121505 38659 110485 -47156 -117327 41443 109605 -48822 -121650 32778 106528 -40024
1533 -40024 -112316 31597 101276 -41606 -112502 24428 98522 -29944 -103654 18865 91062
1544 91062 -28943 -104885 11899 94332 -14570 -99721 1767 88236 -10051 -99249 -4111
$$ packed form
1467A17909n0457j68016M3414J62427m0375j55898M1495J52750l9560j53815L3741
1478e6385J51647k5608j47176J9690J46061j5050j48805M928J48311N907j43368
1489e9848j3606J39970J6250j40894k3134J42520L1064j42190l7058J41472L8771
1500I3317j45900m3996J51259N1950j54167o0192J52367O2503j55500o3375J58209
1511D6475O7411j58781p3631J56121P3019j57403o8359J59515O8316j62238p1950
1522a21505J60164P1826j57641p0171J58770O8162j58427p2828J54428P3750j46552
1533d0024p2292J43913O9679j42882p0896J36930P4094j28466p3710J22519P2197
1544I1062j20005p5942J16784Q2433j08902q5151J01488Q6469r8287q9198R5138
$$ plain form
1555 -4111 92861 5859 -97497 -16547 88798 11150 -96159 -18913 96669 22420 -100452
1566 -100452 -31373 95413 28910 -98703 -30793 103206 36093 -105341 -40722 104216 42429
1577 42429 -101060 -36454 109568 43582 -106780 -42620 110087 48421 -101346 -38082 110415
1588 110415 45168 -105897 -40618 111187 50789 -97740 -37381 105687 46057 -97333 -38585
1599 -38585 104415 51394 -87639 -39058 94323 47902 -84092 -39669 93109 55237 -75598
1610 -75598 -45715 80618 52852 -70032 -47012 77405 60746 -63968 -55565 66022 63191
1621 63191 -57320 -58323 63772 70013 -55558 -71002 54169 75355 -48271 -72954 52842
1632 52842 80601 -51428 -84974 46560 85750 -44468 -86198 45169 87962 -48726 -96088
$$ packed form
1555d111R6972q7002j03356Q0950J05345p7648j07309P7246J15582p4249j22872
1566a00452O9079J26786o6503j27613O7910J33999o7113j41434O4619J44938o1787
1577D2429j43489O4606J46022o5986j50362O4160J52707o1666j49767O3264J48497
1588A10415o5247j51065O5279J51805o0398j48529O0359J43068n9630j43390N8748
1599c8585J43000n3021j39033M8581J33381m6421j31994M4423J32778l7872j30835
1610g5598K9883J26333k7766j22884K3020J24417j6659j24714Q403J21587k831
1621F3191j20511j003J22095O241j25571j5444J25171K1186j23626k4683J25796
1632E2842K7759j32029l3546J31534L9190j30218m1730J31367M2793j36688m7362
$$ plain form
1643 -96088 43902 94865 -44050 -97738 42336 91572 -49513 -101948 42406 95957 -45992
1654 -45992 -101646 37712 91235 -48268 -99888 38548 92878 -43667 -99497 31360 86116
1665 86116 -41881 -95382 32785 86858 -37967 -95581 22681 81249 -32333 -89306 21806
1676 21806 80980 -27232 -91110 10664 78682 -16540 -84689 6940 78652 -10636 -88123
1687 -88123 -2443 79553 -48 -83343 -6957 79938 4672 -86466 -13157 84420 15374 -84662
1699 -84662 -18345 85084 18241 -87404 -22202 91267 29030 -88639 -26541 92154 30056
1710 30056 -89567 -26958 96371 35484 -89323 -29028 94251 34501 -88424 -26592 98687
1721 98687 38085 -87566 -30310 94552 38658 -83875 -27853 95362 40931 -83462 -31813
$$ packed form
1643i6088J39990N0963j38915n3688J40074M9236j41085n2435J44354N3551j41949
1654d5992n5654J39358N3523j39503n1620J38436N4330j36545n5830J30857N4756
1665H6116j27997n3501J28167N4073j24825n7614J18262N8568j13582n6973J11112
1676B1806N9174j08212o3878J01774O8018r5222o8149R1629P1712q9288p7487
1687h8123Q5680Q1996p9601q3295P6386Q6895p5266r1138P3309R7577o9046j00036
1699h4662O6317J03429o6843j05645O5202J13469o2237j17669O2098J18695o2098
1710C0056j19623O2609J23329o0887j24807O0295J23279n9750j22925O1832J25279
1721I8687o0602j25651N7256J24862n5894j22533N6022J23215n4431j24393N1649
$$ plain form
1732 -31813 89403 41019 -76289 -29806 85423 40696 -73923 -34144 79896 45408 -66685
1743 -66685 -34698 73380 46164 -65572 -42260 68892 52215 -58217 -45994 61730 53151
1754 53151 -54876 -52353 57054 59202 -49471 -57693 50872 60839 -48894 -62115 48457
1765 48457 67067 -46629 -69318 43898 69185 -47362 -75165 43155 73841 -45535 -79672
1776 -79672 38682 75027 -44107 -81536 37910 75021 -44720 -85466 35913 76288 -42835
1787 -42835 -85088 34810 76174 -43946 -87183 31278 75024 -40874 -84392 29044 73767
1798 73767 -39445 -85700 25704 72443 -34005 -80974 21144 69812 -30768 -80113 17862
1809 17862 70304 -23744 -77753 12934 67555 -19453 -76250 10059 70556 -11579 -75659 2331
$$ packed form
1732c1813J21216m8384j17308M6483J15229m4727j14619L9779J14040l4488j12093
1743f6685L1987J08078k7216j11736K3312J11152j6677j10432J2223J07724q579
1754E3151j08027K523J09407K148j08673q222J08565R967j09733j3221J10572
1765D8457J8610j13696k2689J13216K5287j16547k7803J18320L0686j19376l4137
1776g9672J18354L6345j19134l7429J19446L7111j19741m0746J21379M0375j19123
1787d2835m2253J19898M1364j20120m3237J18461M3746j15898m3518J13436M4723
1798G3767j13212m6255J11404M6739j06448m6969J02118M8668j00580m9345R7975
1809A7862N2442r4048n4009R0687N4621q7008n6797Q6309O0497q2135o4080P7990
$$ plain form
1821 2331 69703 -4017 -74144 -2208 72121 2100 -74712 -6780 72753 8366 -74397 -10036
1833 -10036 75571 13098 -74683 -13744 76893 17677 -74695 -15494 79853 23053 -76252 -19471
1845 -19471 82399 26783 -74714 -20976 82716 28939 -75057 -22190 82212 30675 -73472
1856 -73472 -21481 82041 31238 -71752 -22906 79790 33810 -69527 -24886 78950 34528
1867 34528 -67928 -26104 75683 37520 -64455 -28898 70594 37427 -59369 -30238 65904
1878 65904 38559 -56926 -33621 60770 40617 -53982 -37492 57131 43782 -51654 -42559 52069
1890 52069 47643 -48483 -48039 47263 50217 -44663 -53183 42448 53764 -42923 -56478 40409 55424
1903 55424 -41772 -61718 37847 58242 -42387 -66110 36400 61016 -41362 -69266 34487
$$ packed form
1821B331O7372p3720p0127P1936P4329p0021p6812O7932P9533o4387q2763O4361
1833a0036Q5607o2473q7781O0939R0637n9216r2372N9201R5347n6800r9305N6781
1845a9471J01870n5616j01497N3738J03692n3777j03996N2867J04402n1537j04147
1856g3472N1991J03522n0803j02990M8846J02696m5980j03337M4641J03836m4422
1867C4528j02456M1824J01787l8163j01975L5557R9492l3167r6796K9131R6142
1878F5904k7345r5485K3305R4391k0153r4599J6490R4623j3349r5436R095R4628
1890E2069m426r6126M44R5302K954r4880q520R5631J1316r6687j3555R6887J5015
1903E5424r7196j9946R9565K0395j00629k3723J02510K4616j02378k7904J03753
$$ plain form
1914 34487 64058 -41021 -72536 31149 63483 -38590 -73238 29803 64146 -37014 -71398
1925 -71398 28379 63513 -37602 -71456 27869 63151 -36010 -71693 26123 63541 -31329 -71198
1937 -71198 21025 63235 -26341 -68896 17478 61039 -21770 -66768 15081 59962 -18352 -64747
1949 -64747 11617 59556 -13826 -64586 7970 61824 -7978 -63809 2686 63395 -601 -62654
1961 -62654 -2490 64581 5072 -62015 -5952 65367 10650 -62645 -8286 65761 13109 -62768
1973 -62768 -9886 68941 16932 -63867 -12220 71162 21362 -65523 -15444 73464 23961 -64814
1985 -64814 -17256 72349 25507 -64143 -17587 71645 25307 -63553 -17657 69813 25232 -61052
1997 -61052 -18636 69222 26353 -60391 -21216 66002 28721 -58297 -22556 62251 29661 -55282
$$ packed form
1914C4487K9571j05079l1515J03685L2334j02073l4648J03041L4343j01160l4384
1925g1398R9777L5134j01115l3854R9325L5282r9161l5683R7816L7418r4870l9869
1937g1198R2223M2210q9576m2555Q6374M3561q2809m4998Q1849M4881p8314m6395
1949f4747P6364M7939p3382n0760P2556N3854o9802n5831O6495O0709o3996o2053
1961f2654O0164O7071n9509o7087N6063P1319n4717p3295N4359P4047n2652p5877
1973f2768N2882P8827n2009q0799N1647Q3382m9800q6885N0079Q8908m9503q8775
1985f4814M7558Q9605m6842q9650M6556Q9232m6338q8860M5896Q7470m4581q6284
1997f1052M2416Q7858m2869q6744L9175Q7218l7281q7018L5741Q4807l2590q4943
$$ plain form
2009 -55282 -25870 58167 31307 -50735 -27686 52840 31037 -47879 -31667 49223 34458 -44331
2021 -44331 -35141 43813 37516 -43177 -39595 42071 41372 -41278 -44457 38521 44010 -40277 -47306
2034 -47306 35923 46360 -37837 -52001 33019 48600 -37138 -55201 31465 51139 -38023 -59556
2046 -59556 31400 54042 -37608 -61123 30619 54950 -37614 -63577 28103 54024 -34909 -62019
2058 -62019 27278 53993 -35144 -61696 25537 53882 -31875 -60015 25314 52322 -31457 -59077
2070 -59077 23788 52517 -27248 -57356 19443 50784 -22316 -56067 15694 52226 -16830 -54357
2082 -54357 10869 51086 -11450 -52204 9339 51799 -6756 -52158 4751 51985 -2726 -51486
2094 -51486 2977 54908 3204 -53891 -2860 57405 8739 -52871 -6010 59634 12772 -53859
$$ packed form
2009e5282K9412Q4037k6860q2042K3049Q0526k1803p8916J6212Q0890j4765p8789
2021d4331R190P8954o297q0693L582Q1666o99q2650l179Q2978N489q4287p029
2034d7306Q3229J0437q4197j4164Q5020J5581q5738j8063Q6666J9674q9162k1533
2046e9556R0956K2642r1650k3515R1742K4331r2564k5963R1680K5921q8933k7110
2058f2019Q9297K6715q9137k6552Q7233K8345q5757k8140Q5329K7008q3779k7620
2070e9077Q2865K8729p9765l0108P6799L1341p3100l3751P1761L6532o9056l7527
2082e4357O5226M0217o2536m0754O1543M2460n8555m5402N6909M7234n4711m8760
2094e1486N4463N1931n1704n7095N1031O0265m8666o1610M6861O5644m6862o6631
$$ plain form
2106 -53859 -9535 61054 15506 -54532 -9242 62499 16026 -55830 -9453 64694 19638 -56263
2118 -56263 -9652 64685 19236 -58852 -12207 66262 21817 -55839 -14446 62547 20656 -54443
2130 -54443 -12657 61440 20737 -52470 -13921 56627 19601 -50004 -14420 56031 21360 -48790
2142 -48790 -20198 49484 23709 -44470 -21166 45868 26352 -42576 -25861 41165 27957 -37829
2154 -37829 -27975 38031 28207 -38403 -33982 34114 33663 -36828 -37591 33282 35715 -37889 -43485 31214
2168 31214 40715 -34217 -46553 28114 40330 -35132 -49777 28481 43921 -32924 -51344 26542
2180 26542 43110 -35633 -51948 28911 46807 -36084 -55014 27575 46833 -35096 -54059 27100
2192 27100 47255 -32587 -54515 24945 45326 -29846 -49775 24617 44315 -29821 -50406 21866
$$ packed form
2106e3859M4324P0589m5548p0038M5290P1741m6473p1856M6377P4147m5056p5901
2118e6263M6611P4337m5449p8088M6645P8469m4445p7656M1393P6993m1891p5099
2130e4443M1786P4097m0703p3207L8549P0548l7026o9605L5584P0451l4671p0150
2142d8790K8592O9682k5775o8179K3304O7034j9516o8928J6715O7026j3208o5786
2154c7829R854O6006r824o6610M421O8096m51p0491p63P0873K433p3604n596P4699
2168C1214R501p4932j2336P4667J2216p5462j4645P8258J5440p6845j8420P7886
2180B6542J6568p8743j6315Q0859J7896q2891j8930Q2589J9258q1929j8963Q1159
2192B7100K0155p9842k1928P9460K0381p5172j9929P4392J9698p4136k0585P2272
$$ plain form
2204 21866 44410 -24579 -48185 20406 43203 -22952 -48805 16108 45529 -14835 -45114 11145
2216 11145 42914 -11829 -44585 8215 46467 -4494 -42448 5206 44170 -2554 -44724 3563
2228 3563 50695 3540 -45622 -2159 51149 6946 -45977 -2527 54391 11694 -47944 -5802
2240 -5802 54649 12815 -48104 -5286 58109 14532 -50595 -7309 57832 15649 -49007 -6003
2252 -6003 58538 14727 -52826 -10456 57922 16845 -48884 -8691 56031 15135 -49064 -9867
2264 -9867 54141 17340 -46072 -10199 50208 15117 -46892 -12420 48514 17582 -41010 -15748
2276 -15748 42906 17298 -39893 -18365 40642 21899 -36975 -22063 35111 21932 -35349 -25630
2288 -25630 33477 26185 -34029 -31885 29340 27841 -32332 -32884 28905 30756 -32186 -39695 25546
$$ packed form
2204B1866K2544o8989k3606O8591K2797o6155k5853O4913K9421o0364l0279N6259
2216A1145L1769n4743l2756N2800L8252n0961l7954M7654L8964m6724m2170M8287
2228C563M7132m7155m9162M3463N3308m4203n2923M3450N6918m2697n9638M2142
2240e802O0451m1834o0919M2818O3395m3577o5127M3286O5141m2183o4656M3004
2252f003O4541m3811o7553M2370O8378m1077o5729M0193O4722m0896o4199L9197
2264i867O4008l6801o3412L5873O0407l5091o2009L4472O0934l0932n8592K5262
2276a5748N8654k5608n7191K1528N9007j8743n8874J4912N7174j3179n7281R719
2288b5630N9107p292o0214K144O1225j499o0173n52O1789J851o2942p509O5241
$$ plain form
2301 25546 34066 -30647 -40091 26102 35239 -34267 -44216 25956 37314 -32186 -44348 26427 38443
2314 38443 -33714 -47079 25451 40623 -30809 -45811 24895 38839 -32923 -46747 24633 39831
2326 39831 -29461 -45429 22875 37155 -29638 -43369 23181 39042 -25247 -42159 20007 36412
2338 36412 -23470 -39640 18588 38746 -18273 -40068 13855 37330 -14414 -36978 13819 39291
2350 39291 -10106 -38106 8786 39555 -4400 -36818 6646 41020 -1815 -39558 2079 43881
2362 43881 4053 -38591 424 44709 5210 -41530 -2628 47514 9051 -40577 -1848 47460
2374 47460 8869 -43174 -3976 49871 12380 -43770 -6304 49834 11420 -44831 -5532 51877
2386 51877 12355 -44421 -7056 49233 10769 -43529 -5613 50034 12016 -42464 -7528 44664
$$ packed form
2301B5546Q520o4713r444O6193R137o9506r949P0172J1358o9500j2162P0775J2016
2314C8443p2157j3365P2530J5172p1432j5002P0706J3944p1762j3824P1380J5198
2326C9831o9292j5968O8304J4280o6793j3731O6550J5861o4289j6912O2166J6405
2338C6412n9882j6170N8228K0158n7019k1795N3923K3475n1744k2564N0797K5472
2350C9291m9397k8000M6892L0769m3955l2418M3464L4374m2835l7743M1637M1802
2362D3881l9828m2644L9015M4285l9499m6740L8902N0142l8463m9628L8729M9308
2374D7460l8591n2043L9198N3847l7491n6150L7466N6138l8414n6251L9299N7409
2386E1877l9522n6776L7365N6289l8464n4298L7916N5647l8018n4480L4936N2192
$$ plain form
2398 44664 11540 -40385 -8437 44552 12765 -40526 -12487 40323 14260 -36564 -11853 37749
2410 37749 14347 -36829 -16141 34187 17386 -32345 -17514 31354 17212 -33118 -22768 28621
2422 28621 22093 -29734 -25606 26405 21984 -30131 -29855 27176 25792 -28920 -32713 22944 26463
2435 26463 -28917 -34518 23739 31241 -28929 -37355 22194 31675 -28926 -38293 24325 33707 -29090
2448 -29090 -39497 22820 34168 -29131 -38461 23285 34085 -27631 -39526 20648 33125 -25984
2460 -25984 -36521 22150 33813 -24975 -38243 20193 33949 -22225 -35932 19574 32090 -20571
2472 -20571 -36227 16568 34227 -15274 -33763 14293 32877 -12635 -33455 12059 34521 -8083
2484 -8083 -32738 8272 34209 -5796 -32869 7623 37654 -102 -33089 3779 37095 1326
$$ packed form
2398D4664l3124n1925L1948N2989l1787n3291K8039N2810k6063n0824K4711M9602
2410C7749k3402n1176K0688N0328j6801m9731J4831M8868j4142n0330J0350N1389
2422B8621o528n1827M128N2011m421n2115K76N7031j384n4712l793N5657L519
2435B6463n5380n601N8257P502o0170q426N9549R481o0601r367O2618R382o2797
2448b9090j0407O2317J1348o3299r330O1746J0800o1716j1895O0174J2477n9109
2460b5984j0537N8671J1663n8788j3268N8436J3756n6174j3707N5506J2516n2661
2472b0571j5656N2795J7659m9501j8489M8056J8584m5512k0820M5514K2462m2604
2484h083k4655M1010K5937m0005k7073M0492L0031l7756l2987L6868L3316l5769
$$ plain form
2496 1326 -34329 2820 40228 4781 -35356 -103 40936 6484 -35755 64 42663 6646
2508 6646 -36643 -2391 43176 8599 -37027 -2773 43496 9528 -38025 -3798 43972 9567
2520 9567 -37978 -4121 42887 9101 -38043 -5592 42191 10470 -36644 -6250 40026 9854
2532 9854 -36378 -7709 37978 11043 -34348 -9427 34926 11298 -34132 -10655 33509 11313
2544 11313 -32976 -13988 29618 13167 -31432 -15505 27870 14719 -29688 -18743 25690 16730
2556 16730 -28074 -22381 23485 18072 -27599 -24977 21553 20523 -26811 -27773 22188 23028 -27985
2569 -27985 -30342 21026 25357 -26286 -31873 20509 26382 -25790 -33269 20204 27505 -25483 -33804
2582 -33804 19819 27435 -25326 -33339 19691 28415 -25205 -33455 19502 28478 -23682 -32872 19479
$$ packed form
2496A326l5655L7149L7408l5447m0137L5253M1039l4452m2239L5819M2599l6017
2508F646m3289L4252M5567l4577m5626L4254M6269l3968m7553L4227M7770l4405
2520I567m7545L3857M7008l3786m7144L2451M7783l1721m7114L0394M6276l0172
2532I854m6232K8669M5687k6935m5391K4921M4353k3628m5430K3477M4164k2196
2544A1313m4289J8988M3606j6451m4599J5927M3375j3151m4407J0945M4433q960
2556A6730m4804N693M5866n413m5671K622M6530j030m7334r62M9961Q40n1013
2569b7985k357N1368M331n1643n587N2382N873n2172p479N3473P301n2988q321
2582c3804N3623P616n2761q013N3030Q724n3620q250N2957Q976n2160r190N2351
$$ plain form
2595 19479 30318 -21108 -31946 19724 29502 -19279 -31190 16408 29756 -16580 -29258 16024
2607 16024 29473 -15440 -28453 16075 29921 -11963 -28294 12487 31397 -8121 -28527 9327
2619 9327 32400 -4966 -28478 7800 32394 -1924 -27100 5991 33475 341 -28877 4806
2631 4806 34116 1166 -29325 2055 36183 3683 -32273 1098 38022 6503 -32284 -1636
2643 -1636 38402 8080 -32655 -2319 37485 7749 -31985 -3133 37317 6218 -32972 -2939
2655 -2939 37175 6925 -33634 -4634 37514 8153 -33663 -5240 36646 9151 -33302 -7058
2667 -7058 32673 7847 -30917 -8126 30661 8794 -29594 -9062 28995 9029 -29821 -10911
2679 -10911 27107 9499 -29619 -13518 25907 12206 -28629 -16812 23115 13487 -25947 -18773
$$ packed form
2595A9479J0839n1426j0838N1670R778m8781j1911M7598J3348m6336j2678M5282
2607A6024J3449m4913j3013M4528J3846m1884j6331M0781J8910l9518k0406L7854
2619I327K3073l7366k3512L6278K4594l4318k5176L3091K7484l3134k9218L3683
2631D806K9310l2950l0491L1380L4128l2500l5956L3371L6924l1519l8787L0648
2643a636M0038l0322m0735L0336L9804k9736l9734K8852M0450l1099l9190L0033
2655b939M0114l0250m0559K9000M2148k9361m1816K8423M1886k7495m2453K6244
2667g058L9731k4826l8764K2791L8787k1867l8388K0532L8057j9966l8850J8910
2679a0911L8018j7608l9118J6101L9425j3701m0835J1817L9927r628l9434P174
$$ plain form
2691 -18773 19884 14696 -24543 -20094 19572 15467 -24759 -22509 18858 18552 -25213 -24630 19261
2704 19261 19883 -25308 -27475 19015 22212 -23949 -29037 17326 22610 -22356 -28474 16279 23262
2717 23262 -23040 -29034 18097 24070 -21993 -28958 18864 24793 -21737 -29373 19434 26328 -19408
2730 -19408 -27569 17029 26311 -16331 -27210 16313 26712 -14749 -25442 14123 26208 -13543
2742 -13543 -23754 14988 26713 -11404 -23582 13784 27209 -8008 -24518 11477 28070 -5263
2754 -5263 -24294 8836 28936 -2676 -23284 5915 29248 -243 -24744 5113 30867 1205
2766 1205 -25100 4310 32064 2526 -26731 2290 32688 4873 -27801 -598 32676 6159
2778 6159 -28880 -963 33200 7346 -29284 -2026 32235 4513 -29185 -2330 32594 5089
$$ packed form
2691a8773L8657n188l9239M449L9666m105m0226K250M1367l06m3765N83M3891
2704A9261O22m5191k167M6490L197m6161n088M6363N284m4966o118M4753O983
2717B3262m6302n994M7131N973m6063o965M7822N929m6530p636M8807O894m5736
2730a9408q161M4598R282m2642j0879M3523J0399m1461j0693L9565J2085l9751
2742a3543j0211L8742J1725l8117j2178L7366J3425l5217j6510L5995J6593l3333
2754e263j9031L3130K0100l1612k0608K9199K3333k9491k4501K9857K5754k9662
2766A205k6305K9410K7754k9538k9257K9021L0398k7815l2674K7203L3274k6517
2778F159l5039K7917L4163k5854l6630K7258L4261k7722l3698K6855L4924k7505
$$ plain form
2790 5089 -29611 -2256 32032 5630 -30703 -4050 31627 5702 -29272 -5185 29407 5340
2802 5340 -29312 -6641 27821 5426 -27814 -8248 24387 6032 -26578 -9514 24414 7316
2814 7316 -26615 -12365 21178 8486 -25498 -14355 19844 10217 -24837 -17040 17886 11173 -22671
2827 -22671 -18561 17716 12582 -22693 -18914 16736 15301 -22223 -21825 16680 17285 -22256 -22725 16851
2841 16851 19060 -21190 -24733 16477 19974 -21676 -24607 16855 20411 -20842 -24854 17611 22120
2854 22120 -20543 -24466 18466 22788 -19189 -23738 16446 21979 -18538 -23162 17258 23448 -16177
2867 -16177 -22842 16433 23134 -13475 -20404 15970 23009 -12190 -21170 13485 23053 -9937 -18971
2880 -18971 12784 24316 -7062 -20677 10653 24893 -4676 -19602 8802 24416 -2599 -20905
$$ packed form
2790E089l4700K7355L4288k6402l6333K6653L5677k5925l4974K4087L4592k4067
2802E340l4652K2671L4462k2395l3240J9566L2635j8355l2610J7064L3928j7098
2814G316l3931J4250L3543j2692l3984J1143L4199r627l5054P797L4926o713l3844
2827b2671M110L6277n134l5275L779L5650j435l7524L98L8505O05l9541m69L9576
2841A6851K209m0250l543M1210L497m1650k931M1462L556m1253m012M2465M509
2854B2120m2663l923M2932M322m1977m549M0184N533m0517m624M0420O190l9625
2867a6177o665L9275O701l6609o929L6374P039l5199q980L4655R568l2990r034
2880a8971L1755J1532l1378j3615L1330J4240k9569j4926K8404J5614k7015j8306
$$ plain form
2892 -20905 6845 26325 -826 -21074 4980 27148 79 -23026 3710 28367 2057 -24150
2904 -24150 2149 27458 2973 -24945 1328 29663 3991 -25402 -662 29042 3777 -25312
2916 -25312 -548 30384 3321 -27651 -2316 28734 3058 -26907 -1518 27907 2038 -27269
2928 -27269 -3571 26830 2671 -25943 -3511 24649 2696 -25545 -5108 23083 3897 -24158
2940 -24158 -6402 22002 3825 -24558 -7040 21076 5715 -22626 -9560 18272 5785 -23391
2952 -23391 -11453 17223 8311 -21122 -13859 15667 9976 -20378 -15229 16644 12650 -20202 -17816
2965 -17816 14906 12528 -20301 -18202 15710 14704 -20093 -19667 15377 16076 -18299 -19809 16576
2978 16576 17467 -19219 -21412 16030 19173 -17906 -20853 17180 18564 -19154 -20509 16848 19290
$$ packed form
2892b0905K7750J9480k7151k0248K6054K2168k7069k3105K6736K4657k6310k6207
2904b4150K6299K5309k4485k7918K6273K8335k5672k9393K4740K9704k5265k9089
2916b5312K4764L0932k7063l0972K5335L1050k5676k9965K5389K9425k5869k9307
2928b7269K3698L0401k4159k8614K2432K8160k1953k8241K0437K8191j9186k8055
2940b4158J7756K8404j8177k8383J7518K8116j5361k8341J3066K7832j2487k9176
2952b3391J1938K8676q912k9433P263K9526n691l0354N149L1873l994l2852K386
2965a7816L2722k378l2829K099L3912j006l4797M26L5044O99l4375j510L6385
2978A6576Q91l6686k193L7442L143l7079k947L8033J384l7718j355L7357K442
$$ plain form
2991 19290 -16367 -19368 16915 19189 -16953 -20074 16150 20846 -14197 -18241 15065 18805 -13088
3004 -13088 -17603 14990 20864 -11209 -16927 12083 19401 -9325 -16203 12268 20549 -6754 -17367
3017 -17367 8442 20437 -5042 -16453 8343 22557 -3587 -19248 6063 22182 -491 -18320
3029 -18320 5921 23297 -651 -19788 3597 24458 1892 -20812 2477 25678 1151 -22791
3041 -22791 1238 26524 3447 -22545 1081 25404 1045 -24620 176 26458 2232 -23432
3053 -23432 -717 24363 521 -25061 -856 24827 1858 -24675 -1670 23081 860 -23629
3065 -23629 -2051 21476 1493 -23792 -3901 19217 1914 -21793 -4747 19356 2504 -22064
3077 -22064 -7366 16692 3347 -20296 -7382 17613 4387 -21528 -10602 13829 6675 -18864
$$ packed form
2991A9290l5657l001L6283K274l6142l121L6224M696l5043m044L3306L740l1893
3004a3088m515L2593N874l2073n718K9010P318k8726o878K8471Q281k7303j0613
3017a7367K5809J1995k5479j1411K4796J4214k6144j5661K5311J6119k2673j7829
3029a8320K4241J7376k3948j9137K3385K0861k2566k2704K3289K3201k4527k3942
3041b2791K4029K5286k3077k5992K3626K4323k4359k5665K4796K6282k4226k5664
3053b3432K2715K5080k3842k5582K4205K5683k2969k6533K3005K4751k2221k4489
3065b3629K1578K3527j9983k5285J9891K3118j7303k3707J7046K4103j6852k4568
3077b2064J4698K4058j3345k3643J2914K4995j3226k5915J0926K4431p154k5539
$$ plain form
3089 -18864 -11872 13821 7560 -18331 -13808 14123 10129 -17637 -14165 12469 11405 -18761 -16568
3102 -16568 14553 13161 -18491 -16924 14836 13289 -17473 -16989 15573 15035 -17390 -17501 14736 15188
3116 15188 -17278 -16747 16321 16235 -16275 -16534 15986 16583 -15849 -15692 16515 17553 -14789 -15425 14901
3131 14901 16629 -11732 -14102 14803 17313 -11681 -14553 13324 17321 -8439 -13793 12267 17162
3144 17162 -8109 -14258 11899 18098 -5402 -13922 9562 18339 -5023 -15309 7563 19682 -2802
3157 -2802 -14641 5295 20488 -2503 -16822 5178 20652 -503 -17415 3192 20457 -400
3169 -400 -18117 3729 22435 -107 -19378 2202 22596 658 -19346 1376 22790 118
3181 118 -21296 394 22108 499 -20761 695 21609 -1140 -20463 -950 21162 754
$$ packed form
3089a8864O992K5693o261k5891M523K7931l994k7766L472K6634j064l0166K193
3102a6568L1121j392l1652J567L1760j547l0762M84L2562n38l2425j11L2237M52
3116A5188l2466N31L3068q6l2510k59L2520N97l2432J57L2207J038l2342o36L0326
3131A4901J728k8361k370K8905K510k8994k872K7877L997k5760n354K6060M895
3144A7162k5271o149K6157O199k3500q520K3484Q777k3362j0286K2872J2119k2484
3157b802j1839J9936J5193k2991j4319K2000J5474k1155j6912K0607J7265k0857
3169d00j7717K1846J8706k2542j9271K1580K0394k1938k0004K0722K1414k2672
3181A18k1414K1690K1714k1609k1260K1456K0914k2749j9323J9513K2112k0408
$$ plain form
3193 754 -20471 -1022 19995 -1091 -22052 -2356 18904 586 -20348 -2922 17431 236
3205 236 -20172 -3819 16244 720 -19227 -5604 14388 1326 -18484 -5782 14248 3277
3217 3277 -17813 -7770 13267 4359 -16704 -9054 12781 5861 -17480 -11219 12016 6714 -16595
3230 -16595 -11885 11848 9093 -15820 -13982 12661 10087 -15559 -13518 13793 12469 -16487 -14485
3243 -14485 14103 12722 -15079 -13935 13809 13470 -15352 -14742 14951 14708 -14193 -14220 14997 13639
3257 13639 -14078 -13614 15164 14320 -12546 -11888 13415 14034 -11578 -12959 14019 15086 -10049 -12537
3271 -12537 11561 14735 -8271 -11231 12708 15250 -7470 -11522 11374 16035 -5173 -11561 10370
3284 10370 16465 -4051 -12902 8097 16456 -3598 -12605 6862 17389 -2593 -13610 5227 17511
$$ packed form
3193G54k1225J9449K1017k1086k0961J9696K1260j8318k0934J7426K0353j7195
3205B36k0408J6353K0063j5524j9947J3623J9992j3062j9810J2702K0030j0971
3217C277k1090J0043K1037q908k1063P650K1835o920k3341O261K3235n302k3309
3230a6595M710K3733k755k4913J838K6643k574k5646K041K7311j324k8956K002
3243a4485K8588j381k7801J144K7744l39k8822O10K9693k43k8901k7K9217j358
3257A3639k7717M64K8778q44k6866O58K5303O19k5612j381K6978J067k5135k488
3271a2537K4098L174k3006k960K3939K542k2720m052K2896M661k1208o388K1931
3284A0370O095k0516q851K0999Q359k0054r007J9467J0527j9982j1017J8837J2284
$$ plain form
3297 17511 -1292 -13988 4034 18237 -908 -15964 3450 18722 -803 -16677 2398 18552
3309 18552 -1014 -17408 1502 19922 -637 -18819 1209 18709 -1217 -19299 -276 20093
3321 20093 -1595 -18869 -178 17771 -1513 -19108 -423 16432 -1387 -19655 -1689 15625
3333 15625 -1032 -19014 -2318 15263 -530 -17543 -3562 14115 555 -18023 -4404 12882
3345 12882 528 -17363 -5199 12074 2136 -16098 -6518 12431 3199 -15394 -8295 11859 5123
3358 5123 -16099 -8889 12199 6293 -15670 -9490 11126 7569 -14018 -9686 12079 7866 -13780
3371 -13780 -11155 12935 9198 -13407 -12110 11787 11326 -13170 -11351 13662 10918 -13102 -12092
3384 -12092 13936 13053 -12312 -11220 14199 12675 -12075 -11447 12652 13895 -11957 -9736 13745
$$ packed form
3297A7511j8803j2696J8022J4203j9145j5056J9414J5272j9525j5874J9075J6154
3309A8552j9566j6394J8910J8420k0559j8182K0028J7500j9926j8082J9023K0369
3321B0093k1688j7274J8691J7949j9284j7595J8685J6855j7819j8268J7966J7314
3333A5625j6657j7982J6696J7581j5793j7013J3981J7677j3560j8578J3619J7286
3345A2882j2354j7891J2164J7273r938j8234R580J8949r232j8593P099K0154o736
3358E123k1222P210K1088n906k1963O180K0616l557k1587M332K1765m213k1646
3371a3780K625K4090l737k2605J297K3897m61k4496J819K5013k744k4020J010
3384a2092K6028q83k5365J092K5419j524k4750O28K4099J243k5852K221K3481
$$ plain form
3397 13745 12757 -9524 -10894 12853 13540 -9350 -9527 11438 13128 -7838 -10136 10996 13751 -7130
3411 -7130 -10122 10038 14003 -5260 -10896 8674 13824 -4017 -11259 7673 14406 -3656 -11179
3424 -11179 6882 14364 -2472 -11960 5501 15048 -2029 -13645 3123 15535 -614 -14375
3436 -14375 2837 15420 -530 -15386 2689 16915 -1327 -15613 742 16261 -1540 -16005
3448 -16005 920 15676 -1426 -17197 161 15922 -1580 -16679 -439 14919 -1081 -17776
3460 -17776 -900 15005 -1519 -17335 -1186 14121 -1333 -16923 -1553 12541 -1236 -15649
3472 -15649 -2486 12955 -1153 -16259 -3378 12432 126 -15380 -4391 11920 299 -13788
3484 -13788 -5465 10622 1691 -14081 -6557 10202 3736 -12828 -6732 10978 5205 -12438 -8314
$$ packed form
3397A3745r88k2281j370K3747O87k2890j77K0965J690k0966k298K1132K755k0881
3411g130k992K0160L965j9263n636J9570N150j7841p242J8932O733j8062p523
3424a1179J8061P482j6836r488J7461R547j7077j1616J6768J2412j6149j3761
3436a4375J7212J2583j5950j4856J8075J4226j8242j4286J6355J5519j7801j4465
3448a6005J6925J4756j7102j5771J7358J5761j7502j5099J6240J5358j6000j6695
3460a7776J6876J5905j6524j5816J6149J5307j5454j5590J5370J4094j3777j4413
3472a5649J3163J5441j4108j5106J2881J5810j2306j5506J0989J6311j1621j4087
3484a3788Q323J6087q931j5772P524J6759o466j6564O096J7710n773j7643M124
$$ plain form
3497 -8314 10944 5862 -12215 -8397 10662 7450 -11721 -9703 10578 8428 -11824 -8457 10947
3510 10947 9436 -11801 -9928 12645 9987 -10638 -9545 11426 11086 -10934 -9879 12364 11114
3523 11114 -10427 -9190 11384 10726 -9850 -8596 11733 11770 -9378 -7660 11691 11369 -7539 -7325
3537 -7325 12228 11581 -7293 -7796 10540 11392 -6248 -7659 9425 11584 -6251 -8633 8504 12227
3551 12227 -4435 -9077 7023 11755 -3694 -9923 6978 12695 -3346 -10452 4603 12570 -2450
3564 -2450 -11093 3749 14158 -1471 -12283 2098 13633 -1856 -13428 2028 14064 -1330
3576 -1330 -13795 1750 12449 -1950 -14600 320 13340 -2123 -15253 1007 14285 -2204
3588 -2204 -14947 351 12627 -2710 -14947 -9 12415 -2424 -16341 -932 11789 -2274
$$ packed form
3497h314J9258n082j8077L818J9059l212j9171K018K0281k150k0252L367J9404
3510A0947j511k1237J873K2573k658k0625J093K0971l40k2020J055K2243j250
3523A1114k1541J237K0574o58k0576J254K0329L7k1148J718J9351l22j8908K14
3537g325J9553o47j8874n03J8336Q52j7640j411J7084K159j7835k382J7137L723
3551A2227j6662m642J6100M732j5449o229J6901N717j6041p106J5055P967j5020
3564b450q643J4842J0409j5629j0812J4381J1535j5489j1572J5456J2036j5394
3576a330j2465J5545J0699j4399j2650J4920J3020j5463j3130J6260J3278j6489
3588b204j2743J5298J2276j5337j2237J4938J2424j4839j3917J5409J2721j4063
$$ plain form
3600 -2274 -15756 -1053 10924 -1837 -14075 -1136 10148 -1812 -13307 -2737 9828 -887
3612 -887 -13063 -2934 9123 584 -12493 -3457 9561 2300 -12346 -4669 9124 2670 -12099
3625 -12099 -5521 9715 3992 -10488 -6855 9420 5240 -10694 -7467 9675 6832 -10235 -6841
3638 -6841 9965 7843 -10024 -7899 10775 8357 -10796 -8430 10806 8886 -10413 -7597 11172
3651 11172 9467 -10062 -7985 11466 9499 -8701 -5897 11354 9115 -8697 -6834 10992 9759
3664 9759 -7634 -6269 11353 9517 -7436 -6708 10498 10211 -5918 -6366 8970 10378 -5475 -6997
3678 -6997 8978 10011 -5974 -7244 7533 10028 -4188 -7504 7522 10639 -2791 -8668 5411
3691 5411 10977 -3186 -8643 4987 12012 -2442 -9956 3519 10791 -2253 -10926 3149 11681
$$ packed form
3600b274j3482J4703J1977j2761j2238J2939J1284j1960j1495J0570J2565j0715
3612h87j2176J0129J2057q539j3077R036J3018p261j4646P677J3793o454j4769
3625a2099O578J5236n723j4480L633J6275m180j5934L227J7142k843j7067L394
3638f841J6806k122j7867K125J8674k418j9153K366J9236j920j9299K816J8769
3651A1172j705j9529K077J9451j967j8200K804J7251k239j7812J863J7826j233
3664I759j7393J365J7622j836j6953P28J7206k87j6129m48J5336J408j5853j522
3678f997J5975J033j5985j270J4777K495j4216l316J5026L117j3430n877J4079
3691E411N566j4163n457J3630P025j4454p514J3475P272j3044q673J4075Q532
$$ plain form
3704 11681 -2890 -12602 2642 12174 -2104 -11769 1450 12205 -2891 -13779 1210 12153
3716 12153 -2380 -13527 622 11705 -2777 -13966 1200 10827 -2497 -13316 652 10386
3728 10386 -2952 -13068 -67 10640 -2674 -13715 -204 9929 -2126 -12640 -916 9411
3740 9411 -1856 -11744 -1884 8591 -626 -10849 -2365 8199 31 -9521 -2672 8026 2558 -10049
3754 -10049 -3670 8479 1996 -11065 -4601 8181 3731 -9990 -5219 8278 4872 -9611 -5107
3767 -5107 9390 6056 -9153 -5791 9167 5667 -8885 -5774 10728 7120 -8717 -6310 10289
3780 10289 6704 -9011 -5419 10904 8163 -8846 -6498 10386 8242 -7823 -6002 10781 7572
3793 7572 -7593 -5410 10417 7933 -6861 -5090 10826 8353 -7508 -5881 9090 8526 -6392
$$ packed form
3704A1681j4571r712J5244R532j4278r665J3219J0755j5096j0888J4989J0943
3716A2153j4533j1147J4149J1083j4482j1189J5166R627j3324j0819J3968R734
3728A0386j3338j0116J3001J0707j3314j1041J3511J0133j2055j0514J1724J0327
3740I411j1267r888R860J0475r217j0223Q484J0564q168r552O849J0698n468j2607
3754a0049O379J2149o483j3061O464J2782m450j3721M771J3497l406j4483M504
3767e107J4497l334j5209L362J4958l500j4552L111J6502l608j5837K407J6599
3780A0289l585j5715L592J6323k741j7009K348J6884k144j6065J821J6783l209
3793G572j5165K183J5827k484j4794J771J5916k473j5861J627J4971n64j4918
$$ plain form
3806 -6392 -5034 9275 8079 -5926 -5539 7005 8462 -3916 -5489 7395 8371 -3639 -7286 5793
3820 5793 9451 -3146 -7018 4620 9264 -3706 -8317 4172 9434 -2493 -9018 3358 9583
3833 9583 -2003 -9723 2429 10339 -2690 -11446 1550 9428 -2203 -11005 1095 11170 -3023
3846 -3023 -11753 824 10264 -2962 -11327 1477 9540 -3348 -12989 981 9020 -3259 -11713
3859 -11713 1126 9589 -3781 -11124 231 9302 -2421 -10921 -512 6996 -2416 -11070 -172
3872 -172 8144 -913 -10675 -1325 6855 -802 -10713 -2064 7869 91 -8855 -2358 6709 967 -9392
3887 -9392 -2827 7930 2437 -8059 -2878 7703 3939 -8677 -4229 8384 4531 -8094 -4851
3900 -4851 8471 4851 -7747 -3890 9244 6401 -8323 -4721 9201 6092 -8252 -4521 10099
$$ packed form
3806f392J358J4309j196j4005L87J2544J457j2378j573J2884R76j2010l647J3079
3820E793L658j2597l872J1638M644j2970m611J2489N262j1927o525J2376O225
3833I583j1586p720J2152P910j3029q756J2996P878j1631q802J2100J0075j4193
3846c023q730J2577R440j3226q365J2804Q063j2888r641J3970Q039j2279q454
3859a1713J2839Q463j3370p343J1355R071j1723q500J0409P508r412q654J0898
3872a72Q316r057r762R350Q180p657r911Q649R933p778q946O497R067n742j0359
3887i392O565J0757n493j0496N181J0581l764j2616M448J2613l853j2625L243
3900d851J3322l620j2598L857J3134k843j4724L602J3922l109j4344L731J4620
$$ plain form
3913 10099 6814 -7998 -4058 9546 7362 -7047 -4791 9576 6728 -8243 -4988 11075 7780
3926 7780 -6698 -3902 9758 6978 -5941 -4473 9202 7834 -4776 -3702 8504 6676 -4378
3939 -4378 -3850 8519 7414 -4673 -5317 6592 7510 -4218 -5559 6682 7892 -3956 -6550 5769
3953 5769 8011 -2755 -6600 4215 7954 -3097 -7621 3810 6946 -4451 -8112 2426 7306
3966 7306 -3324 -8863 2596 8161 -2893 -9321 2358 8645 -3271 -10808 1060 7872 -2730
3979 -2730 -9296 1683 9369 -3696 -10763 567 7807 -3397 -10571 634 7447 -3436 -11224
3992 -11224 1060 9039 -2424 -9864 518 8043 -3250 -10500 444 7090 -2513 -8902 212
4005 212 7586 -1983 -8823 -655 6492 -1614 -8538 -1871 6767 -341 -9043 -1149 7289 87 -7371
$$ packed form
3913A0099l285j4812L940J3604k184j4409K256J4367k848j4971L255J6063l295
3926G780j4478K796J3660k780j2919J468J3675j368j2610J074J2206j828j1054
3939d378N28J2369j105j2087o44J1909R18j1728j341J2241J210j1848k594J2319
3953E769K242j0766l845J0815L739j1051m524J1431L136j1397l661J0538M880
3966G306j0630n539J1459N565j1054o428J1679O287j1916p537J1868O812j0602
3979b730o566J0979P686j3065p067J1330P240j1204p174J1205O813j0883p788
3992a1224J2284P979j1463p440J0382P525j1293p250J0944O646r603o389R114
4005B12P374r569o840Q168P147q106o924O667Q638p108q702P894Q438p202p458
$$ plain form
4020 -7371 -2463 6876 1690 -6863 -2020 6395 2407 -6737 -3459 6827 3566 -7377 -3083 7865
4034 7865 4142 -7603 -3782 8760 5319 -7510 -3532 8668 6331 -6187 -3584 9537 5672
4047 5672 -6153 -3315 8127 5634 -6460 -3613 9368 6031 -6244 -3353 8657 6255 -6215
4060 -6215 -3359 8785 6371 -6212 -3647 7922 6632 -5515 -3229 6902 6336 -5408 -3910 6702
4074 6702 5635 -4601 -3914 6293 5931 -4317 -4295 5755 6252 -4265 -5678 3884 6209 -3371 -5781
4089 -5781 3202 6064 -2515 -6344 3220 5864 -3180 -6757 3006 7128 -3723 -7624 1909 7468 -3931
4104 -3931 -8411 1892 6887 -3095 -8758 1864 6615 -2890 -9226 1508 6847 -3067 -9564 1322
4118 1322 6972 -3457 -9327 1196 7614 -3967 -8831 696 7274 -3287 -9389 -111 6289 -3354
$$ packed form
4020g371M908R339n186q553M843Q415l988r144L278J0286l261j0943M294J0948
4034G865l723j1745L821J2542l441j2829L978J2200k337j2518K603J3121l865
4047E672j1825K838J1442k493j2094K847J2981l337j2275K891J2010k402j2470
4060f215K856J2144k414j2583K565J1569j290j2147K286J0131n66j1744J498J0612
4074F702j067j0236O87J0207l62j0248K2J0050M97j0517j413R562K325r580k410
4089e781Q983K862q579l829R564K644r044l577R763M122j0851l901R533N559j1399
4104c931m480J0303M995r982n663J0622M751r505o336J0734N339r914o497J0886
4118A322N650j0429n870J0523O418j1581m864R527O578j0561o102R278O400r643
$$ plain form
4132 -3354 -9300 905 6542 -2608 -8851 110 6319 -2728 -7391 -188 6260 -1135 -7504 -420 6990
4147 6990 -330 -6209 -485 5882 816 -6742 -828 6368 1244 -7522 -1211 6358 2278 -6415 -1431
4162 -1431 7096 2821 -5929 -1985 7158 3956 -6070 -2555 8470 3875 -5988 -2747 8412 4239
4176 4239 -6022 -3120 7968 5190 -5957 -2611 7471 5265 -5848 -3100 7833 4519 -5596
4189 -5596 -2299 7509 5666 -5383 -3005 8471 5327 -5125 -2533 7206 5258 -5997 -2727 6507
4203 6507 4811 -4703 -2944 6109 3444 -4573 -3530 5150 4681 -3455 -4148 4720 4979 -4590 -4880 4278
4219 4278 3943 -3413 -5123 4051 4443 -3331 -5242 1383 5660 -3104 -6034 2882 5293 -2817 -7450
4234 -7450 1666 5662 -2740 -7443 2058 5856 -2802 -7587 1263 5791 -3297 -7876 1908 6329 -3957
$$ packed form
4132c354n946J0205N637r150o243Q961O209r047m663P203O448p395o369P084P410
4147F990p320n879N724O367n066p558N914P196n124q766O311P569m080q693M984
4162a431Q527m275q750L944R143l202j0026L515J1025m595r863L241J1159m173
4176D239j0261K902J1088k778j1147L346J0082k206j1113K748J0933l314j0115
4189e596L297R808j843j1049K378J1476l144j0452K592R739j948j1255L270R234
4203F507j696r514J759R053k665q017J043Q680m69q136o93Q868K59r569k90R158
4219D278l35p356j710R174L92p774j911O625M277q764k930Q916K411q110m633
4234g450R116L996q402m703R501L798q658m785Q850M528r088m579R784M421j0286
$$ plain form
4249 -3957 -8409 1130 5816 -3712 -8483 950 6581 -3766 -8174 933 5605 -2597 -8907 1297
4263 1297 4948 -3426 -7425 668 6111 -2203 -7728 651 5564 -2216 -6591 50 5440 -1020 -6556
4278 -6556 1007 5599 -348 -5951 9 5473 -364 -5396 131 5900 2180 -5296 -362 6855 1935
4293 1935 -5130 -797 6128 1910 -4582 -942 6170 2532 -4915 -2563 7121 4160 -4506 -842 7171
4308 7171 4163 -4281 -2154 7575 4642 -4577 -1522 8220 4522 -5165 -2045 7579 4160 -4590 -2219
4323 -2219 6348 4738 -4896 -2784 7652 4608 -4710 -1972 6510 3751 -4630 -3309 5935 3424 -4097
4338 -4097 -2715 5515 3158 -3868 -2433 5104 4283 -4629 -3045 4839 4841 -4740 -4127 3766 3920 -3742
4354 -3742 -4487 3285 4110 -3610 -4519 2088 3537 -3610 -5978 2050 3013 -2379 -6095 1794 4440 -3586
$$ packed form
4249c957m452R539M686r528m771R433N631j0347m408R107M672q202o310J0204
4263A297L651q374l999Q093N443q314n525Q379M913p780m375O641N390o460n536
4278f556P563M592n947n603N960N464n837n032N527N769l720p476M934P217m920
4293A935p065M333O925m218o492L640P112l638p447K352R684k961q666L664Q013
4308G171l008q444K127R729k933r219L055R742l698r687L120R624l419q750K371
4323b219Q567j610r634K112J0436l044r318K738Q482k759q381J321R244k511p521
4338d097J382Q230k357p026J435P537q21q912J584P884Kr581O13P893J54p662
4354c742p45P772Q25p720r09O607J449p147k368Q028R63n392l716P889K646q026
$$ plain form
4370 -3586 -6543 1067 4937 -3788 -7114 1069 5298 -3425 -7947 745 5047 -3042 -6747 899 5055
4385 5055 -2977 -7260 399 5784 -3519 -7598 1140 4600 -2465 -7991 1580 5419 -2678 -6119 618
4400 618 5049 -2621 -6553 1176 5422 -1259 -5300 634 5462 -1304 -5105 887 5438 -54 -5462
4415 -5462 110 5494 477 -4877 -214 5209 1389 -4738 -380 5448 1455 -3936 -1274 5982 2515
4430 2515 -4040 -137 5645 2709 -4613 -938 5581 2837 -4337 -1758 6780 3823 -4847 -1468 7347
4445 7347 3698 -4243 -2007 7010 3750 -5048 -1656 6896 3329 -5577 -1927 7053 3532 -4864 -829
4460 -829 5951 4008 -4374 -2292 6433 3181 -4918 -2500 5403 4084 -4641 -2427 5053 2467 -4488
4475 -4488 -2693 4904 2795 -3678 -2387 4024 2920 -3838 -3887 2195 2930 -2733 -4021 3227 3274 -3316
$$ packed form
4370c586k957P610L870q725l326Q183M229q723m522Q692M302q089l705P646M156
4385E055q032m283P659N385r303m079Q738L460p065n526R571L839q097l441O737
4400F18M431p670l932P729M246o681m041N934M828o766l801N992M551n492n408
4415e462N572N384n017n354M663N423l820o127M358N828l993n391K662P256l467
4430B515o555L903N782k936p322L675O519k744p174K579Q538k957q670L379Q815
4445G347l649p941K236R017l260q798L392Q552l567q906L650Q980l521q396M035
4460h29O780j943q382K082Q725l252q099K418P903j319q725K214P480k586o955
4475d488J795P597k109o473J291O411j104o758m9O082P35n663j288P248M7o590
$$ plain form
4491 -3316 -4941 1515 2899 -2677 -4789 2274 3775 -3034 -4666 1832 4580 -3234 -6238 1593 4348
4506 4348 -3419 -6281 962 4439 -3442 -6113 1300 3942 -3113 -6520 591 4932 -3505 -6221 1664
4521 1664 4152 -2391 -5964 1980 4443 -2481 -5995 496 4794 -2378 -5708 1784 4227 -2177 -5803
4536 -5803 1281 4744 -2086 -4552 1492 4422 -987 -4138 508 5121 -1 -4074 951 4146 250
4551 250 -5116 301 5376 468 -4548 -758 5117 1250 -3936 -565 5111 2727 -3667 -1026 5427
4566 5427 2399 -3408 -290 6326 2798 -3258 -980 5401 2684 -4450 -1186 6363 2942 -4586 -1816
4581 -1816 5769 2264 -4607 -1189 6110 2695 -4289 -1143 5720 2965 -4679 -1042 5836 2507 -4534
4596 -4534 -2340 4279 3095 -4428 -1216 4072 2295 -4316 -2026 4684 2156 -3643 -1361 3090 1952
$$ packed form
4491c316j625O456J384n576k112P063J501o809j632O498K748p814l004P831K755
4506D348p767k862P243L477p881k671P413K642p055l407P111M341q437k716P885
4521A664K488o543l573P944K463o924l514O491M298p172l330P492K443o404l626
4536e803P084L463o830k466O044K930n409l151M646M613n122m073N025L195l896
4551B50n366N417N075m908n016L790N875l867n186L371N676k384o394K641O453
4566E427l028n807L118O616l528o056K278O381k717p134L264P549l421p528K770
4581a816P585l505o871L418P299l415o984L146O863k755p644L637O878l329p041
4596d534K194O619j184p523L212N288j777o611K290O710k528n799K282M451j138
$$ plain form
4611 1952 -3737 -2148 3179 1913 -3636 -2546 2730 1708 -4373 -3022 2153 2365 -2664 -4161 1619
4626 1619 2612 -3061 -5723 1478 2708 -2914 -5728 1508 3431 -3527 -5536 1923 3326 -4207 -6529
4641 -6529 951 3297 -3100 -5661 1033 2428 -3217 -5873 1300 4316 -2083 -4149 1178 3435 -2383
4656 -2383 -4624 1188 4070 -2020 -4524 984 4079 -2594 -4144 1165 4270 -1852 -4769 1376 3914
4671 3914 -2233 -3325 713 4168 -882 -4814 799 3658 -290 -2861 993 4876 78 -3504 417
4686 417 4994 701 -3600 815 4966 1401 -3574 1040 4353 1511 -3528 -73 4707 1684 -3946
4701 -3946 -429 4635 2095 -3598 -1127 5191 2360 -4234 -441 6013 2704 -3295 -1344 5621 2567
4716 2567 -3506 -221 6149 1031 -3629 -1289 5655 3190 -3911 -1158 4150 661 -4114 -335 4536
$$ packed form
4611A952n689J589N327j266n549J090N276j022o081J351N175K12n029j497N780
4626A619R93n673k662P201J230n622k814P236J923o958k009P459J403p533k322
4641f529P480K346o397k561O694J395n645k656P173L016o399k066N327K257n818
4656b383k241N812K882o090k504N508L095o673j550N309L105o122k917O145K538
4671C914o147j092M038L455n050l932N613K859l948k571L854L883m798l582L921
4686D17M577m293m301M415M151l565m975M614L313k842n039L455M780l023n630
4701c946L517N064k540n693K471O318k831o594L793O454l309n999J951O965l054
4716B567o073L285O370n118m660K340O944k465p101K753N308l489m775L779M871
$$ plain form
4731 4536 2150 -3784 -877 4387 1649 -3496 -2145 4358 2197 -2776 -1033 2891 685 -4148 -2146
4746 -2146 2902 1811 -3167 -2818 2748 1918 -3318 -2272 1417 2617 -2593 -3295 1834 1310 -2839 -4554
4762 -4554 2471 2295 -2842 -4222 989 2368 -2788 -4696 1129 2949 -2832 -4857 1319 2759 -2754
4777 -2754 -4439 1758 3662 -3304 -4645 1761 4199 -2614 -4973 1532 3893 -3260 -4739 2136 2956
4792 2956 -3037 -4309 1075 3023 -1918 -4198 1883 3095 -2226 -2983 940 3640 -1318 -3292 1715
4807 1715 4532 -1160 -2921 1514 3099 -596 -2598 650 3549 -369 -2442 522 4100 642 -1835
4822 -1835 770 4657 327 -3079 220 4538 1466 -2139 11 4876 1046 -2967 -298 4750 1710
4837 1710 -2838 -549 5234 1991 -2982 1048 4973 2091 -3888 -23 4626 2634 -2753 -281 4981
$$ packed form
4731D536k386n934K907N264k738n145J351O503k161m973J743L924k206m833K002
4746b146N048j091m978L49N566q30n236J046L689J200n210p02N129n24m149j715
4762d554P025j76n137j380N211J379n156j908N825J820n781k025O176J440n513
4777b754j685O197J904o966j341O406K438o813k359O505K361p153j479O875Q20
4792B956n993j272N384J948m941k280O081J212n321p57L923K700m958j974N007
4807A715K817n692j761M435J585l695k002L248K899l918k073K964L578l458k477
4822a835K605L887m330l406L299M318l072l605K150M865l830m013K669N048l040
4837A710m548K289N783l243m973M030L925k882n979L865M649j992n387K472N262
$$ plain form
4852 4981 1484 -3988 -760 4270 2003 -3647 -1363 4509 1074 -2786 -414 3279 2081 -3475 -1133
4867 -1133 3560 1344 -3422 -1279 3172 859 -3214 -1377 2740 843 -2661 -1732 1751 1324 -2587
4882 -2587 -2471 1998 1510 -3208 -3335 1788 2320 -2538 -2719 1222 2423 -3233 -4061 1267 1498 -2482 -4207
4899 -4207 1859 2379 -3166 -4190 1418 2284 -2330 -3896 1258 2211 -3095 -4184 848 3572 -2734 -4355
4915 -4355 1434 2421 -2476 -3830 1353 3389 -1651 -3334 1182 2662 -1918 -3419 1942 2670 -1287
4930 -1287 -3371 1819 3239 -1558 -3184 1630 3381 -956 -3384 1738 4087 -436 -2413 1953 4254
4945 4254 -1177 -2190 1702 3866 -573 -2476 856 3481 -203 -2438 1286 4492 986 -1831 1069
4960 1069 3280 1030 -2612 854 4094 1907 -2545 -24 4475 1002 -2633 31 4326 1440 -2640
$$ packed form
4852D981l497n472L228N030k267n650K284N872l435l860K372L693j198n556K342
4867a133M693k216m766K143M451k313m073J837M117j897l504R29L483m27l911
4882b587J16M469m88m718j27N123N32m858j81L941J201n656q28N328K31l980j725
4899d207O066N20n545j024N608Q66m614j566N154R53n306j089N032K724o306j621
4915d355N789R87m897j354N183K036n040j683M516J480m580j501N361P28l957
4930a287k084N190J420m797j626M814J751m337k428N122K349m523j977M366K301
4945D254n431j013L892K164m439j903L332K625l684k235L724L206l506k817K900
4960A069K211k250l642L466L240k187m452K521M499l473l635K664M295k886m080
$$ plain form
4975 -2640 111 4229 1382 -2736 -1037 4012 1228 -3651 -316 3209 644 -3318 -1083 3808 1185
4990 1185 -3642 -1640 3607 656 -2784 -919 4141 1005 -4116 -1131 2417 1353 -4246 -2130 2567
5005 2567 874 -2936 -1647 1018 721 -3041 -1547 2018 1498 -3347 -1972 1821 1327 -2390 -2532 1684
5021 1684 1865 -2323 -1731 1287 1275 -2464 -2568 1031 2310 -2847 -3178 1255 1386 -1542 -4702 550 2067
5038 2067 -2377 -2805 1141 1756 -2017 -3092 733 1598 -2345 -4144 1300 3350 -2130 -4102 1814 2487
5054 2487 -1588 -3407 713 3124 -1460 -3306 1167 2725 -1904 -2295 2088 3628 -785 -2240 1739
5069 1739 2702 -1330 -2400 1918 3542 216 -1722 1787 3178 -18 -1980 1909 3226 -1260 -1618
5084 -1618 1781 3541 428 -2267 1531 3306 1519 -1796 340 3116 -9 -2820 321 3689 1459
$$ packed form
4975b640K751M118k847m118J699N049k784m879L335L525k565l962K235M891k623
4990A185m827K002N247k951l440J865N060l136n121K985L548j064n599K116M697
5005B567j693l810J289K665k97l762J494L565n20m845J375L793m94l717j42M216
5021A684J81m188N92L018j2l739j04L599J279n157l31M433J31k928l160N252J517
5038B067m444m28L946O15l773j075L825Q65l943j799N444K050n480j972N916O73
5054B487m075j819M120K411m584j846M473J558m629l91M383J540m413j455L979
5069A739R63m032j070M318J624l326j938L509J391l196j962L889J317m486l58
5084a618L399J760l113k695L798J775j787l315K136K776l125k811L141L368k230
$$ plain form
5099 1459 -2489 388 4172 467 -2057 -158 3221 1186 -1787 -69 3793 709 -2675 -501 3734
5114 3734 1234 -2426 -558 3118 1665 -2553 -377 4069 558 -3213 -1123 3195 454 -3354 -1093
5129 -1093 3323 586 -3311 -449 2983 733 -4204 -1079 1742 -490 -3333 -1970 2357 0 -2969
5144 -2969 -1579 1373 967 -2987 -2279 1401 1232 -2713 -2147 1599 595 -2728 -2850 999 1106 -2377
5160 -2377 -3216 1048 1802 -1644 -2045 613 1482 -2770 -3206 513 1441 -2246 -3052 1023 1545 -2048 -3253
5177 -3253 1434 2714 -2436 -2830 2265 1574 -2079 -3803 645 2046 -2419 -2432 2267 3478 -1456 -2797
5193 -2797 1213 2705 -1512 -2156 1757 2751 -1110 -2348 2178 2699 -837 -1070 1779 3003 -739 -1489
5209 -1489 1251 3352 -161 -1789 1720 3121 -321 -1398 1133 2571 107 -1510 311 3000 1244
$$ packed form
5099A459l948K877L784l705k524J899L379k035k973J718L862l084l384K174M235
5114C734k500l660J868L676j453m218K176M446l511l771K090M318k741l808K261
5129a093M416k737l897K862L432k250m937L125K821k232k843J363M327k357k969
5144b969J390K952m06l954P08L680j69l945N66L746j004l323j22L849J07l483
5160b377q39M264P54l446m01K658Q69m252m36L719R28l687q06M075N22l593j205
5177c253M687J280n150l94N095o91l653j724M448J401m465j3M699J211m934j341
5193b797M010J492m217o44L913R94l861j238M526N21l536k33K849J224l742p50
5209a489K740K101l513j628L509J401l442j077K531J438k464j617J821K689j756
$$ plain form
5224 1244 -1585 703 2797 669 -1439 568 3123 370 -2187 112 2780 1116 -1506 119 3341
5239 3341 780 -1612 70 2854 891 -3012 146 3013 1265 -2559 -176 2819 295 -2625 -862
5254 -862 3509 667 -3242 -509 2838 399 -3087 -1150 2449 -347 -2884 -133 2332 -747 -3386
5269 -3386 -561 1219 56 -2236 -1133 1157 -17 -3178 -604 1941 319 -2917 -1194 231 -367
5284 -367 -2762 -2746 1433 672 -2327 -1999 976 564 -3363 -1907 1070 881 -1492 -2056 1116 1378 -2683
5301 -2683 -2246 1033 1787 -2753 -2154 917 1147 -1010 -1981 1313 1678 -1449 -2748 1109 2034 -580 -2262
5318 -2262 2322 2506 -1307 -2130 1913 2952 -965 -2191 2392 2199 -1585 -1774 1235 2200 -1306 -1102
5334 -1102 1448 2261 -829 -848 2030 1975 -311 -1551 1777 2115 -251 -957 1779 2681 -243 -1246 799
$$ packed form
5224A244k829K288K094k128k108K007K555k753k557K299K668j664k622J625L222
5239C341k561k392J682K784j963l903L158K867j748l824K383K995k524k920J763
5254h62M371k842l909K733L347k439l486J937L599k796k537K751K465l079k639
5269c386K825J780j163k292J103K290j174l161K574K545j622l236J723J425n98
5284c67k395J6M179p61k999L28K975m12l927J456K977j89k373n64L172K62m061
5301b683M37L279P54m540N99L071K30k157r71L294L65l127j299L857R25k614j682
5318b262M584J84l813q23M043J039l917j226M583j93l784j89L009R65l506K04
5334a102K550Q13l090j9K878n5k286j240L328L38k366p06K736R02k924j003K045
$$ plain form
5351 799 2486 523 -1605 1259 3179 377 -1595 638 3342 550 -1063 133 2510 622 -1764
5366 -1764 455 2360 754 -2003 130 2839 567 -1834 -309 2847 -133 -2604 261 2052 -153
5381 -153 -2302 295 3198 677 -2009 -309 2380 290 -1996 -37 1843 713 -2938 -804 2420
5396 2420 -256 -2106 -1091 1319 -307 -2825 -674 1809 46 -2964 -497 1203 341 -3154 -616
5411 -616 750 654 -1672 -1330 1258 774 -2117 -2716 1476 741 -1818 -1138 1087 722 -1245 -1603 221
5428 221 635 -2012 -1137 1001 1414 -2168 -1758 481 1124 -1771 -2104 2111 1215 -1817 -2422 1136 1812
5445 1812 -1580 -1254 1285 2562 -1874 -1637 1873 2046 -1579 -1628 1216 2463 -1210 -883 1867 1865 -1857
5462 -1857 -1192 1065 2718 -335 -1117 1654 1751 -1553 -733 1600 2123 -65 -652 1147 2014 169 -979
$$ packed form
5351G99J687j963k128K864J920k802j972K233K704k792j613J196K377j888k386
5366a764K219J905j606k757K133K709k272k401J525L156k980k471K865J791k205
5381a53k149K597K903k521k686J700K689k090k286J959J880j130l651K134L224
5396B420k676j850J015K410j626k518K151K483j763l010K467J700q62l495K538
5411f16J366r6k326L42K588m84k891n99M192p35k559O80K225l65j967l58J824
5428B21M14k647Q75K138M13l582M10K239O43k895l33M215q96l032o05L558O76
5445A812l392L26K539J277m436K37L510J73l625m9K844J247l673L27K750kl722
5462a857O65K257J653l053p82K771R7l304Q20K333N23k188n87J799Q67j845j148
$$ plain form
5479 -979 684 2290 -678 -1793 811 2555 -150 -1487 1046 2451 373 -1680 703 2979 -700
5494 -700 -2188 1123 2082 -673 -1549 99 2216 388 -2303 162 2550 32 -1707 644 1914 -283
5510 -283 -2607 -648 3139 -266 -2392 250 2237 15 -1640 -118 1821 -588 -2940 -142 2881
5525 2881 -719 -2739 -109 1374 -723 -2884 -443 1835 -39 -2480 -793 1858 -188 -2967 -291
5540 -291 1241 71 -1873 -869 723 -605 -1441 -717 558 627 -1850 -1759 883 42 -1785 -1420 1020
5557 1020 477 -1911 -2126 1504 984 -2083 -1255 1012 734 -1510 -1201 756 900 -1391 -837 1416 1675
5574 1675 -1227 -2058 1850 717 -936 -1707 2255 1494 -726 -1362 1336 1317 -1018 -1640 1577 2214 -883
5591 -883 -1450 2240 394 -1347 -375 1413 1627 -599 -867 1786 2287 -1252 -1042 1981 2533 137 -864
$$ packed form
5479i79J663J606k968j115K604J744k705j337K533J405k078k053K383K276l679
5494g00j488L311R59k755q76J648K117j828k691K465K388k518j739K351J270k197
5510b83k324J959L787l405k126K642J987k222j655J522J939k409k352K798L023
5525B881l600k020K630J483k097k161K441K278j874k441J687K651k046k779K676
5540b91J532j170j944J004J592j328q36P24J275O9k477R1K642q41j827L65K440
5557A020n43k388k15L630n20l067Q28K267k78k244L09J957J44k291N54K253K59
5574A675k902q31L908j133j653p71L962p61k220o36K698j9k335o22L217O37l097
5591h83n67L690j846j741R72J788K14k226k68K653N01l539K10L023N52k396j001
$$ plain form
5608 -864 633 2147 416 -714 768 2138 -860 -2212 1166 1616 21 -305 1077 2043 179 -524
5624 -524 95 1982 402 -475 874 2088 -124 -1525 400 2187 550 -1858 104 2976 1194 -1856
5640 -1856 786 1807 -887 -2522 -253 1750 -600 -1429 -783 2011 -451 -2650 -537 2138 -877
5655 -877 -2739 392 1900 -972 -2280 -673 1374 -1044 -2098 -209 1403 -89 -1957 -1093 1131
5670 1131 38 -1895 -674 1162 -168 -2068 -1192 807 216 -1663 -1480 780 869 -913 -1056 941
5686 941 655 -1801 -1041 2084 492 -1910 -337 980 441 -2186 -558 567 1338 -1404 -1388 1578 967
5703 967 -1445 -1374 998 1855 -1825 -899 1504 1136 -1467 -1094 1563 1498 -1277 -965 1828 794 -776
5720 -776 -1374 1783 1742 -1153 -332 2147 2308 -251 -508 1617 1924 -669 225 1180 2211 -953 -617 1625
$$ packed form
5608h64J497J514j731j130J482J370k998j352L378M50j595l26J382R66j864p03
5624e24O19J887j580q77J349J214k212j401J925J787j637k408J962K872j782l050
5640a856K642J021k694j635K269K003k350q29O46K794k462k199K113K675l015
5655h77j862L131J508k872j308J607K047k418j054J889J612j492j868Q64K224
5670A131j093j933J221J836j330j900Q76J999n91j879J83K260Q9j782j43J997
5686I41k86k456P60L125j592k402J573J317n39k627J628J125P71k742J6K966o11
5703I67k412P1K372Q57l680R26K403l68k603L73K657o5k775L12K793j034j570
5720g76n98L157m1k895Q21K479J61k559k57K125L07k593Q94R55J031l164L36K242
$$ plain form
5738 1625 1137 77 -622 1629 1028 -64 -817 806 2012 -124 -509 1061 1713 -195 -826 792 2166
5755 2166 117 -922 603 1053 296 -1286 335 1519 -17 -2246 637 1897 71 -1648 171
5770 171 1086 -1410 -1613 660 1863 468 -1327 -15 785 -769 -1525 -278 1926 -653 -1335 -430 1809
5787 1809 -559 -1655 -589 925 -565 -2473 367 1021 -810 -1907 -518 1546 -510 -2441 -1081
5802 -1081 433 -440 -2110 32 949 -153 -1220 -1052 921 188 -2288 48 985 -125 -1632 -685
5818 -685 431 112 -1526 -1110 811 655 -1397 -1547 810 514 -1195 -359 565 389 -1451 -1036 1145
5835 1145 107 -1074 -1119 1485 1045 -1183 -1023 1588 1370 -1122 -718 1201 1413 -1460 -1487 991 1255
5852 1255 -455 -899 1546 1081 -726 -1624 2055 1446 -681 -1099 1339 1487 -107 -213 1750 1734 132
$$ packed form
5738A625m88j060o99K251o01j092p53J623J206k136l85J570O52j908o31J618J374
5755B166k049j039J525M50p57j582J621J184j536k229K883J260j826j719J819
5770A71R15k496k03K273J203j395j795J312Q00j554p56J247K204k579o82R05K239
5787A809k368j096J066J514j490j908K840O54j831j097J389K064k056j931J360
5802a081J514q73j670K142R17j102j067J68J973p33k476K336R37j110j507R47
5818f85J116l19j638M16J921j56k052j50K357k96j709Q36R24j76j840M15K181
5835A145j038j181m5K604m40k228J60K611k18k492M04J919K12k873k7K478K64
5852A255j710m44K445m65j807q98L679o09k127m18K438J48j594j06J963j6j602
$$ plain form
5869 132 -1674 1257 1153 -761 -1167 624 1047 -609 -460 951 1671 -58 -177 381 1912 -1040 -1280
5886 -1280 983 1108 -698 -815 344 694 169 -1333 619 2078 -794 -601 664 1142 -310 -1386
5902 -1386 787 1427 -323 -1453 -62 2046 501 -1643 -176 722 -468 -1967 136 1500 -345
5917 -345 -1719 -163 2130 -592 -1856 -570 1061 -285 -2215 -1450 822 -807 -1255 -184 306 9
5933 9 -1971 -772 210 -205 -883 24 1434 83 -1625 276 1362 498 -820 -632 924 -205 -1639
5950 -1639 -1316 453 345 -604 -519 722 287 -755 -240 1050 883 -540 -820 639 648 -1041 -778 1158
5968 1158 -172 -658 248 1111 825 -1036 -1144 1430 1076 -1162 457 1753 1600 -462 -1010 2438 853
5985 853 -285 -804 1495 1679 -1298 -231 1332 1535 -928 -337 2107 1131 -503 -62 1604 1425 -1021
$$ packed form
5869A32j806K931j04j914m06J791M23j656J49J411P20j729j19N58J531k952k40
5886a280K263J25j806j17J159L50n25j502J952J459k872J93J265M78j452j076
5902a386K173O40j750j130J391K108j545k144J467Q98j190j499K103J364j845
5917c45j374J556K293k722j264J286J631j346j930P65K272j629m48J071M90k97
5933Ij980J199R82m15o78R07J410j351j708J901J086q64j318J88J556j129j434
5950a639L23J769j08r49Q5J241m35j042N15J290j67j423k80J459Rj689K63J936
5968A158j330m86R06Q63k86j861j08K574l54k238J619J296j53k062n48L448j585
5985H53j138n19K299J84k977J067J563K03k463N91K444r76j634M41J666j79k446
$$ plain form
6002 -1021 -766 1473 849 -281 -643 1419 1480 -310 -501 1025 1492 -496 -46 580 721 -332 151 1313
6020 1313 -13 54 -474 35 1761 -621 -674 976 1183 28 -1562 106 1211 -1013 -1616 -734 1036
6037 1036 -1185 -975 -208 758 -1143 -2379 -416 1215 -645 -2175 -283 1627 -386 -2042 100 409
6053 409 -230 -1632 36 1331 -736 -1636 -919 1136 -14 -1353 -180 449 -945 -1021 33 488 -1263
6070 -1263 -1310 132 1345 -320 -1562 -258 896 -181 -1511 -1069 699 89 -1813 -328 920 79
6086 79 -908 -721 880 18 -1718 -354 727 665 -1658 -594 1210 1362 -1616 -572 928 -201 -1380
6103 -1380 -653 2129 1603 -980 -617 1800 1182 -374 -140 756 1164 -1377 -220 1511 1160 312 86
6120 86 1617 1288 -528 18 1461 1382 -870 -556 1362 625 -914 351 1207 820 85 -474 1534 949
$$ packed form
6002a021K55K239o24j130l62K062O1j790j91J526M67j988M50O26J41j053M83J162
6020A313j326O7n28N09J726k382n3J650K07j155j590J668J105k224o03Q82J770
6037A036k221K10P67R66j901j236J963J631j860j530J892J910k013j656K142L09
6053D09o39j402J668J295k067r00P17K055j150j339J173O29j394p6J054M55j751
6070a263m7J442J213j665j242J304J154j077j330M42J768o10j902J485J248q41
6086G9r87J87J601q62j736J364J081o2k323J064J804J52k978J044J500j129j179
6103a380P27K782n26k583L63K417o18j556K34Q96M08k541J157J731l51q48k26
6120H6J531l29j816N46J443p9k252L14J918p37j539J265Q56l87p35n59K008n85
$$ plain form
6138 949 -516 -487 667 1322 -70 59 917 1381 -66 -225 14 273 -824 -673 -140 924 -236 -1007
6156 -1007 -455 1591 -647 -831 735 862 -759 -1028 -342 1655 -600 -1747 453 888 -601 -1467 -9
6173 -9 1184 -776 -2167 -73 1182 -567 -1290 413 1356 -1682 -914 -687 266 -764 -1396 303 768
6190 768 -128 -1877 -796 1900 -607 -1463 116 1118 -129 -483 64 709 -606 -1094 -305 606 -798
6207 -798 -1028 -280 775 -105 -232 -356 -68 823 -852 -383 579 -691 -1230 104 992 120 -885 109
6225 109 1507 357 -447 -122 851 483 -22 14 1517 1035 725 342 774 480 -806 202 1145 639 -987
6244 -987 584 1123 916 -1442 542 1945 842 -673 50 1561 889 -121 -750 1545 1375 -1011 109
6261 109 443 1098 114 739 1180 721 -1778 -51 1822 836 472 105 1282 552 -786 -140 -26 751
$$ packed form
6138I49j465K9J154O55j392J29Q58M64j447j59K39K59j097J51N33J064j160p71
6156a007N52K046k238j84J566J27j621k69O86J997k255j147K200M35j489q66J458
6173iJ193j960j391K094J255j749p23J703R43l038P68K27R53j030o32J699M65
6190G68q96j749J081K696k507q56J579J002j247l54N47O45j315m88P89R11j404
6207g98k30P48J055q80j27j24K88Q91j675M69R62j270n39J334Q88q72j005R94
6225A09J398j150q04L25R73l68n05L6J503m82l10l83M32k94j286J008R43n06j626
6244i87J571N39k07k358J984J403j103j515P23J511o72j010o29K295j70k386J120
6261A09L34O55r84O25M41m59k499J727J873r86l64l67J177p30j338O46J14P77
$$ plain form
6279 751 -286 -967 470 366 -602 -355 197 786 -117 -580 317 718 -112 -790 -527 238 -1185 -499 104
6298 104 1043 -1069 -1626 -72 347 -1207 -1455 -771 76 -734 -775 112 500 -1482 -932 -358 61 -1242 -1192
6317 -1192 -634 1453 -1151 -1651 -174 649 -771 -1389 -364 727 -1095 -2278 843 508 -990 -1607
6333 -1607 -103 146 -547 -1413 -349 1014 39 -941 -492 514 -345 -189 -731 1465 389 -117 -30 811
6351 811 710 -1177 -819 768 919 -521 298 1725 717 -350 -433 1626 -478 -729 150 1346 313
6368 313 -1013 -167 1072 900 -472 181 2397 472 -535 -879 1178 545 -802 -489 988 1037 -222
6385 -222 157 871 930 -1028 -703 1514 136 -771 -566 1160 828 -734 576 1774 560 -1078 -586
6402 -586 123 1418 495 -653 1817 383 -455 -825 1111 835 -729 -538 644 235 -402 -683 685
$$ packed form
6279G51j037o81J437j04r68K47N52N89r03m63Q97M01q30o78K63P65j423O86O03
6298A04R39k112n57J554M19j554k48O84Q47q10m1Q87L88j982N50N74M19j303N0
6317a192N58K087k604n00J477Q23j420o18J025J091j822j183L121l35j498o17
6333a607J504K49o93q66J064J363r75r80M49J006q59J56n42K196j076n06Q7Q41
6351H11j01j887L58J587J51j440Q19J427j008j067q3K059k104k51Q79J196j033
6368C13j326Q46J239j72j372O53K216j925j007l44K057o33j347L13J477M9j259
6385b22L79P14N9j958L25K217j378r07K05J726l32j562J310J198j214j638M92
6402e86P09J295r23j148K470j434q38l70J936k76j564J91J182m09o37k81J368
$$ plain form
6419 685 919 -1122 -844 418 295 -536 -879 720 728 -862 -1876 12 119 -975 -1258 -58 512 -525
6437 -525 -1884 -132 107 -912 -1359 -683 51 -627 -1582 58 512 -600 403 -403 478 -537 -967 -721
6455 -721 507 -672 -1691 -24 712 -247 -1161 405 708 -345 -498 319 1316 -132 -1624 -75 1055
6472 1055 -262 -583 -490 698 94 -344 126 175 -87 -405 992 1017 577 -600 -33 465 861 76 -209
6491 -209 946 -19 -860 69 622 862 -41 -629 1597 507 -943 -203 941 1001 -236 -337 1591 891
6509 891 -93 -152 1888 922 -486 -1 1114 497 94 -170 1067 1165 62 -215 1493 674 -784 118
6527 118 1333 459 -424 -91 711 307 -760 255 858 514 -640 -139 206 207 -262 -1017 287 769 -134
6546 -134 -120 700 483 -576 -741 135 121 30 -205 781 246 -953 -767 -525 -925 -459 -1503 478 503 -1086
$$ packed form
6419F85K34k041K78J262j23q31l43J599Qj590j014J888J07j094k83J200N70j037
6437e25j359J752K39j019m47O76P34o78r55J640M54j112J003q06Q81j015m30K46
6455g21J228j179j019J667P36r59r14J566L03j053j53Q17R97j448j492J549J130
6472A055j317l21R3J188o04m38M70M9k62l18J397K5m40j177N67M98L96p85k85
6491b09J155r65q41R29N53K40r03n88K226j090j450P40J144O0j237j01J928p00
6509H91r84n9K040r66j408M85J115o17m03k64J237R8j103k77J708q19j458R02
6527A18J215q74q83L33Q02m04j067J015O03l44j154N01L45Jm69p55J304M82r03
6546a34J4Q20k17j059j65Q76j4r1k35R86n35j199J86K42m00M66j044J981K5j589
$$ plain form
6566 -1086 -554 -212 196 484 -258 565 8 -378 -1298 -341 1521 -883 -1695 211 262 -630 -818 -263 -73
6585 -73 -1135 -1632 -962 110 -708 -737 -397 295 -1366 -1937 -284 305 -53 -1465 -100 341 26 -1669
6603 -1669 -211 1302 -212 -866 316 1309 -17 -1091 -197 484 300 -522 560 1017 94 -663 67
6620 67 1567 910 -744 106 697 614 -960 -517 813 477 -68 700 1221 402 -24 587 1098 -188 -26
6639 -26 -494 654 1106 -399 87 1003 910 326 -65 1113 -35 -37 -800 1039 1399 -847 -118 408 583
6658 583 210 -86 668 1131 -41 -193 1265 308 -745 583 391 262 -133 -1001 1121 1276 -1477 -129
6676 -129 290 686 -153 -1425 116 -112 186 -515 82 -181 -560 -1136 644 965 -802 -519 123 672 -578
6695 -578 -801 330 613 -545 -773 532 8 -529 -732 430 871 -274 -1054 211 437 -366 -467 -502
$$ packed form
6566a086N32L42M08K88p42Q23n57l86r20R57J862k404q12J906N1q92j88N55J90
6585g3j062m97O70J072q18k9L40O92j661n71J653N89l58j412J365M41l15j695
6603a669J458J513j514o54J182R93j326j074Q94O81j84q22J082M57r23p57P30
6620F7J500o57j654Q50N91q3j574M43J330l36n45P68N21q19m26O11N11j286J62
6639b6m68J148M52j505M86R16r3n84l91J178j148kp63J839L60k246P29N26J75
6658E83l73k96P54M63j172j52J458r57j053J328j92j29l95q68K122J55k753J348
6676a29M19L96q39j272J541k28K98p01N97k63l79n76J780L21j767K83O42N49j250
6695e78k23J131K83j158k28J305n24n37k03J162M41j145p80J265K26q03j01l5
$$ plain form
6713 -502 485 -359 -951 52 234 -393 -853 -251 -98 -470 -448 -360 1518 -407 -653 -23 1064 -929 -303
6732 -303 120 351 -91 -1501 1157 938 267 -1265 82 637 779 -758 132 701 195 -661 -457 1057
6750 1057 352 166 468 1080 -796 -290 -163 484 573 -1177 -64 988 987 -862 197 522 1240 -756
6768 -756 -216 1138 332 -480 -58 1189 161 -1386 -759 702 561 -25 -232 529 277 -894 212 996
6786 996 1108 -210 -311 1032 -34 -533 53 768 581 54 98 624 -47 133 -512 407 679 -365 -819
6805 -819 607 -889 -1232 -284 139 508 -1116 -509 -839 -101 -581 -1189 303 -330 -747 -597 5 282 8
6824 8 -961 -1102 154 -940 -888 407 230 -396 -917 -14 457 -408 -985 -316 649 393 -1114 528 233
6843 233 -1024 -230 -49 609 -710 -1080 463 281 -342 -902 744 860 -540 -856 38 -18 437 -515 918
$$ packed form
6713e02R87q44n92J003J82o27m60O02J53l72K2Q8J878j925k46O30J087j993O26
6732c03M23K31m42j410K658k19o71j532J347N55J42j537Q90N69n06q56K04J514
6750A057p05j86L02O12j876N06J27O47Q9j750J113J052jj849J059L25P18j996
6768g56N40J354q06q12M22J247j028j547O27J461j41n86k07P61k52j171J106P84
6786I96J12j318j01J343j066m99N86P15j87n27M4N26o71J80o45R19K72j044m54
6805h19J426j496l43R48M23L69j624O07l30P38m80o08J492o33m17J50O02K77k74
6824Hr69j41J256j094N2J295j77o26n21R03M71q65n77O69R65k56j507J642k95
6843B33j257P94J81O58j319l70J543j82o23n60J646J16j400l16Q94n6M55r52J433
$$ plain form
6862 918 1218 -497 -333 856 1257 202 -799 859 1061 -898 -30 375 -66 662 -706 109 814 -429
6880 -429 -369 -105 892 -363 173 376 734 -128 254 185 1173 -195 -838 -384 1771 589 -737 -31 157
6899 157 808 -616 415 405 63 345 -132 861 597 -524 325 144 70 217 497 1503 209 -304 368
6918 368 462 -202 -508 -638 844 33 207 -796 -120 10 -113 -226 695 -145 -648 283 -304 -201 -465 367
6938 367 -400 174 -1366 -67 1056 -22 4 -533 976 361 -220 -27 106 -670 -632 -1049 -100 653 -474
6957 -474 -955 -408 291 -582 -84 205 297 -626 -780 -644 287 3 -572 84 -590 -203 -866 402 -182 -1202
6977 -1202 -265 830 77 -1241 -126 -13 495 3 145 962 646 164 -705 267 460 -242 -489 -39 104
6996 104 451 24 -645 819 -681 -855 -101 -75 -296 -1026 262 958 685 -180 727 145 548 -622 49
$$ packed form
6862I18L00j715J64J189M01j055j001J658K02j959Q68M05m41P28j368Q15P05j243
6880d29O0K64R97j255N36K03L58q62L82o9R88j368o43M54K155j182j326P06J88
6899A57O51j424J031j0l42K82m77R93k64j121Q49j81p4J47K80J006j294n13O72
6918C68R4o64l06j30J482q11J74j003O76J30j23j13R21q40n03R31n87J03k64Q32
6938C67p67N74j540J299J123j078K6n37J509o15n81J93J33p76L8m17R49P53j127
6957d74m81N47O99q73M98K89R2r23j54J36R31k84n75O56o74L87o63J268n84j020
6977a202R37J095p53j318J115J13N08m92J42Q17l16m82q69R72J93p02k47M50J43
6996A04L47m27o69J464j500j74P54K6k21p30J288O96k73q65R07n82M03j170O71
$$ plain form
7015 49 135 262 -293 420 499 -500 -374 -24 805 -66 -804 1003 975 328 -1105 777 947 323 -1123 -139
7035 -139 1254 387 184 -433 471 -148 -783 258 1126 780 -529 -1090 270 443 -899 606 413 553
7053 553 -236 332 857 387 -687 -51 875 327 -241 12 157 -724 -974 -1141 239 -198 -249 -537 215 -731
7073 -731 -541 -302 353 -32 -672 -622 -224 -158 -188 -911 -599 -918 -744 -1615 210 -775 -837 -216 214 66 -456
7094 -456 -993 131 264 -374 -95 -494 263 -1328 -1048 792 -232 -340 -1793 -72 426 -737 -638 918
7112 918 1382 -699 -754 -736 -20 526 -633 1 638 541 134 947 815 -187 96 391 256 -779 -66 114
7132 114 1523 548 -841 459 948 171 -285 182 754 68 -115 6 623 -277 -564 148 699 890 -26
7151 -26 -325 22 285 104 70 177 929 -788 139 963 149 -1073 -162 -264 -584 -1213 -821 299 -174 289
$$ packed form
7015D9Q6J27n55P13P9r99J26L50Q29q71p38J807k8o47j433J882J70o24j446R84
7035a39J393q67k03o17R04o19o35J041Q68l46j309n61J360J73j342J505j93J40
7053E53p89N68N25m70j074O36R26n48n68K53J45q81k50j67J380m37n1k88P52r46
7073g31J90K39O55l85o40N0L98O6l0p23L12l19J74q71J825r85o2O21M30j48n22
7094d56n37J124J33o38K79l99P57j591K80J840j024j08j453J721M98j163R9J556
7112I18M64k081n5J8P16N46j159O34O37r7m07Q13j32j002K83K95j35j035P13J80
7132A14J409r75j389J300M89p77m56M67N72o86j83J21O17r00k87P12N51J91r16
7151b6k99L47K63j81l4J07P52j717R27Q24q14j222R11j02l20o29L92J120m73M63
$$ plain form
7171 289 -62 748 -667 -393 -311 1081 -46 -1006 283 394 170 -181 -970 849 -115 -580 595 164
7189 164 314 -591 107 -692 -382 -285 287 224 -51 -1345 -333 626 -294 -1112 -680 64 -117 -503 -498 -432 -194
7210 -194 -1390 -79 -890 -27 -565 -831 80 148 -543 -527 518 504 195 -87 -342 -81 9 -1009 1030 -211
7230 -211 -1047 -128 335 415 -113 -124 -553 -103 -307 -964 1113 -195 -253 -523 566 -204 -441 -685 -79 340
7250 340 -517 -436 105 136 -416 -105 240 424 368 -331 -839 944 -447 119 684 947 -95 62 593 1171
7270 1171 54 -447 468 1290 505 -507 710 1057 170 339 -199 243 817 138 420 161 208 -341 -13
7289 -13 1680 326 -60 131 -387 -109 -343 -17 -432 -97 -814 359 1416 131 -893 105 666 -253
7307 -253 -186 39 162 16 -248 418 -389 -344 -604 -67 118 -270 -143 -443 146 -94 -361 -179 -516 590
$$ packed form
7171B89l51Q10j415K74Q2J392j127r60J289J11k24l51p89J819r64m65J175m31
7189A64J50r05O98p99L10R7N72o3k75j294J012R59r20q18M32P44j81l86NO6K38
7210a94j196J311q11Q63n38k66R11O8o91J6J045j4l09k82k55K61R0j018K039j241
7230b11q36R19M63Q0n28j1m29M50k04o57K077j308n8k70J089p70k37k44O06M19
7250C40q57Q1N41L1n52L11L45J84n6o99n08J783j391N66N65K63j042J57N31N78
7270A171j117n01R15Q22p85j012J217L47q87J69n38M42N74o79K82k59M7n49L28
7289a3J693j354l86J91n18K78k34L26m15L35p17J173J057j285j024R98N61r19
7307b53O7K25J23j46k64O66q07M5k60N37J85l88J27l00N89k40k67J82l37J106
$$ plain form
7327 590 322 41 427 -315 -187 -439 340 481 -494 -219 842 -251 254 -712 400 929 -714 392
7345 392 127 -539 -1014 -801 -272 -215 -445 -465 215 1379 160 -477 213 141 -984 -515 273 48 -418 2
7365 2 53 -884 -363 39 -551 -163 -170 -860 368 79 256 -462 -574 392 -51 -942 310 653 -427 -133 459
7386 459 556 -387 538 -265 128 515 -114 -670 109 -361 384 12 -194 164 283 1055 242 13 -601 1361
7406 1361 -65 128 606 813 691 754 -21 989 845 361 -110 613 34 -438 543 -616 -920 1132 552
7425 552 329 -400 629 -438 327 452 303 -649 369 -203 413 -675 -228 780 428 -365 1246 521
7443 521 615 111 -513 510 -76 -949 -914 400 -1469 -310 108 1070 -360 -936 229 238 449 -255 172
7462 172 -316 -496 -240 -773 -66 -353 -1336 -507 617 -1212 -251 105 11 27 -440 -1302 664 370 -1394
$$ packed form
7327E90k68k81L86p42J28k52P79J41r75K75J061j093N05r66J112N29j643J106
7345C92k65o66m75K13N29N7k30k0O80J164j219o37O90p2j125M69P88k25m66M20
7365BN1r37N21M02n90L88po90J228k89J77p18j12R66m43q91J252L43j080K94N92
7386D59R7r43R25q03L93L87o29n56P79m70P45l72k06L58J19P72q13k29o14J962
7406A361j426J93M78K07j22O3p75J010j44m84m71P23n79m72R81j159l04K052n80
7425E52k23p29J029j067P65J25j49r52J018n72O16j088M47J008l52p93J611p25
7443E21R4n04o24J023n86q73L5J314j869J159M18R62j430n76J165RK11p04M27
7462A72m88j80K56n33P07k87r83Q29J124j829R61L56r4J6m67q62J966k94j764
$$ plain form
7481 -1394 -1292 -431 -922 -482 -1001 -638 373 116 -597 137 44 -1026 -299 -458 5 -329 9 153 -521
7500 -521 -1070 -403 257 388 -909 -216 107 255 145 -42 -260 253 -551 56 1274 2 -639 -1092 798
7519 798 -299 364 104 374 297 196 -431 260 672 -406 393 445 627 -488 35 132 1087 589 279 535
7539 535 1613 294 -1041 449 1251 414 -365 188 502 207 -354 -315 645 1154 59 1049 146 69 113
7558 113 -25 201 144 -803 377 491 -296 -641 -350 601 257 -956 272 366 -74 -482 144 1037 -598
7577 -598 115 680 81 120 489 182 715 -384 -134 570 75 250 -1252 -133 27 -281 -462 -1111 -68
7596 -68 797 -384 16 121 77 -652 -206 102 504 -926 270 138 -436 -1538 -785 204 125 -543 541
7615 541 674 340 -358 -423 -368 312 -44 -415 839 155 95 172 242 203 -1069 18 -869 503 -392 -987 -60
$$ packed form
7481a394J02Q61m91M40n19L63J011k57p13P34r3j070P27j59M63l34L38J44o74
7500e21n49O67O60J31j297O93L23J48j10j87k18N13q04O07J218j272o41m53J890
7519G98j097O63k60K70p7j01o27O91M12j078P99N2J82j115N23R7R55m98l10K56
7539E35J078j319j335J490Q02q37p79N53L14k95n61L9R60N09j095R90r03p7M4
7558A13j38K26n7r47J180J14p87l45K91R51l44j213J228R4m40m08O26Q93j635
7577e98P13N65n99L9L69l07N33j099K50P04m95J75j502J119J60l08j81o49J043
7596f8Q65j181M00J05m4p29M46L08M02j430J196j32n74j102P53R89p9o68J084
7615E41J33l34o98o5N5O80l56l71J254o84o0P7P0l9j272J087q87J372q95n95R27
$$ plain form
7636 -60 509 278 -626 253 110 -611 -520 622 569 -195 799 325 654 143 -519 818 837 348 74 322 402
7657 402 -526 -163 883 203 -137 -72 703 482 273 666 690 -516 941 -369 868 -339 424 -615
7675 -615 442 -308 143 -536 977 919 573 311 207 475 -210 -393 355 -135 -321 -165 165 906 -7 -717
7695 -717 220 162 -568 222 217 1262 -272 -383 -189 690 -395 -78 1078 -213 -404 -253 274 455 -309
7714 -309 -353 -579 400 583 -1013 274 -325 -158 99 208 808 -288 -961 -245 221 -188 -1406 -854 471
7733 471 284 -309 81 -303 493 30 -133 448 -62 -313 82 751 -104 -753 172 190 -225 -147 608 617 50
7754 50 -1209 -215 33 331 -354 -108 708 62 -179 -383 1877 774 -292 -172 921 359 -162 -446 -244
7773 -244 352 -158 -281 444 607 -274 -205 -19 737 348 599 172 994 -619 83 -309 180 -465 -756 723
$$ packed form
7636f0N69k31r04Q79j43p21R1J142n3p64R94m74L29n11o62J337J9m89k74K48Q0
7657D02r28L63J046o80l40O5P75k21k09L93K4j206J457j310J237j207P63j039
7675f15J057p50M51o79J513n8l46k62j04K68o85j83P48m90j86J56L30P41r13p10
7695g17R37n8p30P90nJ045j534j11J94Q79j085L17J156j291j91J51N27J81p64
7714c09m4k26R79J83j596J287n99J67K57J09O00j096o73P16M66m09j218N52J325
7733D71j87n93L90l84P96m63j63N81n10k51L95O69q55o49R25J8m15P8P55Rn67
7754E0j259R94K48K98o85K46Q16o46k41k04K260j103j066J20J093n62n21k84K02
7773b44N96n10j23P25J63q81O9J86P56l89K51m27Q22j613P02l92M89o45k91J479
$$ plain form
7793 723 1147 310 -333 589 294 -350 -81 209 -302 -737 -1204 747 531 144 220 537 -79 317 561 939
7813 939 297 251 -138 -737 340 536 -708 171 177 -64 -695 385 -189 -100 -403 -141 530 -500 18 203
7833 203 219 39 -17 117 54 -403 -198 -254 -386 907 -1244 -704 796 95 562 -200 618 -246 -707 -362
7853 -362 -265 -566 266 653 133 -117 -838 442 -71 -120 -964 282 -212 -381 -827 109 -738 506 2 -656
7873 -656 -155 -350 -116 -892 235 -208 250 -482 81 -610 -374 112 72 -826 -654 -271 331 -208 -349 -40
7893 -40 179 4 -298 -84 682 546 85 218 323 333 -654 153 1040 355 340 -449 920 729 519 -117 917
7914 917 86 314 28 172 375 97 112 389 -445 345 318 -790 406 1082 -1 471 383 693 -166 133
7934 133 1051 158 -402 510 634 -846 -252 178 189 91 280 1064 352 17 649 398 144 183 91 -214 655
$$ packed form
7793G23M24q37o43R22k95o44K69K90n11m35m67J951k16l87P6L17o16L96K44L78
7813I39o42m6l89n99J077J96j244Q79Ok41o31J080n74Q9l03K62O71j030N18J85
7833B03J6j80n6J34o3m57K05n6j32J293k151N40J500p01M67p62Q18q64m61L45
7853c62R7l01Q32L87n20k50p21J280n13m9q44J246m94j69m46R36q47J244n04o58
7873f56N01j95K34p76J127m43M58p32N63o91K36M86m0q98J72L83O02n39j41L09
7893d0K19j75l02K14P66j36m61J33J05J0r87Q07Q87o85j5p89J369j91k10o36J034
7914I17q31K28k86J44K03k78J5K77q34P90k7j108J196O76j083M72q8L10q59K99
7934A33R18q93n60R12J24j480N94M30J1r8J89P84p12l35O32k51k54L9r2l05Q69
$$ plain form
7955 655 606 -248 -489 -99 274 -551 751 80 -238 -1034 426 427 352 -262 -792 268 -61 -774 914 358
7975 358 390 -172 -460 286 348 -815 -310 3 -414 -440 -537 -781 -500 -543 254 633 548 -1013 304 352 -1549
7996 -1549 -295 55 96 193 -138 -496 159 -572 -613 -64 328 -518 -353 -726 187 -134 -220 -150 437 -109 427
8017 427 -92 -481 519 244 311 -300 -669 294 -267 859 341 563 -345 -375 601 168 1030 169 -206 -69
8037 -69 380 -149 488 -204 530 496 283 -401 -31 -306 246 625 -847 -200 551 419 17 -258 721 -514
8057 -514 436 971 47 926 944 142 -537 -66 235 435 142 -139 202 709 213 -191 365 633 549 20 158
8078 158 508 -122 342 124 -210 420 -448 -220 -627 -108 -186 -120 -64 27 -32 -292 -341 483 -952 246 -341
8099 -341 -36 -1061 -756 -590 -408 674 573 596 -209 -93 -581 862 592 -64 -592 123 -545 411 -733
$$ packed form
7955F55m9q54k41L90L73q25J302o71l18p96J460Jp5o14n30J060l29p13J688n56
7975C58L2n62k88P46O2j163N05L13m17k6r7k44K81m3P97L79q5j561J317M8j901
7996a549J254L50M1R7l31l58O55p31m1N49L92q46J65l73R13l21q6P0N87n46N36
8017D27n19l89J000k75O7o11l69R63n61J126n18K22r08l0R76m33Q62q61l75J37
8037f9M49n29O37o92P34l4k13o84L70k75N52L79j472O47P51j32m02k75R79j235
8057e14R50N35r24Q79J8q02o79M71L01K00k93k81L41N07m96m04N56K68q4n29J38
8078A58L50o30M64k18l34O30q68K28m07N19p8O6N6R1n9k60m9Q24j435J198n87
8099c41L05j025L05J66J82J082j01K3q05J16m88J443k70o56n28P15o68R56j144
$$ plain form
8118 -733 -281 -564 -406 -9 -232 225 -1205 -1084 -322 -330 -96 -871 -7 435 -123 -760 -131 611 -501 -242
8138 -242 -256 195 -566 145 -149 -68 151 413 -595 -326 -192 -400 278 -592 272 264 1 -690 141 -309 283
8159 283 130 283 -305 -165 -665 606 147 410 867 239 290 137 622 273 139 -278 -200 -190 -196 456 874
$$ packed form
8118g33M52k83J58L97k23M57j430J21P62qK34p75Q64M42n58o37O29P42j112K59
8138b42j4M51p61P11k94Q1K19K62j008K69J34k08O78q70Q64qk63o91Q31m50N92
8159B83j53J53n88J40n00J271m59K63M57o28N1j53M85l49j34m17P8J0oO52M18
$$ [...]
8191B61
##END NTUPLES=NMR FID
##END=
