##TITLE=1H_SAM_22.BBSX1_THF 1.6
 CDCl3, 8 sc, 
 6.5.2019
##JCAMPDX= 6.0         $$ Bruker NMR JCAMP-DX V2.0
##DATA TYPE= NMR FID
##DATA CLASS= NTUPLES
##ORIGIN= UXNMR, Bruker Analytische Messtechnik GmbH
##OWNER= root
$$ XWIN-NMR		Version 3.5
$$ Mon May  6 14:54:00 2019 Russian Standard Time (UT+4h)  she@DPX200
##.OBSERVE FREQUENCY= 200.1315
##.OBSERVE NUCLEUS= ^1H
##.DELAY= (6, 6)
##.ACQUISITION MODE= SIMULTANEOUS
##.ACQUISITION SCHEME= undefined
##.AVERAGES= 8
##.DIGITISER RES= 18
##SPECTROMETER/DATA SYSTEM= spect
##.PULSE SEQUENCE= zg30
##.SOLVENT NAME= CDCl3
##.SHIFT REFERENCE= (INTERNAL, CDCl3, 0, 15.7039)
##AUDIT TRAIL= $$ (NUMBER, WHEN, WHO, WHERE, WHAT)
$$ ##TITLE= Audit trail, XWIN-NMR		Version 3.5
$$ ##JCAMPDX= 5.01
$$ ##ORIGIN= Bruker BioSpin GmbH
$$ ##OWNER= she
$$ F:/spectra/data/she/nmr/H-F/1/audita.txt
$$ ##AUDIT TRAIL=  $$ (NUMBER, WHEN, WHO, WHERE, WHAT)
(   1,<2019-05-06 14:52:42.54 +0400>,<she>,<DPX200>,
      <created by zg, POWCHK disabled, PULCHK disabled
       configuration hash MD5:
       00 E9 B6 7A A2 85 ED C7 34 08 36 98 17 FE 4E 26
       data hash MD5: 16K
       6C 05 AE 5B 35 FF D6 5C D2 D6 BC A0 07 96 A6 95>)
$$ ##END=
$$ 
$$ hash MD5
$$ 91 8A 97 44 1E E7 B0 9A 24 B9 A9 22 51 8D A0 45
##$RELAX= 
##$RELAX= 
##$RELAX= 
##$RELAX= 
##$RELAX= 
##$RELAX= 
$$ Bruker specific parameters
$$ --------------------------
##$DU= <F:/spectra>
##$EXPNO= 1
##$NAME= <H-F>
##$PROCNO= 1
##$TYPE= <nmr>
##$USER= <she>
##$AMP= (0..31)
100 100 100 100 100 100 100 100 100 100 100 100 100 100 100 100 100 100 
100 100 100 100 100 100 100 100 100 100 100 100 100 100 
##$AQSEQ= 0
##$AQ_mod= 1
##$AUNM= <au_zg>
##$AUTOPOS= <>
##$BF1= 200.13
##$BF2= 200.13
##$BF3= 200.13
##$BF4= 200.13
##$BF5= 200.13
##$BF6= 200.13
##$BF7= 200.13
##$BF8= 200.13
##$BYTORDA= 1
##$CFDGTYP= 0
##$CFRGTYP= 5
##$CHEMSTR= <none>
##$CNST= (0..31)
1 1 145 1 1 1 1 1 1 1 1 1 1 1 1 1 1 1 1 1 1 1 1 1 1 1 1 1 1 1 1 1 
##$CPDPRG= <>
##$CPDPRG1= <>
##$CPDPRG2= <>
##$CPDPRG3= <>
##$CPDPRG4= <mlev>
##$CPDPRG5= <mlev>
##$CPDPRG6= <mlev>
##$CPDPRG7= <mlev>
##$CPDPRG8= <mlev>
##$CPDPRGB= <>
##$CPDPRGT= <>
##$D= (0..31)
0 1.2 0 0 0 0 0 0 0 0 0 0.03 0 0 0 0 0 0 0 0 0 0 0 0 0 0 0 0 0 0 0 0 
##$DATE= 1557139961
##$DBL= (0..7)
120 120 120 120 120 120 120 120 
##$DBP= (0..7)
150 150 150 150 150 150 150 150 
##$DBP07= 0
##$DBPNAM0= <>
##$DBPNAM1= <>
##$DBPNAM2= <>
##$DBPNAM3= <>
##$DBPNAM4= <>
##$DBPNAM5= <>
##$DBPNAM6= <>
##$DBPNAM7= <>
##$DBPOAL= (0..7)
0.5 0.5 0.5 0.5 0.5 0.5 0.5 0.5 
##$DBPOFFS= (0..7)
0 0 0 0 0 0 0 0 
##$DE= 6
##$DECBNUC= <off>
##$DECIM= 24
##$DECNUC= <off>
##$DECSTAT= 4
##$DIGMOD= 1
##$DIGTYP= 9
##$DL= (0..7)
0 120 120 120 120 120 120 120 
##$DP= (0..7)
150 150 150 150 150 150 150 150 
##$DP07= 0
##$DPNAME0= <>
##$DPNAME1= <>
##$DPNAME2= <>
##$DPNAME3= <>
##$DPNAME4= <>
##$DPNAME5= <>
##$DPNAME6= <>
##$DPNAME7= <>
##$DPOAL= (0..7)
0.5 0.5 0.5 0.5 0.5 0.5 0.5 0.5 
##$DPOFFS= (0..7)
0 0 0 0 0 0 0 0 
##$DQDMODE= 0
##$DR= 18
##$DS= 0
##$DSLIST= <SSSSSSSSSSSSSSS>
$$ [...]
##$SUBNAM2= <"">
##$SUBNAM3= <"">
##$SUBNAM4= <"">
##$SUBNAM5= <"">
##$SUBNAM6= <"">
##$SUBNAM7= <"">
##$SUBNAM8= <"">
##$SUBNAM9= <"">
##$SW= 24.9337058887773
##$SWIBOX= (0..15)
0 0 2 0 0 0 0 0 0 0 0 0 0 0 0 0 
##$SW_h= 4990.01996007984
##$TD= 16384
##$TD0= 1
##$TE= 0
##$TE2= 300
##$TE3= 300
##$TEG= 300
##$TL= (0..7)
0 120 120 120 120 120 120 120 
##$TP= (0..7)
150 150 150 150 150 150 150 150 
##$TP07= 0
##$TPNAME0= <>
##$TPNAME1= <>
##$TPNAME2= <>
##$TPNAME3= <>
##$TPNAME4= <>
##$TPNAME5= <>
##$TPNAME6= <>
##$TPNAME7= <>
##$TPOAL= (0..7)
0.5 0.5 0.5 0.5 0.5 0.5 0.5 0.5 
##$TPOFFS= (0..7)
0 0 0 0 0 0 0 0 
##$TUNHIN= 0
##$TUNHOUT= 0
##$TUNXOUT= 0
##$USERA1= <user>
##$USERA2= <user>
##$USERA3= <user>
##$USERA4= <user>
##$USERA5= <user>
##$V9= 5
##$VALIST= <valist>
##$VCLIST= <CCCCCCCCCCCCCCC>
##$VD= 0
##$VDLIST= <DDDDDDDDDDDDDDD>
##$VPLIST= <PPPPPPPPPPPPPPP>
##$VTLIST= <TTTTTTTTTTTTTTT>
##$WBST= 1024
##$WBSW= 4
##$XGAIN= (0..3)
0 0 0 0 
##$XL= 0
##$YL= 0
##$YMAX_a= 264676
##$YMIN_a= -463079
##$ZGOPTNS= <>
##$ZL1= 120
##$ZL2= 120
##$ZL3= 120
##$ZL4= 120
##$ABSF1= 10
##$ABSF2= 0
##$ABSG= 5
##$ABSL= 3
##$ALPHA= 0
##$AQORDER= 0
##$ASSFAC= 0
##$ASSFACI= 0
##$ASSFACX= 0
##$ASSWID= 0
##$AUNMP= <proc_1d>
##$AZFE= 0.1
##$AZFW= 0.1
##$BCFW= 1
##$BC_mod= 2
##$BYTORDP= 1
##$COROFFS= 0
##$CY= 11.3945322036743
##$DATMOD= 1
##$DC= 2
##$DFILT= <>
##$DTYPP= 0
##$F1P= 18.9103706918063
##$F2P= -1.10871071338519
##$FCOR= 0.5
##$FTSIZE= 0
##$FT_mod= 4
##$GAMMA= 1
##$GB= 0.15
##$INTBC= 1
##$INTSCL= 1
##$ISEN= 128
##$LB= 0.24
##$LEV0= 0
##$LPBIN= 0
##$MAXI= 10000
##$MC2= 0
##$MEAN= 0
##$ME_mod= 0
##$MI= 1.114404
##$NCOEF= 0
##$NC_proc= 0
##$NLEV= 6
##$NOISF1= 3.799351
##$NOISF2= 2.8
##$NSP= 1
##$NTH_PI= 0
##$NZP= 0
##$OFFSET= 15.70392
##$PC= 1
##$PHC0= -8855.642
##$PHC1= 15.00026
##$PH_mod= 1
##$PKNL= yes
##$PPARMOD= 0
##$PSCAL= 0
##$PSIGN= 0
##$REVERSE= no
##$SF= 200.130013532006
##$SI= 16384
##$SIGF1= 3
##$SIGF2= 2
##$SINO= 400
##$SIOLD= 16384
##$SREGLST= <1H.CDCl3>
##$SSB= 0
##$STSI= 0
##$STSR= 0
##$SW_p= 3612.71676300578
##$SYMM= 0
##$S_DEV= 0
##$TDeff= 0
##$TDoff= 0
##$TI= <>
##$TILT= no
##$TM1= 0
##$TM2= 0
##$TOPLEV= 0
##$USERP1= <user>
##$USERP2= <user>
##$USERP3= <user>
##$USERP4= <user>
##$USERP5= <user>
##$WDW= 1
##$XDIM= 8192
##$YMAX_p= 0
##$YMIN_p= 0
$$ End of Bruker specific parameters
$$ ---------------------------------
##NTUPLES= NMR FID
##VAR_NAME=  TIME,          FID/REAL,        FID/IMAG
##SYMBOL=    X,             R,               I
##VAR_TYPE=  INDEPENDENT,   DEPENDENT,       DEPENDENT
##VAR_FORM=  AFFN,          ASDF,            ASDF
##VAR_DIM=   8192,          8192,            8192
##UNITS=     SECONDS,       ARBITRARY UNITS, ARBITRARY UNITS
##FACTOR=    0.0002004,     1,               1
##FIRST=     0,             0,               0
##LAST=      1.6414764,     0,               0
##MIN=       0,             -463079,         0
##MAX=       1.6414764,     264676,          0
$$ Real data points
##PAGE= N=1
##DATA TABLE= (X++(R..R)), XYDATA
0@%%%%Qj6J6j6K4l2M0n6P2q8J04j28J54j78K12k52K96l48M04m67N40o19P07q05
28d28R14j034J168j316J477j653J846k060K295k550K831l142L480l854M268m723
44b481N231n800O438p161P989q944J0061j1388J2997j4998J7563k0994K5847l3284
58a8924M6278p5513K56219j2686l64356K59885J73773j36431j70394J68095N1261
69A77207k48479k00436J94278K11078p3869j94764n554N6907k6237k2306J19967
80a2208R0710r2181j59885J0715J36471O7757m9692k5511P843o0286q6838O4038
92a09067J60175N625j72386p9902Q7797M9488m3993M2540J04940n9220j74975
103a88978J0384J99162Q6398r1284m3021M9007k1525o2959P7522J54622k698j48548
$$ y = [0, 0, 0, 0, 0, 8, -8, 8, -8, 16, -16, 24, -32, 40, -48, 56, -72, 82, -96, 116, -136, 160, -188, 216, -251, 289, -330, 377, -428, 486, -548, 620, -696, 781, -872, 974, -1086, 1209, -1341, 1490, -1652, 1828, -2026, 2242, -2481, 2750, -3050, 3388, -3773, 4216, -4728, 5333, -6055, 6942, -8056, 9507, -11487, 14360, -18924, 27354, -48159, 208060, 195374, -168982, 90903, 264676, 128245, -42149, 125946, 177207, -71272, -271708, -77430, 133648, 59779, -134985, -140539, -83632, -109869, -132175, -12208, 78502, -13679, -173564, -162849, -26378, 41379, -8313, -33824, -25981, -86267, -173105, -109067, 51108, 56733, -115653, -195555, -107758, -58270, -102263, -59723, 45217, -14003, -188978, -178594, 20568, 106966, 15682, -27339, 21668, 143, -62816, 14706, 169328, 166630, 18082]
115A8082o9239O4465N7664N217K2748J4898p2369r9542R940J06380N9466m2151
127G5559o3300k6586j6166m075N5460Q2412j2262j15057o5453O1325P2461n939
139C8379j1729J7789m3617r4745J1915J28188M9234r1185p1230K0628P386k0770
151e9757N0294P9607m0202j25210k7150Q8125N8239j2118p596m971n3000m6584
163a00323N0061R9071K6927o3192o4699p572L0448L5953L4424K4907k2735p8482
175c5212m9011O1583J01832Q450o8557k8375J0698k7378j0737Q7219P4832p7373
187D7971j20830J6261Q8038O359k4712L8653P435r8581n5839R4716R3808m0057
199E3222o8561N301K930l7538K3630R0461J3466r1897n7968L5584M4616J0004
$$ y = [18082, -51157, 13308, 70972, 76189, 98937, 113835, 41466, -58076, -48136, 58244, 117710, 75559, 12259, -14327, -30493, -34568, 20892, 103304, 91042, -24015, -89468, -28143, 44318, 38379, 26650, 44439, 822, -93923, -82008, 46180, 95414, 4229, -67001, -46373, -38987, -59757, -9463, 70144, 29942, -95268, -122418, -34293, 23946, 11828, 4232, -739, -53739, -100323, -50262, 48809, 75736, 12544, -52155, -59727, -29279, 6674, 41098, 66005, 43270, -35212, -84223, -22640, 79192, 87642, 19085, -9290, 1408, -25970, -36707, 50512, 125344, 47971, -72859, -56598, 31440, 37799, 13087, 51740, 59175, -39406, -95245, -529, 93279, 53222, -15339, -10038, -7108, -44646, -21016, 69445, 82911, -8986, -66954, -31370, 13246, 23250]
211B3250J2953O117m2267n6987L738O3234M8190j3214n2397l7713L003K3178K1708
224B793K7049J3434m5202p2003L711Q1384M1015l8070k7891Q489k3963l3537N0212
237a2579Q4883j9740r4792k0341N2572J4000j4502L2932K5811o2446o7260L8979
249d2483P9329L883m1432r641j172k6532K071N8292L8337l7968n9021p306L2775
262a0868K6271J0575M409j3264m0995l0375K8228O5064J7271n0399m2328Q173
274b8238J2101l758L0570M7067k8106q7293j4125P5968M1184l0842r860J8617
286B3285l4706n3504M0554R2695O12p9613k7846L1619N694r100L8150L5625m4817
299A8648p0618M650O1032L0099j5699j7875j2865k0406r872K8708M8832Q890n0902
$$ y = [23250, 36203, 42320, 53, -56934, -53196, 10038, 58228, 45014, -7383, -45096, -42093, -18915, 2793, 29842, 43276, -1926, -73929, -70218, 11166, 52181, 14111, -13780, -5291, -29254, -62791, -12579, 72304, 52564, -42228, -62569, -9997, 4003, -10499, 22433, 48244, -14202, -81462, -42483, 36846, 40729, -703, -10344, -11516, -38048, -35977, 22315, 60652, 22684, -36337, -43643, -10868, 15403, 25978, 30387, 17123, -23872, -54247, -26019, 39045, 56316, 5917, -36411, -28238, -16137, -19895, 10675, 57742, 29636, -57657, -71782, 4186, 45370, 14528, 4668, 23285, -11421, -64925, -24371, 68324, 68936, -10677, -38523, -6904, -1210, -10310, 27840, 63465, 18648, -51970, -47320, 13712, 43811, 28112, 10237, -2628, -23034, -32906, -4198, 44634, 53524, 2622]
312B622m9712J2274M4758J4013p204Q020r233n4794k3209O6088O3094l3985o0707
325b7975N771J8989k6169M858P2524J9766q7623n8281N5790N5977k1051j3600
337a024L2505j4653p2324m454Q5191M3551n0034m6480R856J0103j1320J7324M4911
350D3152J351n7861m2808K7520N4403J3308k6023j6754j63j7160j4400L7381N5449
363E7395j6962p3625j9862M9367K3115k0116J0872K6615m0310o4709K8974Q3532
375D4286M459o0220j1591K3816k0978k1631N3250N3178m3875p3436O680N1328
387E266R060j2109J5517N922m4706l5901L4817O1373O109m5516k8568R859R844
400i033q85J8327L2768j2536o2251k5331N4191N0431k1094l3521J1166J198l9892
$$ y = [2622, -47090, -34816, 9942, 23955, 16751, 24771, 15538, -39256, -62465, 3623, 66717, 32732, -27975, -22204, -3215, -29384, -24526, 47998, 67764, -19859, -78140, -22350, 33627, 12576, -1024, 31481, 16828, -55496, -59950, 25241, 68792, 18758, -27722, -17866, -7763, -19083, -1759, 43152, 44503, -13358, -56166, -28646, 25757, 39065, 13042, -3712, -3875, -21035, -35435, 1946, 57395, 40433, -33192, -53054, -3687, 19428, -688, 10184, 36799, -3511, -68220, -39246, 44286, 48745, -11475, -23066, 750, -20228, -41859, 11391, 64569, 20694, -52742, -46062, 5266, 14326, 2217, 17734, 23656, -21050, -56951, -22134, 39239, 45348, -168, -28736, -18877, -9033, -9918, 8409, 41177, 28641, -33610, -58941, -4750, 45681, 24587, -8934, 2232, 3430, -36462]
413c6462K022P2398K8695o7953n1669L4641L4934j7713J889L9698j3209o9125
425d1854j2178O5374L7143k9745k4490O047j0440k0600K3122N0153K223m9004
437d249l2240J4682K7840J1212K378J129j5212l1801j1364L7158M5490q788m8093
450a1858j6520K1125M030o888K9690K7679m2416o1032J9968O3942L949l5170N025
463A524J3433l7405k6227N1949N3878l1044n6870L319K7108m171o07L1483P688
476C4058m6046l3995K5748M0619N701j4756j1899j1683j1760O218K7813K2212
488C2230j0739l6702k0977J7992K8430N626n471n86j5597l0630O239M9378K1564
501D0757l5726k8642J0975N200j1489K0767L9099j7204n7779p829M4882J8148
$$ y = [-36462, -34440, 37958, 66653, -1300, -52969, -18328, 16606, -1107, 782, 40480, 27271, -41854, -54032, 11342, 48485, 18740, -5750, 297, -10143, -30743, -7621, 42532, 44755, -4249, -36489, -21807, 6033, 17245, 19623, 20752, 5540, -26261, -37625, -467, 45023, 36235, -11858, -28378, -7253, -3223, -10111, 19579, 47258, 4842, -56190, -36222, 27720, 31669, -3501, 1524, 14957, -22448, -48675, 3274, 57152, 26108, -30762, -27443, -335, -4506, -5113, 26370, 34058, -11988, -45983, -20235, 20384, 26085, 11329, -570, -12253, -24013, -17795, 10018, 32230, 21491, -15211, -36188, -18196, 10234, 15860, 10389, 9803, -5794, -36424, -30185, 19193, 40757, 5031, -23611, -12636, -7436, -18925, 1842, 40941, 23737, -34042, -41871, 3011, 21159]
513B1159j6615L528J0565k9241l1377K7629M9584j735l6381j3848O049k83N028
526e938K3978J2513k3200l1277m602K3626K4049L124j4741j5327p620l499R781
539i133K7352J4781k6691l4949M900K6378O791j429J1221o242l6707j1832M1321
552E761L0158k0202k1407O039m870j8707J7651M3000l009m7011j5907K4868J1810
565H174o130J1490J2513k4852l2916R686L6392J2734j5969j5247o202l778K714
578a1391J5665J6985j692k5447k3428R288K9930J0524j4454o845O06j5498j0073
591b5830K8759L3739j8220m0525Q70K3870k888n074K4651Q541m0871k7243L2982
604g239L3889j4562j6519J1314m554l0155M765M4138J2970l5402k2779J2706R179
$$ y = [21159, 4544, 8072, 18637, -10604, -41981, -14352, 35232, 33497, -2884, -16732, -10683, -10966, -5938, 18040, 30553, 7353, -23924, -28526, -4900, 19149, 22273, 7532, -7795, -15415, -18914, -9133, 18219, 33000, 6309, -28640, -23740, 2638, 9429, 8000, 19221, 12979, -23728, -35560, 5761, 35919, 15717, -5690, 349, -4521, -23228, -5577, 37423, 34414, -12597, -28504, -3636, 8174, 2044, 13534, 26047, 1195, -31721, -22035, 14357, 27091, 11122, -4125, -10327, -14105, -11391, 4274, 21259, 19567, -5880, -29308, -20020, 9910, 20434, 5980, -865, -259, -15757, -25830, 2929, 36668, 18448, -22077, -21207, 2663, -225, -5299, 19352, 27893, -12978, -40221, -7239, 26650, 12088, -4431, 6883, 2329, -27826, -23061, 21077, 34047, -1355, -24134, -11428, -2249]
617b249m175R486J6927r578l0103r713K2145K4023N81j6301j1099O35L83j132
631a0170J5304K1653j1951l8984o355L5651J6054j9367m309J6554j3118l3158
643c2196J5551M8107o24m3727q939K5794k327j6698K1021K6757k5724m0723J2031
656b1697L6445j05j7570N680N886k1399j3864K5243K8034r221k7405p360J1071
669f262P498K39O897Q196j0378k5479l008L0317K0632j8239k1045Q635P421j6560
683a1136J21L4664R839m1695k6061L1222K6559j8896j2294K1957N48l7445n651
696b8268M2558J8959l0985k0725J5250O441j3322N794K4608j245l0703j3827J9924
709e541K0281k934j0661j129q0r735m034J8612K0571j1594k9918k399K2207N868
$$ y = [-2249, -6424, 3062, 19989, 10411, -19692, -29405, -7260, 16763, 17344, 1043, -10056, -9421, -9038, -10170, 5134, 26787, 14836, -24148, -30503, 5148, 21202, 1835, -2474, 14080, 962, -32196, -16645, 31462, 30838, -12889, -21828, 3966, 1639, -15059, 5962, 32719, 6995, -33728, -21697, 14748, 14643, -2927, 2753, 8639, -12760, -26624, -1381, 26653, 17432, -9973, -17333, -6262, 1236, 1475, 8372, 16568, 6190, -19289, -22297, 8020, 28652, 10413, -10632, -1997, 5424, -11136, -11015, 23649, 33488, -8207, -34268, -3046, 23513, 4617, -7677, 14280, 14828, -22617, -28268, 14290, 33249, 2264, -18461, -3211, 3230, -10092, -4298, 20310, 19065, -11638, -25465, -5541, 14740, 11806, 1145, 16, -64, -9799, -13833, 4779, 25350, 13756, -16162, -18561, 3646, 9514]
723I514j1648O988J3644k0362k8649J8043L8030o308l2203L099J8757j5326j7426
736b3847K8918K8261k8161l6134J4311K8809p324j3063J4511P781k5872j5163
748b6973K3002K4335q234j9473k098O109r54K16R636R050q134k0039o107J9588
762g6J8036q919j5899K865O606j2249m114K5591J3229k8534k2365J9573J8289
775A2033j3528m922J9824k412l2584k934L5489J1607k5670q827J5608l465j7435
788a7216J2221K7256o706k9383l372J8627M935n405M367N988j2300j4489O480
801h997J8481P508j0022j2694k346O426L031O17P189N191j4507j9001Q972K4695
815A4543J302j7620j323P719j0041r089J9007J9261j5851k3602O258J5136m135
$$ y = [9514, -2134, 4854, 18498, -1864, -30513, -12470, 25560, 19252, -12951, -9852, 8905, -6421, -23847, 5071, 33332, 5171, -30963, -16652, 12157, 4833, -8230, 6281, 14062, -11810, -26973, -3971, 20364, 12130, -7343, -9441, -3332, -4286, -4070, 5566, 14616, 6482, -13557, -19664, -76, 17960, 9041, -6858, -3993, 2613, -9636, -13750, 11841, 25070, -3464, -25829, -6256, 12033, -1495, -6417, 13407, 10995, -21589, -24523, 10966, 22573, -3097, -11924, 3684, 219, -17216, -4995, 22261, 15555, -13828, -17200, 1427, 6362, 957, 5324, 11312, -988, -15477, -8997, 9484, 16992, 6970, -5724, -8070, -1644, 1387, 2004, 9193, 14384, -123, -19124, -10152, 14543, 15845, -1775, -3098, 4621, -5420, -14509, 4498, 23759, 7908, -15694, -9436, 5700, 1565]
828A565l840J3424K229k1885j0162J8793J5012p713q382K632l048q674O365J6030
842A2346J691j3735r579K471O925M489J706k92l976q299o446R086J6522L27j7101
857c865p400Q886K865o374P887J4205j1536k3876L747K3977J577j3868K877P807
871F909j3853j1930J7683J9828j1859j7923M870Q094o920m8J4956J367j8089p994
885a4909J1789Q261k461o59P68o888o302N014R968L094m813q466m750N229Q805
900C680K07l380J730l664j1119J052K0080P866j8895j1487J1653M855j1339N702
914c059K0270o091k9321r00K6193N331j6063K612J1945j2424j9402J4260K5290
927A8641n235k0349o46Q992m747k920J3203Q127j3097j3922L307J1084M748j456
$$ y = [1565, -2275, 11149, 13378, -8507, -18669, 124, 15136, 7423, -959, 1673, -1375, -10049, -3684, 12346, 14037, 302, -9277, -6806, 119, 4608, 6314, 6022, 2046, -6253, -12699, -3613, 12909, 13236, -3865, -11265, -2379, 486, -5888, 1999, 16204, 4668, -19208, -15461, 8516, 10093, -3775, -898, 6909, -6944, -18874, -1191, 18637, 6778, -11145, -6275, 1819, -5101, -5149, 9807, 11174, -6915, -14909, -3120, 5141, 2680, 2021, 2789, -4099, -10401, -5387, 4581, 7675, 2862, -5604, -10354, -5125, 3680, 3887, 507, 2237, -1427, -12546, -11494, 8586, 16452, -2443, -13930, -2277, 2578, -8761, -3059, 17211, 11120, -18201, -19101, 7092, 12423, -3640, -1028, 10917, -1507, -20909, -6649, 18641, 13406, -6943, -7589, 1403, -3344, -6264, 6939, 15066, 1969, -11953, -8646, 2438, 7186, 5730]
941E730k821l091l689k716M043J1464M235j2137j2840O014J2002j778m900P891
955G407K024j8556p862K2044J5572j5931j4640J0004N846j4591O55K3821M465
968B0258k6964j2506J9166J1856j0186k523J1257l960j8820j194K0143J0434j1784
981E177j0835J537L757j655O47Q270M885j0833j4480M055J7255K990j2257k532
995d019Q272n018j2137J0163J9606p480k3355K240J8757k434j2617Q920J2834
1008A3732j6138j8425J5873K1394r290j7181O170Q812j0779n668J6983J0454j5330
1021F07j5515N927J2228R27l985J586R19p327p657M934J5632M692j3752j2439
1035a3223O544R507m550k790J1860L556k1092j1492K1066J6659j3471j2941J1567
$$ y = [5730, 2909, -182, -3871, -6587, -2544, 8920, 13155, 1018, -11822, -5808, 6194, 4416, -484, 7407, 9431, -9125, -16987, 5057, 20629, 4698, -9942, 62, 5908, -8683, -8028, 15793, 20258, -6706, -19212, -46, 11810, 1624, -899, 10358, 6398, -12422, -13616, 6527, 16961, 5177, -5658, -4121, -364, -2019, -1372, 6898, 11783, 950, -13530, -9475, 7780, 10770, -1487, -4019, 4253, -765, -12902, -2739, 16867, 9387, -13968, -11728, 7029, 4595, -8022, 898, 13732, -2406, -20831, -4958, 16436, 7146, -10035, -3865, 4947, -5832, -11500, 5483, 15937, 607, -14908, -8981, 3247, 4174, 189, 1775, 2694, -4633, -12290, -7356, 8276, 12968, -784, -13223, -6679, 2828, -1722, -4512, 7348, 10904, -10188, -21680, -614, 16045, 2574, -10367, 1200]
1048A200L807j6992q78K4840N808k4062j0327J6290O902j0621K043J3993o402
1061E601j9570K193J9305M504j0665m177L235l257m302P207J0681j088j2039q254
1075a0626M104J0528L209m450j197Q78o955p423J0049J7901m349j9669j689J3251
1089C562j372q696J0801J2991j4575k0020R549K0460l672j2450M991O066j2044
1102d409p130J4989J2776j0496j2977L670N901j906O41N620j34r438n312N526
1116b679Q281J903m765n918j059K408P47K816N771j217j2084n989J1167R179n760
1131B801m313M956k956j2034L890J8774J822j7164n064J0317J28p231P892J1545
1145A3363r591j7331L977J4414J255o471J903J247r151m185R962R155l761p516
$$ y = [1200, 5007, -11985, -12863, 11977, 17785, -6277, -16604, -314, 6588, -4033, -1990, 12003, 5601, -13969, -11776, 7529, 12033, 1368, -2809, 426, -2831, -7133, 74, 10755, 9667, -2372, -10626, -6522, 4006, 7215, 2765, 1568, 2446, -4509, -11932, -1883, 16018, 11669, -8000, -9689, 3562, 2190, -6506, 4295, 17286, 2711, -17309, -7760, 12700, 9028, -3422, 1569, 7635, -4409, -11539, 3450, 16226, 5730, -7247, -3577, 2324, 418, 1059, 6679, 6545, -2893, -8205, -2679, 5602, 7505, 2740, -3178, -4237, -1829, -1082, 1734, 7505, 6288, -5796, -11785, -618, 8561, 2801, -1512, 3444, 488, -11546, -7656, 11118, 12940, -4224, -9288, 1029, 1157, -6074, 1818, 13363, 3772, -13559, -9582, 4832, 6087, -384, 1519, 2766, -6385, -10570, -608, 8547, 4786, -2730]
1159b730l419j09K733N769K605l269l871l953k212N694J0326m02j0827m473M579
1174c559R41n5Q681M162j3091j1358Q742J1713k930k752N269l662j4761J288J9148
1189G776N856j3229o308N703k469o743R960J3891o860j7277o57J0156K306j023
1203A082M468k98r610o159O663R494K248l929o130l984K020N487K872J990m04
1218E810p243p774M848J2395K252r196k910K621m176k218J1664Q952j1646j3530
1232a0151N548R026l459r83R730k003j6999m038J6694Q911r336n066L993l488
1246a621p548N734J4288k44j2578o997N105M760J694J722R94l434p524l011P959
1261g01J0559m78j1633n376O088K698l295M777Q267p463j6458K100J7678K946
$$ y = [-2730, -6149, -6258, -3525, 2244, 4849, 1580, -2291, -6244, -8456, -2762, 7564, 7162, -3665, -8138, -3559, -2618, -2673, 6008, 10170, -2921, -14279, -5537, 6176, 3246, 494, 5763, 2101, -12660, -11372, 7776, 13632, 403, -5905, -202, -2671, -9414, 546, 14437, 7577, -9700, -10357, -201, 2105, 1082, 5550, 5252, -4358, -10517, -3854, 5640, 7888, 3959, -2171, -6155, -4135, 1352, 4224, 6214, 5810, -1433, -9207, -4359, 8036, 10288, 1092, -1818, 803, -3373, -5591, 6073, 15025, 3379, -10151, -4603, 4423, 964, -19, 9711, 7708, -9291, -13329, 3365, 12276, 2940, -2126, 1867, -1621, -9169, -3435, 10853, 10609, -1969, -8966, -3861, 899, 2593, 4315, 5309, 1875, -5649, -8660, -701, 9858, 9380, -2253, -7629, -1541, 1157, -2138, 2639, 10906, 3443, -13015, -10915, 6763, 9709]
1275I709j1328n20N460q140q231J2493J5425r134j6184K359Q791k959j925J0420
1289F236K866j4457r298R396J1427r50m531q54k119n065J017Q993O428l384j0701
1304d996n720O771Q261r20k665K536j341j1476j914J6522J0141j4061j2084P799
1318c147O721q583j02J5861O74k0733o484J7180R001j0492k331P903m366j3173
1332a2071M773J7595J794j3996m975N269J373j197M934M980m394r932j737P352
1346b32P531K38n720l728M08o54j33O644P118p395j3497J836J2699Q60p003K650
1362A622O082r998j0983J1250J6838o812j5478K849Q681n747m446J2280P069j3696
1376d89j2452Q250J1683k414m575K666l76p722k106Q700Q392l200r173m160M021
$$ y = [9709, -1619, -2139, 3321, -4819, -13050, -557, 14868, 5734, -10450, -8091, 700, -2259, -4184, 6236, 9102, -5355, -14653, -5257, 6170, 5220, 689, -165, -2284, -7349, -6332, 2661, 9089, 5705, -4996, -10716, -3945, 4316, 3396, 731, 3267, 1926, -9550, -11464, 5058, 15199, 1138, -10946, -3147, 3574, -5009, -5111, 10750, 11424, -9309, -15793, 1387, 10388, -104, -2435, 5468, 1102, -12071, -7298, 10297, 12091, -1905, -6880, -1611, -238, -1435, 3499, 8479, 4085, -5847, -7584, -232, 7299, 7537, 1817, -1911, -1503, -2157, -2290, 4354, 11472, 4077, -9420, -7584, 5115, 5975, -1028, 1622, 7704, -2294, -13277, -2027, 14811, 7999, -7479, -4630, 4051, -1696, -6142, 6138, 13207, -489, -12941, -4691, 6992, 4578, 3, 2669, 2293, -5429, -7535, 1165, 9557, 6357, -2816, -6976, -2955]
1391b955M450O78P5J742k957q449j286J0544P959p300p551K726J825n403K619
1406c283J2259p68j5589m425J1646M654o094R88P002o821j1629N147J4239J56
1420G482j0122j462L074k535j705P764N604n970r236n30O335M054R29j911l234
1435a463j853j504P92N998O303m037j1591j113Q850L265l712K023L775r059q539
1450a1865Q866J2731l446r882J851K625o209J23J2458L951j2547p710P177M777
1464B900k473K205M908n550j0425K339J0420K676m334j029j272m738k86Q011M626
1479G978k897n826l555m50N112O250l95n227k033j118k308L932R210M61j1506
1494b372n378O355L691k191L076N065p524j0972M163J2354M91o459J37O28o607
$$ y = [-2955, 1495, 2173, 2248, 3990, 1033, -7416, -8702, 1842, 9801, 2501, -5050, -2324, -499, -5902, -3283, 8976, 8208, -7381, -11806, -160, 4494, -1600, -612, 6390, -431, -12060, -6913, 7326, 7482, -2640, -4102, -1028, -3563, -5268, 2496, 8100, 2130, -7106, -7636, -1301, 2753, 3682, 1771, -1463, -3316, -4820, -4028, 1970, 8273, 4236, -7355, -8468, 382, 3647, -65, 1958, 5733, -3326, -11865, -2999, 9732, 6286, -3596, -1745, 880, -5329, -5206, 7252, 11203, -1344, -9054, -1877, 2900, 427, 2632, 7540, 1990, -8435, -6096, 4324, 7000, 2666, 1637, 365, -4373, -4659, 3352, 7978, 5081, -745, -4300, -4750, 362, 6612, 6217, 990, -1043, -2161, -4469, -537, 8673, 9134, -2372, -7750, -1395, 2296, 105, 3181, 8246, 722, -10250, -6087, 6267, 6758, 299, 436, 1064, -5543]
1509e543j591J1105O562p972q333K281K013j199M409O055m099j0390r92O653M269
1524C228L61p08k695m496k189L757N855L053l635p457l212N385N254l00j348O68
1540A521m092p237L819J1825J822j0091l887M592k99l696O625Q420p255j2261
1554a0194K356R891O36l316K872N14q307l286Q800P521l380n375j794q1k14L849
1570D92M785m22n570m859j91N691N984p64n771j872L20j892J796Q860K912j0906
1586a407q589O838P749l077j715O786k004j3480o56J5554O107j1093n300N823
1600A536r07o838N582J2277k830j3754k013P865K859j587J996J273o195n463K820
1615c379P750L093l183n596k952J827L436J253J643J023n549p582K712J1160K029
$$ y = [-5543, -7134, 3971, 10533, 2561, -5772, -3491, -1478, -2677, 1732, 7787, 3688, -6702, -7694, -1041, 3228, 3589, 2881, 186, -4310, -6499, -2742, 3113, 6166, 2531, -4926, -8138, -2753, 2501, 2201, 853, 1521, -2571, -9808, -5989, 5836, 7658, -2433, -6320, -1728, -2027, -5723, 902, 9322, 2067, -10194, -7838, 2053, 2689, -627, 2245, 2759, -5548, -8834, -34, 7487, 4107, -1268, -3062, -3143, -3357, 492, 5277, 4855, -715, -5574, -5765, -74, 5910, 5146, -625, -2497, -2177, -4069, -2273, 6587, 9499, -1407, -9996, -3158, 4591, 1514, -201, 6585, 4581, -8899, -9555, 5999, 12106, 1013, -4287, 1536, 629, -6209, -627, 11650, 8820, -4934, -6947, 918, 3777, 2190, 4186, 5459, -736, -6199, -3379, 4371, 7464, 4281, -1315, -4267, -2440, 996, 2249, 3892, 4915, -634, -8216, -5504, 5656, 7685]
1630G685p879k201L016l204m432Q866J0189p778j3220K856R284j771l314P140
1644E237K782j2517p489J0900R948m513p351K361Q68o083N85R626L910p949p594
1659g279J133N088K867j07o92j096l242m136K561Q222M125q729p015M064M879
1674F43k279j18P034j646j1725k020J1681N904p109l614M581k593o768N162J1631
1689H764k172j1254k017N757J405j220L662K866o584p286K758P876K829k788l759
1704a163j988o75Q64L476M200R65o431p516K997R140J740m778n09K220n420m537
1720g415Q568J0557n796j1266J428O691k316j747Q024K295j1029o728Q113P851
1734G230l350k751K006k706o155K940Q617J800o273l952k91M89K712M221Q48m167
$$ y = [7685, -194, -2395, 621, -2583, -7015, 1851, 12040, 4262, -8958, -6102, 3182, 1411, -1903, 5237, 8019, -4498, -11987, -1087, 8861, 4348, -3003, -642, 226, -5857, -5272, 4354, 8264, 315, -7279, -6146, -1058, 1809, 1702, 1010, -86, -3328, -7464, -4903, 3319, 7444, -1285, -8300, -4236, 643, -1636, -1754, 5280, 3634, -8091, -10111, 1570, 7474, 365, -3249, 1332, -1261, -8029, -2867, 8764, 6592, -4662, -6679, -922, 483, -737, 2925, 5791, -793, -8079, -5321, 2555, 5384, 2596, -1163, -3151, -3826, -2962, 514, 4714, 5679, -752, -8268, -5271, 3869, 5609, 831, 322, 2542, -2878, -7415, 1153, 11710, 5914, -5352, -3924, 2767, 451, -1296, 6728, 9023, -2006, -8734, -621, 7230, 3880, 1129, 3135, 429, -5726, -2786, 5831, 7631, 1358, -2594, -2885, -2396, 316, 4537, 5385, 1218]
1750A218m671n94J990M984M072l527n975j135K528N36K018N325j558r888k986
1765g663Q097N398l896r84L074n259p125M816J1711j449r437j275L501j998r91
1780c480O504L881p633p196K955N581O60l43J103l456n060J157N549K732r71k723
1796g40l196j912L430M603Q59k158k588k619j323M668O126j533n162j783P74j161
1812c715K667O338K09q860m266N411L485j422J434K793n389p721L688R735N05
1827D892n286p62l4l127k30O913M232m955o222P33K194J880L090J162l158m205
1843b883n68K354L942K814j544n927k591L334K905L95J845J56n900m643M920P424
1859F033k121l993R52p30m996J675R368K199r369m791N735J347k811L485N703
$$ y = [1218, -3453, -4047, -2057, 2927, 6999, 3472, -2503, -3638, -1110, -574, 1444, 6769, 5211, -4677, -7663, 434, 5832, 1936, 952, 4026, -1233, -8358, -3542, 8169, 6720, -2717, -3992, -491, -2489, -3480, 3024, 6905, -728, -7924, -4969, 612, 1272, 929, 2032, -1424, -6484, -5327, 222, 2954, 1983, -740, -3936, -5848, -2418, 2185, 3044, 886, -1702, -4321, -5644, -976, 5150, 3617, -1545, -3328, -2554, -3715, -1048, 5290, 5499, -3361, -7627, -2216, 1269, -153, 1281, 4074, -1315, -9036, -5348, 4387, 4892, -394, -1156, -1190, -4317, -4547, 2366, 6598, 1643, -4579, -3846, -1652, 228, 3318, 4480, 1322, -2883, -3451, -1097, 2845, 5659, 4115, -1812, -4403, -1069, 1836, 2231, 4076, 4232, -1668, -6311, -1391, 6033, 3912, -81, 871, 141, -4855, -3180, 6188, 8387, -982, -5773, -38, 1309, -1502, 1983, 7686]
1874G686m814r874J811Q989J298l667K41l31m203j628N828M873j372n076l263
1889c502N83L004L080J60j650j620k217k220L319P171n87p483l006M254Q44k019
1905a889M015M246o642q419M202R038j057n141J761J360o873j771R577N824p183
1920A048o552K782K565k339K069N592j202q574k787N512N136k29k140j400k011
1935b530j583P23M718M054j760p876l292N191N563j922j623K250k116p063P75
1950f491J0755L796q838m581M140Q58l574L749P834l574j0775k67Q021K640l078
1965F15P38J363n131l921M890P112q42m888k586K55O57K422L135N45k621n005
1981c262k268M779O266k01n195j510J100k001j003P418M820p362q917L370P950
$$ y = [7686, 2872, -7002, -5191, 3798, 5096, 1429, 1670, 1339, -2864, -4492, 1336, 6209, 4837, -239, -3502, -2919, 85, 3165, 3325, 1675, 55, -2162, -4382, -1063, 6108, 5521, -1962, -4968, -714, 130, -1889, 2126, 6372, -270, -8689, -4487, 4551, 3494, -1647, 114, 1474, -5399, -7170, 2407, 8231, 1048, -5504, -2722, -157, -2496, -427, 5165, 3963, -4611, -7398, -1886, 3250, 3021, 881, -519, -2530, -4113, -3390, 1328, 5382, 3622, -4254, -7546, -2355, 3208, 1286, -337, 1913, -203, -7266, -6491, 4264, 8060, -778, -5359, -1219, -361, -3935, -186, 7648, 4074, -6701, -6968, 1053, 3693, 615, 1353, 2716, -2415, -6336, -1446, 5666, 4824, -64, -2650, -2395, -1738, 684, 3819, 4364, 1743, -3262, -5530, -751, 5515, 5314, 119, -1391, -291, -2292, -3295, 4123, 8943, 1581, -7336, -3966, 3984]
1996C984j466k647M111O31r178l498R508P367n841n483J962J197l993J605P873
2011F132M43q174m084L482L813Q58Q36j064l324k526Q04L343L906L5m363m592
2027d475J089M312J017K23P67k206o177j29P998M313n522l599K050j079l562M383
2043e97Q103k725r981j349O387J010j823M131J745o948o610N080P657k82l689
2058A09j018q65k742J636M983K837k960m756k172J430M340L064j757k988j352
2073b211j032J21L870N074k698p443n96L898J205J72L207q2o955l769N690N696
2089D147j794k350N89k568l824L432P290M90n889k560J263N6O73M585K126m999
2105F67n467J173L993K300O05r46k714k976J052K708K477J172j840m919j651L914
$$ y = [3984, 2518, -129, 3982, 4613, -4565, -8063, 1445, 8812, 2971, -2512, -550, 647, -3346, -1741, 6132, 6575, -1599, -5683, -2201, 1612, 2470, 3306, 2242, -1082, -3608, -2804, 539, 4445, 4480, 117, -4475, -3386, 926, 1943, 2166, 2933, 727, -5450, -5579, 2419, 6732, 1210, -2389, -339, -1418, -4980, -597, 7506, 4781, -5200, -6549, -162, 848, -975, 3156, 4901, -2047, -8657, -3577, 4080, 3798, 109, -909, -1774, -4516, -2880, 2103, 4940, 1980, -2776, -4948, -3518, 822, 3886, 2129, -859, -2211, -3243, -3122, 748, 5822, 3124, -4319, -4915, -1017, 188, 360, 3567, 3485, -3470, -7239, -1549, 4147, 2353, 3, 592, -1976, -5800, -2368, 4922, 5412, -477, -3037, -1774, -1718, -1045, 3540, 5666, 667, -4800, -3627, 366, 2666, 3271, 2325, -389, -3365, -2313, 395, 2872, 4044, 2204, -2715, -4366, -452]
2121d52L765q82j006j6l286l045M040O375j383n586o35J766j408N59N392J339
2137E537o560m071L490L694q99Q13J780l343n819K537O415M98l216n09n46k506
2153b705j53N331K940l721m042q39J119K503K412J14l012k403k02L96K568L735
2169D041r12n740k370L896K455j350R81K462m543n514L242P583j64n248K76J095
2185A90l186j282O577L966n607n327K342K682j169J231L625k215n994o25N104
2200C12K824j617r41j256j977q40K568L458N97k485l496j446K910L374J62k008
2216A39q9j036l197J221O858J705o137l610L268K036k498J782M993k642q100L96
2232d911P643J447l876j52J684l212k694L865N057j584m766j327J281J141Q14
$$ y = [-452, 3313, 2431, 1425, 1409, -1877, -4922, -882, 5493, 4110, -1476, -2111, -345, -1753, -1194, 4198, 5537, -1023, -5094, -1604, 2090, 1191, 2004, 3784, 441, -5378, -2841, 3574, 4072, 856, 347, -199, -2705, -2858, 2473, 5413, 1692, -2350, -3189, -2070, 433, 2845, 2959, -53, -2456, -2658, -2262, 306, 4041, 3129, -2611, -4981, -1085, 1370, 20, 1001, 3463, -1080, -6594, -3352, 4231, 4067, -1181, -905, 190, -2996, -4278, 2299, 6265, 658, -4669, -2327, 355, -814, 417, 4042, 1827, -4167, -4792, 312, 3136, 1519, 578, -678, -2655, -3495, -927, 2531, 3128, 643, -2853, -4299, -1389, 1985, 2147, 139, 50, -986, -4183, -2962, 3896, 5601, -536, -4146, -878, 1158, -1340, 442, 5435, 2793, -5307, -4911, 2732, 4179, 303, 151, 1835, -1377, -4071, -206, 4851, 3267, -1499, -2826, -1545, -404, 410]
2247D10J962L61k880k718p5L148L447o59l248j638O01L13K98L517K020m912m966
2264e019K812N569j192k464K507K32n605j945P491M385n885m236L033J399l089
2279b007J151N162m13o846j972M690K673j475o72K82j549j909O47L565J952j503
2295A776l662k047K199L001K05j026O37j125l520j87O533K434n213l308K715R32
2311C44k748K072N296j903p341k81O247K64k808J721J885m416m425M922N677k058
2327B448m173M29Q72k294R96L710J082l395k864M77K001K136M74j462j329m80
2343a372j27L36K845K453l373m533Q89M851l99j514J488Q96m531k836N498M808
2359E379l299m203J682N06k479J056N090N03n969j897K983J879q49J439O74l007
$$ y = [410, 2372, 2733, -147, -2865, -2940, 208, 3655, 2996, -252, -1890, -1289, -976, -678, 2839, 4859, -53, -5019, -2207, 3362, 2170, -294, 2213, 2445, -3160, -5105, 2386, 6771, 886, -3350, -317, 1082, -2007, -856, 4306, 3893, -2953, -4925, -235, 2438, 963, 291, 573, -976, -2885, -2238, 1327, 3279, 1776, -1886, -3933, -1734, 1267, 1472, 446, 1083, -42, -3562, -3749, 2784, 5218, 5, -3303, -588, 344, -2404, -332, 4964, 3061, -4280, -4561, 1686, 1950, -858, 863, 2748, -1668, -6093, -1171, 4506, 2448, -1725, -1296, -424, -2718, -1722, 1988, 3070, -325, -3189, -2712, -711, 1425, 1899, 437, -892, -1372, -1499, -1163, 1682, 4135, 762, -3771, -2882, 1969, 1570, 56, 1544, 2440, -2091, -4927, 571, 5379, 2080, -2123, -441, 65, -2414, -1358, 3732, 4235, -1734, -3631, -648, 1231, 382, 1821, 2495, -512]
2375e12l010J560L272J526j125j608j299o91J290K207J161o11j920k741L41L850
2391A690J616k280j057M87j020k131K655M852j938n316l50L468J21j624K791J366
2407C330m516l590L411M460j453k081R06q91k779J533L955Q26l164j654K17R4
2423a396J050K604K75k908j771M52Q93J254J880o12k947j324J794J136j46J280
2439A514o6l470k149L756K690k021j046J732j514l456K156N427r04m652m17K374
2455d6j297p71L409K318l870m040K227L458p14l89J650j611l605O64L907J531
2471B821k048r70n66j170O12K751J179k191r40q27p92J604K840j10k601j327Q43
2488h92j62O13K790O68l784k226K528J989j161P8K214j852m480J308N288O14m039
$$ y = [-512, -3522, -1962, 1310, 2836, 1711, 103, -1196, -1887, -597, 1610, 2771, 2160, 240, -2501, -2160, 1690, 3306, 1026, -31, 456, -564, -2695, -40, 4812, 2874, -2442, -2792, 676, 797, -827, 1964, 3330, -1186, -4776, -1365, 3095, 1642, -439, 467, -424, -3203, -1670, 2285, 3111, -53, -1707, -1490, -1396, -346, 2258, 2533, -375, -2146, -1694, -801, 453, 2333, 1721, -1226, -2550, -756, 380, 234, 1514, 1448, -2022, -4171, -415, 2275, 254, -792, 940, -574, -4030, -1874, 3553, 2649, -2003, -2420, -46, -1343, -2114, 1295, 3613, -257, -4297, -2070, 1388, 674, 285, 1935, 324, -3281, -2617, 1290, 2821, 773, -197, -763, -1933, -1321, 1430, 2609, 418, -522, -1349, -2141, -537, 2303, 2193, -408, -1735, -892, -1054, -441, 2349, 3017, -767, -2993, -465, 1524, 363, 441, 2655, 803, -3677, -2369, 2919, 3533, -506]
2505e06k17J964j586j663L096L560k861l813M92K186L23j45J028m2k217j611J152
2522h60K043J153p28j782j434J555P87k24Q73P55k444k455J850L517q13k675J083
2539B01J010k934p45M301K262m283k888K660J843k617K57L418l53m919k57M288
2555A244J161k756n08J556j056j760J421K395j7k187j641M53J518J230m99r79
2571d25K50l99j721M74L588P53m046j229K466J058k793P57L580q45n389Q73N170
2588B122l79m096J325K742k144l136L053L815k563l135J055K235j840l86K487
2603A155M55k648j750K135J554k22n40k77m45m09L37O04R39P16k053k074J777
2620g46K812q20k210J245J565l043j597L749L171l819k785K621J917k668j037
$$ y = [-506, -723, 1241, -345, -2008, 1088, 4648, 1787, -2026, -1534, 652, 975, 830, 1858, 1816, -401, -2012, -860, 1183, 2336, 1608, -174, -1608, -53, 734, 510, 1383, 2138, -306, -2761, -911, 2606, 1793, -882, 201, 1211, -1723, -2468, 1833, 4095, -188, -3076, -416, 1427, -1190, -933, 2485, 2132, -2787, -3044, 1244, 2405, -351, -859, 697, -359, -2119, -698, 1697, 1680, -507, -2148, -1695, -177, 1053, 554, -425, -175, -574, -2295, -1821, 1767, 2520, -1526, -2755, -289, 769, -2024, -1267, 2313, 1468, -3921, -3048, 2122, 1743, -2353, -1028, 1714, -430, -3566, -513, 3302, 739, -2396, -1341, 894, -946, -1332, 1155, 1610, -1038, -2788, -653, 901, 679, 139, -138, -583, -992, -655, -51, 888, 1604, -449, -2523, -746, 2066, 1246, -964, 281, 1846, -1197, -2794, 955, 4126, 307, -2478, 143, 2060, -608, -1645]
2635a645L942J032m793j603M101J172k136j14J659p78k324O66K895K8k098n70
2651e66N61K39N68K71j21j42n14j289K79K235O56k211r03J292O02k038R21K788
2669B628j014l786O86L488n13k687J400K107k284k665K630K970k095k766J422
2684d79J844k232p27K464J306k616j566J704N63l79L85J03q39m31P93j41J62P37
2702F51n34j939K5K299l22j331J092R58k003j324K362J740k025j664J556R42j907
2719a424Q9K649k07l420K42K614m2j897J030J997k056k412K038K748j618j619
2735a288J416J75j518K50J858K71j521j23J48n09J09J570r3j457N75j04p06L26
2753f21J835o5j867l63J714J46j524J130J341j688j899J767J946j377j317J841
$$ y = [-1645, 2297, 3329, -1464, -3067, 1034, 2206, 70, -44, 1615, 837, -1487, -821, 2074, 2102, 4, -566, -5, 234, 802, 1073, 952, 810, 296, -993, -714, 1521, 2177, -34, -937, 355, 957, -1081, -160, 2628, 1614, -2172, -1486, 2002, 1489, -1198, 202, 2309, 25, -2640, -10, 2960, 865, -1901, -479, 1365, -867, -1594, 870, 2176, -440, -2006, -302, 261, -118, 267, 370, -469, -900, -107, -248, -86, 651, 117, -1822, -1797, 502, 180, -1151, -59, 899, -1104, -2428, -66, 1674, -351, -2015, -459, 483, -1424, -1335, 1314, 1107, -2313, -2071, 543, 501, -1396, -366, 1631, -425, -2837, -799, 1949, 331, -1288, 128, 303, -1215, -965, 893, 1164, -357, -480, -332, -841, -732, 838, 745, -712, -137, -241, -947, -621, 1214, 1149, -718, -1081, 633, 779, -745, 385, 1726, 38, -1861, -94, 1852, 475, -842, 999]
2769I99J47k157J48K753r1k537K68J936m38k179J403K024j581j930J204J634j285
2786C18p98J190J62j157k27J238K85n88k73q0O2J34M18p32OQ05j68j696O85K224
2806A808n34k385Q82J529p24k065J786J770j998j644J800J314k059o53J887L10
2822A024k423J47K485l47k443L73J851o24j693J002J402q43j195K17J149m01M4
2839b75j51k82K13L48p25L6J376O1j662p59K251L38k287J29K414l36k787M53L375
2858A730p10l283P03L123j405k725J517L242k262k143J644K053j907j449J988
2873A16Q19j739p72J993P9r24n64J082M53m72k37n7J95N1J71m86N27R06o29j206
2893f94R53J573j431j647J843J732k580j781K971J751l195j315L066R69l183l96
$$ y = [999, 1146, -1011, -863, 1890, 1799, -738, -470, 1466, 1028, -1151, 252, 2276, 695, -1235, -31, 1603, 318, -480, 710, 872, -285, -512, 726, 1011, 423, 150, 70, 132, 266, 684, -48, -42, 763, 595, -1101, -416, 1808, 1274, -1111, -229, 1300, 576, -1489, 297, 2067, 69, -1575, 225, 1539, -520, -1173, 714, 1024, -1399, -1252, 1233, 886, -1557, -1184, 667, 43, -1650, -648, 754, -89, -1284, -1067, 82, -319, -275, -426, -708, -495, -147, -872, -836, 540, 601, -1061, -1820, 431, 769, -1518, -1389, 1025, 689, -2098, -1645, 1730, 1020, -2263, -1560, 1563, 158, -2567, -1050, 2192, -70, -2213, -569, 1484, -423, -1872, 116, 935, -804, -1576, 417, 496, -428, -992, 90, 543, 71, -166, -223, -28, 23, 194, -292, 235, 1141, 512, -694, 259, 1832, 401, -1246, 597, 2329, -251, -2032, 939, 2690, -505, -1820, 1246, 2215, -968, -1364]
2909a364L328r3l171R1K746K59k805J59K413n23j898P35J315l04j068r9N20K90
2927E31j90j20J79J84r0o30l74J786K9k058K14J512J38j802K05K615j194k751
2945a816P45K789q14k176J328J515j937k271K510J936j698j925J380J077j428
2960g85n15J898N32j980n71P95P32l64O1j20M1L9k24l21O18R62r86j418J030J506
2980I30r04j706J439J133j904j351K354J699k164j623J957Q71k209J89K234P3
2996A018k718n6K283J75j597R80Q30j506j302J575J627o39r16L31R6j022O89J477
3014A325o11m45k32l28l50J208R33j150q93N13O72j483R40J795p79k336J90K337
3032A306m71j623J311R23j378j993K090J951j460j558J220N47j341P4K149j82
$$ y = [-1364, 1964, 1871, -1300, -1209, 1537, 1796, -1009, -850, 1563, 1040, -858, -123, 1192, 888, -180, -279, 241, 531, 341, 221, 400, 584, 494, -136, -510, 1276, 1305, -753, -539, 973, 1111, -691, -486, 2129, 935, -1816, -1071, 1718, 904, -1272, 56, 1571, -366, -2637, -127, 1809, 111, -1814, -434, 643, -785, -1300, 598, 1130, -850, -1421, -626, 106, -258, -197, -317, -276, -237, -461, -782, -164, 798, -188, -1606, -576, 930, 26, -1680, -241, 892, -1012, -2363, -9, 1690, -474, -2097, -140, 731, -1478, -1289, 945, 1018, -1700, -1756, 527, 702, -895, 85, 915, -591, -1893, -318, 1309, 670, -246, 85, 181, -841, -152, 1325, 714, 269, 37, -291, -641, 567, 1500, 350, -543, -30, 642, -841, 99, 1894, 1115, -1221, -1031, 1306, 835, -788, 523, 1446, 68, -1925, 165, 2116, 656, -902, 318, 865, -476, -402, 1747, 1565]
3048A565k185M5R07O7m90J284O57j637j326J115O46j63K09M06j228r12P92P51
3066E03J46J91l18j184q73J684J072q79n75O11q89o66N02J972k23k149j01J250
3084G4n24q33J830P85k016j454J443J472o06n99P78l96j608N57K100m7j182k98
3102e24R5k41k71J139L05o99q48L9J5O57Q78j40j120m38P25k76J43J059L20j781
3122i63r24J364J493j295J12J361j204k195J433K481k21k635O60J405j436n25
3138a089J860J518k081k137J498J623j008j16J256p74j470l35J794N54j37o13
3154C43m49n49L66J261p5l43J49q19j119J074J640J6j576k8O54j127q0K158J172
3173B668k459j874J673J205j167k9J889o08l124J50L013R21k535o8J209r60r68
$$ y = [1565, -620, -575, 332, 399, -91, 1193, 1850, 213, -1113, 2, 648, 485, 694, 1100, -128, -1040, -248, 503, 649, 840, 522, -662, -1535, 149, 1221, 342, -233, 378, -511, -1177, -675, 1297, 1074, -1075, -1176, 74, -450, -1283, 547, 1332, -684, -2138, -695, 777, 171, -428, 350, -46, -1654, -1097, 1003, 956, -226, -524, -429, -670, -941, 198, 503, -196, -1044, -1005, -990, -333, 545, 405, -715, -1153, -428, -704, -561, 498, 818, -963, -1887, -523, 970, -325, -213, 1148, -56, -2251, -818, 1663, 1442, -1193, -533, 872, -564, -1089, 771, 2289, 208, -1929, -431, 1192, 184, 68, 1324, 550, -920, -1255, 539, 1093, 956, 343, -106, -655, -289, 972, 897, 554, 703, -116, -1235, -161, 1479, 1495, -81, -109, 545, -582, -662, 1496, 2668, 209, -1665, 8, 1213, 46, 17, 1906, 1298, -1826, -1676, 1337, 2258, -277, -345, 864, -96, -1064]
3190a064Q87K142p52j905k05M55O24J12K05N2o35r45K82N25J576k42j672r39J160
3209c39N64o42j59K008j255k527Q85K527M62k503J95J073j241j470K626K092j985
3226C11k032J094R75p75j91J495N0k060q69J890Q33m36p57J52j78n14R5J014N83
3245F80k87j445o20R43J276k79o29M02K99j565o63K716Q22k035j760K003P55j272
3263f59P1K749r41k801l43K759R03j676J56Q30j503j369J455K414n01j813J84
3280h5J72j79O0J355j41r14j098L61L93J250L19p47j485P71K77k63L49J327p03
3299A019k400J82K477Jj063L73O45j727j189J750K422j403k349J093R43j240l25
3316g91K123K31k134j035J538Q27k91K10J73j137j267Q47J063M68n7p05j201J51
$$ y = [-1064, -177, 1965, 1213, -692, -897, -442, 182, 294, 499, 551, -84, -1029, -747, -222, 1354, 1112, -560, -1499, -339, 225, -417, -576, 1432, 177, -2350, -1465, 1062, 1524, -979, -784, 289, -952, -2422, 204, 2296, 311, -1721, -627, 348, -427, -618, 877, 927, -1133, -2002, -112, 721, 285, -472, -320, -498, -1012, -917, 97, 680, 393, -1052, -1672, -729, 547, 268, -361, 41, 340, -1225, -1888, 828, 1650, -385, -2145, -142, 613, -659, -588, 2161, 1220, -1581, -1924, 835, 1738, 62, 218, 1048, -455, -1824, -369, 2045, 1544, -269, -85, 87, -92, -32, 1323, 1182, 268, -830, -469, -76, 1174, 1493, 746, -739, 32, 309, 46, 395, 1722, 1019, -1381, -1199, 1278, 1279, 216, 589, 1234, -493, -1682, 68, 2490, 1087, -1262, -169, 774, -466, -791, 1332, 1563, -571, -1606, -68, 759, 468, 678, 851, -286, -1553, -706, 357, 825, 768, 63, -1138, -987]
3334i87N32J260m42m63J68j391j94J598J351j027j403K79K23m81N94J611l19j809
3352i00q27J812M5o61P93Q67j829j569J469J805k41j178J74j65q05J60J996Q7
3370A033j324j005J51L58Q85N31J47j198o42o7O16P50L46J09j475k84O10O04K84
3389D29M69j60j386q65P46K247o12p71M54p13j143Q17K246J1k313k32J169l99
3407fm99J416J191k131j616J034J709k31m43N62o25j368M19J312O29k02j234l15
3425c98k54O61P96L13q88m4l04j004J258J457l52j316q39J169k26k14J359J008
3443B182k212j785J102J851n56n18O69l00k106J80K607P57j972m99M71k45r42
3460a316J421J645j343k023N07J038J66J33M03o56p58l42O86Q38R48p76j221o80
$$ y = [-987, -455, 805, 363, -100, 68, -1323, -1517, 81, 1432, 405, -998, -719, -496, -977, -383, 1228, 909, -900, -1727, 85, 130, -531, 262, 1129, -700, -2269, -800, 1005, 764, -414, -240, -405, -1210, -1050, 946, 1033, -291, -1296, -1145, -787, 98, 629, 776, -422, -1064, -1131, -515, 235, 581, 690, -785, -1069, -459, 145, 429, 898, 738, -648, -1513, -767, 1480, 868, 97, 551, -162, -1305, -488, 1758, 1769, -544, -776, 393, -6, -505, 911, 2102, -29, -1645, -611, 1098, 867, 424, 986, 361, -1007, -588, 724, 1353, 1151, -83, -398, -652, 9, 805, 1118, 230, 186, -118, -1122, 136, 1593, 1241, -75, -914, 255, 29, -185, 1174, 2182, -30, -1815, -713, 1138, 582, 64, 733, 433, -1673, -1493, 1114, 1871, -101, -600, -129, -374, -1316, 105, 1750, 407, -1616, -1109, -71, 95, 228, 631, -25, -783, -1125, -439, 399, 1347, 571, -650, -1330]
3478a330N03P55L06q9M07j032j619O80K619j4j861n4P67p44q75J749J740j598
3496C10k133M80J312j00m54J312j61k161k43J789J010k18q99o1l68o55J057R20
3514G37L21r21j073j67O89J296N9o97q3m87q50O25J949M13j919j247J266N99n21
3533a1J82J587o42k883P4K615J158j925k81Q48r96j259J162K156k70k350K82R86
3551D33k70L06M26R7q82r22J64J208Q09O7j067p60k1N93J27M80O40q44j683m4
3571a143K165J38j098k62O60q52j089J818J936j497k020N89R92p59k63J929l9
3588A205k044q39J337J464q76j04j07j32j234N99J299N55j052q68m00J05J219
3605A27P17m90o69j54o60n5J386J136r32j722R8J047r5J57J202k43k273m02J749
$$ y = [-1330, -827, -72, 234, 145, 552, -480, -2099, -1419, 1200, 1186, -675, -729, 38, -706, -1581, 168, 1908, 310, -1823, -1343, -31, -131, -585, 727, 566, -1595, -1838, -49, 961, 743, -156, -217, -585, -1240, -183, 737, 1058, 137, -936, -1103, -414, 882, 941, 244, 161, -326, -1176, -551, 1398, 1811, -108, -1355, -89, 510, -11, 171, 1758, 1116, -1767, -1693, 922, 2080, 155, -126, 722, -274, -1533, -371, 1785, 1515, -835, -553, 433, 163, 469, 895, 992, 110, -812, -648, 560, 1369, 1436, 369, -391, -412, 181, 308, 788, 1428, 584, -1099, -1143, 1022, 1160, 62, -200, 460, -392, -1481, 337, 2273, 776, -1244, -655, 337, -422, -685, 1244, 1205, -839, -1678, -341, 1123, 247, 143, 36, -96, -1330, -731, 568, 1123, 71, -797, -1197, -1092, 127, 844, 354, -315, -469, -1129, -1184, 202, 1338, 406, -1316, -1218, -171, -266, -109, 1093, 850, -1423, -1825, -76]
3624g6Q36p29l37M86r19j275J523J808n83j446kK68k38L95J128L51j137j396L55
3643i88R31O20K57l05p16o56q0J045N03N03p47j188l3P91N00l14M61j25j013q00
3663a354J288J581q43j271J19P00q83O67J265M23j911q42N85R28m89Q63K55j083
3681bj083N66J362m6l19j0n88p58O50R94P37j024o41Q6l37O08J059o4j005m92
3701c07K0j85N87J066Q0j504q46R32J64O6Q40M45j543j414Q70J827k79j083O42
3720C78pj728J90K262L48j646p91Q53j46l07J238P70j685r94JJ197M27m7k1j10
3740A82j353L9J210K00J65m71m87p35M37J306l60N2l08l57j064P40J504M40j677
3759e37l52K48L18q50J355J297j404j580L86J836m48m62P71J7j589p78J844J046
$$ y = [-76, 760, 31, -306, 180, -739, -2014, -491, 1317, 734, -712, -714, -446, -684, -289, 839, 1190, 53, -1343, -988, -57, 563, 820, 515, -201, -857, -937, 108, 611, 1114, 367, -821, -854, -63, 437, 123, 584, 459, -554, -1354, -66, 1515, 672, -599, -480, 220, -663, 4, 1269, 1692, -219, -1061, -476, 452, -37, 826, 1081, -2, -1085, -519, 843, 797, 478, 468, -120, -878, -228, 766, 1503, 479, -162, -76, -413, 195, 1254, 1190, 185, -307, -287, -472, 115, 1181, 1261, -243, -1089, -157, 7, 73, 913, 1358, -185, -1599, -729, 1098, 819, -264, 378, 371, -1357, -1167, 1095, 1443, -203, -994, -141, -287, -594, 644, 1414, -271, -1265, -1264, -67, 360, 313, 292, 182, -1171, -1132, 78, 278, 443, -28, -515, -1250, -813, 493, 133, 185, -123, -480, -1544, -804, 700, 1140, -537, -889, -641, -323, -1173, 182, 1479, 75, -1505, -1119, 717, 269, -193, 578, 595, -994, -1772, 72, 1118]
3777A118n35n19k59j86j58L43J034k45p05o87K14K58R97K23p26o63Ol2K14R85
3797F77M41j206r43Q13Q44k81l6Q97p44j589k22K365K86j117m45Q14n77j127J161
3816A1J589j49j937k20Q78J51j53J028k41j273p28O24O64M31J03m49q32J81N22
3835B00K24j6L12p42r28L6J521M05j095p6M70n22r65J210J525q97j746J22J274
3854C12o60j4J226M40k232o68J638R92r11l21M40k04j202L62J548l2r83n08JJ79
3874e97N72N26L7m18q53r1K11P29N47n07r37J45N30o01N13J096k90j604n85J177
3894d00J195q92l8M66m26j342P08J830j88j250m15Q55n75j95J087N54j086j101
3912a213P89M83O5RL26n89n34J00N89N98k2l29o38m74P70J052j34o35J92o80p29
$$ y = [1118, 583, 64, -195, -381, -539, -196, 838, 593, -112, -799, -585, -327, 670, 893, 167, -496, -490, -522, -308, 677, 1118, -88, -1031, -218, 626, 345, 309, 1206, 462, -1127, -1349, 1016, 1302, 185, -260, 554, -23, -1150, 11, 1600, 1451, -486, -706, 172, 323, 170, 1198, 957, -316, -1044, -420, 244, 675, 778, 329, -503, -322, 200, 424, 408, 720, -22, -950, -914, 607, 1012, -83, -159, 311, -211, -1176, 34, 1559, 662, -1084, -962, 312, -348, -362, 864, 1304, -928, -1596, 42, 1034, 123, -198, 242, 38, -1164, -802, 746, 714, -269, -777, -776, -597, -25, 501, 538, 120, -733, -824, -613, 116, 663, 156, -781, -636, -106, -707, -194, 902, 612, -992, -1577, -400, 795, -97, -135, 331, -95, -1437, -729, 1101, 913, -337, -752, 103, -472, -667, 420, 974, -112, -1213, -424, 59, 124, 133, 459, -130, -664, -564, 25, 623, 601, 272, -366, -840, -70, 982, 848, 213, 405, -275, -1004]
3933a004J348J039p02j268K77N11m62P6R18O16j511o46O92P00j74k77O68p53r92
3952i44K61J342L76q39m81M34n70j7J064K58n69l87m76M7Q11K97L77j098k88j06
3972e08M72L3O26K74j366l80J076L47n73L25P07j127j207O68J461k31q76J1M98
3991B30r20q0J417M48j011j219R00j36kL07N70l79q68n6Q51L28j91k9m84l74K63
4012d35N34O8M3l92r3p12L40J111K79m97o36Q8j88Q6Q43L43q06p92M85J73k47
4033d05N52O87n94j791L52J838P8q75M45p8j028r7J428L16n69o96L5L88l76M57
4053F7P95k63p14n30M66M38K58K3l33l60j00L97Q2K94M54p26j116N95P45N7l32
4074A97L29l7j232J11J352J78o55l61K17k37j12P73O57n18j541N90Q75n54M13
$$ y = [-1004, 344, 1383, 681, -587, -310, 201, -261, -185, 733, 1349, -162, -808, -116, 584, 410, 133, 801, 48, -944, -683, 659, 1035, 196, -285, 149, -421, -438, 626, 884, 315, -72, -548, -501, 310, 607, 984, -114, -402, -508, -36, -3, 623, 897, -469, -849, 227, 574, 1, 326, 1033, -94, -1301, -633, 828, 597, -279, -268, 230, -690, -770, 647, 1095, 84, -1135, -235, -371, -373, -66, 504, 125, -743, -799, 52, 380, 189, 160, -324, -698, -435, 99, 167, 210, -182, -275, -987, -647, 464, 743, 246, -390, -302, -490, -404, 439, 782, -24, -816, -331, -158, -405, 147, 834, 240, -1551, -1199, 639, 717, -158, 287, 209, -819, -916, 512, 828, 259, -437, -402, -14, -390, 67, 862, 599, -115, -645, -179, 259, 517, 540, 207, -153, -253, 144, 226, 520, 974, 248, -868, -273, 472, 529, 197, 526, 489, -743, -632, 720, 898, 243, -118, 99, -138, -250, 523, 1180, 662, -879, -289, 586, 32, 445]
4093D45L41j81o53r15N78P37M10n36k13m16J52J62Q10q14M41k12j052O32M78R17
4113A111r71k94K73j05o06P99P78l94j886M18J391o35l03R61J72j341o83J197
4131a18R00q20k46K81r1j005O13R40M67j601K29K25N2n0K58L56m31l46k15K53
4151c49M26O19n55o64l15R37l62j48Q31P1j419NJ121K58p03p5Q66o28q26L25J604
4172A019m40j519K45R33n6m07N88L53q73o85N93O91K0m78L93m37KO5N92J26j83
4193E42n50k56J29j3N74j95k32L03k81l45L89J058m63j082M32M14m10m11R63M67
4213A033j239p05J221M48m67n07O28Jq82j30J445j27q02l6lM71o83M54L70q5m30
4234b5l20K41N48j39J51p40m0J89O8n8M72K29q48m32N06M08m19j31N79l05p08
$$ y = [445, 786, 605, -48, -963, -385, 352, 762, 226, 13, -403, -251, -89, 721, -93, 348, 136, -916, -284, 194, 1111, 140, -154, 119, 14, -592, 207, 985, 591, -1295, -877, 514, -121, -424, 537, 709, -632, -1315, -118, 782, -38, -284, -3, -94, -1099, -486, 454, 921, -680, -451, -226, -174, -224, 34, 390, -41, -387, -602, -349, 77, 696, 141, -523, -838, 99, -263, -411, 420, 491, -928, -923, 198, 456, -247, -322, 544, -84, -910, -585, 1019, 579, -940, -695, 238, 182, -225, 363, 716, -157, -842, -249, 442, 462, -16, 377, -60, -58, 7, 599, 725, 542, -8, -264, -135, -148, 426, 231, -1, 302, 21, -324, 65, 1123, 660, -422, 10, 424, 14, -397, 566, 1033, -206, -911, 310, 758, 291, -216, 412, 413, -469, -599, 846, 719, -83, -119, -122, 349, -334, 120, 490, 405, -25, -345, -104, 444, 305, 456, -284, -324, -135, -67, -125, 347, 576, -272, -704, -198, 210, -209, -340, 239, -66, -774]
4255g74K48R42n10l2j93M94r3r26P53O81p10n57N20K04l02j91M57L7m46j70L60
4276b08L43l66r6p1l88M33O28k9k65o9K7k03l31O73k1m16J67L31k86l27O29M92
4298F47o72m56L88M59k02l63M85k06o49L56L10M31p14J63K35m58r4P65M86q90
4318B1m58O26O3m38J44O07j12o68J38K82k83K84L17k90l51J81n1L30l7K31l85
4339A51o00J98Q64k36n42J95L85l24m99P06L84o30l49M96L91q32K88P12m61o89
4359c92L48R23o41o08M63M15q27m9N14k0k23J31L65m91j39N82k6n22L20m7m56
4380c80J18K15L41l51j03L14m20l36M68L06l36p78M69N83k01o64P69L85p97l28
4400g26Q25M79p60n37J017j74q20J69Q40l6o68P8L35k44P1l1P69q69j18J08q4
$$ y = [-774, -526, 416, -94, -126, -319, 175, 82, -844, -91, 590, -120, -677, -157, 47, -255, -446, 11, 48, -398, -568, -208, 135, -231, -327, -398, -786, -353, 275, 246, -19, -88, -61, -264, -595, 78, 57, -359, -192, 139, -147, -474, 155, 647, -25, -481, -93, 366, 164, -199, 286, 80, -569, -213, 97, 528, -186, -23, 212, -246, -340, 425, 911, 21, -437, 189, 252, -186, -42, 565, 453, -215, -77, 205, -78, 206, 523, 233, -118, 63, 12, 342, 305, 536, 151, -449, -251, 613, 377, -165, 30, 415, 91, -408, 298, 682, 52, -297, 199, 590, -242, 46, 758, 297, -392, -44, 879, 238, -370, 93, 508, -319, -368, 146, 126, -97, 34, 399, -92, -231, 351, 325, -197, 123, 76, -380, -262, -47, 294, -57, -160, 154, -266, -602, -134, 172, -164, -942, -473, 110, -91, -755, 14, 399, -398, -726, 99, 578, -182, -719, 298, 124, -696, -527, 313, 277, -391, -313, 22, -222, -151, -182, 587, -282, -400, -292, -376]
4421c76O32k41j76n85L74N84k54k48M03J77n42k78Q16N00j057o2N80L6k80j58
4441a55O77Q1j049J33J063q48j79K43O68l90q47N00Q68o19n56O07L17o22q5O63
4461D70k72L59k80k04k24K12L85n00J24J10J06k81M61L72q64k66M38K02l5n03
4481a90M05J88j53q61Q18J92k80j29K20L96p48k72Q51J46n08l61P05j98l32j53
4501b64N08k29p15L68M92l79MM21l00j04L50m48j67M50K73o09o4K85L80p02K52
4522a98K83m4o11j49R65j00q14N39L27k85n43L90O39m04r56O57K95n09j22O38
4542bn5l39j13N13J05l37r7O5O0j3P5L97m43J16J56o33N26K48R3n33MM84k38l57
4566c18N22M97l86p01O29Pl02k67P29J91p36l72P49M70r47K15L48j41o87L62P96
$$ y = [-376, 256, 15, -161, -746, -372, 212, -42, -290, 113, 290, -252, -530, 286, 786, -271, -333, 247, 283, 3, -155, 522, 603, -446, -313, 750, -98, -277, -34, 634, 244, -603, -103, 765, 146, -410, 197, 514, -108, -193, 470, 198, 557, 277, 73, -151, 61, 446, -54, 70, 180, 286, 5, 466, 838, -26, -292, 146, 348, 313, -190, 215, 403, 250, -611, 207, 399, 119, -10, 210, 606, -142, -414, 437, 583, 75, -286, 419, 221, -111, -264, 244, 15, -700, -332, 160, -219, -215, 206, -94, -198, 152, -296, -463, -13, 260, -349, -413, -128, 252, -450, -198, 85, 41, -570, -719, 246, 146, -668, -129, 198, -87, -630, -240, 399, -5, -961, -304, -9, -518, -640, -2, -57, -396, -509, 4, 109, -228, -325, -260, -200, -213, -138, 259, -184, -68, 88, -545, -19, 229, 322, -211, -207, 277, 39, -318, 204, 701, 315, -386, 243, 250, -52, -319, 410, 601, -135, -507, 242, 712, -235, -20, 328, 187, -500, -138, 658]
4587F58l42l44K80Q4l09m5L57J63n77J7M74j44m05K51L58m54l1K41J85m50M53
4608D20k45l11J65K41k66Q6k14O64n85j09L29K56m10n85O02R5k14r8L80l7n59
4629c95j24O03J6k71Q4O23n68k31L00m3K37k95K69k63k60K02J45K2k53J97k71
4650b76k47M84RJ51m21R8J9J7j37N13j75r12J99O38k57p6L13J10j70p61Q78M51
4672D48o88j65L55J46m79J85M47J02p40j03O74L2l13L2o7m2J1L04l04J48J83O1
4694B27k72p5N2L48m78Q2O70n74n09M96L55k39j55J85L03q17M85O05l53l04L7
4715F9N35k20o59K49M99l36k64M94J48l99j18O00k06j14l58K15K79j22l26j36
4735a70K78N1K61k65J30p1k67k15L01L78m03L2j60N89l41m33L60J94k96l39K34
$$ y = [658, 316, -28, 252, 336, 27, -18, 339, 502, -75, -58, 416, 272, -133, 118, 476, 22, -9, 232, 417, -33, 420, 175, -136, 29, 270, 4, 90, -124, 540, -45, -154, 175, 431, 21, -564, 38, 133, -81, -179, 201, 164, -395, -519, 84, 100, -171, -87, 536, -32, -263, 37, -6, 231, -64, 205, -58, -318, -116, 29, 51, -202, -5, -276, -523, -39, -30, 121, -300, -202, -183, -166, -303, 210, 35, -877, -678, -40, -297, -373, -60, 50, -120, -881, -3, 448, -240, -405, -50, 96, -383, -198, 249, 351, -389, -492, 182, 214, -99, -67, -134, -176, -165, 139, -165, -17, 166, 227, -45, -120, -68, 280, -198, -116, 554, -20, -529, -33, 322, 83, -72, 113, 416, -401, 84, 689, 336, 32, 69, 604, 384, -275, -26, 473, 137, -127, 367, 515, 116, -2, 598, 392, 278, -80, 135, 414, 292, -34, -170, 108, 159, 420, 155, 285, 214, -53, -268, 33, 411, 8, 40, -120, 469, 128, -305, 55, 249, -47, -386, -152]
4756a52O51n87j76N35L45j179K43M18J92n25N0M65R6p39j5O59j41l17r7R6q3%
4778b61M64m43J0J50q9QJ29J32j62l53O16p1m97K56M22k98l60j33O03K8q53M06
4800b96M18l5o99N07N11j73p50L04M59j95l85M93K12n70M8k49M53l65J63L67m42
4821b24j14J63J86j12K2K73oj92J39l7j35R2M25k10o57L29P75q05k34N56K0l55
4843a01J33M51N7o47l43P00R9l92p4N78J5j081N70P81k46n56J95j91P9j88M27
4864B66J29m65N2J59j53J12N8n4k11j76L14p7k64L95L70m94k42M08k02k9K77L10
4886D83p78j40J00N53n5n61N69J45m50k51M21K07m66k85N25j24l33M27M1J37k61
4907i6k56M02k76J90j1k63q6L80j04k99L11L17n3m89N22Q4o27JJ14L91m58k49
$$ y = [-152, 499, -88, -264, 271, 616, -563, -320, 98, 290, -235, -185, 280, 376, -363, -378, 281, 140, -177, -274, -178, -261, -261, 203, -240, -230, -80, -169, -161, -32, 100, -62, -415, 201, 130, -367, -111, 311, 13, -347, -480, 123, 151, -702, -296, 122, 87, -612, -105, 406, 233, -517, -213, 246, 51, -334, 159, 371, -199, -151, -400, 53, -312, -149, 218, -224, -338, -175, 11, -101, -79, 194, 188, -4, 135, 98, -37, 55, 480, 270, -387, -58, 717, -88, -322, 234, 254, -101, 32, 483, 540, -107, -450, 250, 349, -43, -117, 461, 476, -605, -35, 746, 500, -56, 139, -52, 27, -161, 266, 395, -70, -18, 141, -12, 100, 158, 104, -107, -283, 31, -46, -310, 85, 455, -39, -281, 127, -75, -104, 173, 483, -295, -435, -335, 218, 163, -398, 171, 316, -134, -385, 36, 243, -223, -508, 17, -107, -440, -13, 28, 165, -96, -352, 50, -226, -36, -47, -310, -396, -16, -120, -419, -108, 209, 156, -333, 189, 273, -354, -353, -239, 152, -306, -555]
4929e55Q02J31r36J82P79l77l09P4M99j71l17L06J38j67m3j17M4j67j81O08J84
4950D07m61k7J58N3q0J04K38l66j70L74J00k08r0K19m04P8K50l0m3j40K64j69
4972E7m53K31Q36n19l7J27J35n39j1M75N1n17j87N76j35r6K51k33K13l41J77J94
4994B55m5l19O87m86J0j21J50K40n02J13L45l82j09K01K64m04o4L14k13L89j57
5015A66K79l08l05K78o3j73Q8L47p09k43N76L47l97J32J76K2p85J3O01J98m12
5036a72r8O8J34p6k42N18j25k65l9R4J23L4K17k65j95K18n6Q5L39l37Mj37l27
5059e00M47j64Q3K86j70p24O06K91N53q98K1N35o09N5M51O1k65n16M91J06k29
5080h9p5M99l55j02l33K74L33j66jK47l23j01K46M61m22Q7l4k68K17J77l7k62
$$ y = [-555, 247, 378, -558, -376, 403, 26, -283, -209, 290, 119, -198, 108, 246, 79, 36, -81, -37, -204, -385, 223, 407, -54, -81, 77, 130, 50, 154, 392, 26, -144, 230, 330, 122, 32, 251, -153, -75, 175, 145, 102, -38, 226, 57, -396, -165, 671, 152, 115, 242, 377, -162, -173, 302, 353, -164, -351, 225, 90, -6, 245, 12, 225, -116, 61, 255, 210, -109, 578, 92, 102, -19, 131, 371, -131, -18, 327, -55, -164, 37, 301, -103, -167, 147, -66, 323, 166, 445, 137, -168, 110, 47, -126, -38, 309, -400, -643, -67, 280, -117, 15, 191, 213, -572, -559, 42, 240, -172, -270, -202, -68, -144, -386, 132, 7, -258, -297, -203, -80, -46, 171, -94, -289, -71, -127, -42, 297, -40, -36, -173, -500, -53, -217, -134, 152, -18, -742, -136, 155, 708, -190, -169, 366, -243, -188, 263, 324, 59, -457, 34, 140, -89, -164, 335, -20, -122, -455, -181, 152, -14, -15, 232, -91, -192, 54, 515, 93, 180, 146, -122, 95, 272, 235, -27]
5102b7%N9j15K73J35K09k46o26M32M7j24j80O19R3o36l36O62K11l31l7K46m81
5124a53j3K32J93Lm79R7L31j02k93O33J00o02j20P4M40o3l85K39k37K40k83L5
5146a13K64J52k08k92n4M64J9j07r7o4k2j31j7L79k61l48J42M15j77k38O1O22
5168C89m69m02M37J18k38J50j29p7j26J38J71Q5J7k22R9j25Q4k96M84P9k38l8
5190a09j59K69K22k27j97l01L75J78l52N69N3q41J22L58J52j09l58M84L9m15M4
5211b03P77l10l85J20o6K00k66M94m1k99j68K62K79k39k7M1p1k6j35L09LJ6m8
5234B17o76N02J94kl8l46J72Q6j59J09M78m05l16n0N21m40J75M22M01q13k1o1
5256e0M25k64r0L47n0n44M2N66j35q6k04j2j23J34R4L36n55R5P8n2r1P9N72o55
$$ y = [-27, -27, 32, -83, 190, 325, 534, 288, -338, 94, 141, 17, -163, 456, 549, -87, -423, 239, 450, 119, 82, 328, -153, -166, 66, 259, 262, -217, -120, 211, 109, -184, 449, 549, -53, -173, -99, 341, 278, -107, 132, -105, 135, -148, -113, 151, 303, 95, -197, -251, 213, 232, 125, 28, -36, -58, -189, -206, 173, -88, -436, -294, 121, -56, -294, -233, 389, -80, -482, -45, 73, -165, -15, -144, -221, -347, -209, -38, 47, 64, -158, -59, -184, -100, -396, 88, 167, -71, -109, -268, 1, 223, -4, -201, -502, -127, 51, -301, 268, 321, -520, -398, -40, 112, 3, -355, 129, 168, -247, -203, 574, 264, -121, -1, -67, 133, -133, 361, 320, 21, -147, 115, 394, 155, 128, 169, 98, 72, -63, 246, 249, 265, 217, -459, 43, 237, 235, 197, -149, 23, 109, -50, 59, 537, 132, -184, -234, 287, -153, 22, 444, 845, 32, 11, -50, 375, 111, 21, 368, 318, -226, -184, 382, 247, 161, -43, -55, -178, -44, 50, 386, -169, -74, 4, -48, -139, -60, 512, -143]
5280a43J2K99j22m04L64J79m83%L71O8m20L02J33k05n33M81J00M6m37L85K15k12
5302dr1Q8J61n10J27L44j70o3j0K39j07n4j23j03J73n3J35Q4k06JP2ql0J46j1
5327B7l42n8L8N32l06l2q3K97n67L86L86n74M65p1K03n36N3N88j18o06K65N16
5349D63n02J94j02N1j86j05J38L34l72k42N93L4l74L05K06k61r2o4rL20R4j08
5371C15k40k2J74j80j80K92L6k57p2K42j3L2l18K31N18o61J02J88M46p11k42N86
5393B66m7j89j48L82J71l41j46J92K5k88K12J82k34j32L8K16J35l43k4o1J0L30
5415B06k40J17j06O9j24k4j03L91l81J88K87m34j11J25M36j55n14P8L64j50k98
5436c79M4N42j02m58O3P74n09j20k52K38j82O4K26J02k36O4K37k82J11L37n17
$$ y = [-143, -131, 168, 46, -358, 6, 185, -298, -298, 73, 141, -279, 23, 156, -49, -582, -101, -1, 45, -392, -7, 208, -4, -95, -7, 154, -356, -229, 115, -55, -118, -128, 111, 4, -50, -173, -276, -103, -156, -21, 63, -143, -142, -70, -78, -108, 38, 27, -315, -373, -335, 197, -109, -141, -224, 73, -494, -108, 278, -296, 169, 98, 301, -235, -182, 406, 288, -318, -53, 463, -39, 155, 53, 104, -82, -187, -49, 285, -87, -329, 264, 298, -76, 229, 435, 174, 82, 18, 9, 329, 423, 315, 75, 53, 227, 47, -133, 159, 195, -62, -134, 108, 95, 127, -191, 40, 558, -103, -1, 187, 633, -78, -320, 266, 219, 30, -118, 264, 435, 94, -52, 140, 165, -123, 89, 271, 37, -95, -57, 159, 294, -49, -73, -134, -124, 206, -34, 83, -23, 46, -78, -102, -205, 186, -195, -7, 280, -154, -265, -140, 296, 141, -373, -295, 69, -81, -379, -335, 207, 105, -353, -290, 484, -25, -145, -397, -159, -341, -277, -51, 51, -185, -121, 116, -166, -55, 282, -235]
5457b35J81k22Q7J35K99L6l50q9K4J4N9J83l2J2j74k05K78J04q1j77K97J28o13
5480c41J07M59o3q08O05L79m98J46N5L13l37m4J63m2J03O3j3j80j68K83j56K45
5502B71k79j55P7jJ43J66J69m10jJ53k17J31K00k12n43K81N63o66N65K88j89r8
5524B36l21J46K32J6p02N41o3l60M79j06n5q5j97K21p2K22r3J37k04j01k32O2
5546b99L26q9M1k27K7J21Q9o4J19M8k38K31j57j35p4L16N3L4l21J72M08n98L18
5569A01l35N04k39n1p1jJ48l67L59J46n23K99N9o7l07J04L48QN2l7l93P1J57M81
5593D46k66J05k20j52N5j26qK62k87N4K4L92m7m22O45o72q5K20J6J1K0J40J44
5616B49n57J53K98J65l24J5O9l32J68J10J47j7n14O23j28j32K29P6J1k81K87n0
$$ y = [-235, -54, -276, -189, -54, 245, 281, -69, -158, -134, -120, -61, 122, 90, 102, -72, -277, 1, 105, 24, -153, 144, 272, -341, -234, 225, 162, -646, -41, 338, -160, -14, 41, 354, 17, -27, 136, 94, 197, 260, 247, 67, -101, 182, 26, 271, -8, -163, -86, -87, 56, 222, 391, -19, -20, 133, -84, 47, 247, 35, -508, -227, 336, -330, 235, 523, 334, 236, -85, 61, 293, 309, -393, 148, 85, -275, 204, 98, 43, -42, -239, -18, -90, 132, 39, 176, -28, -129, -361, -299, 27, -62, -21, -248, -221, -100, -11, -75, 44, 92, -146, 85, -72, -207, -281, 35, 88, 122, -199, -27, 381, -217, 101, -234, 270, 31, -20, -91, -92, 56, -311, 48, 194, -329, -30, 29, -38, -345, -241, 107, 115, 167, 130, -263, -192, -35, 446, 180, 285, 65, -87, -32, -158, -166, 96, -191, -137, -113, 279, 232, -190, 455, -217, -302, -82, -66, -55, -35, 105, 249, -308, -155, 143, 308, -16, -1, 68, -264, -96, 14, 161, 144, -370, 253, 125, -7, 222, 298, 309, 28, 315, 265]
5638B65j49L06m49J41l5j40L07k41J05N2J63m58L50J0j5j83L12k81j80m0K38L90
5660D68l91j23K82j02k09n7L30L9m44J8J63J29k0j87J05O9j05J91L00p82J67K27
5682F8J10j52K01j09k13O2n6L5J2K78k67l0k75O67m61J27K77n2j5o86L82L75J3
5705B91o47J13J8nLj3N38j51l25K15L68n77q4K72R2k35j67J66J58K4O3K10n70
5728b43J92J41J25l55J5J44k16M28j52m6l02L10K96l86k5J59K68l15j02M08k63
5749H1n1p1L51j82K3l55M65P8k77L57l00j04k23J16K95j21Q9l31J58K10l53K22
5771G7M58n32K35m86M71o8m6Jk87L50q3k87J67M72l95j89o3J17J71k11j42K82
5793A2m60L35J97K61m86j16J73K43j06k60O31l31k70L5L44k5k44L2K04o9m84J38
$$ y = [265, 116, 422, -27, 114, 79, -61, 246, 5, 110, 162, 325, -133, 217, 227, 212, 29, 341, 60, -120, -160, 78, 468, 77, -46, 236, 134, -75, -132, 198, 237, -207, -189, -26, 103, 83, -104, 1, 70, -35, 156, 456, -326, -159, 68, 178, 26, 227, 118, -95, -33, -89, -54, -42, 236, -31, -61, -336, 331, -130, -3, 274, 222, 207, -479, -97, 278, 291, -356, -243, -225, -230, -227, -240, 298, 147, -178, 37, 405, -172, -256, 16, 108, -127, -294, -128, 30, 54, 117, 327, -243, -51, 90, 215, -140, -125, 19, -197, 231, 79, 33, -269, 41, 337, -49, -74, 85, 353, 38, -64, 344, 81, 30, -41, 310, 128, 151, -204, 261, 339, 62, 419, 119, 15, -208, -92, 203, 82, 171, -160, -2, 208, -145, 77, 535, 3, 238, -248, 223, 155, 109, 110, -177, 173, 90, -197, -30, 442, 47, -142, -205, -88, 83, -128, -270, 12, -448, -113, 84, 345, -141, -257, -84, 159, 53, -207, 424, 93, -177, -142, 202, 177, -67, -35, 169, 100, -384, -246]
5815b46K3J79M0k02n6L1K96q4N8p0P5j8k46L37kk57Q4R3m8P8J67k05J39k88k65
5840c87J46M17m84L77N2k51j03j53N75k60Mp1J8q3L7J07P1J0q5N7J00l25K56K4
5864D9k40J91n3l12K60K2j06K03j73O2J56l84K16J08R7j09j07J59N4j05K89k23
5886E4l3P4j45L41m94K33r3k1J08L60p4j13m53J53L33j62n5K29m38m5J48M56k4
5909C39l52M0K1r8R5J65l01J06N7q8O4k08M01k70l99K29J14j03k62M37J04k3l24
5932b56Q2L63j97J19k65J83p6k5M92l96l76J04M65l90N6L59K38k70m73K07N9k77
5954b74K81M53o85K90J10m31J21qK67k73Q3J33l7j11Jo5L8MrM47n57J27j10M77
5978B72k57j26R7J0k02j28j05N16J08n50K13L52m77M13R4n0J62k65n1m55L75J91
$$ y = [-246, -223, -44, -4, -206, -262, -231, 65, -19, 39, -31, 44, 26, -220, 117, 115, -142, -58, 35, -13, 65, 232, 27, 166, -122, -387, -241, 176, -308, 69, 121, -130, -233, -386, 189, -71, -67, -138, -120, -203, -166, -59, 12, 22, -63, -6, 94, -231, 25, 49, -191, 0, -53, -365, -105, -83, -189, 14, -159, -97, 59, -325, -109, -1, 96, -13, -120, 39, 93, -12, 277, 54, 21, 95, -50, 291, -203, 30, -63, -84, 24, 384, 310, 197, -256, -103, 230, 68, 13, 242, -196, -241, -93, 363, 339, -13, 27, 48, -50, 45, 210, -91, 15, 72, -16, 48, -160, 241, -29, -428, -199, -85, -188, -450, -13, 91, 68, -256, -174, 189, -8, 111, -154, 29, -47, -72, 420, 24, -352, -248, 217, -173, -117, 242, 480, 210, -263, -56, 3, -274, 7, 460, -225, 65, 175, -256, -135, -143, 124, -149, -66, 67, 30, -81, -80, -145, -107, -103, -112, 335, -222, -95, -205, 272, 15, -111, -14, -4, -206, -334, -439, 77, 185, -365, -152, 200, -277, 136, 230, 180, 342, 77, 26, -429, -54, 137]
6000A37R4n2j18j26O2Q8M1N5j76n0l2J27J04K7nl19L63m30K98j87M8O7p7k0L66
6025B85k84K79j81K50p2j51N7j15k2p1qkK48O5n3k04J8q8nK33l71N18Q5k61j93
6050d3J38K60l52Q6K7k89k23L45K84k60l25N24k66J2QJ02K72k89m93M03J53k4
6072E0r8L28p6l75k34N32R0l71R1j02k97K79N7L80j30n25K90J3J94N2l1j73L1
6095b5NP2K39k66J77o12O7P5L00j67n9J29jl49K2K27M80m13j45n5K37j0J74K34
6119C36l27k10j5M06n75L04K51P3m24RL58Q2k77RK39k50l92L12L40j73L6k83K8
6142a43j47L65K26l52K14k53L26j66J75m0K00n98K02J1Q8J17j39K91k85l11M87
6163B68m6q5kl94O46j77J9j85J65l26o7L62l05R2K14m67K90J54l51K16Q1o8n0
$$ y = [137, 231, 179, 61, -65, -3, 85, 126, 181, 5, -45, -77, 50, 154, 181, 176, -143, 220, -210, 88, -99, -51, 16, -61, -81, 285, 1, 280, 99, 349, 277, 126, 183, 68, 46, -25, -33, -35, 213, 278, 225, 21, 39, -49, -54, 179, -192, 326, 411, 150, -43, 95, 355, 3, 89, 116, -173, -396, -51, 233, -27, -352, 172, -94, -82, -74, 28, 300, 11, -482, -79, 74, 50, -48, 280, 204, -171, -405, 127, 217, -154, -63, -165, -462, -183, -126, 254, 124, -401, -111, -98, 96, 148, 117, -56, -25, -20, 52, 291, 25, 202, -410, -343, -268, 32, -135, -194, -65, -66, -415, -393, -166, 314, -99, -244, -299, -62, -72, 102, 336, 9, -201, -216, 190, -385, -81, 170, 243, -181, -172, 186, 268, -9, 0, 239, -11, -403, -91, 249, 76, 112, -171, -143, -290, 75, 301, -51, 163, -90, 236, 70, 245, 205, 405, -193, 9, 20, 108, 225, 86, 377, 92, -219, 268, 222, 137, 135, -259, 387, 210, 229, 44, 209, -117, -184, 178, -127, -35, 179, -288, 2, 156, -195, 21, 102, 34, -16]
6186a6p5Q9n0k43M67M5Ok21j92J80l8l0K76k50o3K8r7K92j34k50J30j4j8m8J90
6211c6L5O0l24M20n7j44j22K59l58j00j42L85J25oJ62l74J49K29jq2j07j84L86
6234A73o53N91J67j92m53J75K49J20k53K53K4k89o0K59rj13P9k15K37n66N08J53
6256A85m7o1N0j94l37N00M1K00l72l1K57l99R3J77j16J57j54j54L82R5k17J30
6278A85k09j45L14J4K04q8l53q2J99J7J02k14J1J29q8n0K43rJ3j25n76L26L90
6301B08j40jP8q9l26L41O0J04n10M16r1j91J48Q8p8k38L16j60J43j14K39k97L7
6324e7m9L5m8M14q1lm00J96p8J89j07j55J99N0n15K29J09j24L78J38j92l85J16
6347a41N30j24l73M6j24J49j29R7J56k20R9j60j6j4K93o1K5j22k69J15L1J67O7
$$ y = [-16, -91, -2, -52, -295, 172, 217, 223, 2, -190, -10, -48, -78, 198, -52, -115, -87, -184, 108, -26, -276, -146, -160, -178, -226, -36, -1, 59, -265, 155, 98, -46, -168, 91, -267, -367, -509, -124, 1, -5, 157, -217, -68, 161, 160, 78, -29, -213, 173, -480, 111, 278, 86, -367, -192, 57, 177, -76, 177, 201, -88, -148, 111, 102, -11, 68, -147, 90, -476, 32, 185, 138, 77, 127, -67, -404, 96, 137, 337, -35, -66, 191, -208, -115, 62, -54, 103, -51, -205, 177, 272, 55, 185, -24, -169, 145, 159, 363, 275, -78, -160, 39, 56, 158, -56, -45, 84, -4, -54, 189, 180, 193, 68, -508, -182, 208, 68, 67, 145, 56, -270, 71, 131, 235, -275, 141, 50, -141, 7, 95, 17, -221, 95, -65, 78, -36, 203, -94, -57, -106, -71, -119, 295, 214, 211, -189, 7, -71, 118, 11, -144, 55, 105, -410, -181, -72, -196, 182, 320, 128, -257, -141, 389, 265, -108, -62, -186, -37, -166, -69, 87, -133, -34, -194, -210, -224, 69, 8, 33, -89, -358, -243, -212, -45, 22]
6370B2j20m73O03M18l80M9j58k0p8nN00j16k99m2N5k29J72K81k8K2j36l19K81
6393@K21k13j3M09m36j57Q5J66K54m97J64j09J7J92M2j48L10k82k79L70O5l5l4
6416I2K75n04O9L58m75Q5J47k1K22p3m3m2J25o8j87RM60m03J63n64J96K07o8j33
6440a73L31k12K18q5k08k84K15J84j11K51k56P6K86l8l02Q3k45K10j20N9R6r7
6462a22K02l09J8L7j02L25m8qN0m57K75Q0K0j59J27J14J31m77N13j19k99j36M28
6485H4n0Mj58P9J37o22N77j32J10K06l07p2k8L59l7o4k79P6N4j72L84J23l61R6
6509Gj30OO1J10L66q7l58l89N14o4l1mJ31J73k75m20O04j2m67J78k13k3K26K24
6533A27K70k56n13O59m16K93O8o9k47m6J36K85j36M9k04m4O7K88k70L37l05j07
$$ y = [22, -98, -571, 32, 450, 70, 119, -39, -59, -137, -142, 358, 242, -57, -99, -44, -273, -101, 180, 152, 174, 38, -281, 0, 221, 8, -5, 404, -32, -189, -104, 62, 316, -181, -17, -126, -109, 83, 125, -23, 287, 5, -274, 96, 161, 126, 92, 367, -137, -68, 290, -185, -100, 47, 26, 248, 175, 132, 90, 215, 147, -40, -31, 429, 26, 189, -375, -179, 28, -40, -173, 158, -54, 164, 79, -129, -413, -198, -14, -125, 126, -130, -54, 232, 194, -108, -25, -270, -60, -180, -121, -25, -122, 80, -229, -211, -174, -276, 49, 1, -7, 43, -414, -139, -59, -39, -198, -71, 43, 174, -303, 210, 91, -208, -344, 84, 34, 38, -120, -41, 96, -526, 51, -81, 29, 235, -72, -144, -172, 187, 150, 86, -193, -117, -63, -235, 149, 272, -89, 7, -123, -117, -56, 54, 420, 333, -25, -414, 100, 36, 5, 1, 132, 305, 30, -390, 214, 202, -265, -87, -300, -323, -97, 127, 397, 141, -372, 287, -129, 164, 232, 163, -84, -130, 6, 291, 155, 204, 0, -44, 23, 311, 41, 378, 73, -34]
6555c4n7R5l00L11J60m00n6K3MK53j28J29L20o27O0L54l2j25J67J95l69j88M61
6578B16j43j78K88k69k90J27L09O8k09j9q5K95m1K0mm1k52Q9L37m3J96k16n86
6601d31N83j75k4N5J93j42Q3J30j84o5l27J98J00l53r2M12K95kj78k32j78L74
6623D0J25j69L11k52j26K76k00Q3r5K07l56Q8P8%j47J38K2r9J3M1K94k22l07L05
6647D8J01n42K27J94K29k37k21J55J03l37N85l20q0j11K58k48M78l41q0K36k64
6668a67J32K91j3N3m42K51p4mJ62k56L38k81j45K18J3Jq1k51J19L3K43m79M38
6691I9L4j77k21J2Q16p15o1M64j24m8k12M29O7m35K13q0J3m3p2K18L3j93LP8m
6716I4J53n38J80J31r7P4M22n00K83j42m15M66J5k76K87j57j15k3K9J27J62n5
$$ y = [-34, -91, 4, -296, 15, 175, -225, -281, -258, -254, -1, -129, 0, 320, -307, -247, 107, 75, -50, 117, 312, -57, -245, 216, 73, -105, 183, -86, -376, -249, 60, 128, -81, -100, -185, 110, 69, 89, 85, 44, -208, -119, 218, 175, 371, 155, -431, 152, -23, -47, 8, 201, 59, 142, 272, 88, 23, -304, -106, -6, -359, -451, -39, 256, 254, 76, -156, -334, 40, 165, -4, 307, 55, -71, 205, 5, 88, -7, 200, -156, -68, 10, 10, -137, 1, 23, -76, -63, -22, 272, 50, -257, 48, 149, -393, -166, 28, 257, 20, -201, -46, 57, -280, 305, -15, -95, -206, 52, -196, 282, -59, -139, 97, -167, -35, 256, 243, 296, -146, 105, 31, 27, 189, -67, 271, -10, -155, 63, 76, 77, -4, -255, -136, -103, 140, -339, 99, 133, -44, -265, -253, 563, -152, -213, 251, 127, 79, -133, 296, 363, -72, 141, 61, 74, 31, -41, 177, 210, 17, 20, 98, 94, 247, -291, -111, 20, -77, -3, 419, -81, 202, 60, -355, 111, 126, -150, 137, -20, -135, -158, -129, -2, 160, 105]
6738A05j20K26j65j82L28j90j45J24j68K84j39K10n9j0l71J32l7K26l9j99P6k14
6760c27k57M92O9j01L89p04L35N4p6n1L76k61o6J97p0O9JJ50k26k00l3J48J49
6783E7MK81l71j53J66J1L60l49P5j36l1M82m48L30l96L72l79K49k60K81L6j10
6805G1lrK41n2l9j10k1k08j06NM15j45J86l26j75L57K19n2m63M82k73o8J12k07
6829a69K84j7k19K74J08m82L63j08o8j09J26J82O4k60K62j43n43M56m0O1k5qj07
6852a18k40N51k72k9L27m77m3J02M62k21J75j86k14L72k3j05M6j76j3o8L09J85
6874C44n83J40J23j07j20J47J84K54n05K22l3j54M8q3J12r6m4L9J1J24J0L37n71
6897b01J40r1K07m3J6J9l99J20L9J89N01j75k8j28l11K77J20o5l8l49J13L58j92
$$ y = [105, -15, 211, 46, -136, 192, 2, -143, -19, -187, 97, -42, 168, 109, 99, -272, -140, -177, 49, 10, -189, -113, -327, -584, -92, -23, -124, 265, -439, -104, -50, -126, -177, 199, -62, -128, 69, -1, 68, 69, 219, -7, -207, -240, -92, 57, 61, 342, -29, -182, -16, -5, 355, 6, 81, -55, -86, 396, -52, 278, -118, 254, -125, 124, -136, 145, 181, 71, 68, 59, 300, 248, 209, 99, 78, -130, -236, -231, 184, 39, 225, -101, -276, 81, 300, 248, -215, 267, -6, -74, 38, -169, 115, 98, -121, 153, 261, -221, 142, 34, -34, -143, -17, 165, 229, -31, 231, 88, -455, 1, -39, 22, -3, -11, -118, -358, 193, -79, -108, 219, -258, -301, -199, 263, 42, 217, 31, -183, 189, 166, 61, 107, -69, -82, -150, 159, 344, -239, -99, 24, -83, -203, -56, 128, 382, -123, 99, 66, -88, -40, -123, -11, -107, -151, -112, -101, 23, 33, 370, -201, -61, -152, 55, 12, 28, 47, -352, -232, -193, -4, 497, 322, 294, 166, -145, 132, 252, 187, 149, -200, -87, 271, 79]
6920G9Qq4J51k58k19M79n8k99L76j71o5O2N8K20j90k11k52L62l8L22p7j91O9o1
6944A2K15o1JM1k55J8K07k14j99O06n42L66l62J10O4R9L0j85J32k28J91J07l64
6967b11M92l80J26k41K4J81K85l04n6M10l04p8K55j95J44j10l78K65L31m76K55
6988C5o9j22j23K93j17N6J7j91L02j72l26N71j03k99r0M25l03L49j10k53L10j97
7010a17L15j48p9m8r5J94L0k10N27m56l0j13K12n7J92k20J22jj8l8j10J9K00K27
7034B98m07O6J46n05K86J58q5j64K76j36j18O3L12k98P4L46k31J10p3k10O6K03
7056A77l84M35j3k63j32K22j16J93k58r2KM17j99j68K94k21J5M5j08k7J03K84
7078B06j88L8k34J36j71n5L56l31J78K09j56K68j81J02j38j35K75Lm1j39N9l6
$$ y = [79, 87, 3, 154, -104, -323, 156, 98, -201, 175, 4, -61, 1, 59, 279, 89, -122, -374, -12, -50, 272, 195, 4, 73, 12, 227, 166, 167, 208, -47, -29, 178, -36, -235, 371, -171, 195, -167, -57, 7, 106, 136, -49, 83, -145, 46, 153, -211, 281, -99, 27, -214, -190, -9, 276, -28, -84, 326, 22, -56, 199, 4, 148, 38, -340, -75, 256, -220, 35, -34, -156, -279, 14, -103, -47, -30, -221, 81, -91, -417, 154, 51, -248, -338, 87, -216, 133, 23, -230, 80, -117, 198, 50, -29, -77, -172, 22, 52, -158, 369, -87, -117, -230, -18, -75, 117, -103, 19, 18, 0, -38, -148, -129, 71, 298, -109, -43, 103, -402, -116, 42, -43, -207, 69, -67, -185, -122, 190, -108, -34, 312, 81, 191, 118, -92, -26, 177, -207, 228, 215, -48, -180, 42, -74, 119, -139, -231, -229, 188, -11, -179, 115, -106, -91, -46, -154, -181, -78, 206, 18, 56, -178, -42, -213, -268, 88, -243, -65, 144, -12, 256, 75, 177, 39, -96, 179, 182, 141, 2, 61, 25]
7100B5lk87J79p5J19k1J88k04K4j1J85n3q8R3r3K18j76l6j12j5Q0n8J7M39j06
7125B29k7k47J65j69O3J12j53r4o8K76k53K91l92J93K18m45O7L88o6J4k07m5K26
7148G6P8l40K81n9k47K66J13k73J55J6q1J24l52K79qj6j0K99j74j55n3K67J44
7171C30n00L69N2k21O4N1j61K68j61L8k69J31j81J75J6K8Q3k87K02N6J13k07k19
7194b30K85P1k58Q3J67j85J26j91K43n6p3j27J60R2j45L46J01n07L73j21K1l91
7216b16L43J00m69k7M06n51L27L54k89J02q6j37K28j94K89k86j97M74k76J62m7
7237A0R9k09j02M06l40r8K74l22J82J01m1N8j8N05n01j19J04k39L80J7j21k28
7259b02J84J92m40K10J93k76L37q7k6j21j58N76j59j19J4j30O9m6K26l41Q2Q9
$$ y = [25, 22, -265, -86, -161, -42, -63, 125, -79, -55, -66, 119, 66, -22, 71, -22, 196, 20, -16, -128, -143, -63, -121, -104, 335, 229, 202, -45, 120, -49, 14, 126, -27, -121, -189, 87, -166, 125, -267, -74, 144, -301, -234, 154, 88, 102, -105, -150, 76, 154, -186, 95, 36, -211, 55, 168, -105, 50, 66, -15, 109, -243, 36, 28, 12, 2, 301, 127, -28, -81, 186, 330, -170, 199, 251, 30, 94, 145, -16, 252, 91, 129, -140, -9, -190, -15, 1, 29, 112, -175, 27, 83, 196, -11, -230, 55, 126, -132, -49, 118, -67, 59, -132, 111, 55, -18, -145, 15, 107, -38, 308, 409, -98, 275, 154, 175, -216, 127, 227, -242, -269, 137, -414, -87, 267, -22, 80, -6, -143, 85, -109, 180, -106, -303, 171, -105, 57, 10, 109, -100, -202, 204, -136, -234, 40, -282, -100, 1, -40, 18, 0, 505, 4, -115, -11, -250, 130, 147, 26, -202, -18, 174, -266, -56, 137, -139, 198, 111, 85, -36, -194, 382, 223, 104, 118, -12, 57, 11, 237, -104, -22, 67]
7281F7j6k1N00m69j29k88N25j89R6K19k96R6PJ3M2k85k45mM42j13L75j81j82L
7305c3J73l58K37K65j48k25k69O39l17k3k78N07k2n15K88J69%N6n36Q9O32l32
7327aJ99j96K46k62N9j67K1L3J64j36M7J8K91o97M78k58J13J91ok93m4K69j26
7350e7k83J24O1L18k05J64l86K95o7p6Q0J06j58N5j07J87K48l98j77K32p9j44
7372b67P59p87M11o1r5L61l58K82l84K4n9R8l46O73l14j1N38l43n9j51j02P1J75
7395E5R9m15j24M58K48j76k81K9r2J84p5J2R0k4L2J02j86k8l61L62L01n59M29
7418H0j80N1K71J23l77n9P7qJ23j79J44j41j01M6J39P2j70L24l68l6L18j0q6k59
7442b06K92N1o6j81J17N3j16J18J01k02J4q6q3J4J07J98j3l91K00J27K5j34J00
$$ y = [67, 51, 30, 530, 61, -68, -356, 169, -20, 76, 295, -1, 95, 102, 115, 157, -128, -373, -377, 65, -48, 327, 146, -36, -33, 140, -218, 19, 284, 136, -89, -358, 281, -36, -59, -337, 170, 148, -367, -79, 90, 90, 146, -390, -301, 331, -1, 198, 2, 248, -14, 45, -122, -101, -68, 96, -40, 7, 25, 316, -381, 97, -161, -48, 143, 137, -156, -200, 69, -57, -340, -216, -155, 163, -42, 122, -264, 31, -36, -112, -32, 74, -84, -29, -136, 51, 299, -99, -276, -44, -123, -267, 492, -295, 116, 55, -40, 321, -37, 245, -139, -115, -174, -76, -422, 251, -63, -74, 464, 121, 62, -89, -191, -120, 55, 154, -261, -385, 73, 321, 145, -136, -107, -199, -15, -90, -78, 12, -12, 20, 122, -64, -92, -453, -91, 210, -349, 80, -100, -49, 222, 345, -32, -91, -14, -22, 101, -78, 66, -75, -176, -130, 9, 81, -89, 235, -133, -169, 149, 139, 53, -206, 86, 137, 71, -110, 7, 60, -56, 62, 163, -39, -25, -111, -194, -180, -73, 125, 112, -279, -79, 48, 73, -61, 39]
7465C9j19K21k6o4K3L69j00N4k93pl63M34k44P4L9o1o8L01j62m8k4R5j37K32k11
7490d6jj25N2K65j27o8j03L45j56k85L08j86L6J03j95J52j7j30J14K19l08J11
7512d2J62r1j34k21M65k44L9j81J29K3j02j9Q7L83k76q4K92J23n20K66R3j38n4
7535d4L1J04Jj55k4N1K04j73K37n58K90J27J23l0j09j06J17L4l77J94o8n9K61
7558G1p4NK32j31k86JK11J35l41O6K29j83K35l19K56k53M12k81K17j18K60k16
7580A28l38K97qk18J85j07J00j87N3l9Q9M64p32L63k0P1K6lQ3j40K0M1M0J4k74
7605i2n1N2K8j53K61J92n37K62q5l9J41J44l28K32n5l5k60N78j01J00l23O0K03
7628A94l52K63p4q5m1K7L67j94m05J65J21p6n7J80K27p2j45J35j36j23j46O0J35
$$ y = [39, -80, 141, 115, 51, 74, 443, 343, 397, 104, 97, -266, 168, -76, -2, 37, -24, -92, 209, 47, -1, -25, 70, -67, 165, -46, -47, -172, -120, 145, 18, -50, -153, 192, 36, -249, 59, -127, -91, 12, -183, -31, -48, -178, -64, 155, -153, -42, 120, 29, -105, -326, 139, -105, -66, -247, -118, -95, -197, -216, -129, 254, -22, -106, 186, 309, -211, 55, 148, 10, -44, -13, 91, 92, -63, -87, -36, 168, -5, 232, -326, -36, 91, 214, 184, 75, -31, 86, 120, -257, -63, -131, -190, 71, -3, 2, 234, 103, -183, -182, 29, 164, -177, -111, 118, -65, 170, -149, 107, -146, 266, -15, 202, 84, 344, 128, -210, 87, 79, -139, 46, -61, 39, -148, -95, -134, -45, 419, -313, 50, 30, 101, 127, 124, 207, 67, 87, 128, 168, 182, -92, -143, -91, -63, -216, 45, 237, -300, -38, -123, -162, -21, 123, -205, 27, -28, -63, -323, 255, 154, 254, -69, -9, 194, -158, 105, 31, -54, -95, -68, 299, 105, -300, -135, -14, -90, -147, 33, 260, 188, 43, 178, 42, -81, -227, -167, -32]
7651c2j15j47O29j68K02M1m91J52j53P6k2o5L32k51J61l49K21l7K68n21J74K78
7673A83l55K01n2j80M1K92J14l6l44M64n81K98P2k30lK41k01J25J2K14l34j53
7695b12P6m9L89j65J52l1r8J0j29J2J1L07j62k10L30l19q7K44q3m8J30Q5k43J68
7719G8j43Q5j35K69k40K04j29Q2j31K69n6l65K41l4J52l25J21K02k47k88N9L11
7741b0K7p6K29k75J49Q0l8L2l9k73J38L01k55o0j8J19q3l0o7K1M9K64j0j54q6
7766g5Q5J20j6P8k18j15O5kj15L89r7l05j3J94k4Pk73J84J77r2NoJ7k51J68L09
7792A96k43Q4j04j45L51k71R4o5J9J05K01m66K77j40l8J50K08l51K01o3K25k03
7814B2L69k48L7m18O2N34k22j96K48l97L70O6j16k22Jj4J68J38k95L06l75K21
$$ y = [-32, -147, -294, 335, 167, 369, 410, -81, 71, -82, -6, -28, -93, 239, -12, 149, -200, 21, -16, 252, -269, -95, 183, -172, 29, -23, -203, -162, 130, 244, 208, -136, 328, -253, 45, 117, -113, -116, 125, -76, 49, 61, 275, -59, -212, -136, -185, 204, 39, 191, 160, 62, 72, -57, -45, -34, 273, 111, -99, 231, -88, -175, 69, -14, -62, 68, 153, -90, 78, -65, 20, -115, 154, -86, 118, -11, 71, -60, 209, 153, -212, 29, -5, 147, -178, -57, 145, -102, -390, -331, -20, 7, -69, 160, -115, 34, 114, 76, 108, 69, -204, -66, 235, -20, -80, -98, 21, -62, -92, -159, -138, -89, 175, 165, 11, -75, 10, 130, 114, 192, -26, -141, -76, -78, -193, 196, 99, -206, -219, -25, -49, -42, -315, -131, 46, -46, -41, -47, -30, -281, -113, 196, -47, 37, -67, -212, 139, -132, -38, -103, -84, 21, 222, -244, 33, -107, -145, 5, 213, -138, 63, 0, 225, 22, 391, 143, 180, -238, -176, 358, 136, -60, 188, -209, 161, 227, 111, -111, -110, -124, 44, 182, -113, 193, -182, 39]
7836C9j25K78k95K8Q2o2L60J22m56kN6j11J88k73N4K43l23N2J17K73k58L8nk68
7860b48K19j1J90p4k4Jpj96M22l33j89K37l1L30k72j26L23l48J83l38J26J23L1
7883a2k20J72j04J84K5r3NL7J28k47L56k73N7j94J34j83J25k8N19m04R1p5l3j24
7907a57k63M63o8l04K02j77J68Q1j80J69Q2J08q5LJ20r0l78J08L15k00K4L23j47
7930A17m36L02j0j01Qn5J04K61m8j22k98K86RR5p4q4p9M32k79q6q0R3n2J00M49
7955D52n49R1J51J06J05k93Jj44J53K37k99p3J55J39pl32K46k84K61k64K17O5
7977A34M0l7k84J17O4K2j31R2J01J48l47K51q1L7k13k7J43K33l59K36j47j72J82
8000BJ3K21p9j49r8L90l13k2o9j59K85j2q7J4O9j59J5L89k62J72j09o2j0J54j22
$$ y = [39, -86, 192, -103, -75, 7, -55, 305, 427, -29, -31, 25, -86, 102, -171, -117, 126, -197, -145, -28, 245, -13, 25, 20, -248, -29, -40, 150, 76, 52, 53, 46, -150, 272, -61, -250, -13, -44, 286, 14, -112, 211, -137, 46, -292, -166, -43, -12, -232, -60, -164, 20, 45, -48, -43, -6, 122, -125, 231, -42, 15, -179, -45, -228, -103, -131, 388, -16, 75, 0, -33, -157, -420, 43, -25, -329, -127, -304, -136, -55, -235, -66, 16, 124, 39, 42, 162, 72, -306, -198, 117, -83, -59, 264, 117, -319, -17, -27, -128, -120, -175, -71, 190, 142, 20, -278, 8, 17, 112, 38, -46, -125, 307, 28, -58, -138, -45, -97, 3, 452, -97, -6, 145, 251, 356, 63, 64, -80, 73, 310, 11, -62, 93, 232, 225, -107, 139, -145, 116, -148, 69, 134, 174, 137, -147, -30, 34, 56, -75, 17, 118, 266, -81, 170, 89, 126, -87, -114, 29, 262, -97, 139, -8, -180, 2, 15, 236, 157, 8, -90, 300, -13, -35, -104, -263, 22, 10, -77, -63, 6, -153, -138, 251, -11, 161, 52, -10, -20, 134, 12]
8025A2J21K4n04M03j71q0K35k16J07j47j27M89l62L42K71l51k08J33Ml9J90j21
8047EJ22j03k75K61j4l3J95J59l22J60n12K93N9n2PK30j5m99K91J44j40j08J36
8070a1K04n08M70j25R2M1k31m5K27j12l16N82k58J71m52n7L29J05N4k14L30r7
8092A79j22p7J66R4o07K21J11k59L30j9k66L34n32K55M13m8o7j22j36M55l05l91
8114c93N22o5k67L69j96R2k62L9M19J66n25J07k75J79K71j04R1r9M2j21Lr2P0
8137b9j20p8L49L1K4j5m24N39l81J15L08m48j35J63M88Om30m9o3J12L27J4n06
8160b02J26j92N63o66M19j1j48J8N7LL5lL56l69o3K42l39K76J22p7j28j09J74
8183H4j83Q8j69j97L26n2K16j0
$$ y = [12, 133, 157, -347, 56, -115, -195, 40, -176, -69, -216, -343, 146, -216, 126, 397, 46, -162, -29, -25, -64, 126, 5, 127, 24, -251, 10, -4, -37, 158, 317, -5, 155, -357, -64, -5, -57, -50, 180, 165, -334, -43, 101, -39, -147, -11, 193, -315, 155, 30, 122, 163, -68, -113, 114, 2, -314, 268, 10, 181, -271, -328, 1, 106, 160, -54, 276, 179, 57, -20, 146, 240, -367, -146, -35, -294, 36, 17, -249, 85, -447, -192, 221, 173, 106, -16, -152, 303, -2, -393, 129, 64, -203, 166, -30, 62, -200, -161, 258, 424, -101, 6, -269, -90, 181, 77, 168, 69, 111, -10, -7, -99, -29, -149, -227, 122, 153, 177, 162, -262, 277, -104, 11, 319, -129, -264, -101, 387, 393, -37, -86, -149, -37, 290, 304, -202, -76, -268, 295, -371, 48, 37, -111, -93, -36, -33, 2, -1, 355, -14, -77, 165, -174, 102, 224, 147, 19, -90, 84, -99, -11, -180, -377, -51, -103, 113, 103]
8191A03
$$ Imaginary data points
##PAGE= N=2
##DATA TABLE= (X++(I..I)), XYDATA
0@%%%%%%qJ6j6J6j6K4l2L2m0N6p1Q0r4J13j32J52j75K04k34K66l05L49l93M43
30B35n00N62o30P04p87Q79r76J082j202J331j470J628j804J999k214K456k731
47a438L042l398L816m310M902n630O549p755R410j1829J5721k3001M1139j64229
61a37011l26068L10044K34246j71800j95184J46598Q3993k04601j19419K51007
71a28195K21591j21511k10335L5913J33740J7190j6346Q9430N2563j13208j30936
82a70104O0371J62393M1843r4890n9189J4580j7881l7478P8095J32112l1266j74955
94i6369m5091J40983Q6453m6641O211P2195n5453j37507N1012K06380M8989j48675
106H2487p7531N8567J0363m7817N7164J05449n6607j73034m7115J05410O9794
$$ y = [0, 0, 0, 0, 0, 0, 0, -8, 8, -8, 8, -8, 16, -16, 16, -24, 32, -39, 41, -53, 60, -72, 80, -95, 109, -125, 141, -164, 185, -208, 235, -265, 297, -333, 371, -416, 463, -513, 569, -633, 698, -772, 856, -948, 1051, -1163, 1293, -1438, 1604, -1794, 2022, -2288, 2614, -3016, 3533, -4222, 5188, -6641, 9080, -13921, 27218, -137011, -463079, -153035, 81211, -90589, -285773, -139175, -55182, -259783, -379202, -128195, 93396, -28115, -238450, -202537, -68797, -51607, -67953, 21477, 74040, -39168, -170104, -109733, 52660, 94503, -387, -59576, -44996, -62877, -100355, -22260, 109852, 78586, -96369, -141460, -477, 85976, 39335, 45546, 117741, 62288, -75219, -24207, 182173, 231162, 82487, 4956, 63523, 73886, 26069, 83233, 188682, 132075, -40959, -88074, 17336, 87130]
117H7130k6296k6107j3875o3774o2276M8140J13238K7297q2147p5204j134K6377
129d8631K2917M6127M2856m4274j10398l0028R5582P9942k8829m7269N6k3956
141d5905n4774L7576J21377K0030j17637o9606N4007M7618q112K9297M8747n3976
153H642j07791J0743J19137N5405m6333l8875n073k5368j2973O4889Q1256j3530
165I0129r0563n4578K7282N6495L2874N431j2500m1120n9233j0423P9776Q2807
177A06377k7253r6452k9927L5202N679j757O1899L7931r4167j06565M7063J12168
189E0198K976n5468Q595O114p3129k7357J06068Q0430p0047q9812J5585L5783
201a0064j4504J9326O6670j1308j00790m0346O7554O0023p225j7846j0355l5953
$$ y = [87130, 60834, 34727, 20852, -42922, -105198, -57058, 56180, 83477, 1330, -73874, -75008, -48631, -25714, 20413, 63269, 18995, -91403, -121431, -25849, 54093, 25264, -22005, -21949, -45905, -100679, -63103, 58274, 78304, -39333, -108939, -54932, -7314, -15426, 13871, 62618, 8642, -99149, -88406, 30731, 86136, 39803, 928, -4145, -29513, -42486, 22403, 103659, 90129, -434, -55012, -27730, 28765, 61639, 67070, 54570, 13450, -45783, -56206, 23570, 106377, 79124, -17328, -47255, -12053, -6374, -8131, 53768, 91699, -2468, -109033, -61970, 50198, 53174, -2294, 6301, 12415, -60714, -88071, 17997, 98427, 28380, -61432, -45847, -10064, -24568, -5242, 61428, 50120, -50670, -91016, -23462, 36561, 29336, 11490, 1135, -34818]
213c4818l3080L0256O8278K4922m2760n9118j7935L0915L9207J7217K479j1138
225A4425m3244m3818L0551Q5586K3821o2407m1759J7830L757j4410M4285O0858
237G5475m0591r7907l228P7864K4647k9029Q214J3487n3176m6273N7086Q0319
249F6888j5909o4101j3010J7349m571Q359M6909J6659n4818n4565J4992N1164
261A5346K2730r817j6163j9449k6563n909M1122N2834o647o4361l6033K8781L3323
274I194J699J2577K1793l5817p1064R422Q9071L4170n3352l0992J7864j4580l1778
287d1793M4763P6285k3201r3186k0176N5490K2540j4552J7161J7395m9362n6050
299f4686K7865P2452J6309l9889l0622m300j477O860L0829L0881j4241n6498l3301
$$ y = [-34818, -67898, -37642, 30636, 55558, 12798, -46320, -64255, -33340, 5867, 23084, 25563, 14425, -28819, -72637, -42086, 43500, 67321, 4914, -36845, -19015, -15258, -29668, 14617, 75475, 34884, -63023, -66251, 11613, 36260, 7231, 15445, 28932, -24244, -70517, -13431, 66888, 50979, -13122, -26132, -8783, -13354, -4995, 41914, 58573, 3755, -50810, -35818, 15346, 38076, 28259, 12096, -7353, -33916, -39825, 1297, 54131, 47484, -16877, -52910, -24129, 9194, 10893, 23470, 45263, 9446, -61618, -52196, 36875, 71045, 17693, -13299, 4565, -10015, -41793, 2970, 79255, 56054, -37132, -57308, -1818, 20722, 6170, 23331, 40726, -8636, -64686, -36821, 35631, 51940, 12051, -18571, -22871, -24348, -17488, 13341, 44222, 29981, -26517, -59818]
312e9818L3587N4081N828k7438q979o943l2289k165O7079M6706n4020o8762J6428
325c6705M1592r440j031M9793K230q6260m0684P5728O4131l4449l7065K0786n695
338B931n2281J0804Q5015K5362p1934n1387K6595L0568m582Q358K6955j4074n6874
351c4544k2555M6811N4453m880m4016k0754R178J473k117L2137L4509l2177o9666
364e2148l102O5414K7355l1813r064J8024k9590m4425M0112P9534j1786p6549
376b8038j3104M0080j006j6795M0779L6288n4446o8100K6188O7214P044l0177
388E927o72L047l2544j8258M5675N3126j5826n8379k1919K6872K3562J79O427
401A7217J4192k1764n0551m777O3371M2086l7672m6850J0836J6165k1715N156
$$ y = [-59818, -26231, 27850, 33678, 6240, -2739, -9682, -41971, -44136, 22943, 69649, 15629, -53133, -36705, 4887, -4553, -5584, 44209, 46439, -39821, -80505, -4777, 59354, 24905, -12160, 8626, 2931, -49350, -38546, 46469, 71831, -103, -51490, -24895, 5673, 1091, 9449, 36404, 22330, -34544, -57099, -10288, 44165, 39285, -4731, -25485, -16307, -14834, -16951, 15186, 49695, 17518, -52148, -55250, 10164, 37519, 5706, -3358, 14666, -14924, -59349, -19237, 60297, 48511, -28038, -41142, -1062, -2068, -18863, 21916, 58204, 3758, -64342, -38154, 29060, 36104, 5927, 5255, 8302, -24242, -42500, 3175, 56301, 40475, -17904, -39823, -12951, 10611, 10790, 17217, 31409, 9645, -40906, -45683, 17688, 59774, 22102, -24748, -13912, 2253, -19462, -14306]
413a4306N8882J1031p5361m4441N2347M8504k1864j5664K4272j2952n6224L542
425d2234P2571K8074m9634l5731J3382O848q911K1748L6356j3784n4901k0142
437d6358L4113L4541K067j3808j0108j3366j6958N389L9530L0232k5825n1728
449c2279p205L5769J4714r344J2728J3288m0521m5863L4417O7743n569n1467m343
462a7932K0629k0252j5308M8827M1234m4982o0107J4973M4796Q41j1189J7081
474A8611l03m3042k0845L9280M2134q476l0718j3456j006J444J3795K3379P306
487B8103k3631l3145n583L0251K9237l824j9016p977p840j3508J5179M4136Q015
500D0397m6323k9156K2396J9643o843J0433K3568k2795n1722N389N5070J6730
$$ y = [-14306, 44576, 55607, -19754, -64195, -11848, 36656, 14792, -872, 23400, 10448, -45776, -42234, 30337, 58411, 8777, -26954, -13572, -6724, -15635, 6113, 42469, 28685, -26216, -46358, -12245, 22296, 24363, 10555, 447, -12919, -29877, -24488, 15042, 45274, 19449, -32279, -39484, -3715, 10999, 1655, 14383, 27671, -12850, -58713, -24296, 43447, 37878, -13589, -17932, 2697, -17555, -32863, 15964, 57198, 12216, -47891, -32918, 11878, 12719, 1530, 18611, 18308, -24734, -45579, -6299, 35835, 27359, -3359, -16815, -17821, -16377, -2582, 20797, 28103, 4472, -28673, -34256, -4005, 25232, 21408, 2392, -5585, -13425, -26933, -11754, 32382, 40397, -5926, -35082, -12686, 6957, 114, 10547, 34115, 11320, -40402, -35013, 20057, 36787]
512C6787l0126j0126R251j8152j8862L2323M3114j5383m7565r691K1381J0231
524C182L092J3467P56k7612k4335J0791L1683J7087j0102k3325j3092L193Q561
537f654J2794J7303R89l0844k7467J6630L4763M510j3844j057n750k5808k46M2431
551A7750K3485l1837l0079R779Q764q938J4249L1528j3536m9131q043L7796J7405
564A9192j3608q27N761k1862k2993K0573L8521J739k8367j7672K782O920Q546
577a295J2623O672j1633k4648j0823J9664L0370K047k3486j1778M849l204k334
590a2976K5157K1942k6172m0131Q663L4115J386j2653J2488L428l5283j7867L9921
603B018L2829k2586k7610R523M455j9134P837L9070L652m3052k0609K4739J8711
$$ y = [36787, 6661, -3465, 5786, -12366, -31228, 1095, 44209, 28826, -18739, -28430, -7049, 3182, 6274, 19741, 20497, -7115, -31450, -20659, 11024, 28111, 18009, -5316, -18408, -15215, -6654, 6140, 23443, 24432, -6412, -33879, -17249, 17514, 22024, 8180, 7123, 1373, -24435, -24681, 17750, 41235, 9398, -20681, -10902, -2138, -11076, 3173, 34701, 21165, -27966, -36009, 1787, 19192, 5584, 4757, 10518, -11344, -34337, -13764, 24757, 26496, -1871, -19543, -16761, -9841, -1295, 11328, 18000, 6367, -18281, -29104, -9440, 20930, 22977, -509, -12287, -7438, -10642, -12976, 12181, 34123, 7951, -32180, -23517, 10598, 11984, -669, 11819, 15247, -20036, -37903, 2018, 34847, 12261, -15349, -5826, -1371, -20505, -12668, 26402, 30054, -12998, -33607, -8868, 9843]
616I843o102J597R131j2641k5194J499K8816J9716j0714k2723q804Q390P525K168
630B507R237R943j6324l2575L262L9915J3850k7485j2766J5210n480k2929J6817
643f818M2310r240m9176o035L5146N591j8765J1868J9857k6162l4707K0497M1352
656B5718m189k7718K58R668j3039p495K5547K1741j8313l0592k73K0539R771l409
670H214o78J836j1154j7403O048L0214J2337k5602k3511J1361J4783j0309j462
683e326K4859K806m0345j8720L7694K8540k3840k0633J8434M296k9017j350M1733
696A9131J2805l8137k2022K2453J4650j1730P61J8531n894k9327o162K7108J9334
709B1501j0996j6841j084M469l643O1J5902J1474j7100k7250M293K7933N902j6130
$$ y = [9843, 3741, 5338, 14469, 1828, -23366, -21867, 6949, 26665, 15951, -6772, -15576, -7186, 339, 2507, 11744, 21687, 5363, -27212, -23950, 15965, 29815, 2330, -10436, 4774, -706, -23635, -6818, 35492, 26252, -22924, -28959, 6187, 11778, -6987, 4881, 24738, -1424, -36131, -15634, 25718, 21529, -6189, -5931, 3737, -9302, -16797, 8750, 30491, 12178, -18414, -18687, 1852, 11623, 8214, 7536, 9372, -1782, -19185, -13137, 17077, 29414, 3812, -19699, -8338, 6445, -3864, -5326, 19533, 22339, -18006, -36726, 968, 29508, 5668, -14965, 3469, 7765, -21252, -22602, 19131, 31936, -6201, -28223, -5770, 8880, -2850, -2089, 16442, 10548, -18779, -24941, 2167, 21501, 10505, -6336, -7420, -2951, -6594, -6533, 9369, 20843, 3743, -23507, -19214, 8719, 14621, -1509]
723a509o66R985j4833k0395K1182L5454j2776l7021K845K4603p456j6129K3366
736F650K1788l0278l3270K1636L4591r113k0403R330Q319k0431j0614K6478K1700
749B6383j6566k3498J676J2343K578j066N931K990j1015j5550K014K1502J3460
762B1182j4740j8874M685J0825o206l280J9578P064k8760j8857K4657K2240j5013
775D501j2366J5719j52k6544J519L5891P889l1244j2215J9683L302j4714R124
788C93K2463j0694l0124J672K4938O515j2044j076M141r921r713J1021J8162M13
802A6146j5875j1950K904J0895M404k234J293R34j2460j2346J3077K3902m051
815A4639k2296k962J1851l326o799J5606J3938j9227k2863J0911K0634l499q986
$$ y = [-1509, -2175, 7810, -7023, -27418, -6236, 29218, 16442, -20579, -17734, 6869, -587, -16716, 6650, 28438, -1840, -35110, -13474, 21117, 12004, -8399, 931, 9250, -11181, -21795, 4683, 26383, 9817, -13681, -12005, 338, 2916, 1850, 7781, 10771, -244, -15794, -13780, 7722, 21182, 6442, -12432, -7747, 3078, -3128, -6408, 13170, 20234, -8526, -27383, -2726, 19514, 4501, -7865, 7854, 7702, -18842, -17323, 18568, 26457, -4787, -17002, 2681, 5983, -8731, 393, 22856, 12162, -17962, -16290, 8648, 15163, 3119, 2043, 6184, -3737, -13450, -2429, 15733, 16146, 271, -11679, -8775, 2120, 6524, 4290, 5583, 6517, -5943, -18289, -5212, 18690, 14639, -7657, -10619, 1232, -2094, -8893, 6713, 20651, 1424, -21439, -10528, 10106, 6607, -2379]
828b379P869J543j8848n856K2436J3783j4131j2649L862J853m465N861J3078k715
842I242j6956o806Q696R462K359k703l609m317m601l34J0403J2356m769j8808
856a0385n147J3751O667o619L216Q861j1059j9482Q285K5603m10j8775q49R975
870C632q950q825J8049J6278j6049k0449P940J3379m430l082J0807m21j7484n076
884a4681J5805Q960o396m613K72m129k766P229Q747j126q782o431m2Q061Q278
899H386j893p247o88l59n886L685J6923L151k0873j0808J5498Q551r738J127J5316
914A5145p455k5984K924K9556M679k1235k996J2523q072j4783J5380K3215j0598
927A2299k4507J590J4332j052m026Q700M519j4328j1563Q555J3896J694o217m822
$$ y = [-2379, 5490, 7033, -11815, -17671, 4765, 18548, 4417, -8232, -4370, -2517, -6982, -1121, 11957, 9242, -7714, -14520, -5824, 3638, 5997, 3294, -315, -4632, -9233, -9567, 836, 13192, 8423, -10385, -15532, -1781, 4886, -1733, 1483, 10344, -715, -20197, -11912, 13691, 13281, -5494, -6343, 3632, -5318, -14143, 3906, 20184, 4135, -16314, -8374, 5005, 575, -2507, 8300, 7879, -9605, -14681, 1124, 10084, 3688, -925, -653, -4782, -7548, -319, 8428, 7302, -1480, -7911, -7953, 108, 8386, 6493, -754, -1442, -1801, -7687, -4002, 12921, 16072, -4801, -15609, -111, 8440, -1298, -171, 15145, 7690, -18294, -15370, 14186, 18865, -2370, -5366, 7157, -915, -15698, -318, 22897, 12299, -12208, -10618, 3714, 2662, -1364, 7336, 11855, -2473, -14036, -5481, 8415, 10109, 3892, -930]
941i30k412j006J534M993P752j046j2572r758R263J4377l339q395L702K149j3322
956i010m082K1604J2066j9758j6885J2203J0547j0930j561J9413O05k7066q306
969b1160K3528J3507j4178o954R408k374j5433L225K0686N686j6804j2056N645
982g274Q071k96j013N227J100j0867j0115Q340J7295l12j5153m224R839j157r357
997i896Q352J6177r559k2361M683K1764j371j5568N530J1271j2731j4922J6889
1010a742K0626j2608k0341P051J2587p619o032J4455P302j7529j3509J1096J4976
1023H713j223q266q56J152m377l524P406J2624r66j5990r232R962J2710m070o109
1038b046P192J920j6860o958K2509J4752j7164j5827J1639Q427j3423j589K1697
$$ y = [-930, -3342, -4348, -2814, 2179, 9931, 8885, -3687, -13445, -4182, 10195, 6856, -1539, 2163, 4312, -9010, -13092, 8512, 20578, 820, -16065, -3862, 6685, -4245, -5806, 13607, 14212, -12854, -21160, 2368, 15875, 1697, -5257, 4151, 1777, -13656, -10431, 10255, 15941, -863, -12919, -7274, 797, 501, -512, 4715, 5815, -5052, -15167, -6827, 10468, 10156, -4997, -9221, 618, -539, -9896, -1544, 14633, 5074, -17287, -12604, 9160, 7789, -7779, -2249, 9022, -3709, -18631, -1742, 18884, 6276, -14065, -7014, 5573, -2046, -8078, 6377, 13679, -3850, -17359, -6263, 8713, 7490, -776, -1632, -480, -4857, -8381, -975, 11649, 10683, -5307, -14539, -4577, 8133, 4063, -2046, 5146, 7066, -9794, -16752, 5757, 20509, 3345, -12482, -843, 7584, -5839, -7428, 14269]
1051A4269L231k5745q929K0899R297j2948k153J1609n813j6555N140K0465J660
1064A4427j6084n066N949N36k422O153P764n453j2787l821Q866J0439L10p465
1078A346l868J594k635l420J0088J2956q111j9936O06J6681J696r830N456R860
1092A2483j3678j7087J3005K1477o062j6957L002Q447q362n992J4601R910j3984
1105H03j3465O395J0212j492k958L903j598q562k199Q685P061j604p206m923J159
1120e789M892K166Q05J974l089r634j878J2622Q681q404q118M378O80q198M890
1135d022J6111j788j8964m323J3550L671p452M137Q473j0068j4846O769J7615
1148H863p07j1027l59K595n264j937J0403P273p411r332l69M183M227M262p18
$$ y = [14269, 17500, -8245, -17174, 3725, 13022, 74, -2079, 9530, 3717, -12838, -7698, 12767, 14427, -1657, -6723, -774, -238, -2660, 3493, 11257, 5804, -6983, -10804, -1938, 8501, 8811, 1346, -2522, -928, -3563, -6983, 3105, 16061, 7950, -11986, -11380, 5301, 6997, -2833, 2623, 12483, -1195, -18282, -5277, 16200, 10138, -6819, -3817, 4630, -3732, -9724, 4877, 14787, 803, -12662, -6267, 3945, 2453, -505, 3398, 1800, -6762, -8961, -276, 6785, 5181, -2025, -6948, -5789, -897, 1269, 2074, 4048, 959, -8675, -10553, 2069, 10750, 2346, -5772, -1394, -714, -8912, -4022, 12089, 10301, -8663, -12986, 564, 4235, -3217, 920, 9393, -675, -15521, -8752, 8863, 8156, -2871, -3230, -635, -5899, -7836, 2567, 9840, 2429, -6903, -7272, -3089, 1138, 5400, 4682]
1163D682n362m134m70K155N871O991m213j1032k765Q106L902j270L621J324j2090
1178d684q131J1766J2614m571q048K589j743r535L441J8085K795j7302p480R153
1192a051K414n069O872J0254r267j6796L254J4546K792m986r4m62p897k555R528
1207A483R041k437p403n392n35M891N880R48k121l230n040l643O669J1244j147
1222I208j1852l281M751k73r52Q212N339j2894j2510Q857J2136l453m549N420
1236D159j430j4104q82J8207P257j2978q159N576Q36m994N985J1514l660j4880
1250g553m083R428O876n84k166j154l572m538J171Q872P182m760j2639l261R238
1265a543N381l819O35N057p323j2916N676J8220J140j5164k622P401l494n675
$$ y = [4682, -680, -4814, -5284, -3129, 2742, 9733, 5520, -5512, -8277, -171, 3731, 2461, 6082, 7406, -4684, -12815, -1049, 11565, 6994, -1054, 1535, -208, -9743, -6302, 11783, 14578, -2724, -10204, -1051, 1363, -3706, 3166, 13420, 4153, -12643, -9389, 5157, 7949, 2963, 2869, 2407, -5490, -8045, 1483, 10524, 8087, 684, -4708, -5243, -352, 5528, 6476, 4355, 1125, -3915, -7558, -889, 10355, 9208, -2644, -5925, -1174, -1447, -2399, 5813, 11152, -1742, -14252, -5395, 6741, 3288, -1261, 4159, 2729, -11375, -12257, 5950, 13207, 229, -7930, -2354, -1518, -6512, -527, 10987, 7327, -7553, -11636, -2208, 4668, 4084, 1918, 764, -2808, -7346, -6175, 2697, 9879, 5119, -7520, -10781, -1543, 3838, 19, 654, 5711, -1612, -14528, -8852, 9368, 10508, -4656, -7278, 123, -3371, -9046]
1279i046J1266J2060j1641j6599N279J3136j602m459O340J510j3432n910J3095
1292cJ1757n168q738j009P67j498K475P963K680p081r866j137R266Q098k982n959
1308d35J86k01o435N42J5226O367j6847j1730J0596R659o771k489J1635n58j9177
1323a0432l499K0121Q865j3982o380Q321j657r771O173J5706k160j6577m031R788
1337D85L251k061K367K673o310q131J982R437N185l634p570l226K829K432J043
1352G52L334L138p851j1089M878J3822R23j0046k19N530o601p633J1289J4390
1366A4617r340j7201M223J2532l355o152R299M930j3947j0193J1729J2724m718
1379E148q415J360J530m986n86R104N542o725r369j165P081N062o59k401n41k379
$$ y = [-9046, 2220, 14280, 2639, -13960, -8681, 4455, 2853, -1606, 4734, 6244, -7188, -13098, -3, 11754, 6586, -2152, -3161, -2394, -3892, -1417, 6546, 9226, 2145, -7721, -8858, 408, 8506, 5524, -435, -249, -450, -6885, -6343, 8883, 15250, -1597, -13327, -2731, 6928, 157, -2332, 9303, 8745, -10432, -13931, 6190, 15055, 1073, -5307, 3014, 1357, -8414, -2241, 13465, 11305, -5272, -9303, 485, 3736, 1675, 4042, 6715, 405, -7726, -5744, 3693, 8878, 5244, -2326, -5552, -2723, -291, 752, 4086, 7224, -627, -11716, -6838, 6984, 7907, -2139, -2358, 3172, -3429, -11062, 227, 14617, 5277, -11924, -7701, 4831, 1476, -4676, 4623, 9553, -4394, -14587, -2858, 9866, 5148, -3267, -1907, -377, -5363, -5949, 3155, 8697, 1972, -7397, -8562, -1481, 3581, 2922, 521, -20, -2399]
1395b399n094J293J0557N108r600q573M241N291l013R59Q802k334j4476k475J4605
1410B892N658q422k591N672m267q685O828J3619k649j2904j675O591O7j557N473
1425D050L529p711p974L012Q134L407k144m596k858m4J751K245L671K813n851
1440A434r286J244J1121L372o403j334K887n813n501R214J1635o601j1954K024
1454c961O177l073o79R299J467j3140o330R888P312m089j386L143n084q084M700
1469c840J1348O94q354k588P57j183J094P047K549o419o084p72L428N232L581
1484F490k918p187j360K232N02L627N600k307j1252l487R219N602l332o08K648
1499C469o827p636O713J2595j703j0208j029L181k989m47J0062L871j0378q199
$$ y = [-2399, -7493, -6200, 4357, 9465, -135, -8708, -4467, 824, -2189, -1230, 7572, 5238, -9238, -11713, 2892, 8550, 128, -2463, 3209, -1058, -9743, -2915, 10704, 8055, -4849, -6524, 67, 134, -1423, 4050, 7579, -132, -8106, -5094, 3040, 6447, 4303, -293, -3151, -3195, -1444, 801, 4472, 7285, 1434, -7852, -6608, 4513, 7885, 1482, 148, 3035, -2778, -8279, 935, 12570, 5969, -5985, -3961, 2216, -857, -1536, 7763, 9230, -3910, -10240, -352, 6960, 2871, 1485, 4628, -456, -8540, -3840, 7508, 8202, -152, -2740, -1983, -3166, -2072, 4975, 7524, 1105, -4979, -5751, -2323, 2909, 6490, 3572, -3615, -4975, -2743, -2241, 1386, 6986, 4679, -6573, -10060, -841, 4761, 1429, 821, 3469, -3358, -10994, -4281, 8314, 6611, -3597, -4626, -1445, -4434, -4881, 5181, 9052, -1326, -9525]
1513i525M940N582p49J674L244n003r182J774R313L714l382k911k687k262Q50
1528d610N365M227n65n438o058K39P373N255k727l817j60k125l725M937J0406
1543H577q96j1808l830P586K147l165M543N299p809j1078N289J2030K34o764J69
1558E24J130n879q26R387N531o323p728L66K584J705L076K402k673o270k304L322
1574a976O404K851l476o596j199K772J109J686N430k05j0644n876R195R189m806
1589C858m406L892j033j0592J741J5311L842j3708o718P819K154n508M035R887
1603A0574n538j3989J57J1222L542m558p41L96m749l240M914P644N8n939n574
1618e821n43M282M424M62j442j008m089m218M424J0377Pj0110k993M847J42l104
$$ y = [-9525, -4585, 997, 248, 1922, 5166, 163, -9019, -7245, 2068, 5782, 2400, -511, -3198, -5460, -4610, 755, 4982, 4417, -1021, -7079, -6840, 533, 5788, 3061, -756, -916, -3041, -6766, -1829, 8577, 7681, -4127, -7957, -371, 1776, -1389, 3154, 8453, 644, -10434, -5145, 6885, 7119, 355, 524, 1654, -4225, -5051, 4336, 9867, 3544, -4184, -3818, -1234, 471, 3547, 5949, 3276, -2994, -5298, -1976, 4428, 7279, 3803, -2793, -3992, -1220, -111, 1575, 7005, 6800, -3844, -9720, -525, 8664, 3858, -548, 3344, 2311, -8281, -6540, 8771, 12613, -1095, -7813, 6, 2160, -3348, 687, 10574, 5036, -8953, -8796, 2426, 5968, 1410, 669, 1065, -3684, -6924, -2010, 5634, 5692, -247, -5821, -6364, -2082, 2342, 2804, 1362, 354, -3735, -7953, -3529, 6848, 6855, -3255, -6248, -1401, -1259, -4363]
1634d363P199O944r454j2445N425J2012j704o361L844K791j0527n170J2602R856
1648A0649q436r113K589L555l175Q79Q006J047r140o635M642P277J809k290k800
1663a136r68j339r47L704O917J89r171n572O384O658k426k089L652j380r238j97
1679f959J2859M467r725n353N145K52m184M087R068m064j2201n69R235K267l121
1694A204J643Q83o006m926N468Q376K89n928l690o82K086K409K474K223k187n832
1710b196m450M909R311k7p160k046K593k134k459P810P413q092j1815L291R509
1725D457j244l901M687J090r926m540R716Q422n545o124J726j90l802L204Q103
1740F133n03q126l986K855L131J981K444j262n189l179K249L318M255P14m784
$$ y = [-4363, 2836, 9780, 326, -12119, -6694, 5318, 3614, -2747, 1097, 3888, -6639, -11809, 793, 10649, 2213, -6900, -4311, -756, -3931, -3052, 4954, 6001, -3139, -9774, -5132, 2145, 3954, 1664, -1136, -2104, -3443, -4390, -686, 6231, 6420, -2751, -8323, -1939, 4719, 2293, 204, 3856, 2476, -6762, -6959, 5900, 10367, 642, -4711, 434, 686, -3498, 589, 9657, 5593, -6608, -7177, 2058, 4325, 1204, 2847, 3730, -2276, -7202, -1734, 6642, 6931, 1003, -2687, -3369, -1283, 1126, 3600, 5823, 3636, -2196, -6646, -1737, 7574, 7547, 387, -1659, 934, -1200, -3659, 4151, 11564, 3472, -8343, -5052, 4457, 3213, -688, 3999, 5089, -4837, -9377, 339, 8761, 3216, -2908, -1182, -1372, -5174, -1970, 6133, 5630, -2496, -6482, -3627, -496, 1485, 3929, 2667, -2522, -5701, -3452, -134, 4121, 4835, 51]
1755E1n763N44N065J583J97K063l174p705n27R704M533n986l788K658j968n103
1771g616N353R963l227j1364l81O435K67j688M661K340q058o106N827P273n69
1786C110l096o2k095l465K952O579P53l824l316j477Q52L971M176j748l891k178
$$ y = [51, -5712, -5168, -103, 1480, 1677, 3740, 566, -7139, -7666, 2038, 6571, 585, -3203, -545, -2513, -7616, -2263, 7700, 4473, -6891, -7272, -837, -570, -2258, 2403, 4743, -3315, -9421, -3594, 3679, 3110, 14, -48, -2143, -5608, -2656, 3923, 4676, 852, -2464, -3941, -3089, 882, 5058, 3310, -581, -2759]
$$ [...]
8191B92
##END NTUPLES=NMR FID
##END=
