##TITLE=1H_SAM_22.BBSX1_THF 1.3
 CDCl3, 8 sc, 
 6.5.2019
##JCAMPDX= 6.0         $$ Bruker NMR JCAMP-DX V2.0
##DATA TYPE= NMR FID
##DATA CLASS= NTUPLES
##ORIGIN= UXNMR, Bruker Analytische Messtechnik GmbH
##OWNER= root
$$ XWIN-NMR		Version 3.5
$$ Mon May  6 14:47:41 2019 Russian Standard Time (UT+4h)  she@DPX200
##.OBSERVE FREQUENCY= 200.1315
##.OBSERVE NUCLEUS= ^1H
##.DELAY= (6, 6)
##.ACQUISITION MODE= SIMULTANEOUS
##.ACQUISITION SCHEME= undefined
##.AVERAGES= 8
##.DIGITISER RES= 18
##SPECTROMETER/DATA SYSTEM= spect
##.PULSE SEQUENCE= zg30
##.SOLVENT NAME= CDCl3
##.SHIFT REFERENCE= (INTERNAL, CDCl3, 0, 15.7039)
##AUDIT TRAIL= $$ (NUMBER, WHEN, WHO, WHERE, WHAT)
$$ ##TITLE= Audit trail, XWIN-NMR		Version 3.5
$$ ##JCAMPDX= 5.01
$$ ##ORIGIN= Bruker BioSpin GmbH
$$ ##OWNER= she
$$ F:/spectra/data/she/nmr/H-F/1/audita.txt
$$ ##AUDIT TRAIL=  $$ (NUMBER, WHEN, WHO, WHERE, WHAT)
(   1,<2019-05-06 14:46:24.92 +0400>,<she>,<DPX200>,
      <created by zg, POWCHK disabled, PULCHK disabled
       configuration hash MD5:
       00 E9 B6 7A A2 85 ED C7 34 08 36 98 17 FE 4E 26
       data hash MD5: 16K
       EB 3F CE 5F 95 31 EC D6 21 2F B7 FD 89 15 D0 6F>)
$$ ##END=
$$ 
$$ hash MD5
$$ 29 63 E4 98 90 24 70 89 09 9B 0C D7 9F 52 E7 1D
##$RELAX= 
##$RELAX= 
##$RELAX= 
##$RELAX= 
##$RELAX= 
##$RELAX= 
$$ Bruker specific parameters
$$ --------------------------
##$DU= <F:/spectra>
##$EXPNO= 1
##$NAME= <H-F>
##$PROCNO= 1
##$TYPE= <nmr>
##$USER= <she>
##$AMP= (0..31)
100 100 100 100 100 100 100 100 100 100 100 100 100 100 100 100 100 100 
100 100 100 100 100 100 100 100 100 100 100 100 100 100 
##$AQSEQ= 0
##$AQ_mod= 1
##$AUNM= <au_zg>
##$AUTOPOS= <>
##$BF1= 200.13
##$BF2= 200.13
##$BF3= 200.13
##$BF4= 200.13
##$BF5= 200.13
##$BF6= 200.13
##$BF7= 200.13
##$BF8= 200.13
##$BYTORDA= 1
##$CFDGTYP= 0
##$CFRGTYP= 5
##$CHEMSTR= <none>
##$CNST= (0..31)
1 1 145 1 1 1 1 1 1 1 1 1 1 1 1 1 1 1 1 1 1 1 1 1 1 1 1 1 1 1 1 1 
##$CPDPRG= <>
##$CPDPRG1= <>
##$CPDPRG2= <>
##$CPDPRG3= <>
##$CPDPRG4= <mlev>
##$CPDPRG5= <mlev>
##$CPDPRG6= <mlev>
##$CPDPRG7= <mlev>
##$CPDPRG8= <mlev>
##$CPDPRGB= <>
##$CPDPRGT= <>
##$D= (0..31)
0 1.2 0 0 0 0 0 0 0 0 0 0.03 0 0 0 0 0 0 0 0 0 0 0 0 0 0 0 0 0 0 0 0 
##$DATE= 1557139584
##$DBL= (0..7)
120 120 120 120 120 120 120 120 
##$DBP= (0..7)
150 150 150 150 150 150 150 150 
##$DBP07= 0
##$DBPNAM0= <>
##$DBPNAM1= <>
##$DBPNAM2= <>
##$DBPNAM3= <>
##$DBPNAM4= <>
##$DBPNAM5= <>
##$DBPNAM6= <>
##$DBPNAM7= <>
##$DBPOAL= (0..7)
0.5 0.5 0.5 0.5 0.5 0.5 0.5 0.5 
##$DBPOFFS= (0..7)
0 0 0 0 0 0 0 0 
##$DE= 6
##$DECBNUC= <off>
##$DECIM= 24
##$DECNUC= <off>
##$DECSTAT= 4
##$DIGMOD= 1
##$DIGTYP= 9
##$DL= (0..7)
0 120 120 120 120 120 120 120 
##$DP= (0..7)
150 150 150 150 150 150 150 150 
##$DP07= 0
##$DPNAME0= <>
##$DPNAME1= <>
##$DPNAME2= <>
##$DPNAME3= <>
##$DPNAME4= <>
##$DPNAME5= <>
##$DPNAME6= <>
##$DPNAME7= <>
##$DPOAL= (0..7)
0.5 0.5 0.5 0.5 0.5 0.5 0.5 0.5 
##$DPOFFS= (0..7)
0 0 0 0 0 0 0 0 
##$DQDMODE= 0
##$DR= 18
##$DS= 0
##$DSLIST= <SSSSSSSSSSSSSSS>
$$ [...]
##$SUBNAM2= <"">
##$SUBNAM3= <"">
##$SUBNAM4= <"">
##$SUBNAM5= <"">
##$SUBNAM6= <"">
##$SUBNAM7= <"">
##$SUBNAM8= <"">
##$SUBNAM9= <"">
##$SW= 24.9337058887773
##$SWIBOX= (0..15)
0 0 2 0 0 0 0 0 0 0 0 0 0 0 0 0 
##$SW_h= 4990.01996007984
##$TD= 16384
##$TD0= 1
##$TE= 0
##$TE2= 300
##$TE3= 300
##$TEG= 300
##$TL= (0..7)
0 120 120 120 120 120 120 120 
##$TP= (0..7)
150 150 150 150 150 150 150 150 
##$TP07= 0
##$TPNAME0= <>
##$TPNAME1= <>
##$TPNAME2= <>
##$TPNAME3= <>
##$TPNAME4= <>
##$TPNAME5= <>
##$TPNAME6= <>
##$TPNAME7= <>
##$TPOAL= (0..7)
0.5 0.5 0.5 0.5 0.5 0.5 0.5 0.5 
##$TPOFFS= (0..7)
0 0 0 0 0 0 0 0 
##$TUNHIN= 0
##$TUNHOUT= 0
##$TUNXOUT= 0
##$USERA1= <user>
##$USERA2= <user>
##$USERA3= <user>
##$USERA4= <user>
##$USERA5= <user>
##$V9= 5
##$VALIST= <valist>
##$VCLIST= <CCCCCCCCCCCCCCC>
##$VD= 0
##$VDLIST= <DDDDDDDDDDDDDDD>
##$VPLIST= <PPPPPPPPPPPPPPP>
##$VTLIST= <TTTTTTTTTTTTTTT>
##$WBST= 1024
##$WBSW= 4
##$XGAIN= (0..3)
0 0 0 0 
##$XL= 0
##$YL= 0
##$YMAX_a= 192802
##$YMIN_a= -228485
##$ZGOPTNS= <>
##$ZL1= 120
##$ZL2= 120
##$ZL3= 120
##$ZL4= 120
##$ABSF1= 10
##$ABSF2= 0
##$ABSG= 5
##$ABSL= 3
##$ALPHA= 0
##$AQORDER= 0
##$ASSFAC= 0
##$ASSFACI= 0
##$ASSFACX= 0
##$ASSWID= 0
##$AUNMP= <proc_1d>
##$AZFE= 0.1
##$AZFW= 0.1
##$BCFW= 1
##$BC_mod= 2
##$BYTORDP= 1
##$COROFFS= 0
##$CY= 11.3945322036743
##$DATMOD= 1
##$DC= 2
##$DFILT= <>
##$DTYPP= 0
##$F1P= 18.9103706918063
##$F2P= -1.10871071338519
##$FCOR= 0.5
##$FTSIZE= 0
##$FT_mod= 4
##$GAMMA= 1
##$GB= 0.15
##$INTBC= 1
##$INTSCL= 1
##$ISEN= 128
##$LB= 0.24
##$LEV0= 0
##$LPBIN= 0
##$MAXI= 10000
##$MC2= 0
##$MEAN= 0
##$ME_mod= 0
##$MI= 1.114404
##$NCOEF= 0
##$NC_proc= 0
##$NLEV= 6
##$NOISF1= 3.799351
##$NOISF2= 2.8
##$NSP= 1
##$NTH_PI= 0
##$NZP= 0
##$OFFSET= 15.70392
##$PC= 1
##$PHC0= -8856.774
##$PHC1= 18.20026
##$PH_mod= 1
##$PKNL= yes
##$PPARMOD= 0
##$PSCAL= 0
##$PSIGN= 0
##$REVERSE= no
##$SF= 200.130013532006
##$SI= 16384
##$SIGF1= 3
##$SIGF2= 2
##$SINO= 400
##$SIOLD= 16384
##$SREGLST= <1H.CDCl3>
##$SSB= 0
##$STSI= 0
##$STSR= 0
##$SW_p= 3612.71676300578
##$SYMM= 0
##$S_DEV= 0
##$TDeff= 0
##$TDoff= 0
##$TI= <>
##$TILT= no
##$TM1= 0
##$TM2= 0
##$TOPLEV= 0
##$USERP1= <user>
##$USERP2= <user>
##$USERP3= <user>
##$USERP4= <user>
##$USERP5= <user>
##$WDW= 1
##$XDIM= 8192
##$YMAX_p= 0
##$YMIN_p= 0
$$ End of Bruker specific parameters
$$ ---------------------------------
##NTUPLES= NMR FID
##VAR_NAME=  TIME,          FID/REAL,        FID/IMAG
##SYMBOL=    X,             R,               I
##VAR_TYPE=  INDEPENDENT,   DEPENDENT,       DEPENDENT
##VAR_FORM=  AFFN,          ASDF,            ASDF
##VAR_DIM=   8192,          8192,            8192
##UNITS=     SECONDS,       ARBITRARY UNITS, ARBITRARY UNITS
##FACTOR=    0.0002004,     1,               1
##FIRST=     0,             0,               0
##LAST=      1.6414764,     0,               0
##MIN=       0,             -228485,         0
##MAX=       1.6414764,     192802,          0
$$ Real data points
##PAGE= N=1
##DATA TABLE= (X++(R..R)), XYDATA
$$ [...]
2284A541K57k478m51K449Q91k601n70K051Q33k238j033K237J457k483j231J939
$$ 1541 1798 -680 -1131 1318 2209 -392 -962 1089 1922 -316 -1349 888 2345 -138 -1369 570
2300E70J494k346j318K513J295k494j564K433J438k176j894K172K288k751j919
$$ 570 2064 -282 -1600 913 2208 -286 -1850 583 2021 -155 -2049 123 2411 -340 -2259
2315b259K636J491k401j737K599J443k372j678K235J745k252j669J879K273k373
$$ -2259 377 1868 -533 -2270 329 1772 -600 -2278 -43 1702 -550 -2219 -340 1933 -440
2330d40k166K703J571k150k114K629J536k574j405K302J593k050j943K165J887
$$ -440 -2606 97 1668 -482 -2596 33 1569 -1005 -2410 -108 1485 -565 -2508 -343 1544
2345A544k173j599J790J821j445j969J507J465j471j636J671K032j635j790J169
$$ 1544 -629 -2228 -438 1383 -62 -2031 -524 941 -530 -2166 -495 1537 -98 -1888 -719
2360g19K118j254j730Q61K108r65k431J110K440j126k330P42K527n96k411N74
$$ -719 1399 145 -1585 -724 1384 419 -2012 -902 1538 412 -1918 -1176 1351 755 -1656 -1082
2376a082K545l76k468N75K523r06k388Q09K744j021k363K63L105o61k539M79K886
$$ -1082 1463 1087 -1381 -806 1717 811 -1577 -768 1976 955 -1408 -1145 1960 1299 -1240 -761 2125
2393B125m24l112Q54K301j55k895R02K247l08k782O85K581q32k069L71K121K44
$$ 2125 1701 -1411 -557 1744 1589 -1306 -404 1843 1535 -1247 -562 2019 1187 -882 -511 1610 1854
2410A854k721K73K480k17k220J00K057J38k111l09K074K63j998l51J926M74k245
$$ 1854 -867 -594 1886 1669 -551 -451 1606 1744 -367 -676 1398 1661 -337 -688 1238 1712 -533
2427e33m87K158N25k167p53K026N72j819r21K463Q01k428j139K314R60j880j241
$$ -533 -1020 1138 1663 -504 -1257 769 1341 -478 -1399 1064 1865 -563 -1702 612 1572 -308 -1549
2444a549K131J171k629r50K071J216k458j005K328J474k471j400K433J281k209
$$ -1549 582 1753 -876 -1826 245 1461 -997 -2002 326 1800 -671 -2071 362 1643 -566
2459e66j428K060J344k192j331K225J324k122j499K272J214k160j040K125O69
$$ -566 -1994 66 1410 -782 -2113 112 1436 -686 -2185 87 1301 -859 -1899 226 895
2474H95j896j071J852J295j576j593J839J496j791j514J629J400j471j149J441
$$ 895 -1001 -2072 -220 1075 -501 -2094 -255 1241 -550 -2064 -435 965 -506 -1655 -214
2489b14J580j449j818J477J277j194j104J134J487r75j691J142J840j025j608
$$ -214 1366 -83 -1901 -424 853 -341 -1445 -311 1176 201 -1490 -348 1492 467 -1141
2504a141N21K137p43k504J318J726o43k162Q26K459r32k287J197J887q35k095
$$ -1141 -620 1517 774 -1730 -412 1314 671 -1491 -665 1794 862 -1425 -228 1659 824 -1271
2520a271O85K376p92k332Q24K271o15k414J056K062p91j841K29K693j171k034
$$ -1271 -586 1790 998 -1334 -510 1761 1146 -1268 -212 1850 1059 -782 -553 2140 969 -1065
2536a065R42J709m32k011O93J817l04j980L94J807j50k171L30J819j84j978J45
$$ -1065 -123 1586 1154 -857 -164 1653 1349 -631 -237 1570 1420 -751 -421 1398 1214 -764 -619
2553f19J847j41j907L86J521O1j638k04J793J55j916p5J924R1j974m85K158N11
$$ -619 1228 1087 -820 -434 1087 1148 -490 -694 1099 1254 -662 -737 1187 1278 -696 -1181 977 1488
2571A488k370l41J678P13j810p77K185L25k095p41K415P42k214o17J815Q99k558
$$ 1488 -882 -1223 455 1168 -642 -1419 766 1091 -1004 -1745 670 1412 -802 -1419 396 1295 -1263
2588a263n88K141Q88k034r91J938Q89j993r41K105O92j666j087J800J093j885
$$ -1263 -1851 290 1178 -856 -1847 91 980 -1013 -1954 151 843 -823 -1910 -110 983 -902
2604i02j016K084R87k150q58K018N00j490o47J298J289j722r39J483J116j628
$$ -902 -1918 166 1153 -997 -1855 163 663 -827 -1474 -176 1113 -609 -1548 -65 1051 -577
2620e77j141J452J576j757q62J401J109j163j225R59J370j129j303J080J419r36
$$ -577 -1718 -266 1310 -447 -1309 92 1201 38 -1187 -228 1142 13 -1290 -210 1209 273
2636B73j384J102J429j220j644R48K081j161j399O63J668o28j998J377J641j210
$$ 273 -1111 -9 1420 200 -1444 -496 1585 424 -975 -312 1356 728 -1270 107 1748 538
2652E38j730J357J799j096k031J106J514l77j724N68J726r37j492O28J493m69
$$ 538 -1192 165 1964 868 -1163 -57 1457 1080 -644 -76 1650 713 -779 -151 1342 873
2668H73j866P95J957q88j824O48J864o89j896J018J482n75j788Q98J450o38j653
$$ 873 -993 -198 1759 871 -953 -305 1559 870 -1026 -8 1474 899 -889 9 1459 821 -832
2685h32K75J911m37j796L87J608l4j752P2J506m1j175n37J559K14j814K24J433
$$ -832 -557 1354 917 -879 -492 1116 1082 -670 -598 908 867 -308 -845 714 928 -886 -662 771
2703G71L99j932l7J332L81j789j05J565L97j746m14J385O36j323r53J821K96k172
$$ 771 1170 -762 -799 533 914 -875 -980 585 982 -764 -1178 207 843 -480 -1433 388 684 -1488
2721a488j02J892N16j518p84K074K56j940o07J951O20j716q27K025N92j876p23
$$ -1488 -1590 302 818 -700 -1484 590 846 -1094 -1701 250 870 -846 -1673 352 944 -932 -1655
2738a655J816M79j716k56J544P29j677n07J435R44k070m58J519O41j356q67J624
$$ -1655 161 640 -1076 -1332 212 941 -736 -1243 192 1136 -934 -1392 127 768 -588 -1455 169
2755A69O51j198q68J060Q04p63j230J163J064q74j235J358J109j156j007J023
$$ 169 820 -378 -1246 -186 618 -145 -1375 -212 852 -22 -1257 101 1210 54 -953 70
2771G0J168j009j105R32J290r23j420J339J391j195j401O55J663p85j883Q00J722
$$ 70 1238 229 -876 56 1346 423 -997 342 1733 538 -863 -208 1455 670 -1213 -413 1309
2788A309q70j336J149J266j143j440J199J426q46j490R50J652j044j611J090J388
$$ 1309 439 -897 252 1518 375 -1065 134 1560 714 -776 174 1826 782 -829 261 1649
2804A649p97j863J141J378r88j112O75J048m35j523P60J474n71j536P00Q87l33
$$ 1649 852 -1011 130 1508 520 -592 83 1131 696 -827 -67 1407 836 -700 0 887 554
2821E54j450L91J582m89j328K55J468l88j356P2J448j71j327L27J013J00j205
$$ 554 -896 -505 1077 588 -740 -485 983 595 -761 -689 759 588 -739 -412 601 701 -504
2838e04k67J267M9j335k70J710L41k152L21J486O2j756o9J356L64j617l58J882
$$ -504 -771 496 545 -790 -1060 650 991 -1161 -840 646 708 -1048 -1117 239 603 -1014 -1372 510
2856E10K39k091j0J745N93j764m17J429N64j769l02J649K12j833j1J444L10j583
$$ 510 749 -1342 -1352 393 986 -778 -1195 234 798 -971 -1273 376 588 -1245 -1256 188 498 -1085
2874a085j74J688O3j077n58J491K91j742m2J377L41j334l54J026O29r51p97J288
$$ -1085 -1259 429 492 -585 -1143 348 639 -1103 -1145 232 573 -761 -1115 -89 540 -411 -1208 80
2892H0P65j090q37J249R79j329r19J096J064j062j179J171J204j085j264J407
$$ 80 845 -245 -1082 167 1146 -183 -1102 -6 1058 -4 -1183 -12 1192 107 -1157 250
2908B50Q69r43j113J102J136o74j357J035J301j092j578J455R54j293p92R26J286
$$ 250 1119 176 -937 165 1301 627 -730 305 1606 514 -1064 391 1345 52 -740 186 1472
2925A472r47j513J357R70r55r89R26J183j220j084J090J155r72j023M60J607j032
$$ 1472 525 -988 369 1339 384 -605 321 1504 284 -800 290 1445 473 -550 -90 1517 485
2942D85j116O42J012n51j139N50J410q39j323J099R47q15r66N57J071m07j410
$$ 485 -631 11 1023 472 -667 -117 1293 454 -869 230 1177 362 -604 -47 1024 617 -793
2959g93L82R98j06j483K63J493l22j287J87J333j32j367J72J606l83j180k19J133
$$ -793 -411 587 481 -1002 -739 754 432 -855 -668 665 533 -834 -662 944 561 -619 -838 295
2977B95Rj159l50K070r1j819J17J539m5j995M9K093l61j506L59J045J23j333j85
$$ 295 304 -855 -1205 865 774 -1045 -928 611 566 -1429 -1380 713 352 -1154 -795 250 373 -960 -1145
2996a145J395L78j698j19J538L81j868m4J422M26j928Q3J640J1j522j07J472j6
$$ -1145 250 628 -1070 -1189 349 730 -1138 -1182 240 666 -1262 -1179 461 472 -1050 -1157 315 299
3014B99r14l15J159M82j527J37P29N43r29p44J135J052j383o24R74M45q40l80
$$ 299 -615 -930 229 711 -816 -679 50 593 -336 -1080 55 1107 -276 -900 74 519 -321 -701
3032g01J237K41p12r87J172P08p77j000R83R23q78q95P49J340j058j086R63J021
$$ -701 536 777 65 -922 250 958 181 -819 164 1087 209 -686 63 1403 345 -741 222 1243
3050A243j129r87J207J178j181r65J028Q87q88j183J078J069q92j167R01J167
$$ 1243 114 -873 334 1512 331 -634 394 1281 393 -790 288 1357 465 -702 199 1366
3066A366j073j042R85J050r76r72O86J064p52o78P92P78j147j062J035R88n60
$$ 1366 293 -749 236 1286 310 -662 24 1088 336 -342 450 1228 81 -981 54 1042 482
3083D82j244O54J203p39r52J72J071l98q20K51J044m40j031K92R82j70j282P11
$$ 482 -762 -108 1095 356 -596 -424 647 249 -571 -320 724 284 -747 -455 527 357 -925 -214
3101b14R02l77j278L94J412m13j240K46P40oj053P0J120J20j016l47J099J6r75
$$ -214 688 311 -967 -573 839 426 -814 -568 172 166 -887 -817 303 423 -593 -940 159 175 -800
3120h00M5J312j77j558L21J276n7j351n2J593m1j832K93J174L60j543L1J283J03
$$ -800 -755 557 380 -1178 -857 419 362 -989 -1041 552 511 -1321 -1028 146 506 -1037 -1006 277 380
3139C80j357J19J054J51r48k57J153K90j391j34J265j61q17k49R83M24j059k65
$$ 380 -977 -858 196 347 -601 -858 295 585 -806 -940 325 164 -653 -902 81 505 -554 -819
3157h19J167J85j002K2N39L53n59l80R43L24o49q44J033O03r79o04O47P54n69
$$ -819 348 533 -469 -447 92 445 -114 -494 449 773 124 -720 313 916 -63 -667 -20 734 165
3176A65q78Q16R27r78m21P93Q45j137r79J285P94q42j249J199R06j213m62Q33
$$ 165 -713 103 1030 52 -369 424 1269 132 -847 438 1232 390 -859 340 1246 33 -429 404
3194D04P56r39q17Q06Q80p09j087R24Q28q79j188R40J335j056p53Q80M57p02n28
$$ 404 1160 221 -596 210 1090 381 -706 218 1046 167 -1021 -81 1254 198 -555 325 782 80 -448
3213d48K47J310p62r39Q01L86l95p55M80P52p38p50P06P63n57q29P44P34k12j254
$$ -448 -201 1109 347 -592 209 595 200 -555 -75 677 -61 -811 -105 658 101 -728 16 750 538 -716
3233g16M25N70j30j004N63O59j65j116N14P57P3j396K24J198l25r71M2J012q2
$$ -716 -291 279 149 -855 -292 367 202 -914 -400 357 430 -966 -742 456 131 -840 -798 214 132
3252A32j130L31J185l22j242M6J399j79j100k23J201K16j449K26J344k46r86Q9
$$ 132 -998 -667 518 196 -1046 -1000 399 220 -880 -1103 98 314 -1135 -909 435 189 -797 -708
3270g08J119l39p12j89J226k1r20J21P02K23j102k35J248J11q72l64R02K29j109
$$ -708 411 72 -640 -829 397 376 -544 -423 279 502 -600 -835 413 524 -348 -712 190 419 -690
3289f90l02J232L17q72k39O44K77n47l99P83O37p67n74R15M61p72l66N96M74o18
$$ -690 -992 240 557 -315 -554 90 367 -180 -579 204 841 74 -500 415 876 104 -262 334 808 190
3309A90o09P63N89q42n65Q04M16m75m69Q67P30j076r66R45Q54j045o35J166O75
$$ 190 -419 344 933 91 -474 330 746 271 -198 669 1399 323 -643 302 1156 111 -524 642 1317
3328A317j303o53Q71Q93r15q21J102P85j069r58Q79Q44q68j122J321L57m51q30
$$ 1317 14 -639 232 1125 210 -611 491 1276 207 -751 128 972 104 -1018 303 660 209 -621
3346f21Q43K93l95o54Q05N14j086k18M15R28o40j372O21J038l21j102O96P25n26
$$ -621 222 515 120 -534 271 785 -301 -519 -104 824 184 -1188 -567 471 150 -952 -256 469 -57
3365e7n69M38O89k01r92M81M60j67r29J56J020j35r51J31J021j84p64j58J010
$$ -57 -626 -188 501 300 -692 -211 249 82 -847 -691 329 194 -757 -626 395 211 -553 -711 299
3384B99l21o66R0J173l05j033j16J117n4p20k59J209k27j004J51J010j34j229
$$ 299 -22 -688 -598 575 270 -763 -879 238 184 -536 -795 414 187 -817 -666 344 210 -1019
3402a019N03R96k51r03J95R17k08r44J20J064l07r43J98P95J63o64l90J149k84
$$ -1019 -516 480 229 -674 -479 438 230 -714 -594 470 163 -780 -582 213 376 -288 -678 471 187
3421A87n47j47J026K0r09K2O30L31q06j13M91P30q96m85O90K55o15l82R84n8n60
$$ 187 -360 -507 519 539 -370 -348 282 613 -193 -306 185 915 19 -466 224 479 -136 -518 466 408 -152
3442a52k55P72L83p93m24R97K73r92l33R35M11o55m51J019J86o23n57O29M63q67
$$ -152 -407 365 748 -45 -469 528 801 -191 -524 411 822 167 -284 735 921 298 -259 370 833 -34
3462c4m30R28M66q59o57R38M56o76m82O76O51r34p19R31L21k47o26L85N50n65
$$ -34 -464 464 930 71 -586 352 808 132 -350 326 977 43 -676 255 576 329 -297 88 638 73
3482G3n81M16R79q42o92P66L82p20k39P37J62l04p78M15R10r12k75K64M91k65
$$ 73 -508 -92 887 45 -647 119 501 -219 -458 279 441 137 -641 -226 684 -228 -503 -239 252 -13
3502a3o67j35R81k01q28K45Q90K2j061K72J024l94p08Q2Q03j98j057K07R98j45
$$ -13 -680 -815 166 -35 -863 -618 272 294 -767 -495 529 135 -573 -491 312 114 -943 -736 262 117
3522A17r47K50Q94k87j137K96J287l52q83L98Q58q5j285L66R03p4q29J52P49k10
$$ 117 -830 -580 314 27 -1110 -814 473 121 -762 -364 494 409 -876 -510 393 319 -510 -358 391 181
3542A81o47q2J024l55p10K73M33K60p46p8P29O4p28k51J069j37o11j52R57l82
$$ 181 -466 -548 476 121 -589 -316 117 377 -369 -447 282 346 -382 -633 436 299 -312 -464 493 111
3562A11k99l3N08M27r34J79M94M6o56k99J010J31q41k30O16O41q90l38R38J02
$$ 111 -188 -221 287 714 -220 -41 453 499 -157 -456 554 685 -156 -386 230 871 -19 -357 581 683
3582F83q30J17N73K36q87J0M80L75o80k94P14l2l88l05R28j6n70n57R70l8m94
$$ 683 -147 -30 543 779 -108 -98 382 757 77 -217 497 465 77 -228 700 684 114 -443 527 489 -5
3603em53R26L19o15p24P68K5l78j06N35M50j102R3L26M81p30p5J11O88o64l73
$$ -5 -458 468 787 172 -552 216 241 -137 -243 292 742 -360 -267 59 540 -190 -265 -154 534 -130 -503
3624e03L53N29o29k87P53J84m47o81L47L91O8p72M69N32J4r14J30R73m17p48L37
$$ -503 -150 379 -250 -537 216 400 -47 -728 -381 10 78 -694 -225 307 321 -593 -463 510 93 -655 -318
3645c18Q90m17j221Q26M64J01j039J14Q43j72p62L19O72k43p91j9J122k97j023
$$ -318 572 155 -1066 -240 224 325 -714 -600 243 71 -691 -372 300 57 -734 -753 369 72 -951
3664i51M48R89n34l82K23N98n76l90L60Q02k74o82j29O94J40r93L01R29k53p45
$$ -951 -503 486 -48 -430 -207 391 -185 -575 -215 587 313 -369 -498 196 336 -657 -356 573 320 -425
3684d25K53M59j72k97o7Q09m78n20K53P72m75k07q4M01M86q60j88P94K91r92j35
$$ -425 -172 287 115 -182 -249 560 82 -438 -185 587 112 -95 -179 222 708 -152 -340 454 745 -247 -382
3705c82Q19J42m60k78M76M38p98l2O39J53q76QO73L34p22m13N64K19m13k89Q34
$$ -382 437 579 119 -159 317 755 -43 -75 564 717 -159 -151 522 856 134 -279 285 504 91 -198 636
3726F36P6j035L2M62K74m22o65J269j64n49k28O52M3n50k32M84M94p23k01P60
$$ 636 712 -323 -291 171 445 23 -642 627 463 -86 -314 338 381 -169 -401 83 577 -146 -347 413
3746D13Qk08q52M04O79l14o96R06k6p16m07N55L14j72l86M77L24j85n90L85k6
$$ 413 421 213 -639 -235 444 130 -566 340 314 -402 -809 -254 60 -112 -498 -21 303 118 -472 -87 -113
3767a13l7m33L66N02l93n17J58P07k36p51M86O41m45n10k91J086l94q54O41L66
$$ -113 -150 -583 -217 285 -108 -625 -467 240 4 -747 -261 380 -65 -575 -866 220 -174 -1028 -387 -21
3787b1l99j40M17M16k32l63j76O87k1p13O4J064k33q52M9J006n08o49L02P61l72
$$ -21 -420 -560 -143 273 41 -322 -498 189 168 -545 -481 583 350 -502 -453 553 45 -604 -302 459 87
3808H7n67j7Q09L9p86K51M16K1n51J01O26J28k69k84L22L2p24L03O08j93n53J52
$$ 87 -480 -497 312 351 -435 -184 232 253 -298 -197 429 557 288 4 326 358 -366 -63 545 352 -201 -49
3830d9O04l27n24J64O96o7r19J3P37L99q14m4L94J85p06J45N22L04o30j70O57
$$ -49 555 228 -296 -132 564 497 -422 -409 328 727 -87 -131 263 448 -258 -113 409 713 83 -87 570
3851E70O9q45L6P13L62p30j97O21K11q96j00P18K2o53j69N41J12n00j38N17J10
$$ 570 639 -206 -170 543 905 175 -22 599 810 -86 -186 532 554 -99 -268 273 385 -115 -253 264 374
3872C74l60m28R96j26m95l59R64j27o92l68N26L30k49m20J95M97m15k74M41K25
$$ 374 14 -414 582 456 -39 -398 566 439 -253 -621 -95 235 -14 -434 -239 258 -157 -431 10 235
3892B35k96l65K88K55m09l08L94L56n56j96L31K29k76j22J95L44j7n75M87J2k16
$$ 235 -61 -426 -138 117 -292 -600 -206 150 -406 -602 -271 -42 -318 -440 -245 99 82 -493 -6 6 -210
3913b10o49P62K71l60m21N90M15n31l12N9M36j62k25j39P19k89o02K33P40l20
$$ -210 -859 -97 174 -186 -607 -17 398 -133 -445 -386 50 -112 -337 -476 243 -46 -648 -415 325 5
3933En88M77L99j72n40L6P50l02m50J96N14j51m48j09R49l17n07K31K62L8n06
$$ 5 -583 -106 293 121 -419 -383 367 65 -385 -189 325 174 -274 -383 566 249 -258 -27 235 273 -233
3954b33J80L37J49p60K62K04Jk90N8L43n5m69L23J91K88n54j84P62n5m37k42M34
$$ -233 -53 284 433 -327 -65 139 140 -150 -92 251 196 -273 50 241 529 -25 -209 553 498 61 -181 253
3976B53r3k13l2O63j6q95J49Q59l75m39KL25L88o06P7N95n2m89m33N36L66n79
$$ 253 160 -53 -85 578 562 -333 -184 675 300 -139 -137 188 576 -30 47 642 590 101 -332 204 570 -9
3998ir1J80K18n83p7Q05n1o12m24J088O5q27K5L64K75m54k60M59M33n44n35P62
$$ -9 -100 80 298 -285 -362 443 392 -220 -644 444 509 -318 -293 71 346 -108 -368 91 524 -20 -555 207
4020B07K72n29k72L82J69k11l35O14J28o47j97K7M22j14k41R0K31nm04J46N28
$$ 207 479 -50 -322 60 229 18 -317 297 425 -222 -419 -392 30 -84 -325 -235 -4 -9 -413 -267 261
4041B61k96n51J92M04l88k66N96M64m27n10J86O80l14o62L66N97l28o26M48M41
$$ 261 -35 -586 -394 10 -378 -644 -48 416 -11 -521 -335 345 31 -631 -265 332 4 -622 -174 267
4061B67k98o73K90J097r02m35O52L07o09k03M05M20l07k81J79L02K27r49M90M26
$$ 267 -31 -704 -414 683 -219 -654 -2 305 -304 -507 -102 318 11 -270 -91 211 438 -511 -21 405
4081D05l00n89J98O92m57J0j01O12k09o69J22P84l53k81J24N27k78n47J88K55
$$ 405 105 -484 -286 406 -51 -41 -142 470 261 -408 -286 498 145 -136 -12 515 237 -310 -122 133
4101A33K32k05Q0rJ6l00L16o8K88m31m1L76L0l62j06N59j64Kk99O40j76q67J33
$$ 133 365 160 240 231 247 -53 263 195 483 52 11 387 417 55 -51 508 344 346 47 687 511 -356 -223
4124b23O29j28m96p1Q05K25q55l41P87o6m99P8M49k1j73k01NM23o78J26M30j71
$$ -223 406 278 -218 -289 516 741 -114 -455 332 266 -233 -155 294 273 100 -101 -96 327 -351 -225 205 34
4146C4k07P3J79J01j41l96L16J60l05k16O22P2o17j53L51K05k47k43L21J10j66
$$ 34 -173 -100 79 180 39 -357 -41 119 -186 -402 220 292 -325 -478 -127 78 -169 -412 -91 19 -147
4167a47N2J33K02l74k37O86l23k21j68l3M96m29l92N96L34n8n70J44J003p01n02
$$ -147 -95 38 240 -134 -371 315 -8 -229 -397 -430 66 -363 -755 -159 175 117 -453 -309 694 -7 -509
4188e09L63L16l46j89k7N79j07m43K46K51j95m39J34O56l55l07M18Q1k42k05K31
$$ -509 -146 170 -176 -365 -392 187 80 -363 -117 134 -61 -500 -366 290 -65 -372 46 127 -115 -320 -89
4209h9L65k50L6j62K67K56n74K78R4k5k55k88Q71l86n92K49M01P5n42J36L53N3
$$ -89 276 26 62 -100 167 423 -151 127 221 196 -59 -347 524 138 -454 -205 196 271 -271 -135 218 271
4231B71l99K79L41k01j41J06K92l09j32j78N03q4o40J26M27q9k83m6K19L55m53
$$ 271 -128 151 492 291 150 256 548 239 107 -71 432 348 -292 -166 261 172 -111 -157 62 417 -36
4252c6J24L23m29n2K0N85j72l98j59M69q8m03K52q0K58m42p9N11K8k73l81Q88
$$ -36 88 411 -18 -70 -50 535 363 -35 -194 275 187 -216 36 -44 214 -228 -307 204 232 -41 -422 466
4274D66k9p99J95M44j72n75K57N48l63j71j7J71m2p2r5J38J69k56p7J79K13r0
$$ 466 437 -362 -167 277 105 -470 -213 335 -28 -199 -216 -45 -87 -159 -254 -116 53 -203 -280 -101 112 22
4296B2k50M79j58m32n9K55K90l44l00J57J93l3m43N00J38k57j10M86J69l54n28
$$ 22 -228 251 93 -339 -398 -143 147 -197 -497 -340 -147 -180 -623 -123 15 -242 -352 134 303 -51 -579
4317e79M80M43o23j8K01L94k53k86j56N65m23j92L46N38l22p13M71K39j82k27
$$ -579 -99 344 -279 -297 -96 298 45 -241 -397 168 -255 -447 -101 437 115 -598 -127 112 -70 -297
4337b97N16k24k06r4J77M11n99k11P06J69j47l20RN44l18m2M5J83k58l29L57J24
$$ -297 219 -5 -211 -305 -128 283 -316 -527 179 348 201 -119 -110 434 116 74 119 302 44 -285 72 196
4359A96J08m90J17O01k05m09K19K04n30m3L04K07K13p40L9O07m53p0j66O30k52
$$ 196 304 -186 -69 532 327 -82 137 341 -189 -232 72 279 492 -248 -209 398 -55 -125 -291 339 87
4380H7k68L17J19p6j37k82P79j19l83r5K37J30k94l74N20K28p41m2O17j31k6j79
$$ 87 -181 136 255 179 42 -240 539 420 37 -58 179 309 15 -359 161 389 -352 -394 223 92 66 -113
4402a13M36j05k58k19N12l00k82J82RL75m50qJ11K48m42q5L77R0m18o7L46j20
$$ -113 323 218 -40 -259 253 -47 -329 -147 -138 237 -213 -221 -110 138 -304 -389 -12 78 -340 -407 -61 -181
4424a81J92M0k67K86l73l35Q40P0o75J8M38K16q71L27o1N07l18l27L33J53k72
$$ -181 11 51 -216 70 -303 -638 202 272 -403 -385 53 269 -602 -275 -336 171 -147 -474 -141 12 -260
4445b60j19L12L3k4m03J81N00o84K9K58K49l14j47K59L83l21n63O99K07l76k5
$$ -260 -379 -67 -34 -58 -461 -280 220 -464 -435 -177 72 -242 -389 -130 253 -68 -631 68 275 -101 -126
4466a26L39k43k44n5M13M4j34j07j11O29m40j7l9L11j80l25O07m5k19j91k6N44
$$ -126 213 -30 -274 -329 84 128 -6 -113 -224 405 -35 -52 -91 220 40 -285 322 277 58 -133 -159 385
4488C85l45Ok10K67Q2l04L05R9k16l51O35j62K45l57R8k08J76K71l66K21k21M9
$$ 385 40 46 -164 103 185 -119 186 285 69 -282 353 191 436 79 177 -31 145 416 50 271 50 99
4510I9o2L11J4l62j46O24l05p7m72N60K55r15K10O78m31l61L59L01k23k73M07
$$ 99 37 348 362 0 -146 478 173 96 -376 184 439 -476 -266 412 -19 -380 -21 280 57 -216 191
4531A91j43L45p01L64J15j74m6J26K26p1m06L2K60m3n39K37K85K12m30j07M31
$$ 191 48 393 -308 56 171 -3 -49 77 303 232 -174 -142 118 75 -464 -227 58 270 -160 -267 164
4552A64k74k49N8O65n14j23M8J83J0j47q7K92L47n63k01J09k3K7K9J77L06n24
$$ 164 -110 -359 -301 364 -150 -273 -225 -42 -32 -179 -266 26 373 -190 -391 -282 -305 -278 -249 -72 234 -290
4574b90J05Q0N3m18L6M68M21p74j72M58K70l60p9M12k0n47l75L51P07j84l43K11
$$ -290 -185 -105 -52 -470 -434 34 455 -319 -491 -33 237 -123 -202 210 190 -357 -732 -381 326 142 -201 10
4596A0L09j42n46K37L96l13k62O89k00l17j32L77r2J41l01J05M54m23p4J46K2
$$ 10 319 177 -369 -132 264 -49 -311 378 178 -139 -271 106 14 155 -146 -41 413 -10 -84 62 84
4617H4J26l23K28P8j43j96L25K57j25m02K73K20k52j21J60k57J24N6k23M92l20
$$ 84 210 -113 115 193 50 -146 179 436 311 -91 182 402 150 29 189 -68 56 112 -111 381 61
4638F1j38L48j12J52j33R5K06l27l59L00J96j48l22R3Q7j10K06l20M55r4j75P7
$$ 61 -77 271 159 311 178 273 479 152 -207 93 289 141 -181 -88 -1 -111 95 -225 230 136 -39 38
4660C8O4J94l06j18L94r0l54o8O73n96R5q7M33j67m01J12M00p2k07m24Q12l03
$$ 38 102 296 -10 -128 266 176 -178 -246 427 -169 -74 -161 272 105 -296 -184 216 144 -63 -487 325 22
4682B2j41J86j64J73l72J84J12Q1j33J33J15Q8l86j5R7L9L9k72qK24j02kM8L17
$$ 22 -119 67 -97 76 -296 -112 0 81 -52 81 196 284 -102 -117 -20 19 58 -214 -222 2 -100 -102 -54 263
4706B63m50n4L13J34j10o1m53M16k91K0J14N99q91K26pK95m7l23K92L32n28J32
$$ 263 -187 -241 72 206 96 35 -418 -2 -293 -273 -159 440 -451 -225 -232 63 16 -307 -15 317 -211 -79
4728g9P0j40L17k44J2O41m11n75O95j86j97J26J06J86k99l17N72p5j96p9M13J00
$$ -79 -9 -149 168 -76 -64 577 166 -409 286 100 -97 29 135 321 22 -295 277 202 6 -73 340 440
4750D40l78k47L85J52j6k67K35K2j24m43L77J14r1j17j7K85q2m03K79L42l37o95
$$ 440 62 -185 200 352 336 69 304 326 202 -241 136 250 159 42 25 310 228 -175 104 446 109 -586
4772e86M65L94l21K7m3O5J71j31K9K01k83k95O15j94L01n29J7K37K72o62K5N22
$$ -586 -121 273 -48 -21 -64 1 172 41 70 271 -12 -307 308 114 415 -114 -97 140 412 -250 -225 297
4794B97L3j68l68O72m98o9J8K70j67k67K62j25K65m76M33K3N7pm35L06k03l72
$$ 297 330 162 -206 466 -32 -101 -83 187 20 -247 15 -110 155 -321 112 135 192 185 -250 56 -147 -519
4816e19Q0P21l62j82J71K42K24n58P5L68j59m15J41K11r3k9k42L57J05k6m52M00
$$ -519 -439 282 -80 -262 -91 151 375 -183 -108 260 101 -314 -173 38 -55 -84 -326 31 136 110 -342 58
4838E8j05Jp6K00k5o60L95J4K5r4PJ3L71l02j19J68M72n42L3L96n3j38j83K45
$$ 58 -47 -46 -122 78 53 -607 -212 -198 -173 -267 -260 -247 124 -178 -297 -129 343 -199 -166 230 177 39 -144 101
4862A01J56j86l93K61L73l50N9j28L56k75j89M75J9k30k19L03J98j60k99J52J3
$$ 101 257 71 -322 -61 312 -38 21 -107 249 -26 -215 260 279 49 -170 133 331 171 -128 24 37
4883C7J6k94J07J90J14j28q4K77M9m44K14o1j4J47pp2J48j60j30L03k35J22J35
$$ 37 53 -241 -134 56 170 42 -42 235 284 -160 54 -7 -21 126 119 47 195 35 -95 208 -27 95 230
4906B30j23J2n1J9P6K76m78J05L18l26k3j02L31k17j41J64K16l34r5L31j70P6
$$ 230 107 119 68 87 163 439 -39 66 384 58 35 -67 264 47 -94 70 286 -48 -143 188 18 94
4928I4jk50L20nm55P9M09l46k30L66K18k27Q3j22J33K43j82m75K01P0n7J63Q1
$$ 94 93 -157 163 158 -297 -218 191 -155 -385 -19 199 -28 55 -67 66 309 127 -348 -147 -77 -134 29 110
4951A10j54j78K32J33r1k80J28L58q5o14N39l88L37o9j97J94l4j63p3j41M62l80
$$ 110 -44 -222 10 143 52 -228 -100 258 173 -441 98 -290 47 -22 -219 -25 -59 -222 -295 -436 26 -354
4973c54J0L14j96jP6J38N3L7j7L8j56R3k87K05K42k87m05P06jm45k18N41R7n66
$$ -354 -344 -30 -226 -227 -151 -13 40 77 60 98 -58 35 -252 -47 195 -92 -497 209 208 -237 -455 86 183 -383
4997c83L46L06k74j8j25M49j06j88k36K68K07o20L36J19M70l91l15M05O5k00k31
$$ -383 -37 269 -5 -23 -148 301 195 7 -229 39 246 -374 -38 81 551 160 -155 250 315 115 -116
5018a16M13j19j53J90j71K44J3m37L16J29k06n63K63M33k04m25M34j22M85m19
$$ -116 297 178 25 215 44 288 301 -136 180 309 103 -460 -197 236 32 -393 41 -81 404 -15
5038a5j39L33m8m0m07O35n9m71L69N4N5l56J19K56l37q2K4N63l02l76K86M75m15
$$ -15 -154 179 131 91 -316 319 260 -211 158 212 267 -89 30 286 -51 -133 -109 454 152 -224 62 537 122
5061A22j90J66R4j86m0J04K3p3j30K17k49J84l17qM79k22m22M23K15j82k48j16
$$ 122 -68 98 192 6 -34 70 93 20 -110 107 -142 42 -275 -283 196 -26 -448 -25 190 8 -240 -356
5083c56R4o9j26J93J38J79j31j31K04P4j04o3K82k39m72N67l40N12n10j25M02
$$ -356 -262 -331 -457 -264 -126 53 -78 -209 -5 69 -35 -98 184 -55 -527 40 -300 212 -298 -423 -21
5104b1J3k14K05j52M98o55J73r8J89L6m08J18N35m65l51O37j43K41p60Q02Rl14
$$ -21 -8 -222 -17 -169 329 -326 -153 -251 -62 -26 -434 -316 219 -246 -597 40 -103 138 -622 180 189 -125
5126a25j07J41K22k39j14jL86n6j51P0L23l64j17L04j71n3m2M5J86k41%K81m35
$$ -125 -232 -91 131 -108 -222 -223 163 107 -44 26 349 -15 -132 172 1 -52 -94 -49 137 -104 -104 177 -258
5149b58L79k92K32J80j22n0J02j40j46K8K08L5j28j80j87L62J16J29j69N9K6j69
$$ -258 121 -171 61 241 119 69 171 31 -115 -87 121 156 28 -152 -339 23 139 268 99 158 184 15
5171A5k59L79K87n93q8N58j39J48l48N49m86n8n3K32K09n45J05J48o4l48J59K92
$$ 15 -244 135 422 -171 -259 299 160 308 -40 509 23 -35 -88 144 353 -192 -87 61 -3 -351 -192 100
5193A00j65n3K11J00k54k06K40J52j98k74N14l8j23m02K36J16P6m23J84L23m40
$$ 100 -65 -118 93 193 -61 -267 -27 125 -73 -347 167 129 6 -396 -160 -44 32 -391 -207 116 -324
5214c24J39p2N73l34L8j04k13K30k18J09N1J49k07J93J01lj46k36K06J88l1l32
$$ -324 -185 -257 316 -18 20 -84 -297 -67 -285 -176 -125 24 -183 10 111 108 -38 -274 -68 120 89 -243
5236b43J35N1k38M24n1k36J89j16L37j55k07L7L50l96K4J34J3J42j78j27n0J46
$$ -243 -108 -57 -295 129 78 -158 31 -85 252 97 -110 -73 277 -119 -95 39 52 194 16 -111 -161 -15
5258a5r4r5L77j72K38l00j5N6l0j70K48Q4n3l79M01J55k88QJ25Rj42o0K24j77
$$ -15 -109 -204 173 1 239 -61 -76 -20 -50 -220 28 112 59 -320 81 236 -52 -44 81 90 -52 -112 112 -65
5282f5Q3j13K08j7M7k86R0L47k68p1K18L6l40K61J10q5J35n91L90K82k34j12J21
$$ -65 18 -95 113 96 143 -143 -53 294 26 -45 173 209 -131 130 240 155 290 -301 89 371 137 25 146
5305A46O0j32J27o0L02j13l78o2N04m00k54Q4K73l23N5L27J3J8o1k06R1J85l22
$$ 146 206 74 201 141 443 330 -48 -110 394 -6 -260 -176 97 -226 -171 156 169 187 126 -80 11 196 -126
5328a26K31L04o86l2L53j09K66m06J78J48nl7k81J26R5j58M9K89j43k87J22J73
$$ -126 105 409 -277 -309 44 -65 201 -205 -27 121 116 79 -202 -76 19 -139 -90 199 56 -231 -109 64
5350F4n2q3j44Q2k3K77r5K10l32J39p5j69K41j29NJ31o0rq8J1K40l94q9O47k09
$$ 64 12 -71 -215 -133 -156 121 26 236 -96 43 -32 -201 40 -89 -84 47 -13 -22 -110 -99 141 -253 -342 305 96
5375I6j69k28J26K37j17k14L37L06l58j06k19N13k23j56K44K79o78K42L56o8l46
$$ 96 -73 -301 -175 62 -55 -269 68 374 16 -90 -309 204 -19 -175 69 348 -330 -88 268 200 -146
5396a46j6J71J10l5q5l5j18rrL72K6J25p09K49L16m78L49L4Rk94K6L37P1l93R6
$$ -146 -162 9 119 84 -1 -36 -154 -163 -172 200 226 351 -358 -109 207 -271 78 112 121 -173 -147 190 261 -132 -36
5421c6K37n7j80k59K66oo4K96M1j27O8k32L13k51K66l98P8J66p0Q5nm4K22j88
$$ -36 201 144 -36 -295 -29 -35 -99 197 238 111 179 -53 260 9 275 -123 -45 121 51 136 131 87 309 121
5445A21J93J36j69l46J69r0J17j40O9k1O4j64K2L01l31k1J37J23k9p49L79J10
$$ 121 314 450 281 -65 104 14 131 -9 60 39 103 -61 -39 262 -69 -90 47 170 141 -608 -229 -119
5467a19K44k24K61L11l36l71J65L68l28m53Q3M40k3m1m60M53j75L69l04J00J64
$$ -119 125 -99 162 473 137 -234 -69 299 -29 -482 -399 41 18 -23 -483 -30 -205 164 -140 -40 124
5488A24m75O75k17j18m11j09M09j23J87j43J35J83k55P5J30J54r8l01K25j52K64
$$ 124 -351 324 107 -11 -422 -531 -122 -245 -58 -201 -66 117 -138 -63 67 221 123 -178 47 -105 159
5509A59n69L77L38m80l6N7M52k59k32K18L9L4j73J50k2k20l6J37L29j71j65J02
$$ 159 -410 -33 305 -175 -211 -154 298 39 -193 25 64 98 -75 75 53 -167 -203 -66 263 92 -73 29
5531B9j39j11J14L22j81J04k07J54k01j78k44O62L42o14O0k28M28l34K52R1l42
$$ 29 -110 -221 -107 215 34 138 -69 85 -116 -294 -538 124 466 -148 -88 -316 112 -222 30 121 -221
5552b21J27K54j66J63j10J82Q8k47k94J84K04q8o0k00J29J95K86n83N00n2l2k40
$$ -221 -94 160 -6 157 47 229 317 70 -224 -40 164 76 16 -184 -55 140 426 -157 343 291 259 19
5574A9q7N19j40m51J94mJ45q9j23J21j17k7j2j61L4K19o0k2Q2j48R9N7j17k0k64
$$ 19 -68 451 311 -140 54 50 195 106 -17 104 -13 -40 -52 -213 -179 40 -20 -42 40 -108 -9 48 -69 -89 -353
5599c53N52J59m64P9K22k43r8R4j18R2K20l66J69M3l19L10O5q8n5K0L27j15k99
$$ -353 199 358 -106 -27 195 -48 -146 -52 -170 -78 142 -224 -55 -12 -331 -21 44 -44 -99 -79 248 133 -166
5622a66L5K34q2l31K48j86J70J42j18K20k73n5K33n7K84n15N9K1L50j98p1K0J0
$$ -166 -131 103 21 -310 -62 -248 -78 64 -54 166 -107 -162 71 14 298 -217 -158 -137 213 15 -56 -36 -26
5645b6L7j06k35N29j54m95M62J88l66J55R3j39j36Q9K52j2j6k00O6j00J61r7j4
$$ -26 11 -95 -330 199 45 -450 12 200 -166 -11 82 -57 -193 -104 148 136 120 -80 -14 -114 47 -50 -64
5668f4J57o6m9j57J88J42m25M35k83j92N93%p5j32J3k11M20l39J54j59L46k37
$$ -64 93 27 -22 -179 9 151 -274 161 -122 -314 279 279 204 72 85 -126 294 -45 109 -50 296 59
5690E9J2J94n1m00K08k0R8J43J54k01J59l43j24K55J14j44k15K93K01l73k05J08
$$ 59 71 265 214 -186 22 2 100 243 397 196 355 12 -112 143 257 113 -102 191 392 19 -186 -78
5712g8R1M02m39j32M54m52J21l0M4L1m3L46j66P5m80K69j19K2J45k06Q8L07k79
$$ -78 13 415 -24 -156 298 -154 -33 -63 -19 12 -31 315 149 224 -256 13 -106 -84 61 -145 -57 250 -29
5735b9J72l09J97j06J16P9j38j88J9K74j12l56M26O5k55n7J03j83K82k77J50J33
$$ -29 143 -166 31 -75 41 120 -18 -206 -187 87 -25 -381 45 110 -145 -202 -99 -282 0 -277 -127 6
5757Fj36n6J87j94K15j93j30J88p3j8L39l3l03n7K38j37j25K81k04K20K20m00
$$ 6 -130 -186 1 -193 22 -171 -301 -113 -186 -204 135 102 -201 -258 -20 -157 -282 -1 -205 15 235 -165
5779a65k44K55J12o0l2R4l5m9m07L40R8K30l18L15o5q2J29m56M29l05J83Q5L8
$$ -165 -409 -154 -42 -102 -134 -40 -75 -124 -531 -191 -93 137 -181 134 69 -13 116 -340 89 -216 -33 52 90
5802I0l49L16J80j21p5j17K49o5k41K40K30q4n0m56K33M5k50O34r5l4k55n3O8
$$ 90 -259 57 237 116 41 -76 173 108 -133 107 337 253 203 -253 -20 25 -225 409 314 280 25 -28 40
5825D0K43o2j95N1R7k79j4L23j31J26l37o7M11o1l9j97J87l41L71k03K51K77o51
$$ 40 283 221 26 77 174 -105 -119 204 73 199 -138 -205 206 145 106 -91 96 -245 126 -77 174 451 -200
5848b00J37K59l00K1J39O5m42L26J06j47Q5j21KK94R7m23j25N95l81k42K29J72
$$ -200 -63 196 -104 -83 56 121 -321 5 111 -36 49 -72 -70 224 321 -102 -227 368 -13 -255 -26 146
5870A46J18l40k2J48K3n02K17R6K75j1m41N40j13J06l47k0Q2n9OR5J7j66m0N48
$$ 146 264 -76 -98 50 73 -429 -212 -116 159 148 -293 247 134 240 -107 -127 -45 -104 -98 -3 14 -152 -192 356
5894C56n92J75j81L3M19o53L06M79m96q1N6L80l97J70L0%K6j04j63K00m4j63K91
$$ 356 -236 -61 -242 -209 210 -443 -137 342 -154 -235 -179 201 -196 -26 4 4 30 -74 -237 -37 -81 -244 47
5917D7N1k3M4K01k57J92j42m39L52J30j9o0j27K71j54j37j9J97l77Q8N3K31k22
$$ 47 98 75 119 320 63 255 113 -326 26 156 137 77 -50 221 67 -70 -89 108 -269 -181 -128 103 -119
5940a19L12l22J93n7qK54j71j35l99O05j92m9k20J66K22M6k3J86n72J09J85J28
$$ -119 193 -129 64 7 -1 253 82 -53 -452 153 -39 -88 -308 -142 80 126 103 289 -283 -174 11 139
5962A39j75J8k47M37q6k26L09k23L06m51K88k58J57j67K61J73p3k04R2n1J19j68
$$ 139 -36 -18 -265 172 86 -140 169 -54 252 -199 89 -169 -12 -179 82 255 182 -22 70 19 138 -30
5984c0m01O74m79j28L33M4O9k54l7L50K27m33k5L55m87K29p5K70J38k79l8l11
$$ -30 -431 243 -236 -364 -31 13 82 -172 -209 141 368 -65 -90 265 -222 7 -68 202 340 61 23 -288
6006b88R2M6K08j59J56l90O02n19J0J21J73L3K43j96m14n9K32J15l6J54R0l61
$$ -288 -196 -150 58 -101 55 -335 267 -252 -242 -121 52 85 328 132 -282 -341 -109 6 -30 124 214 -147
6028a47L61l55J23J13k12L63k91P4K36l71l5J98l39K66J54j46K2p8J63k30o3Q5
$$ -147 214 -141 -18 95 -117 246 -45 29 265 -106 -141 57 -282 -16 138 -8 14 -64 99 -131 -194 -109
6050a09J89l81J77J9k59M70j7r6N0K0J34j76K22j2n02M61j31k0K39j56j03o7J00
$$ -109 80 -301 -124 -105 -364 106 89 -7 43 63 197 21 243 231 -271 190 59 39 278 122 19 -48 52
6073E2j45P7L9l8K69j58k21K38k21K41j50J0L00j00k35Q6n4L4J77NK4lMM6l49
$$ 52 -93 -16 23 -15 254 96 -125 113 -108 133 -17 -7 293 193 -42 44 -10 24 201 206 230 227 231 277 -72
6098g2l68O59r1p5k39M90k32j2Q3O7j06l5pJ08p0l05L94k3l62J65J78j87j87K79
$$ -72 -440 219 128 53 -186 304 72 60 143 210 104 69 62 170 100 -205 189 166 -196 -31 147 -40 -227 52
6122E2qK9j28K13m20N11l38J18JJ24j90j13J72K05l05k3MmQ7l1J01J08p3k47K90
$$ 52 44 73 -55 158 -262 249 -89 29 30 154 -36 -149 23 228 -77 -100 -96 -100 -13 -44 57 165 92 -155 135
6147A35P8k11j13j72K00k9j04K02j86j67O2K02R1qq0J99n84M41q8m0M3J85k74
$$ 135 213 2 -111 -283 -83 -112 -216 -14 -200 -367 -305 -103 -12 -20 -100 99 -485 -44 -132 -172 -129 56 -218
6170b18J56L31l61J17l78L47n7k6j24J11R4N8p3OK21j67O7l58O0L28j14N0J62
$$ -218 -62 269 -92 25 -353 -6 -63 -89 -213 -102 -8 50 -23 -17 204 37 104 -254 -194 134 20 70 232
6193B32j90k4J06l89K09K2R4J93m63o9L02M3k45n9M48l80L97m50J92L5K20o9k90
$$ 232 42 18 124 -265 -56 -34 60 253 -210 -279 23 66 -179 -238 210 -170 227 -223 -31 4 224 155 -135
6216a35J63k06K03K76j78j57J31j53o2J20k73L88R4n23L24L53l39j55J03K05j16
$$ -135 28 -178 25 301 123 -34 97 -56 -118 2 -271 117 211 -312 12 365 26 -129 -26 179 63
6237F3j07j94L32j04J19qj52K05j81j59J11n9M6J49l43L69k09K07K6J70l57%j33
$$ 63 -44 -238 94 -10 109 101 -51 154 -27 -186 -75 -134 -88 61 -282 87 -122 85 111 281 -76 -76 -209
6260b09J00L07n86K35K02n9o4j79M11l69j12N47J51l18l82K83J86k62o0j60L12
$$ -209 -109 198 -388 -153 49 -10 -74 -253 158 -211 -323 224 375 57 -325 -42 144 -118 -178 -338 -26
6281b6j49K12k66K7j0N0K26k76M34l77K8J14j71J03J45k14P3K17l61M47j85k4
$$ -26 -175 37 -229 -202 -212 -162 64 -212 222 -155 -127 -13 -184 -81 64 -150 -77 140 -221 226 41 17
6303A7J22l23K06k15k0J81K21k90jM64k61k62R6J0M54o84L32j74L54l85n0J27
$$ 17 139 -184 22 -193 -213 -32 189 -101 -102 362 101 -161 -65 -55 399 -285 47 -127 227 -158 -208 -81
6325h1J2p8J59J11l88J51n2L24j66L8J10j47J53k33m4K64m9j3M9k09K36l53K94
$$ -81 -69 -147 12 123 -265 -114 -166 158 -8 30 140 -7 146 -87 -131 133 84 71 120 -89 147 -206 88
6348H8q6k1p1K65j15K62j53j59L10l33j88O4R6m3L6K49k95J72%K00q2k92J36k27
$$ 88 2 -19 -90 175 60 322 169 10 320 -13 -201 -137 -41 -84 -48 201 -94 78 78 278 196 -96 40 -187
6372a87l18O03qq5j37M12N4k88k47L82l69K03K18M7m99J14pj85J70J05K59k25
$$ -187 -505 98 90 5 -132 280 334 46 -201 181 -188 15 233 280 -219 -105 -112 -297 -127 -22 237 12
6394A2j11J16j29L42m09N8L7j87RJ28P8K8J13k5k90M60j38k90K10m3nj0j26J80
$$ 12 -99 17 -112 230 -179 -121 -84 -271 -262 -134 -56 -28 85 60 -230 230 92 -198 12 -31 -36 -46 -172 8
6418Hj70J33M72m08n4k22K03q0K9KJ30J00o8l2j44O3K94m41N9J82l2r4N6K56k46
$$ 8 -162 -29 443 35 -19 -241 -38 -118 -89 -87 43 143 75 43 -101 -38 256 -185 -126 56 24 -70 -14 242 -4
6443dk81M69K4j78J32k62o7K86k37J74n7j76N7j14K13J60L8j92q3K3K9J29n6o7
$$ -4 -285 184 208 30 162 -100 -167 119 -118 56 -1 -177 -120 -234 -21 139 177 -15 -98 -75 -46 83 27 -40
6467d0J67L9J9k97k09L55j6L86l11j50K59k24P3L7j3N6l04M21M2J7m42K58l42
$$ -40 127 166 185 -112 -321 34 18 404 93 -57 202 -22 51 88 75 131 -173 248 290 307 -135 123 -219
6490b19L77l26L26l7j34j35J69R8o8J95j63j64J30m4j45R5j04M25j45J92m44K9
$$ -219 158 -168 158 121 -13 -148 21 119 51 246 83 -81 49 5 -140 -45 -149 276 131 323 -121 -92
6512i2P1k19L00l96K97M06m67m9j1K36j33J65p23N35J10k36J48M14l59J33l4k65
$$ -92 -21 -240 60 -336 -39 367 -100 -149 -160 76 -57 108 -615 -80 30 -206 -58 356 -3 130 96 -169
6534a69K45J13l29j7Q2M4k4l5P2j04j34K20J28j62p1Q5J57p5K00l02M1K53k45
$$ -169 76 189 -140 -157 -75 -31 -55 -90 -18 -122 -256 -36 92 -70 -141 -56 101 26 226 -76 -35 218 -27
6557b7l97M47nj15k05M9R1J7K15j62l0R9P2k5m0m37K17M41k35K48m65J70J29q7
$$ -27 -424 23 18 -97 -302 -253 -162 -145 70 -92 -122 -23 49 24 -16 -453 -236 205 -30 218 -247 -77 52 -35
6581c5L53k63k41K24j53M78m90n32Q79k6Oj70k33L58m8j33M00k43K34m08P1J12
$$ -35 318 55 -186 38 -115 363 -127 -659 220 194 200 30 -203 155 107 -26 374 131 365 -43 28 140
6603A40j98l8K69j14L13k18j14N3j16J29p7K19l14L27n3L1r9k56K40j58L31k47
$$ 140 -58 -96 173 59 372 154 40 93 -23 106 29 248 -66 261 208 239 140 -116 124 -34 297 50
6625E0K15l63L1K72p3j27j25N7l41L90N5j23j5K70j92k17L56j81L99k99k57J81
$$ 50 265 -98 -67 205 132 5 -120 -63 -404 -14 41 -82 -97 173 -19 -236 120 -61 338 39 -218 -37
6647c7M7L75m57J81j31k37P4K11K49o10K94J16j55J40j95R5j27J44p0j09L54l79
$$ -37 10 385 -72 109 -22 -259 -185 26 275 -335 -41 75 -80 60 -135 -40 -167 -23 -93 -202 152 -227
6669b27K38n6PK99l81L46j85l71L48o3J41p6k55K11k17j17L52K5P6o48N28l44
$$ -227 11 -45 -38 261 -120 226 41 -330 18 -45 96 20 -235 -24 -241 -358 -6 19 95 -553 -25 -369
6691c69M97K61n95J32O7K05j90m6K22n53J94k21J96M18k35J4J35j78L06k09l8
$$ -369 128 389 -206 -74 -7 198 8 -38 184 -369 -175 -396 -200 218 -17 -3 132 -46 260 51 13
6712A3j32J69J51J37j25k00q7oL8l56K31j38M24l29L91L0k16m2K33k57J88n85
$$ 13 -119 50 201 338 213 13 -74 -80 -42 -398 -167 -305 119 -210 181 211 -5 -47 186 -71 117 -468
6734d68Q51m11J75L4M6k31k9j32J72l3NR5J31j39J10k89j31L47k14L23k73L56
$$ -468 383 -28 147 181 227 -4 -33 -165 7 -26 -21 74 205 66 176 -113 -244 103 -111 212 -61 295
6756B95k16k78L50k43K60k76j31K93l85K21k9J36l4L1l9K24J6l54N00m43k50O00
$$ 295 79 -199 151 -92 168 -108 -239 54 -331 -110 -139 -3 -37 -6 -45 179 195 -159 341 -102 -352 248
6778B48m37K53O4l32J39N5q7j26Q3J5K0M04l24P6L08n32N5J66l40K22R4K2K9j98
$$ 248 -189 64 128 -204 -65 -10 -97 -223 -140 -125 -105 299 -25 51 359 -173 -118 48 -292 -70 24 46 75 -123
6802a23J31m8K0J09j87L05j73j26O2K42m52K13j2J31j9K0j53j11M05l20J46k68
$$ -123 8 -40 -20 89 -98 207 34 -92 -30 212 -240 -27 -39 92 73 93 -60 -171 234 -86 60 -208
6824b08RK18J35p6m91K79J82k17L06l23J42K31l31M60m93J2K86j95j83R8L85M4
$$ -208 -199 19 154 78 -413 -134 48 -169 137 -186 -44 187 -144 316 -177 -165 121 -74 -257 -159 226 270
6846B70l69L9M23j29j14p0q4K51l54K47k10k41J33J76P2J26m10K86R7j69O0j69
$$ 270 -99 -60 363 234 120 50 -34 217 -137 110 -100 -341 -208 -32 40 166 -244 42 139 -30 30 -139
6868a39M61l75P9J36k69M69m25l12J13L67j78M34o27J75M2O7M2R3j53j26O4K50
$$ -139 322 -53 26 162 -107 362 -63 -375 -262 105 -73 361 -266 -91 -49 18 60 153 0 -126 -62 188
6890A88m44L93k32J89K20m93K83k2j6l8p1l0M4M3O9j82L11j29l3k09K76j33k32
$$ 188 -256 137 -95 94 314 -179 104 82 66 28 -43 -73 -29 14 83 -99 212 83 50 -159 117 -16 -248
6913b48K16K9M1k45K44p1k7J82r1o4J55j73J75k31Q5L2J84n00M31P0k50J09k8
$$ -248 -32 -3 38 -207 37 -34 -61 121 30 -34 121 -52 123 -108 -23 9 193 -307 124 194 -56 53 25
6936B5l27M21j08p6j32j6J31j93j65N72l07j9O6p7J76R8LR7k55r0K58o1j41p5
$$ 25 -302 119 11 -65 -197 -213 -82 -275 -440 132 -175 -194 -128 -205 -29 69 72 169 -86 -176 82 21 -120 -195
6960a95L9K64j22r8m9J50m7m1L6l2L36k48n8J90k12j28L26n2P8l07N3K02m06K61
$$ -195 -156 108 -14 -112 -161 -11 -58 -99 -63 -95 241 -7 -65 125 -87 -215 111 59 137 -170 -117 85 -321 -60
6984f0k5J65j13j00K97p5M80o05j6J01q3J02k95K56K1k20QM74k71Q4j03Q5k84
$$ -60 -85 80 -33 -133 164 89 569 -36 -52 49 -34 68 -227 29 50 -170 -162 312 41 125 22 107 -177
7007a77J98m11K47J38M6J24k37L12k99J35J7J32j01J46k89k44K55J31k06o9K14
$$ -177 21 -390 -143 -5 41 165 -72 240 -59 76 93 225 124 270 -19 -263 -8 123 -83 -152 62
7028F2J82m46L8m5J58K6L55j68m7lj22L5J06k40J76J04j47J19j64K18k71Q2j43
$$ 62 244 -202 -164 -209 -51 -25 330 162 115 112 -10 25 131 -109 67 171 24 143 -21 197 -74 8 -135
7051a35M1L7P2J81l16J36k98Q6Q6mO0l6K37k24L03j93k75K45q1J32j0L8k42P3
$$ -135 -94 -57 15 196 -120 16 -282 -196 -110 -114 -54 -90 147 -77 226 33 -242 3 -78 54 44 82 -160 -87
7075h7j26J15Q7n3m3J67j6j65N1l69M06K12j77l69J55K95j93L25o12L88j30J23
$$ -87 -213 -98 -11 -64 -107 60 44 -121 -70 -439 -33 179 2 -367 -212 83 -110 215 -397 -9 -139 -16
7097a6K2p6n8O5lj18L02j20J11m4L06m70J42J09l51J97o9P5R5j7nM03l00j59l7
$$ -16 6 -70 -128 -63 -66 -184 118 -2 109 65 371 -99 43 152 -199 -2 -71 4 99 82 77 480 180 21 -16
7122a6J88l11K07o1o4J89j16J05j15K73j46J80J36q23M60p4q8rK25J37o7j01K
$$ -16 172 -139 68 7 -57 132 16 121 6 279 133 313 449 -374 86 12 -76 -85 140 277 210 109 111
7145A11k66J80K49m46J61l73N06l3K59k46j19l1J03j97M40k61q3j0J97Rl22q0
$$ 111 -155 25 274 -172 -11 -384 122 89 348 102 -17 -48 55 -142 298 37 -46 -56 141 150 -172 -252
7167b52J41k4J00R1Oj97J70J14k08R8nn4J88k1J67k97J17l4r4J78k51L80k17k19
$$ -252 -111 -135 -35 56 62 -135 35 149 -59 39 34 -20 168 147 314 17 134 100 6 184 -67 313 96 -123
7191a23j60M25qo3J86m66J23L03j81l16J97J07k32K90k05J92m10K17K86o6j74
$$ -123 -283 142 134 71 257 -209 -86 217 36 -280 -83 24 -208 82 -123 69 -341 -124 162 96 -78
7212g8M4j13k4R6j1N7K72m49k5K01J07k7L47m79J05k54N9j07M53k57J14n1k53
$$ -78 -34 -147 -171 -75 -86 -29 243 -206 -231 -30 77 50 397 -82 23 -231 -172 -279 174 -83 31 -20 -273
7235b73n6K3N60l65J44n2J21j15L8L32j16j86K4O5k07L6J84k28K04J98n01O8K12
$$ -273 -329 -306 254 -111 33 -19 102 -13 25 357 241 55 79 144 -63 -27 157 -71 133 331 -170 -102 110
7258A10O6J85m44K96k58r7P36o47J22n9J42k3l5j30j05l8K0J9K07MJ90m07L80
$$ 110 176 361 -83 213 -45 -142 594 -53 69 10 152 129 94 -36 -141 -179 -159 -140 67 71 261 -146 234
7281B34l49KK15M8j30r1L5p6J56O2J8N4k02J74p0n6j18o1kJ81K42k58k27J97q7
$$ 234 -115 -113 102 150 20 -71 -36 -112 44 106 124 178 -24 150 80 24 -94 -155 -157 24 266 8 -219 -22 -109
7306a09K36l09O3J27m0k34J46J7MK31k40L78l29J26p4j75l9J28K54j30K0j09J01
$$ -109 127 -182 -119 8 -32 -266 -120 -103 -99 132 -108 270 -59 67 -7 -182 -221 -93 161 31 51 -58 43
7329D3N4m8J71k37N0k53K04j6J67j94Ql43K58n9M36J20l89P6k99K45o8J89l04
$$ 43 97 49 220 -17 33 -220 -16 -32 135 -59 -51 -394 -136 -195 241 361 -28 48 -251 -6 -74 115 -189
7352a89N9j00K48l9k05RL03j11j76J79m4K3k90K09M3j89K78K4k08M4L54o25N79
$$ -189 -130 -230 18 -21 -226 -217 86 -25 -201 -22 -66 -43 -333 -124 -81 -270 8 32 -176 -132 222 -403 176
7375A76j40J53k60p2P7m2L95j93l4p1L6P3J97l57M13m14K0K33k17m3J61K45k03
$$ 176 36 189 -71 -143 -66 -108 287 94 60 -11 25 98 295 -62 351 -63 -43 190 -27 -70 91 336 133
7398A33j52J40Lp4J19k38J7n1j26L07J76J2l04N4J86p3l2k24J36j74K64k22J55
$$ 133 -19 121 124 50 169 -69 -52 -103 -229 78 254 266 -38 16 202 129 97 -127 9 -165 99 -123 32
7421C2j4n2J58j59l02N61j62k2L3j94L26q3j32j35L58l63P9R9k69M86k31K2l12
$$ 32 18 -34 124 -35 -337 224 62 40 73 -121 205 122 -10 -145 213 -150 -71 28 -241 245 14 36 -276
7444b76K04O6l5K70m94N62k51Pj70L37j76l01K09K8J52j99j5R3j46J70j7k13r3
$$ -276 -72 -6 -41 229 -265 297 46 53 -117 220 44 -257 -48 -20 132 -67 -82 11 -135 35 18 -195 -288
7467b88K89r1P9K5n19L49L21j27k6K03k51O3l9P2J60k95O9j66P2J71j85Q2K58
$$ -288 1 -90 -11 14 -505 -156 165 38 12 215 -36 27 -12 60 220 -75 -6 -172 -100 71 -114 -32 226
7490B26l95L07j97M9k03L27j53P0Ko3J0K12K14j14m72M16l8l06J1k28M78m11K39
$$ 226 -169 138 -59 -10 -213 114 -39 31 33 -30 -20 192 406 292 -180 236 198 -108 -97 -325 153 -258 -19
7513a9j7%R0K20m71K35k77N82m50K57j09j7Q9p0K27l39k8Q8r7n1L18j55J44k65
$$ -19 -36 -36 54 274 -197 38 -239 343 -107 150 41 24 113 43 270 -69 -97 -9 -106 -157 161 6 150 -115
7537a15K56M03m68j06m5K00j83K10l28J88n6J52j81M4j1K74j02m89L77k53M08
$$ -115 141 544 76 -30 -75 125 -58 152 -176 12 -44 108 -73 -29 -40 234 132 -357 20 -233 175
7558A75k41m7L06j89O0J66k57p6j06J53M5rLP1l3J38l01J68O1l2M2q6k94J46J39
$$ 175 -66 -113 193 4 64 230 -27 -103 -209 -56 -11 -20 -17 54 21 159 -142 26 87 55 97 11 -283 -137 2
7583BO2n7K9m1Qk39R2O6K55k10Q5j34j39J21J68l50L30m06l3M48l69l1L54K23
$$ 2 64 7 36 -5 3 -236 -144 -78 177 -33 52 -82 -221 -100 68 -282 48 -358 -391 57 -312 -343 11 234
7607B34k07Q9k54l0J00N1j28K2j41J63O9Rp9l83L29p1P6K14r6p9j29K56j81Q4
$$ 234 27 116 -138 -168 -68 -17 -145 -123 -264 -101 -32 -23 -102 -485 -156 -227 -151 63 -33 -112 -241 15 -166 -82
7631h2N76k35n20K36R3kk17K70j34r5J63j57O8j58J55j33K21j57M1j92L24j17
$$ -82 494 259 -261 -25 68 66 -151 119 -15 -110 53 -104 -36 -194 -39 -172 49 -108 -67 -259 65 -52
7653e2MK31m2j43q9K14k40R6J25Q5K4j63L3P9J82m24J19j70mJ78R0M7j23pK50
$$ -52 -48 183 141 -2 -91 123 -117 -21 104 189 213 50 83 162 344 -80 39 -131 -135 43 133 180 57 50 300
7678C00k79k2JK8R5L4q2j41m4L58K1l12J92j15j04J87J30j28K36k60nl27J27M54
$$ 300 21 -1 0 28 123 157 75 -66 -110 248 269 -43 149 34 -70 117 247 119 355 95 90 -237 -110 344
7702C44m82K6J9K81l01L15K46l39k31L40j88k93K72j04K5J11k52L46q7n9K8L1
$$ 344 -138 -112 -93 188 -113 202 448 109 -122 218 30 -263 9 -95 -70 41 -211 135 48 -11 17 48
7724D8k14K48j00J71l82l0M10k19K54j54j01J79KJ5m3j45J11k65L14k86K75m0
$$ 48 -166 82 -18 153 -229 -259 151 -68 186 32 -69 110 112 127 84 -61 50 -215 99 -187 88 48
7746D8n9r5P7j67j27K93l1Q9N3o7P0M4k41Q2l1n0j62O91n36J32K22l68K06j25
$$ 48 -11 -106 -29 -196 -323 -30 -61 28 81 14 84 128 -113 -31 -62 -112 -274 417 -119 13 235 -133 73 -52
7770e2J03J90j06j59J04Qq9O4pn2P2n6m2J12Q8Jj0n9j44j01J04j97O8J60L26l58
$$ -52 51 241 135 -24 80 88 -1 63 56 4 76 20 -22 90 178 179 169 110 -34 -135 -31 -228 -160 0 326 -32
7796c2J98k3k08O4pj92L1K28j89K17N2r5k30L02M1j89m3M9J19j40L26k24l20K51
$$ -32 166 143 -65 -1 -8 -200 -169 59 -130 87 139 44 -186 116 157 -32 -75 -26 93 -47 279 55 -265 -14
7820a4j41j67L36N3r8L91m17K52k93J38j03o3L68m37J01m3K41kj90p1L50j81P6
$$ -14 -155 -322 14 67 -31 360 -57 195 -98 40 -63 -126 242 -195 -94 -137 104 102 -88 -159 191 10 86
7843H6J19n1j85k41M03P4M9o01J25L66k06MN9l0o6K32l08M08l12L22j33k05o0
$$ 86 205 154 -31 -272 131 205 254 -347 -222 144 -62 -58 1 -29 -95 137 -171 237 -75 247 114 -91 -151
7866a51J63j8m08J59P8J02MK25M8l11l6J19p8J33n7k2P1pl8n3J17n8k5K66O2j90
$$ -151 12 -6 -414 -255 -177 -75 -71 154 202 -109 -145 -26 -104 29 -28 -50 21 14 -24 -77 40 -18 -43 223 285 95
7892I5R1p3J54k2m02K94m45N68r2k52N05l63L7j34j97L34k8Ll63K04J18L19k87
$$ 95 186 113 267 245 -157 137 -308 260 168 -84 421 58 95 -39 -236 98 70 73 -290 -86 32 351 64
7915F4N4j85J72k66J51j32J17J9j64L50m23K13J1q7M03j86r1jK25l74J5J84q1
$$ 64 118 -67 105 -161 -10 -142 -25 -6 -170 180 -243 -30 -19 -106 297 111 20 19 244 -130 -115 69 -12
7938a2m7M25n92K99r5q9K80l38PK49k69J45M6j48R7R4J51K07k81k97M78l54J10
$$ -12 -59 366 -226 73 -22 -111 169 -169 -162 87 -182 -37 9 -139 -42 52 203 410 129 -168 310 -44 66
7961F6J60k20J22k03L9p0J05n7l7j25L07j56O0n9J5K54m10q0K20L2J64k07o6M57
$$ 66 226 6 128 -75 -36 -106 -1 -58 -95 -220 87 -69 -9 -68 -53 201 -209 -289 -69 -37 127 -80 -146 311
7985C11m14nj34J70P9j15K04P5j90K24j60l39L23j54k34K91R5k91J49M9K04k08
$$ 311 -103 -108 -242 -72 7 -108 96 171 -19 205 45 -294 29 -125 -359 -68 27 -264 -115 -66 138 -70
8007g0k39M22o1j33Q3k1j42K07n4k53J08n9K43k80M31l37K29L66m57J12o2J56
$$ -70 -309 113 52 -81 2 -19 -161 46 -8 -261 -153 -212 31 -249 182 -155 74 440 -17 95 33 189
8029A89o1q6J30j66N3K5l35J01KJ94j7J37k06j53k9J22N8k50L55j4o2K89j85%
$$ 189 128 42 172 6 59 84 -251 -150 -148 46 29 166 -40 -193 -222 -100 -42 -292 63 49 -13 276 91 91
8053I1rl1l5O2k02M21l92K6J02j69J88k6j1R3j49R0O1J77l34K15n5j51QL59l60
$$ 91 82 51 16 78 -124 297 -95 -69 33 -136 52 26 15 108 -41 49 110 287 -47 168 113 -38 -30 329 -31
8078c1m3j41K25L81m13J33j42L03l68J07J66j23j9Rl00N0Q2K31j85L8rJ37l9j98
$$ -31 -74 -215 10 391 -22 111 -31 272 -96 11 177 54 35 44 -256 -206 -124 107 -78 -40 -49 88 49 -149
8102a49QQ5q6j0J35R9q5R3k54j10K17J64k22L32K6k90l3R4j34l3j3J9P9j7L41
$$ -149 -141 -56 -142 -152 -17 82 -3 90 -164 -274 -57 107 -115 217 243 -47 -80 14 -120 -153 -166 -147 -68 -85 256
8127B56k73k69K62J27j47k3J52m2oj26j07J65o7K76M0j4n3j49k2k41P3m9J78L2
$$ 256 -17 -286 -24 103 -44 -67 85 43 37 -89 -196 -31 -98 178 218 204 151 2 -20 -261 -188 -237 -59 -27
8151b7RM38l62k75N6JQ7j5q5K9l2L39k96L7k21M58m13L35l9K20J22m51KJ91O3
$$ -27 -18 420 58 -217 -161 -160 -73 -88 -173 -144 -176 163 -133 -96 -317 141 -272 63 24 244 366 -85 -83 108 171
8176A71j27m8K50l06pJ96l16K28j01P4m2K22l24K01J03
$$ 171 44 -4 246 -60 -67 129 -187 41 -60 14 -28 194 -130 71 174
8191A74
$$ Imaginary data points
##PAGE= N=2
##DATA TABLE= (X++(I..I)), XYDATA
0@%%%%%%%%mMqJ6j6J6k4L2l3M1m8N6o9P7q8J04j20J37j57J77k00K28k56K86l22
$$ 0 0 0 0 0 0 0 0 0 -4 0 -8 8 -8 8 -16 16 -17 24 -24 32 -37 40 -48 56 -64 73 -84 93 -107 121 -135 151 -171
33a71L61m04M52n00N52o12O79p52Q33r24J023j132J256j396J556j739J952k205
$$ -171 190 -214 238 -262 290 -322 357 -395 438 -486 537 -595 661 -735 821 -918 1034 -1171
51a171K508k881L351l968M815o054Q048j1768K1006q4115j47286J83154R7375
$$ -1171 1337 -1544 1807 -2161 2654 -3400 4648 -7120 13886 -70229 -217515 -34361 63014
64F3014j62473j29026J44056J17119j21178j18868J16520J22356q1938j02407
$$ 63014 -99459 -228485 -84429 32690 -88488 -207356 -90836 31520 -50418 -152825
74a52825Q7792J07194o0637q5533O9459Q8896n3568p8699N2784P3536m6978p2569
$$ -152825 -65033 42161 -18476 -104009 -34550 54346 778 -77921 -25137 48399 1421 -71148
86g1148M2396O7747l8656o8438L4657O9622k6378o5481L1143P7329j6207o7326
$$ -71148 -28752 38995 339 -68099 -33442 36180 9802 -55679 -24536 52793 36586 -30740
98c0740K4269Q1232q255p1392J6351Q2098n720p9524L420P8524k175q1303n053
$$ -30740 -6471 74761 66506 -4886 11465 93563 87843 8319 11739 90263 88088 6785 1732
111A732P2203m187q2820p344P1013l297p8542l597O7589r230p2672Q648O9714
$$ 1732 73935 69748 -13072 -20416 50597 47300 -31242 -34839 32750 23520 -49152 -40504 29210
124B9210j4624p1149J5914O9490j9785o9401K3434P1634k3994p2212K3359P2115
$$ 29210 14586 -56563 -40649 28841 9056 -60345 -36911 34723 10729 -61483 -38124 33991
136C3991k2993p1190K2603P0173k1318o9470J9159O8427j5952o4579J6024O4150
$$ 33991 10998 -60192 -37589 32584 11266 -58204 -39045 29382 13430 -51149 -35125 29025
148B9025j1256n9930J0625O0827l685n5656L836N7203K699n3769l761N4704R866
$$ 29025 17769 -42161 -31536 29291 25606 -30050 -26214 30989 33688 -20081 -23842 30862 40728
161D0728n0653j0285N1100J2626n0274j4268N0569J7451n1172j9962N0741K0005
$$ 40728 -9925 -20210 30890 43516 -6758 -21026 29543 46994 -4178 -24140 26601 46606
173D6606n3604k2400N4740K3930n8440k7727N7612K7224o0239k9510O0387K9650
$$ 46606 -6998 -29398 25342 49272 -9168 -36895 20717 47941 -12298 -41808 18579 48229
185D8229o2818l2722O1258L2162o1676l2516O0891L1122o1323l2693O0776L2510
$$ 48229 -14589 -47311 13947 46109 -15567 -48083 12808 43930 -17393 -50086 10690 43200
197D3200o0219l2439N8880L1473n8446l1900N7425L1937n5808l2574N2816L1921
$$ 43200 -17019 -49458 9422 40895 -17551 -49451 7974 39911 -15897 -48471 4345 36266
209C6266n1000l2514M8153L2809m5582l3292M2127L3793m0008l3409L8423L5454
$$ 36266 -14734 -47248 905 33714 -11868 -45160 -3033 30760 -9248 -42657 -4234 31220
221C1220l5023l5611L3628L7058k9755l6618K9287L9579k6943m0367K5412M2165
$$ 31220 -3803 -39414 -5786 31272 1517 -35101 -5814 33765 6822 -33545 -8133 34032
233C4032k2998m3207K1947M3727k1656m5619K0294M6415j9000m7580J8788M8217
$$ 34032 11034 -32173 -10226 33501 11845 -33774 -13480 32935 13935 -33645 -14857 33360
245C3360j8993m9127J9098N1050j7753n0786J7721N1805j6767n1441J7085N2047
$$ 33360 14367 -34760 -15662 35388 17635 -33151 -15430 36375 19608 -31833 -14748 37299
257C7299j6724n2221J5921N1001j6220n0496J5312M9753j5674m9575J4367M8580
$$ 37299 20575 -31646 -15725 35276 19056 -31440 -16128 33625 17951 -31624 -17257 31323
269C1323j3380m7851J3226M8236j2496m6469J1663M6920r704m5091Q831M5006
$$ 31323 17943 -29908 -16682 31554 19058 -27411 -15748 31172 21468 -23623 -14792 30214
281C0214p303m3927N762M2840l863m2673J898M1464j378m1974q16M0699K091m0935
$$ 30214 22911 -21016 -15254 27586 23723 -18950 -17052 24412 23034 -18940 -19756 20943 23034 -17901
295a7901l892M0239M787m1019n851M0903P752m1297r289M0603J0422m0070j1505
$$ -17901 -21793 18446 23233 -17786 -23637 17266 25018 -16279 -25568 15035 25457 -14613 -26118
308b6118L9977J2909m0682j4426M0645J4914m1148j5483M0635J5972m1331j6306
$$ -26118 13859 26768 -13914 -28340 12305 27219 -13929 -29412 11223 27195 -14136 -30442
320c0442M0953J7156m0660j7143L9784J8330l9827j8081L9424J9120l8672j9553
$$ -30442 10511 27667 -12993 -30136 9648 27978 -11849 -29930 9494 28614 -10058 -29611
332b9611L8297J9941l7744j9938L7197K0476l6986k0113L5448K0593l5341k0383
$$ -29611 8686 28627 -9117 -29055 8142 28618 -8368 -28481 6967 27560 -7781 -28164
344b8164L3379K1075l2409k2024L1377K2517l1076k3401K9978K3987k9103k4756
$$ -28164 5215 26290 -6119 -28143 3234 25751 -5325 -28726 1252 25239 -3864 -28620
356b8620K7602K4980k7280k5341K6765K5812k5763k6475K4367K7229k3330k7312
$$ -28620 -1018 23962 -3318 -28659 -1894 23918 -1845 -28320 -3953 23276 -54 -27366
368b7366K2273K8266k1493k8943K0926L0284j9854l0828K0103L1346j9295l1245
$$ -27366 -5093 23173 1680 -27263 -6337 23947 4093 -26735 -6632 24714 5419 -25826
380b5826J9083L1791j7504l2436J7299L2729j6052l2523J5806L3203j4731l3412
$$ -25826 -6743 25048 7544 -24892 -7593 25136 9084 -23439 -7633 25570 10839 -22573
392b2573J4511L4085j3651l4342J3402L4340j2567l4316J2532L4177j1419l4542
$$ -22573 -8062 26023 12372 -21970 -8568 25772 13205 -21111 -8579 25598 14179 -20363
404b0363J1112L4141j0147l4031R155L4118q857l3767P730L3196o623l3900N864
$$ -20363 -9251 24890 14743 -19288 -10133 23985 15128 -18639 -10909 22287 15664 -18236 -12372
417a2372L3795n112l3834M666L3321m057l2910L060L2403k283l2329R63L1741
$$ -12372 21423 16311 -17523 -12857 20464 16407 -16503 -13443 18960 16677 -15652 -14689 17052
430A7052K4l1712j210L1856J836l2408k575L1650L425l1512m615L1485N230l1710
$$ 17052 17076 -14636 -15846 16010 17846 -14562 -17137 14513 17938 -13574 -18189 13296 18526 -13184
444a3184n440L1053O004l0403p986L0275Q443l0231r350L0206R733l0470j0427
$$ -13184 -18624 12429 18433 -11970 -19956 10319 18762 -11469 -20819 9387 19120 -11350 -21777
457b1777L0321J1101k9973j1843K9540J1896k9734j2196K9136J2909k8846j3647
$$ -21777 8544 19645 -10328 -22171 7369 19265 -10469 -22665 6471 19380 -9466 -23113
469b3113K8299J3941k7450j4645K7292J4884k7100j5295K6744J5978k6601j5833
$$ -23113 5186 19127 -8323 -22968 4324 19208 -7892 -23187 3557 19535 -7066 -22899
481b2899K5833J6054k5228j5980K4628J6870k4065j7055K2989J7846k1842j8553
$$ -22899 2934 18988 -6240 -22220 2408 19278 -4787 -21842 1147 18993 -2849 -21402
493b1402K1465J9248k1152j9744K0848K0178j9861k0433J9452K0602j8914k0650
$$ -21402 63 19311 -1841 -21585 -737 19441 -420 -20853 -1401 19201 287 -20363
505b0363J8448K1373j7617k1776J7212K2420j6502k2188J5749K3419j5392k4294
$$ -20363 -1915 19458 1841 -19935 -2723 19697 3195 -18993 -3244 20175 4783 -19511
517a9511J5650K4813j5020k4721J4219K5123j3425k5127J3005K5674j2877k5391
$$ -19511 -3861 20952 5932 -18789 -4570 20553 7128 -17999 -4994 20680 7803 -17588
529a7588J2397K5421j1852k5630J1769K5558j0925k5857J1023K6236j0756k6056
$$ -17588 -5191 20230 8378 -17252 -5483 20075 9150 -16707 -5684 20552 9796 -16260
541a6260R615K6488r149k5838Q244K5442p660k6025P210K5618o072k5498N299
$$ -16260 -6645 19843 10694 -15144 -6900 18542 10882 -15143 -7933 17685 11613 -13885 -8586
554h586K4652m494k5119M486K4564l476k5225K943K4394j594k4869Q46K5160m06
$$ -8586 16066 11572 -13547 -9061 15503 12027 -13198 -10255 14139 12545 -12324 -11478 13682 13276
568A3276k5319q25K4983J524k4738k646K4586K650k4798l594K4953L857k5174
$$ 13276 -12043 -12868 12115 13639 -11099 -13745 10841 13491 -11307 -14901 10052 13909 -11265
581a1265l878K4474M915k5120n551K5289O045k5462o592K5438O784k5116p604
$$ -11265 -15143 9331 14246 -10874 -16425 8864 14909 -10553 -17145 8293 15077 -10039 -17643
594a7643K5009P780k4678p972K3958P935k3555p992K3240Q428k3076q933K3040
$$ -17643 7366 15146 -9532 -17504 6454 14389 -9166 -17158 6082 14510 -8566 -17499 5541
607E541Q428k2444q902K2503R538k2069r875K0910J0804k0414j0804J9419J1650
$$ 5541 13969 -8475 -17377 5126 14664 -7405 -17280 3630 14434 -5980 -16784 2635 14285
620A4285j9230j1540J8118J2590j7527j2485J6547J3032j6594j3477J6473J4458
$$ 14285 -4945 -16485 1633 14223 -3304 -15789 758 13790 -2804 -16281 192 14650
632A4650j5536j5132J5312J5828j5106j6247J5240J7072j4681j7610J4429J7902
$$ 14650 -886 -16018 -706 15122 16 -16231 -991 16081 1400 -16210 -1781 16121
644A6121j3492j8372J3593J8585j3129j8667J2964J8873j2835j8824J3264J9054
$$ 16121 2629 -15743 -2150 16435 3306 -15361 -2397 16476 3641 -15183 -1919 17135
656A7135j3211j9346J3441J9488j2785j9206J2168J9917j2329j9674J1601J9807
$$ 17135 3924 -15422 -1981 17507 4722 -14484 -2316 17601 5272 -14402 -2801 17006
668A7006j0855j9113J0312J8988j0387j9393J0257J9065r589j8458Q921J7882
$$ 17006 6151 -12962 -2650 16338 5951 -13442 -3185 15880 6291 -12167 -3246 14636
680A4636q469j8009Q058J8397p166j8799N895J8392m980j8297L897J8984l373
$$ 14636 6167 -11842 -3784 14613 7447 -11352 -5457 12935 7955 -10342 -6445 12539 9166
693I166j9628K525J8849j779j8525J425J8563r39j9355J94J9195M59j9969o29
$$ 9166 -10462 -7937 10912 9133 -9392 -7967 10596 9657 -9698 -9504 9691 10150 -9819 -10448
707a0448J9869J063k0395j814K0805K421k1149k771K0821K797k1389k781K1133
$$ -10448 9421 10484 -9911 -11725 9080 11501 -9648 -12419 8402 11199 -10190 -12971 8162
720H162L174k1091k881J9928K904k0117k986K0829K914k0908l274K0630L249k0583
$$ 8162 11336 -9755 -12636 7292 10196 -9921 -12907 7922 10836 -10072 -13346 7284 10533 -10050
734a0050l180K0282L749k0035m510J9212M953j8035m502J7198M749j7075n195
$$ -10050 -13230 7052 10801 -9234 -13744 5468 10421 -7614 -12116 5082 9831 -7244 -12439
747a2439J6454N507j5655n802J5501O355j5773p031J5764P853j4452q795J3790
$$ -12439 4015 9522 -6133 -11935 3566 9921 -5852 -12883 2881 10734 -3718 -12513 1277
760A277R488j3634r808J3313J1036j2527j1514J1734J2081j1169j2643J2050J3230
$$ 1277 10765 -2869 -12677 636 11672 -855 -12369 -635 11446 277 -12366 -316 12914
773A2914j2272j3453J2351J3814j2323j3478J2900J3848j2751j4982J3172J4586
$$ 12914 642 -12811 -460 13354 1031 -12447 453 14301 1550 -13432 -260 14326
785A4326j1830j5077J2268J5061j2226j4944J1770J5170j1777j4381J1668J3914
$$ 14326 2496 -12581 -313 14748 2522 -12422 -652 14518 2741 -11640 28 13942
797A3942j2091j3761J2389J3975j1900j3718J1160J3121j0664j2924J0248J3577
$$ 13942 1851 -11910 479 14454 2554 -11164 -4 13117 2453 -10471 -223 13354
809A3354r533j3784Q189J3377p590j3480P569J3342o760j3772N879J3373n524
$$ 13354 3821 -9963 -1774 11603 4013 -9467 -1898 11444 4684 -9088 -3209 10164 4640
822D640j2914N047J3466n039j3993L598J4492k903j4600J968J4977j979j5511
$$ 4640 -8274 -3227 10239 5200 -8793 -5195 9297 6394 -8206 -6238 8739 6760 -8751
835h751J084J5904m31j6470R21J5618m08j6646Q21J6390j12j6578n45J6732p1
$$ -8751 -7667 8237 7806 -8664 -7743 7875 7467 -9179 -8358 8032 7920 -8658 -9203 7529 7458
850G458j6917J18J7152N18j8037n75J7482N25j7140l26J7208K7j6658r29J6623
$$ 7458 -9459 -9341 7811 8329 -9708 -10283 7199 7724 -9416 -9742 7466 7493 -9165 -10094 6529
865F529N12j5605n28J5561L23j5539r58J5304J586j4754j539J4434J707j4389
$$ 6529 7041 -8564 -9092 6469 6792 -8747 -9705 5599 7185 -7569 -9108 5326 7033 -7356
879g356k238J4020L418j3309l568J2453L758j1841m697J2211N353j1788n591J1280
$$ -7356 -9594 4426 7844 -5465 -9033 3420 7178 -4663 -9360 2851 8204 -3584 -9175 2105
893B105O115j1320o367J1289P853j1456q264J1401Q271j0797r010J1594R361j1223
$$ 2105 8220 -3100 -9467 1822 9675 -1781 -10045 1356 9627 -1170 -10180 1414 10775 -448
907d48r605J0826J0119j0717j0104J0848J0663j1198j0484J0923J1084j1320j0512
$$ -448 -10053 773 10892 175 -9929 919 11582 384 -10100 823 11907 587 -9925
920i925J1332J0930j1839j0726J1616J0947j1005j0729J0591J0556j0799j0411
$$ -9925 1407 12337 498 -10228 1388 12335 1330 -9399 1192 11748 949 -9462
932i462J0763J0178r721j0427R398R970q887j0053Q624J0071q054j0780Q096R986
$$ -9462 1301 11479 1758 -8669 729 10699 1812 -8241 383 10454 2400 -8380 -284 9702
946I702p483r906O962R885o283j0532N712J0640n104j0715M490J0915m472j1335
$$ 9702 2219 -7687 -725 9160 2877 -7655 -1943 8697 3593 -7122 -2632 8283 3811 -7524
960g524L845J1487l378j1833L209J1504k613j2142J937J2793j813j2720J095J2779
$$ -7524 -3679 7808 4430 -7403 -4194 7310 4697 -7445 -5508 7285 5472 -7248 -6153 6626
974F626j392j3042J459J3342j399j3442Q48J3180q90j3341R30J3550o86j3868
$$ 6626 5234 -7808 -6349 6993 5594 -7848 -7000 6180 5290 -8051 -7121 6429 5743 -8125
988h125M32J3667m51j3756N56J3353l88j3099Q9J3141L42j3546J36J2490M55j1908
$$ -8125 -7693 5974 5523 -8233 -7677 5676 5288 -7811 -7722 5419 5761 -7785 -7649 4841 5296 -6612
1004f612r89J2197J360j2388j285J1538J684j1366j956J1203K493j0784k624J0889
$$ -6612 -7601 4596 5956 -6432 -7717 3821 5505 -5861 -7817 3386 5879 -4905 -7529 3360
1018C360K773j0695k950J0232L658r951m221J0080M373r204n051R776N059r206
$$ 3360 6133 -4562 -7512 2720 6378 -3573 -7794 2286 6659 -2545 -7596 2180 7239 -1967
1032a967n636R089O259r169o230R648O512r245o821Q994P499r052p782R169P843
$$ -1967 -7603 1486 7745 -1424 -7654 1994 8506 -739 -7560 1434 8933 -119 -7901 1268 9111
1047I111r089p484Q591Q361r030q204R056Q334r199q067Q970Q337r099p608P977
$$ 9111 22 -7462 1129 9490 460 -7744 1312 9646 447 -7620 1350 9687 588 -7020 957
1062I57Q384q308p976Q031Q089p550q566P543Q068p223q400P330Q498p093q623
$$ 957 9341 1033 -6943 1088 9177 1627 -6939 604 8672 1449 -6951 379 8877 1784 -6839
1077f839O960Q232o524p967N744Q062n413q540N001Q286m223q855M326Q859m204
$$ -6839 121 8353 1829 -6138 -394 7668 2255 -6285 -1284 7002 2779 -6076 -1750 7109 2905
1092B905r087L656R448l676r747L275R726l397r520L021R371k270j0171J912J0431
$$ 2905 -6182 -2526 6922 3246 -6501 -3226 6500 3103 -6417 -3396 5975 3705 -6466 -4554 5877
1107E877k138j0489J898J0159j443j0619J338J0921j203j1273J441J0649j252
$$ 5877 3739 -6750 -4852 5307 3864 -6755 -5417 5504 4301 -6972 -5531 5118 3866
1120C866j0280P02J0423m82j0761N07J0497k95j0728L59J0964l36j0907K98J0428
$$ 3866 -6414 -5712 4711 4229 -6532 -6025 4472 4177 -6551 -6192 4772 4436 -6471 -6173 4255
1135D255l0j0608J77J0348Q9r991j18R772P02j0118o18R358J897r630j757R472
$$ 4255 4225 -6383 -6206 4142 4231 -5760 -5878 3894 4596 -5522 -6140 3218 5115 -4515 -6272 3200
1151C200J904r231j786Q923K498r151k573Q811L022q624l127Q962K780p879l824
$$ 3200 5104 -4127 -5913 3010 5508 -3643 -6216 2595 5617 -3007 -6134 2828 5608 -2271 -6095
1166f095Q477M266q529m228Q432M461p751n011Q328M739p964n522Q435N317p914
$$ -6095 2382 6648 -1881 -6109 2323 6784 -967 -5978 2350 7089 -875 -6397 2038 7355 -559
1181e59n549Q219N450p873n509P737N790p927n893P648O465p570o502P473O458
$$ -559 -6108 2111 7561 -312 -5821 1916 7706 -221 -6114 1534 7999 429 -6073 1400 7858
1196G858p725n990P351O485p536o171P184N681o398o259O309O552o060o684N722
$$ 7858 133 -5857 1494 7979 443 -5728 1456 7137 739 -5520 789 7341 1281 -5403 319
1211C19O703n944o871N854O730n629p245N885O920n063p176M605O791m072p067
$$ 319 7022 1078 -5793 61 6791 1162 -6083 -198 6722 1659 -5517 -912 5879 1807 -5260
1226e260L795O930l678p478L352P598l155p919L092Q204l347q009K713Q444k743
$$ -5260 -1465 5465 1787 -5691 -2339 5259 2104 -5815 -2723 5481 2134 -5875 -3162 5282 2539
1241B539q544K441Q294j996r112K797Q417j890q912J512R100j701r095J663R008
$$ 2539 -6005 -3564 4730 2734 -6378 -3581 4836 2946 -5966 -4454 4646 2945 -6150 -4487 4521
1256D521j709r128J560Q908j147r438J389R074r27q972Q77Q961r09q650L75R002
$$ 4521 2812 -6316 -4756 4152 3005 -6433 -5044 4030 3103 -5869 -4992 3969 3060 -5590 -5215 3787
1272C787o30q379M79Q509q57q029N80P993Q7q011k9P935N06p995j82P344R96p727
$$ 3787 3157 -5222 -4743 3766 2909 -5120 -4540 3453 3540 -4471 -4500 3435 3941 -4054 -4236 3108 4104 -3623
1290c623j176Q010J482p433j946P599J816p109k257P283K353p190k391P451K640
$$ -3623 -4799 3211 4693 -2740 -4686 2913 4729 -2380 -4637 2646 4999 -2191 -4582 2869 5509
1305E509p401l033P536L529p382l503P334L633p139m206P587M204p188m930P701
$$ 5509 -1892 -4925 2611 6140 -1242 -4745 2589 6222 -917 -5123 2464 6668 -520 -5450 2251
1320B251M572p372m283P172M664p467m450P563L951p174m348P358M281p178m895
$$ 2251 6823 -549 -4832 2340 7004 -463 -4913 2650 6601 -573 -4921 2437 6718 -460 -5355
1335e355P236M868o890m831O811M549o629m495N850M857n407n222N314M978n368
$$ -5355 1881 6749 -141 -4972 1839 6388 -241 -4736 1114 5971 564 -4658 656 5634 266
1350B66m739M997M917m848n810N518M587m480n503M295N800m196n954L493O484
$$ 266 -4473 524 5441 593 -5217 301 4888 408 -5095 -800 5000 804 -5150 -1657 4827
1365D827l421o412L422O210l359o559L018O723l089o764K840O929l149p025K833
$$ 4827 1406 -5006 -1584 4626 1267 -5292 -2274 4449 1360 -5404 -2564 4365 1216 -5809 -2976
1380b976P110k752p460K886Q049l166p690J930Q478k420p869K260P852k131p967
$$ -2976 4134 1382 -6078 -3192 4857 1691 -5999 -4069 4409 1989 -5880 -3620 4232 2101 -5866
1395e866K067P428j616p518J793P374k022p269K241P505j783p648J611P040p09
$$ -5866 -3799 3629 2013 -5505 -3712 3662 1640 -5629 -3388 4117 2334 -5314 -3703 3337 2628
1410B628p297J102P465j206o946R28O367k89o456N64O276j86o294q2O230L85o029
$$ 2628 -4669 -3567 3898 2692 -4254 -3326 3041 2752 -3704 -3140 3136 2950 -3344 -3426 2804 3189 -2840
1427b840n82O561R04o872j275P196J873o941j550O180K152o573k422O948K338
$$ -2840 -3422 3139 4043 -2829 -4104 3092 4965 -1976 -3526 2654 4806 -1767 -4189 2759 5097
1442E097o184k959O362K826o288l297P167L306p268l233O912L401o946k882O753
$$ 5097 -1087 -4046 2316 5142 -1146 -4443 2724 6030 -1238 -4471 2441 5842 -1104 -3986 2767
1457B767L337p318l131O757L384o272l208O280L031o497l352O705L145o413l190
$$ 2767 6104 -1214 -4345 2412 5796 -476 -3684 2596 5627 -870 -4222 2483 5628 -785 -3975
1472c975N960L291o474l079O265L045n828l152N289L316n048l789M923L727m462
$$ -3975 1985 5276 -1198 -4277 1988 5033 -795 -3947 1342 4658 -390 -4179 744 4471 9
1487Im130M172M019l903m135L734M511m278m336L817M423l398n052L543N005l372
$$ 9 -4121 51 4070 167 -3968 -234 4277 -1 -4337 -520 3903 505 -4547 -1004 4001 629
1503F29n701L157N764k543o232K843O105k983o583K741O576k457o695K820O536
$$ 629 -5072 -1915 3849 1306 -4926 -2083 4022 1039 -5544 -2803 3773 1316 -5379 -2559 3977
1518C977l373o038K688O982l115o361K102O831k846o397K810P031k602o878K160
$$ 3977 604 -5434 -2746 4236 1121 -5240 -3138 3693 847 -5550 -2740 4291 1689 -5189 -3029
1533c029O642k276o412K373O364k181o041J991N728j643n820J691N684j443n324
$$ -3029 3613 1337 -5075 -2702 3662 1481 -4560 -2569 3159 1516 -4304 -2613 3071 1628 -3696
1548c696J317N540r34n688Q26N600n28n763L88O118j59n343l87N482L43n204q57
$$ -3696 -2379 3161 2227 -3461 -2635 2965 2437 -3326 -2938 3180 3021 -2322 -2709 2773 3116 -2088 -2945
1565b945N607J293n867j475N820J657n748j815O637J522o194k049O194J990n874
$$ -2945 2662 3955 -1912 -3387 2433 4090 -1658 -3473 3164 4686 -1508 -3557 2637 4627 -1247
1580a247k159O292K139o485k284O328K254o064k022O227K111o569k100O465K122
$$ -1247 -3406 2886 5025 -1460 -3744 2584 4838 -1226 -3248 2979 5090 -1479 -3579 2886 5008
1595E008o405j836O089J927o156j846O176J720n734k166N054K434n326k172N191
$$ 5008 -1397 -3233 2856 4783 -1373 -3219 2957 4677 -1057 -3223 1831 4265 -1061 -3233 1958
1610A958K191n004k171M289K692m899k808M686L107m561k952L767L100m047k789
$$ 1958 4149 -855 -3026 1263 3955 -944 -3752 934 4041 -520 -3472 295 3395 -652 -3441
1625c441L531L613l561m152L215M228l483m263L437M122l063m515K930M842k935
$$ -3441 90 3703 142 -4010 -795 3433 -50 -4313 -876 3246 183 -4332 -1402 3440 505
1640E05m852L123M696l299m990L024N295k827n508K939N334k931n465K936N782
$$ 505 -4347 -1224 3472 173 -4817 -1793 3502 675 -4833 -1894 3440 509 -4956 -2020 3762
1655C762l326n348K762N378k623n691L492N057k894n164K506N034k306n033K800
$$ 3762 436 -4912 -2150 3228 605 -5086 -1594 3463 569 -4595 -2089 2945 639 -4394 -1594
1670a594M753k386n143K593M596j712m913K134M616j619m776J499M822j282m391
$$ -1594 3159 773 -4370 -1777 2819 1107 -3806 -1672 2944 1325 -3451 -1952 2870 1588 -2803
1685b803P91M972j081m562N77M743j39m815J58M721m5m816J10M971M66n324k64
$$ -2803 -2012 2960 1879 -2683 -2106 2637 2498 -2317 -2159 2562 2517 -2299 -2189 2782 3248 -2076 -2340
1702b340N227L37m789r96N620R28n565j021N286J284n199j386N483J273n692j273
$$ -2340 2887 3224 -1565 -2561 3059 3987 -1578 -2599 2687 3971 -1228 -2614 2869 4142 -1550 -2823
1718b823N599J400n333j738N571J319n234j511N419J307n450j329N281J356n207
$$ -2823 2776 4176 -1157 -2895 2676 3995 -1239 -2750 2669 3976 -1474 -2803 2478 3834 -1373
1733a373j369N433J313n296j622M869J842m722j946M550J811m454j900L973K398
$$ -1373 -2742 2691 4004 -1292 -2914 1955 3797 -925 -2871 1679 3490 -964 -2864 1109 3507
1748C507m599k085M296K137l879k612L872K251l704k468L575K766l608k877L121
$$ 3507 -1092 -3177 1119 3256 -623 -3235 637 2888 -816 -3284 291 3057 -551 -3428 -307
1763c07L282l687l090L033L505k965l754L163L796l063m180L319L632k933l975
$$ -307 2975 -712 -3802 -769 2736 -229 -3983 -820 2976 -87 -4267 -948 2684 -249 -4224
1778d224L233L718l233l537K918M077l057m319L248M324l243m294L085M263k687
$$ -4224 -991 2727 -506 -4043 -1125 2952 -105 -4424 -1176 3148 -95 -4389 -1304 2959 272
1793B72m465K654M477k997m189L265L854k733l962K341M576k384m242K158M552
$$ 272 -4193 -1539 2938 -59 -4248 -983 2871 138 -3824 -1483 3093 709 -3533 -1375 3177
1808C177k291m387K042M486j948m042J604M207j693l725J419M262j313m357J288
$$ 3177 886 -3501 -1459 3027 1079 -2963 -1359 2848 1155 -2570 -1151 3111 1798 -2559 -1271
1823a271L759n74m042O30M570q42m483N12M759o57m203N57M377n07m364n5M592
$$ -1271 2488 1914 -2128 -1498 3072 2230 -2253 -1741 3018 2361 -1842 -1285 3092 2585 -1779 -1834 2758
1840B758K19m435l69M417N39m756n01M841O68m891m22M924M54m907m48M560N46
$$ 2758 2977 -1458 -1827 2590 3129 -1627 -2128 2713 3381 -1510 -1932 2992 3446 -1461 -1909 2651 3197
1857C197m307q15M850N74m906o52M431R06m743o73M652Q20m862p51M251P95m597
$$ 3197 -1110 -1925 2925 3499 -1407 -2059 2372 3278 -1465 -2138 2514 3334 -1528 -2279 1972 2767 -1830
1874a830o33M403N82l775j292L992J574m433j294L946J125l490j612L424K117
$$ -1830 -2463 1940 2522 -1253 -2545 1447 3021 -1412 -2706 1240 2365 -1125 -2737 687 2804
1889B804m061j671L513J795l842j455L202K149l165k213K745K648l191k575K950
$$ 2804 -1257 -2928 585 2380 -1462 -2917 285 2434 -731 -2944 -199 2449 -742 -3317 -367
1904c67K717l073k441K828K741k674l311L047L175l058l503L073L293k964k996
$$ -367 2350 -723 -3164 -336 2405 -269 -3580 -533 2642 -416 -3919 -846 2447 -517 -3513
1919c513K715L249k747l145K468L468k779l357K515L695k743l411K578L452k575
$$ -3513 -798 2451 -296 -3441 -973 2495 -284 -3641 -1126 2569 -174 -3585 -1007 2445 -130
1934a30l395K491L738k861k982K452L135k093l635K449L634k490k960K041L327
$$ -130 -3525 -1034 2704 -157 -3139 -687 2448 355 -3280 -831 2803 313 -2647 -606 2721
1949B721j633l450J519L469j624l239J463L233j335l138J196L482j097l430N77
$$ 2721 1088 -2362 -843 2626 1002 -2237 -774 2459 1124 -2014 -818 2664 1567 -1863 -1286
1964a286L953o50l962N62L876o53l186M28L114L41m084K77M044l11m036J94L868
$$ -1286 2667 2017 -1945 -1383 2493 1840 -1346 -918 2196 2537 -1547 -1270 2774 2463 -1573 -1379 2489
1981B489j55l744n0M099ll939m43M313L02m080l29L698P19m220l12L946K70l807
$$ 2489 2334 -1410 -1460 2639 2636 -1303 -1746 2567 2869 -1211 -1540 2158 2877 -1343 -1655 2291 2561 -1246
1999a246o43M183Q2l789n27L896M86l710p80L889O48l678j144M034N55l665j005
$$ -1246 -1889 2294 2376 -1413 -1940 1956 2442 -1268 -2048 1841 2489 -1189 -2333 1701 2256 -1409 -2414
2016b414L534J357l737j116L222J222l314q86K691R68k941j112K847J905l347
$$ -2414 1120 2477 -1260 -2376 846 2068 -1246 -2132 559 1527 -1414 -2526 321 2226 -1121
2031a121j417K378J874k770j758K536K483k943k321K647K329k557k446K374K330
$$ -1121 -2538 -160 1714 -1056 -2814 -278 2205 -738 -3059 -412 1917 -640 -3086 -712 1618
2046A618k468k269K441K489k434k685K749K672k841k545K684L145k815k873K443
$$ 1618 -850 -3119 -678 1811 -623 -3308 -559 2113 -728 -3273 -589 2556 -259 -3132 -689
2061f89K991k395l192K534K968k441k931K991K008k112k472K079K982k068k674
$$ -689 2302 -93 -3285 -751 2217 -224 -3155 -164 1844 -268 -2740 -661 2321 253 -2421
2076b421J901K976k181k786J844L141j791k922J421L279j668k563J486K399q45
$$ -2421 -520 2456 275 -2511 -667 2474 683 -2239 -818 2461 793 -1770 -284 2115 1270
2091A270k865Q63K816p86k937J228K752j085k937Q98L122n07l209O07L185o12
$$ 1270 -1595 -732 2084 1298 -1639 -411 2341 1256 -1681 -783 2339 1832 -1377 -770 2415 1803
2107A803l358L04L664q4l543R7L440j29l322J93L391j03l460M9L370j86l568L18
$$ 1803 -1555 -1251 2413 2329 -1214 -1117 2323 2194 -1128 -935 2456 2353 -1107 -1058 2312 2126 -1442 -1124
2125a124L149K37l801P2L711M24m154n8L688O0l639j20L315J2l084k17L217L44
$$ -1124 2025 2262 -1539 -1467 2244 2668 -1486 -1544 2144 2204 -1435 -1555 1760 1772 -1312 -1529 1688 2032
2143B032l563j16L228j2k864n34L233L41l148q30K914Q73k718o23K056R81k268
$$ 2032 -1531 -1647 1581 1569 -1295 -1829 1404 1745 -1403 -2233 681 1554 -1164 -1787 269 1250 -1018
2160a018j030K524R56k324j428K106J708k462j617K810J551k786j763K654J616
$$ -1018 -2048 476 1432 -892 -2320 -214 1494 -968 -2585 225 1776 -1010 -2773 -119 1497
2175A497k481j816K647K257k698k046K306K166k566k281K534K592k689k422K606
$$ 1497 -984 -2800 -153 2104 -594 -2640 -334 1832 -734 -3015 -481 2111 -578 -3000 -394
2190c94K414k888k390L351J753k589k113K592K220k410k009K009K727k562k420
$$ -394 2020 -868 -3258 93 1846 -743 -2856 -264 1956 -454 -2463 -454 2273 -289 -2709
2205b709K298K530k165k216J945K264j931k041J977K238k096j977J674K050j387
$$ -2709 -411 2119 -46 -2262 -317 1947 16 -2025 -48 2190 94 -1883 -209 1841 454
2220D54k375J757K182j185k546J172K959j093k989J462K405r21k649O66K754p39
$$ 454 -1921 -164 2018 833 -1713 -541 2418 1325 -1664 -202 2203 1282 -1367 -701 2053 1314
2236A314k628L95K786j53k928M77L096l54l343M15L312k61l720O91L317m38l431
$$ 1314 -1314 -919 1867 1714 -1214 -737 2359 2005 -1338 -923 2389 2128 -1592 -901 2416 1978 -1453
2253a453N88K916m22l123L27L631p42l223N23L129n01l446L86L371m00k703j38
$$ -1453 -865 2051 1629 -1494 -1167 2464 1722 -1501 -978 2151 1650 -1796 -1410 1961 1561 -1142 -1280
2270a280L396l21l079n4K662k92k560J79K413O22k860k91K575j32k290j23K314
$$ -1280 2116 1795 -1284 -1338 1324 1032 -1528 -1349 1064 1686 -1174 -1465 1110 978 -1312 -1435 879
2287H79P9k063o13K246O90k378q18K418R11k526j053K086J681k343j041J957R14
$$ 879 958 -1105 -1718 528 1218 -1160 -1978 440 1351 -1175 -2228 -142 1539 -804 -1845 112 1026
2304A026j825j930K304J809k126j787K641J461k367k016K737J519j817j928K193
$$ 1026 -799 -2729 -425 1384 -742 -2529 112 1573 -794 -2810 -73 1446 -371 -2299 -106
2319a06J691k172j803K395J944k502j822K211K133k925j632K442J796k126j905
$$ -106 1585 -587 -2390 5 1949 -553 -2375 -164 1969 -956 -2588 -146 1650 -476 -2381
2334b381K630J662k449j633K263J670j921j562J778J570j590j780J912J637j475
$$ -2381 249 1911 -538 -2171 92 1762 -159 -1721 57 1627 37 -1743 169 1806 331
2349C31j994J472J958j309j988J638J577j166j763J170K152p54k539R75J886o87
$$ 331 -1663 -191 1767 458 -1530 108 1685 519 -1244 -74 2078 1324 -1215 -240 1646 959
2365I59k340P89K633r75k143M83K444o95k302N20K758r07k774J018K758q67k470
$$ 959 -1381 -592 2041 1066 -1077 -594 1850 1155 -1147 -627 2131 1224 -1550 -532 2226 1359 -1111
2382a111O20L022j215k698R52K639r44k378K68L200q53k781K73K810l67k736L63
$$ -1111 -491 2531 1316 -1382 -430 2209 1265 -1113 -845 2355 1502 -1279 -1006 1804 1437 -1299 -936
2399i36K872o63k612M86K684j035k231N03K497n64k526L58K371l42k170J89K109
$$ -936 1936 1273 -1339 -853 1831 796 -1435 -932 1565 1001 -1525 -1167 1204 862 -1308 -1119 990
2416I90o4k141P4J947L93k472j46J767M31j864n54K331M34k062q39K075P10j876
$$ 990 926 -1215 -1141 806 1199 -1273 -1419 348 779 -1085 -1639 692 1126 -936 -1775 300 1010 -866
2434h66r36K180R22k338q40J969J148k167j163K415R75k484j221K604J064k002
$$ -866 -1802 378 1300 -1038 -1878 91 1239 -928 -2091 324 1299 -1185 -2406 198 1262 -740
2450g40j520K275J479k309j234K135J380k108j449J940J660k243j416K344J288
$$ -740 -2260 15 1494 -815 -2049 86 1466 -642 -2091 -151 1509 -734 -2150 194 1482
2465A482k213j246K216J043j894j198K339J371k440j336K379J065j968q73J901
$$ 1482 -731 -1977 239 1282 -612 -1810 529 1900 -540 -1876 503 1568 -400 -1273 628
2480F28J057j572j807J921J518j513j328J327J532j500j272J247J569j167j861
$$ 628 1685 113 -1694 227 1745 232 -1096 231 1763 263 -1009 238 1807 640 -1221
2495a221J365J420p03j988R40K081j052j474M32K212j020j824O64K283j073j909
$$ -1221 144 1564 861 -1127 -187 1894 842 -632 -200 2012 992 -832 -168 2115 1042 -867
2511h67P93K311r99j986M47K008m85k499P78K423r10k205O36K347q69k275Q43
$$ -867 -74 2237 1238 -748 -301 1707 1222 -1277 -499 1924 1014 -1191 -555 1792 923 -1352 -509
2528e09K334r49k230O47K461q90k120M25K033o21j809O80J931q57j624J02J984
$$ -509 1825 876 -1354 -707 1754 864 -1256 -831 1202 581 -1228 -548 1383 526 -1098 -996 988
2545I88j87k028K90J799n71j829L66J865J5j621l75K016J71k113M4J539M72k140
$$ 988 801 -1227 -937 862 291 -1538 -1172 693 708 -913 -1288 728 899 -1214 -1170 369 841 -1299
2563a299n5J678O20k188l10K018L53j895o74K088M47j942l83J839N20k128o68
$$ -1299 -1354 324 944 -1244 -1554 464 817 -1078 -1752 336 783 -1159 -1542 297 817 -1311 -1979
2580a979K041J023k205p79K345Q97k159j097K367Q10j973q66J678J065j761j126
$$ -1979 62 1085 -1120 -1899 446 1343 -816 -1913 454 1264 -709 -1575 103 1168 -593 -1719
2596a719K055P03j949o00J917Q21j736j004J733J383k204q12K152P11j693n87
$$ -1719 336 1039 -910 -1510 407 1228 -508 -1512 221 1604 -600 -1412 740 1451 -242 -829
2612h29J541Q06j552j044J609J305j791r72J396O18q80r96J519Q63j231j369J702
$$ -829 712 1518 -34 -1078 531 1836 45 -927 469 1087 207 -789 730 1593 362 -1007 695
2629F95J114j567j241J009J673r03j813J155J412r50j365J266J310j108k031J342
$$ 695 1809 242 -999 10 1683 780 -1033 122 1534 584 -781 485 1795 687 -1344 -2
2645bJ776j033j807J100J835j096j862J033J479j087j560P87J927r69j835J116
$$ -2 1774 741 -1066 34 1869 773 -1089 -56 1423 336 -1224 -437 1490 521 -1314 -198
2661a98J737q84k017R71J592o79k003R40J834p86j988Q70J888p06j786M50J939
$$ -198 1539 655 -1362 -391 1201 522 -1481 -541 1293 507 -1481 -611 1277 571 -1215 -765 1174
2678A174n07k193R48J331n37j554K92K010n67j662R8J899k42j853K09J733j30
$$ 1174 667 -1526 -578 753 216 -1338 -1046 964 397 -1265 -1167 732 490 -1363 -1154 579 449
2695D49j593j23J585M57j702j89J624J4j726k63K153j19j698m51J851M92j863
$$ 449 -1144 -1267 318 775 -927 -1116 508 522 -1204 -1467 686 567 -1131 -1582 269 761 -1102
2712a102n83J848N24j795n12K052N77j664q28J869M79j787l03J745O36j960n62
$$ -1102 -1685 163 687 -1108 -1620 432 1009 -655 -1483 386 865 -922 -1225 520 1156 -804 -1366
2729a366J843N44j533q10J836M99j326p07J859M64j601r00J803N34j579l95J684
$$ -1366 477 1021 -512 -1322 514 1013 -313 -1020 839 1303 -298 -1198 605 1139 -440 -835 849
2746H49N92j752l84J409O28j390n38J120Q29j281o82J224P73j370p90J287O70
$$ 849 1441 -311 -695 714 1342 -48 -586 534 1363 82 -600 624 1397 27 -763 524 1194
2763A194j196n26P87J334j325q65J099J047j305j051J023J130o92j263P32J064
$$ 1194 -2 -528 259 1593 268 -597 502 1549 244 -807 216 1346 654 -609 123 1187
2779A187n00j460J124J264j138j506J173J175r40j162Q93J037p67j401O56J552
$$ 1187 687 -773 351 1615 477 -1029 144 1319 379 -783 110 1147 380 -1021 -365 1187
2795A187p85j347N02J691q47j284N11J735j270j499Q89J667j139j104M87J208
$$ 1187 402 -945 -443 1248 401 -883 -372 1363 93 -1406 -517 1150 11 -1093 -606 602
2811F02j7j892P22J312r35j240R00J212q29j085O48J569q69j645P56J353k96j378
$$ 602 585 -1307 -585 727 -208 -1448 -548 664 -165 -1250 -602 967 98 -1547 -791 562 266 -1112
2829a112L08J371o0j740K04J469k41j034l57J439Q0j418J63J330J86j673M1J626
$$ -1112 -804 567 507 -1233 -1029 440 199 -835 -1192 247 327 -1091 -928 402 588 -1085 -1044 582
2847E82J67j860j38J932j08j419l20J972M1j543l17J605N1j316m99J727M15j717
$$ 582 749 -1111 -1249 683 575 -844 -1164 808 849 -694 -1011 594 645 -671 -1170 557 972 -745
2865g45l08J711L70j807O8J391O83j791q25K129Q9j326n73J976J54j559l10J510
$$ -745 -1053 658 1028 -779 -711 680 1363 -428 -1253 876 965 -361 -934 1042 1196 -363 -673 837
2883H37L11j274m67J231P93j610l11R02Q86j181o41J258N96j261o11J267O77j166
$$ 837 1148 -126 -593 638 1431 -179 -490 412 1298 117 -524 734 1330 69 -542 725 1402 236
2901B36j174J211J049q38j271J144J028r54r78R11R93j023r10P22J374j133j489
$$ 236 -938 273 1322 484 -787 357 1385 431 -547 364 1357 334 -576 146 1520 387 -1102
2918a102J234J496j196j491R31J500j172j198Q38J470j150j465J332R43r07r91
$$ -1102 132 1628 432 -1059 -128 1372 200 -998 -160 1310 160 -1305 27 970 63 -928
2934i28Q36R18p99j145Q75J099p96j131P14J243p76j474P75J407j033j223Q79
$$ -928 -92 826 27 -1118 -243 856 60 -1071 -357 886 110 -1364 -589 818 -215 -1438 -559
2951e59J307o95j466N87J517q29j156M89J368q69j072L59J450l6j673J95J470
$$ -559 748 53 -1413 -826 691 -138 -1294 -805 563 -306 -1378 -1019 431 395 -1278 -1083 387
2968C87Lj429J4J258l22r39J30J418K2j551l75J970q6j468LJ534K6j699K29J357
$$ 387 390 -1039 -1025 233 -89 -1028 -898 520 542 -1009 -1384 586 500 -968 -965 569 595 -1104 -875 482
2988D82K38j748L2J433L52j317m50J766qj609r5J503J98j317j34J696o2j780K76
$$ 482 720 -1028 -996 437 789 -528 -978 788 780 -829 -924 579 777 -540 -674 1022 960 -820 -544
3007e44J525j09j131l39J514K22j275n05J175O59j446k09J077K08o25o49J202
$$ -544 981 872 -259 -598 916 1138 -137 -642 533 1192 -254 -463 614 822 197 -452 750
3024G50K05j023l57Q29N52p96p12J177R39j477p90J087R41j382n74R81N82m86
$$ 750 955 -68 -425 404 956 160 -552 625 1564 87 -703 384 1325 -57 -631 350 932 446
3042D46j199J156P44q44j036P96J170j288p48R40R30o71j468Q79J292j271o04
$$ 446 -753 403 1147 303 -733 63 1233 -55 -803 137 1067 396 -1072 -193 1099 -172 -776
3059g76P04J362j217j011R18J018q77j137Q77Q98q91j352J271R06j025p49J098
$$ -776 -72 1290 73 -938 -20 998 121 -1016 -139 759 -132 -1484 -213 693 -332 -1081 17
3076A7N07o93j158R84R58q60o66M01J303p61r24J88J312o61q33L07R30k35j298
$$ 17 524 -169 -1327 -343 615 -245 -911 -510 793 32 -892 -704 608 -53 -886 -579 351 116 -1182
3095a182O69R79m18j024L81J071m06j129L19J102q1j318k07J499J87j443L16J249
$$ -1182 -513 466 48 -976 -595 476 70 -1059 -740 362 281 -1037 -1244 255 442 -1001 -685 564
3113E64m0j488J69J122J0q63k71J454K7j455JJ526j36j239j30J456J49j392j11
$$ 564 524 -964 -795 327 337 -526 -797 657 684 -771 -770 756 620 -619 -749 707 856 -536 -647
3132f47J222L50j162R5J022k68q29k08J251j08j133l48J487J77j151j09J160K36
$$ -647 575 925 -237 -142 880 612 -217 -425 826 718 -415 -763 724 901 -250 -359 801 1037
3150A037j244k50J277K29j286N3R76L99j174q63J659J55q65j86R11J60j181k39
$$ 1037 -207 -457 820 1049 -237 -184 792 1191 17 -846 813 968 103 -83 828 988 -193 -432
3168d32J301J66r84l91P89O50j009o10P21R60j009n72O90R48r62j154J291O76
$$ -432 869 1035 51 -340 449 1099 90 -520 201 1161 152 -420 270 1218 256 -898 393 1069
3186A069j300n48J265L08j163j78N95Q17r47n93M61R06m02j097P00Q58r64q38
$$ 1069 -231 -779 486 794 -369 -547 48 865 -82 -675 -214 692 290 -807 -107 751 -213 -1051
3204a051R90P86j035o53Q04Q25r85l22K65N96j41j016K43J150p56m64M25O25k65
$$ -1051 -61 725 -310 -963 -159 666 -319 -641 -376 220 79 -937 -694 456 -300 -764 -339 286 21
3223B1j176P70P27m32o81K61Q75n07p23K45Q02r2r60K57J049m25r60J6J242k55
$$ 21 -1155 -385 342 -90 -771 -510 365 -142 -865 -620 182 90 -870 -613 436 11 -949 -933 309 54
3243E4q12J71Q46J0j166L31R70n1j238K01J239j7j170P6J193j11q34j02J169m7
$$ 54 -758 -587 259 269 -897 -566 404 353 -885 -684 555 538 -632 -556 637 526 -308 -410 759 712
3263G12j390K25J350m18q33J01J167p00m10k45J071J16j019j39J210J07j407L40
$$ 712 -678 -453 897 479 -354 -253 914 214 -196 -441 630 746 -273 -412 798 905 -502 -162
3281a62J044j99j157r9J332l14n88L4P90N48j259k53O06N22r70r4Q45L8o65l96
$$ -162 882 683 -474 -573 759 445 -143 -109 681 1229 -30 -283 323 845 -125 -219 626 664 -1 -397
3301c97Q24P41r31r09J532j02q61m86P85O13q67o34Q11O99r79n28Q76M54n79o43
$$ -397 427 1168 237 -672 860 758 -103 -589 196 809 -58 -692 119 818 -161 -689 187 641 62 -581
3321e81Q54O62j043n62O32Q31o49q76Q62P21p82q21P18O85r57l20N40Q27j041
$$ -581 273 935 -108 -670 -38 793 144 -732 130 851 69 -752 -34 651 -306 -626 -86 741 -300
3340c00o66P54O05n87o18N96O62n62q42R12N42p08o40M54R10o24m31m1R83q76
$$ -300 -966 -212 393 -194 -812 -216 446 -116 -958 -46 496 -212 -852 -398 512 -112 -543 -584 399 -477
3360d77j51K88P74m66p45M12P81m87n58L62N69j52q64M13P41k04j109K62J038
$$ -477 -628 -340 434 -32 -777 -365 416 -71 -629 -267 302 150 -714 -301 440 236 -873 -611 427
3379D27k59r06M86O25k01j135N72J184n65p11M16O19o3q83K0J080m2j457N60J146
$$ 427 168 -738 -252 373 172 -963 -391 793 228 -483 -67 552 489 -394 -374 706 664 -793 -233 913
3399I13m64j065J18J247p3j333L81J048J9j088j1J017k13r99O75R06n26o80j58
$$ 913 449 -616 -498 749 676 -657 -276 772 791 -297 -308 709 496 -503 172 1078 552 -128 -286
3418b86Q28K18r58K28O16o8n67k13Q83K07j049J84O68P3j030p0O44N04q36l00
$$ -286 542 760 -198 30 646 578 11 -202 681 888 -161 23 691 764 -266 -336 308 812 -24 -324
3438c24R56R5q73j35O24J27m42n47J242n2p59k54N98O02p89p23P66O63q60o04
$$ -324 632 727 -146 -281 343 470 28 -519 723 671 -88 -342 256 858 69 -654 112 775 -85 -689
3458f89R12P12j088l17Q82J22o79l67M87N83p34o27P93M11m80p10J068Q4q53l02
$$ -689 223 935 -153 -470 412 534 -145 -512 -25 558 -176 -803 -10 401 -79 -789 279 363 -490 -792
3478g92O87L98q08m23Q07N01n69n16K97P44o91l90N15K05N4p26M63J75L9p29K77
$$ -792 -105 293 -515 -938 -131 370 -199 -715 -418 326 -365 -755 -240 -35 19 -707 -244 -69 -30 -759 -482
3499d82Q40p28m49N69P87m79q14M07P02m33l31K75O24k95q16K11J016o59l31k7
$$ -482 358 -370 -819 -250 537 58 -756 -349 353 -80 -411 -136 488 193 -623 -412 604 -55 -386 -413
3519d13P94M0j170L64R87k95o93j82J319l14q98L14P95m91k54n4P56k1r51j07
$$ -413 381 421 -749 -385 602 307 -386 -568 751 437 -461 -147 648 157 -97 -151 605 584 -367 -474
3539d74R59Q6o16q6J086m71r12L26O81mm92j17M42K17p19l38Q76K09m47l27P66
$$ -474 485 571 -45 -131 955 484 -428 -102 579 575 83 -34 408 625 -94 -432 444 653 206 -121 645
3560F45m7n20k64N42N8l02l89N95K30o35k71Q93l0n88j87N88m3n36k96O21N94
$$ 645 598 78 -186 356 414 112 -277 318 548 -87 -358 535 505 -83 -270 318 275 -261 -557 64 658
3581F58r29j16O79K94p32k30O35J41o29j60N43K99p88l49P84N02q52m56N75Q99
$$ 658 -271 -387 292 586 -146 -376 259 400 -229 -389 154 453 -335 -684 100 602 -250 -706 -131 768
3601G68j193n20R22L89o84k26L83K67j035R6J117J13j095L0K88N08m13o77P21
$$ 768 -425 -945 -23 366 -318 -544 -161 106 -929 -833 284 397 -698 -668 -380 128 -285 -962 -241
3620b41M81m82m99M63O65r21k2K25P13l43r40M16O84k93p20O68L99m13n50L38
$$ -241 240 -242 -741 -278 387 -534 -556 -331 382 39 -901 -485 199 -94 -814 -146 253 -160 -710 -372
3640c72Q84m76m36L21L85j0r98O66O58m74n03M10O59l40j163M61Q49l73r09Q48
$$ -372 512 36 -400 -79 306 296 -702 -36 622 148 -355 55 714 374 -789 -328 521 148 -761 87
3660H7N23l33p19O22L23l2m64j12O19r7q09N06N41k05p10J2Q61j34n93J16P07
$$ 87 610 277 -442 180 503 471 7 -105 514 417 -392 114 655 450 -260 -248 613 479 -114 2 709
3681G09l13k70l9O65l50m58J83M78k12o92K97N06p1m55j50P29l34m43k9Q57J19
$$ 709 396 126 87 752 402 -56 127 605 393 -299 -2 504 433 -22 -172 557 223 -220 -249 608 727
3702G27o56R1L51P4o25l79O85J85n49j58N09K66n16l12L45L91q10l16Q40L12j043
$$ 727 71 162 513 587 -38 -417 268 453 -96 -254 255 521 5 -307 38 429 -381 -697 143 455 -588
3723e88m46J173K93r51k43R02Mm92j55O51J76p23k15Q55M6o01l56N78J51p16P7
$$ -588 -1034 139 432 -519 -762 140 144 -348 -503 148 324 -399 -614 241 287 -314 -670 -92 59 -657 -580
3744e80J18Q09q24k83N39P62r03L4K67M69n56o20Q91o6l36p56Q04N92l44r92Q04
$$ -580 -462 347 -477 -760 -221 541 -362 -328 -61 408 -148 -768 123 57 -279 -1035 -231 361 17 -975 -171
3765a71L90l09l22O4N87k90l80L04N60l70m23O9P55n94p64N78P50j59p57J53P62
$$ -171 219 -90 -412 -348 239 -51 -431 -127 433 63 -360 -291 464 -130 -894 -316 434 275 -482 -329 433
3786D33l05l73J59N40l7q99J85Q00l24m97J02J023o53o32J95J030n53o41L13N20
$$ 433 128 -245 -86 454 417 -482 -297 503 179 -318 -216 807 154 -478 -283 747 194 -447 -134 386
3806C86J8q01M09N00j57o30M75L51j82o25J57Q29J41r29J42O53n57l08K87L84
$$ 386 404 -397 12 512 355 -275 200 551 369 -256 -99 730 871 -58 84 737 180 -128 159 543
3826E43m85m88N25L32K57p62K09N33m41q4k32O79O0p03m05N69K76p43O4N33M70
$$ 543 58 -430 95 427 684 -78 131 664 223 139 -93 586 646 -57 -462 107 383 -360 -296 237 707
3847G07p14l11L79K44n61k18P10K97q78p4O37K07p31l63O78J45m31k44L72K29
$$ 707 -7 -318 61 305 -256 -474 236 533 -345 -419 218 425 -306 -669 9 154 -277 -521 -149 80
3867H0m73l84P80K97o02j93K60J39n30k41J122j18n76j54Q48K8o33L3M35K6m91
$$ 80 -393 -777 3 300 -302 -495 -235 -96 -626 -867 255 137 -439 -593 255 283 -350 -317 118 144 -347
3888c47O4J49O43n62m83K26L99p9n80M42M70l81l47K21O19n58l56M22L25l68m38
$$ -347 -283 -134 509 -53 -536 -310 89 10 -570 -128 342 -39 -386 -165 454 -104 -460 -38 287 -81 -519
3909e19K71O76l48p61O27N73n20m10K40K73M9q49O21O70o13k30K72P71n11m05
$$ -519 -248 428 80 -681 -54 519 -1 -411 -171 102 151 -698 -77 593 -20 -250 22 793 282 -123
3929a23r0Q33p2r56M35K19J87n99K43L82l86Q8j39N74l67m36K33O14k43o86Q8
$$ -123 -213 620 548 -408 27 246 433 -166 77 459 73 161 22 596 229 -207 26 640 397 -289 -201
3950b01J048n01o60N90J92j54l24j2P67m79m35L90J46j66p27N71L49J43n23l79
$$ -201 847 346 -314 276 468 314 -10 -22 745 266 -169 221 367 201 -526 45 394 537 14 -365
3970c65P17J97o25J32q3K76k33k55N41K34p84k7N37j45l69l42R39j4p40P9N72
$$ -365 352 549 -76 56 -27 249 16 -239 302 536 -248 -275 262 117 -252 -594 345 331 -409 -330 242
3991B42J15m05n42R45j31n62r2L72M10o25J52J89L11q98P3M18K83o29q7N92m9
$$ 242 357 -48 -590 355 224 -338 -430 -58 352 -273 -121 68 379 -519 -446 -28 255 -374 -461 131 82
4012H2j64p95Q16n2m1k51M10j8m46J17K18L35o44j63O72Q5m06j89l3R65p55KL42
$$ 82 -82 -877 -61 -113 -154 -405 5 -13 -459 -342 -124 211 -433 -596 76 161 -245 -434 -467 498 -257 -255 87
4035H7R3k24m65P42O2j90p45O99P51o44m54K56L78k31l63P1P13k24m28l8M14q3
$$ 87 180 -44 -509 233 295 105 -640 59 810 166 -288 -32 346 115 -248 -177 536 312 -116 -154 260 177
4057A77l14N10K41m90k45K02N47o05n4n8N09q5m91L09M11k09n18O92R3l53l90
$$ 177 -137 373 614 124 -121 81 628 23 -31 -89 420 335 -156 153 564 355 -163 529 622 269 -121
4078a21n5O39k4r10M57N61l26k30j55N02j45k57k72L51K89l60J39J11j0l08J47
$$ -121 -176 463 439 -471 -14 547 221 -9 -164 338 193 -64 -336 15 304 -56 83 194 184 -124 23
4099B3L59J18q19J36P29l8p26P1K97J10j77m70P05j59o30L1M44O7j89r5K03K13
$$ 23 382 500 -319 -183 546 508 -218 -147 150 260 83 -387 318 159 -471 -440 4 71 -118 -213 -10 203
4121B03o73J96M10J06n10j83O58j5n19k0N51Nm60k26L25O12n18k88L87J55k01
$$ 203 -470 -274 136 242 -268 -451 207 192 -327 -347 204 209 -251 -477 -152 460 -58 -346 41 196 -5
4142em36L42J03l40M0L92o3j60n01L51K06m53Q8N64J6j39o71M78O98p69j50Q4
$$ -5 -441 -99 4 -336 -296 96 33 -127 -628 -277 -71 -524 -436 128 144 5 -666 -188 510 -259 -409 -325
4164c25N20n66J76L50O7m13k46K87L23k11L6j97M84K2o18L60L39L9o93L7Q57o13
$$ -325 195 -371 -195 155 222 -191 -437 -150 173 -38 -2 -199 285 307 -311 49 388 427 -266 -229 628 15
4186A5j12K78K43m14n50P68K90k93l49J07N75k38n62L42O87l48r13N30L31m24
$$ 15 -97 181 424 10 -540 228 518 225 -124 -17 558 320 -242 100 787 439 -474 56 387 -37
4206c7j63N73M7K59n61j07N51l39l51m2P16m33l40L46K57l08k71J90j14M40l80
$$ -37 -200 373 420 679 118 11 562 223 -128 -170 546 113 -227 119 376 68 -203 -13 -127 313 -67
4227f7K53l9j74l12N05J48k32l55K17K63j11k60P1K88l01j78L5M34j90l43K9N19
$$ -67 186 147 -27 -339 166 314 82 -273 -56 207 96 -164 -93 195 -106 -284 -249 185 -5 -348 -319 200
4249B00O3m75j06M74p4r2j73M82km82j22O77k56m78k08M15m0l10J79N34k11l52
$$ 200 263 -212 -318 156 82 -10 -183 299 297 -185 -307 370 114 -364 -572 -157 -197 -507 -328 206 -5 -357
4271c57o7O11k23k29k51L95K23m06j92N09K10n56L6M99j52n7m4j44J45k99O1j77
$$ -357 -424 187 -36 -265 -516 -121 102 -304 -496 13 223 -333 -297 202 50 -7 -51 -195 -50 -349 -288 -465
4293d65N47l66n6K37J33j07j69L52L5l05m0j2M37l09J67J62j8l84j67N26J16j16
$$ -465 82 -284 -340 -103 30 -77 -246 106 141 -164 -204 -216 221 -88 79 241 223 -161 -328 198 314 198
4315A98n81P39o8j32n90N68K94m97m5K60J9L86p73J06N33j58l38KJ93N6j97L08
$$ 198 -383 356 288 156 -434 134 428 -69 -114 146 165 551 -222 -116 417 259 -79 -77 116 172 -25 283
4337B83L30o69PL29j2k50l9MM87k51m66N68r7K6m07J9M89j04n13J91N79m88k40
$$ 283 613 -56 -49 280 268 18 -21 -17 470 219 -247 321 224 250 -157 -138 351 247 -266 -75 504 16 -224
4360b24K1N58j38j79j33M41k70k27k68O20K24m52qJ94l8k72N8J66L4k46j25N22
$$ -224 -203 355 217 38 -95 346 76 -151 -419 201 425 -27 -35 159 121 -151 -93 73 107 -139 -264 258
4382B58r0p28L20j6N89n55j29M36Q6m87oL12l9l61J61M84k13m19l2O42l55k42
$$ 258 168 -560 -240 -256 333 -222 -351 85 171 -316 -322 -10 -49 -410 -249 235 22 -397 -429 213 -142 -384
4404c84k01Q48n00O3j96J44L89p73K36K50L53o44O7L61L97m15j72L4K18m01k11
$$ -384 -585 263 -237 -174 -370 -226 163 -610 -374 -124 229 -415 -348 13 410 -5 -177 -143 75 -326 -537
4425e37P62j64l91J12K47K84m60k35N61K67p37K66M30j75m91RM69K26l52n10N81
$$ -537 225 61 -330 -218 29 313 -147 -382 179 446 -291 -25 405 230 -261 -252 217 443 91 -419 162
4446A62J1J6m11L53O51o18m87K09N38n68k84O75O2Q4p23M02K15l64j8L78L6N9
$$ 162 173 189 -222 131 782 164 -323 -114 424 -144 -428 247 309 393 -330 72 287 -77 -95 283 319 378
4468C78n61L66L05l44m19M44K04j94j39j39O61m88j4K93n6l01j9K36J52M0m15
$$ 378 -183 183 488 144 -275 169 373 179 40 -99 562 74 60 353 297 -4 -23 213 365 405 -10
4489a0R0J66j54k98J47K51k80J22J65o7k70j12L53K42k58n0j79L96o9k00j53L07
$$ -10 80 246 92 -206 -59 192 -88 34 199 132 -138 -250 103 345 87 37 -142 254 185 -15 -168 139
4511A39J13n28j23M60J45m88Q0M16Ok00m02N41j68l93kL06K01k63l67O04J62n92
$$ 139 252 -276 -399 61 206 -282 -202 214 220 20 -382 159 -9 -402 -404 -98 103 -160 -527 77 239 -353
4533c53j54P20P8n82J35KK59k35j31J20J94m13J77r2J43p4OJ70J76l96L8K72j17
$$ -353 -507 213 291 -291 -156 -154 105 -130 -261 -141 53 -360 -183 -275 -132 -206 -200 -30 146 -250 -212 60 -57
4556e7l41J66N8K61j00k90L93O0m54K19L20Q8k48k76L13O2j35l73M63j33K33n09
$$ -57 -398 -232 -174 87 -13 -303 90 150 -304 -85 235 323 75 -201 112 174 39 -334 129 -4 229 -280
4578b80K59r0M3K51O1J44l03J19j72Q3r6j20K28M37l21l42N55J24o33J03K24l74
$$ -280 -21 -111 -68 183 244 388 85 204 32 115 19 -101 127 564 243 -99 456 580 -53 50 274 -100
4600a00P9n1r3K41K70n67N75R8m66k73M10L40m74k90L59J30O0l83N9L11k83k04
$$ -100 -21 -72 -165 76 346 -221 354 452 -14 -287 123 463 -11 -301 58 188 248 -135 -76 235 -48 -252
4622b52M70k8m38M02m09M88j84j58M8J36J03l48J44K12l52q0J90J18O3m43l1K90
$$ -252 218 190 -248 154 -255 233 49 -109 -61 75 178 -170 -26 186 -166 -246 -56 62 125 -318 -349 -59
4644e9r0p8j07K24K0n1L4K82j91l38J68L58k1k00l96N42o9m72J94N11J21n41l3
$$ -59 -149 -227 -334 -110 -90 -141 -107 175 -16 -354 -186 172 151 -49 -445 97 28 -444 -250 261 382 -159 -192
4667a92K87k07j13q8L29j20l08k3N46R6m70L7K09q3L1l22M20O5l17n5L95K16p42
$$ -192 95 -112 -225 -313 16 -104 -412 -435 111 207 -263 -226 -17 -100 -69 -391 29 94 -223 -278 117 333 -409
4690d09J95R0L7J68r7nM6j83K22Q3j53R9l00K4K71j20j28K15J53k86M1J75L14
$$ -409 -214 -124 -87 81 -16 -21 25 -158 64 147 -6 93 -207 -183 88 -32 -160 55 208 -78 -37 138 452
4713D52m77m54N36L64o47J65K71J22Q4p00L86K74l72m0K89L2k02l76Q8O63l14
$$ 452 -25 -479 57 421 -226 -61 210 332 416 -284 102 376 4 -36 253 285 83 -293 -205 458 144
4734A44j69J59P3l99J9M12N5l83L01k73J02j67K64qRr2l6Q8K76k56l00N7N93k63
$$ 144 -25 134 207 -192 -173 239 294 -89 212 -61 41 -126 138 130 139 47 11 99 375 119 -181 -124 469 206
4758B06n14M33K11l05j70M11j87k00K6oL36j31r7l46K72O5j97J99J15j84j07K14
$$ 206 -308 125 336 31 -139 272 85 -115 -89 -95 241 110 13 -333 -61 4 -193 6 121 -63 -170 44
4780D4J59l17l95j4R57n96J39j65K93k79K2k43K48j63M02k33J52j40m28M71M90
$$ 44 203 -114 -509 -523 434 -162 -23 -188 105 -174 -152 -395 -147 -310 92 -141 11 -129 -557 -86 404
4801D04l66J40n07K12J47l17r5M91j80L4j48L05P4m18Q8K03q9j27j5k17N02j04
$$ 404 38 178 -329 -117 30 -287 -382 109 -71 -37 -185 120 194 -224 -136 67 -22 -149 -164 -381 121 17
4823A7j13j5K44k22j61M40O2j61j16m0j04k56J96K90K82o75j7L38l7J4r4M05j37
$$ 17 -96 -111 133 -89 -250 190 252 91 -25 -65 -169 -425 -229 61 343 -332 -349 -11 -48 -34 -128 277 140
4846A40k00j4j41N21m84j8K14M62q03nO61J69n59j76K22K80n12L32L9J52j66l06
$$ 140 -60 -74 -215 306 -178 -196 18 480 -323 -328 333 502 -57 -233 -11 269 -243 89 128 280 114 -192
4868a92L11L10l58k09L24L86m32l19L98K41m80k56L79J12J35m60L43lr5k33L54
$$ -192 119 429 71 -138 186 572 140 -179 219 460 -20 -276 103 215 350 -110 233 230 135 -98 256
$$ [...]
8191a7
##END NTUPLES=NMR FID
##END=
