##TITLE=1H_SAM_22.BBSX1_THF 1.2
 CDCl3, 8 sc, 
 6.5.2019
##JCAMPDX= 6.0         $$ Bruker NMR JCAMP-DX V2.0
##DATA TYPE= NMR FID
##DATA CLASS= NTUPLES
##ORIGIN= UXNMR, Bruker Analytische Messtechnik GmbH
##OWNER= root
$$ XWIN-NMR		Version 3.5
$$ Mon May  6 14:39:55 2019 Russian Standard Time (UT+4h)  she@DPX200
##.OBSERVE FREQUENCY= 200.1315
##.OBSERVE NUCLEUS= ^1H
##.DELAY= (6, 6)
##.ACQUISITION MODE= SIMULTANEOUS
##.ACQUISITION SCHEME= undefined
##.AVERAGES= 8
##.DIGITISER RES= 18
##SPECTROMETER/DATA SYSTEM= spect
##.PULSE SEQUENCE= zg30
##.SOLVENT NAME= CDCl3
##.SHIFT REFERENCE= (INTERNAL, CDCl3, 0, 15.7039)
##AUDIT TRAIL= $$ (NUMBER, WHEN, WHO, WHERE, WHAT)
$$ ##TITLE= Audit trail, XWIN-NMR		Version 3.5
$$ ##JCAMPDX= 5.01
$$ ##ORIGIN= Bruker BioSpin GmbH
$$ ##OWNER= she
$$ F:/spectra/data/she/nmr/H-F/1/audita.txt
$$ ##AUDIT TRAIL=  $$ (NUMBER, WHEN, WHO, WHERE, WHAT)
(   1,<2019-05-06 14:38:46.57 +0400>,<she>,<DPX200>,
      <created by zg, POWCHK disabled, PULCHK disabled
       configuration hash MD5:
       00 E9 B6 7A A2 85 ED C7 34 08 36 98 17 FE 4E 26
       data hash MD5: 16K
       81 E0 C5 97 A2 BC 87 04 DF AE CC CA 7D 76 FA B5>)
$$ ##END=
$$ 
$$ hash MD5
$$ 3D C7 EB 52 60 90 6A 5C CC 5C E2 DF 5E 09 C1 83
##$RELAX= 
##$RELAX= 
##$RELAX= 
##$RELAX= 
##$RELAX= 
##$RELAX= 
$$ Bruker specific parameters
$$ --------------------------
##$DU= <F:/spectra>
##$EXPNO= 1
##$NAME= <H-F>
##$PROCNO= 1
##$TYPE= <nmr>
##$USER= <she>
##$AMP= (0..31)
100 100 100 100 100 100 100 100 100 100 100 100 100 100 100 100 100 100 
100 100 100 100 100 100 100 100 100 100 100 100 100 100 
##$AQSEQ= 0
##$AQ_mod= 1
##$AUNM= <au_zg>
##$AUTOPOS= <>
##$BF1= 200.13
##$BF2= 200.13
##$BF3= 200.13
##$BF4= 200.13
##$BF5= 200.13
##$BF6= 200.13
##$BF7= 200.13
##$BF8= 200.13
##$BYTORDA= 1
##$CFDGTYP= 0
##$CFRGTYP= 5
##$CHEMSTR= <none>
##$CNST= (0..31)
1 1 145 1 1 1 1 1 1 1 1 1 1 1 1 1 1 1 1 1 1 1 1 1 1 1 1 1 1 1 1 1 
##$CPDPRG= <>
##$CPDPRG1= <>
##$CPDPRG2= <>
##$CPDPRG3= <>
##$CPDPRG4= <mlev>
##$CPDPRG5= <mlev>
##$CPDPRG6= <mlev>
##$CPDPRG7= <mlev>
##$CPDPRG8= <mlev>
##$CPDPRGB= <>
##$CPDPRGT= <>
##$D= (0..31)
0 1.2 0 0 0 0 0 0 0 0 0 0.03 0 0 0 0 0 0 0 0 0 0 0 0 0 0 0 0 0 0 0 0 
##$DATE= 1557139126
##$DBL= (0..7)
120 120 120 120 120 120 120 120 
##$DBP= (0..7)
150 150 150 150 150 150 150 150 
##$DBP07= 0
##$DBPNAM0= <>
##$DBPNAM1= <>
##$DBPNAM2= <>
##$DBPNAM3= <>
##$DBPNAM4= <>
##$DBPNAM5= <>
##$DBPNAM6= <>
##$DBPNAM7= <>
##$DBPOAL= (0..7)
0.5 0.5 0.5 0.5 0.5 0.5 0.5 0.5 
##$DBPOFFS= (0..7)
0 0 0 0 0 0 0 0 
##$DE= 6
##$DECBNUC= <off>
##$DECIM= 24
##$DECNUC= <off>
##$DECSTAT= 4
##$DIGMOD= 1
##$DIGTYP= 9
##$DL= (0..7)
0 120 120 120 120 120 120 120 
##$DP= (0..7)
150 150 150 150 150 150 150 150 
##$DP07= 0
##$DPNAME0= <>
##$DPNAME1= <>
##$DPNAME2= <>
##$DPNAME3= <>
##$DPNAME4= <>
##$DPNAME5= <>
##$DPNAME6= <>
##$DPNAME7= <>
##$DPOAL= (0..7)
0.5 0.5 0.5 0.5 0.5 0.5 0.5 0.5 
##$DPOFFS= (0..7)
0 0 0 0 0 0 0 0 
##$DQDMODE= 0
##$DR= 18
##$DS= 0
##$DSLIST= <SSSSSSSSSSSSSSS>
$$ [...]
##$SUBNAM2= <"">
##$SUBNAM3= <"">
##$SUBNAM4= <"">
##$SUBNAM5= <"">
##$SUBNAM6= <"">
##$SUBNAM7= <"">
##$SUBNAM8= <"">
##$SUBNAM9= <"">
##$SW= 24.9337058887773
##$SWIBOX= (0..15)
0 0 2 0 0 0 0 0 0 0 0 0 0 0 0 0 
##$SW_h= 4990.01996007984
##$TD= 16384
##$TD0= 1
##$TE= 0
##$TE2= 300
##$TE3= 300
##$TEG= 300
##$TL= (0..7)
0 120 120 120 120 120 120 120 
##$TP= (0..7)
150 150 150 150 150 150 150 150 
##$TP07= 0
##$TPNAME0= <>
##$TPNAME1= <>
##$TPNAME2= <>
##$TPNAME3= <>
##$TPNAME4= <>
##$TPNAME5= <>
##$TPNAME6= <>
##$TPNAME7= <>
##$TPOAL= (0..7)
0.5 0.5 0.5 0.5 0.5 0.5 0.5 0.5 
##$TPOFFS= (0..7)
0 0 0 0 0 0 0 0 
##$TUNHIN= 0
##$TUNHOUT= 0
##$TUNXOUT= 0
##$USERA1= <user>
##$USERA2= <user>
##$USERA3= <user>
##$USERA4= <user>
##$USERA5= <user>
##$V9= 5
##$VALIST= <valist>
##$VCLIST= <CCCCCCCCCCCCCCC>
##$VD= 0
##$VDLIST= <DDDDDDDDDDDDDDD>
##$VPLIST= <PPPPPPPPPPPPPPP>
##$VTLIST= <TTTTTTTTTTTTTTT>
##$WBST= 1024
##$WBSW= 4
##$XGAIN= (0..3)
0 0 0 0 
##$XL= 0
##$YL= 0
##$YMAX_a= 363223
##$YMIN_a= -418181
##$ZGOPTNS= <>
##$ZL1= 120
##$ZL2= 120
##$ZL3= 120
##$ZL4= 120
##$ABSF1= 10
##$ABSF2= 0
##$ABSG= 5
##$ABSL= 3
##$ALPHA= 0
##$AQORDER= 0
##$ASSFAC= 0
##$ASSFACI= 0
##$ASSFACX= 0
##$ASSWID= 0
##$AUNMP= <proc_1d>
##$AZFE= 0.1
##$AZFW= 0.1
##$BCFW= 1
##$BC_mod= 2
##$BYTORDP= 1
##$COROFFS= 0
##$CY= 11.3945322036743
##$DATMOD= 1
##$DC= 2
##$DFILT= <>
##$DTYPP= 0
##$F1P= 18.9103706918063
##$F2P= -1.10871071338519
##$FCOR= 0.5
##$FTSIZE= 0
##$FT_mod= 4
##$GAMMA= 1
##$GB= 0.15
##$INTBC= 1
##$INTSCL= 1
##$ISEN= 128
##$LB= 0.24
##$LEV0= 0
##$LPBIN= 0
##$MAXI= 10000
##$MC2= 0
##$MEAN= 0
##$ME_mod= 0
##$MI= 1.114404
##$NCOEF= 0
##$NC_proc= 0
##$NLEV= 6
##$NOISF1= 3.799351
##$NOISF2= 2.8
##$NSP= 1
##$NTH_PI= 0
##$NZP= 0
##$OFFSET= 15.70392
##$PC= 1
##$PHC0= -8857.858
##$PHC1= 19.00026
##$PH_mod= 1
##$PKNL= yes
##$PPARMOD= 0
##$PSCAL= 0
##$PSIGN= 0
##$REVERSE= no
##$SF= 200.130013532006
##$SI= 16384
##$SIGF1= 3
##$SIGF2= 2
##$SINO= 400
##$SIOLD= 16384
##$SREGLST= <1H.CDCl3>
##$SSB= 0
##$STSI= 0
##$STSR= 0
##$SW_p= 3612.71676300578
##$SYMM= 0
##$S_DEV= 0
##$TDeff= 0
##$TDoff= 0
##$TI= <>
##$TILT= no
##$TM1= 0
##$TM2= 0
##$TOPLEV= 0
##$USERP1= <user>
##$USERP2= <user>
##$USERP3= <user>
##$USERP4= <user>
##$USERP5= <user>
##$WDW= 1
##$XDIM= 8192
##$YMAX_p= 0
##$YMIN_p= 0
$$ End of Bruker specific parameters
$$ ---------------------------------
##NTUPLES= NMR FID
##VAR_NAME=  TIME,          FID/REAL,        FID/IMAG
##SYMBOL=    X,             R,               I
##VAR_TYPE=  INDEPENDENT,   DEPENDENT,       DEPENDENT
##VAR_FORM=  AFFN,          ASDF,            ASDF
##VAR_DIM=   8192,          8192,            8192
##UNITS=     SECONDS,       ARBITRARY UNITS, ARBITRARY UNITS
##FACTOR=    0.0002004,     1,               1
##FIRST=     0,             0,               0
##LAST=      1.6414764,     0,               0
##MIN=       0,             -418181,         0
##MAX=       1.6414764,     363223,          0
$$ Real data points
##PAGE= N=1
##DATA TABLE= (X++(R..R)), XYDATA
$$ [...]
2601C334l055m723L540L830k296m690L044M328k559m444K175M788k439m353J979
$$ 3334 279 -4444 -904 2926 630 -4060 -1016 3312 753 -3691 -1516 3272 833 -3520 -1541
2616a541M433j505m352R86M769j124m592Q01M745o01m600K78M939k16n019K46
$$ -1541 2892 1387 -2965 -1979 2790 1666 -2926 -2125 2620 2019 -2581 -2303 2636 2420 -2599 -2353
2632b353N153k1n405R0M721Q62n239l15N209N15n338n92N165R71n517p04N519
$$ -2353 2800 2779 -2626 -2536 2185 3047 -2192 -2507 2702 3217 -2121 -2713 2452 3423 -2094 -2798 2721
2649B721Q90n642o41N674O55n460r16N682M74n115j366N645J033m967j723N582
$$ 2721 3611 -2031 -2672 3002 3657 -1803 -2719 2963 3437 -1678 -3044 2601 3634 -1333 -3056 2526
2665B526J220n109j432M892J689n269j094M526J487m595j610M410J831m468j891
$$ 2526 3746 -1363 -2795 2097 3786 -1483 -2577 1949 3436 -1159 -2769 1641 3472 -996 -2887
2680b887M314J878m079k085M189J993l964k064L350K661l844k566L343K904l362
$$ -2887 1427 3305 -774 -2859 1330 3323 -641 -2705 645 3306 -538 -3104 239 3143 -219
2695b19k793L227L013l161l390L146L391l056l837L223L536k685m033L070L616
$$ -219 -3012 215 3228 67 -3323 -177 3214 158 -3679 -456 3080 395 -3638 -568 3048
2710C048k530m570K886M699k783m916K827M726k920m614K768M430k536m276K634
$$ 3048 518 -4052 -1166 3533 750 -4166 -1339 3387 467 -4147 -1379 3051 515 -3761 -1127
2725a127M515k699m867K743M897k763m542K271M793k471m417K029M584k423m313
$$ -1127 3388 689 -4178 -1435 3462 699 -3843 -1572 3221 750 -3667 -1638 2946 523 -3790
2740c790K532M231k172m125J918L994j405m158J030M553j360m053Q17M435q25
$$ -3790 -1258 2973 801 -3324 -1406 2588 1183 -2975 -1945 2608 1248 -2805 -1988 2447 1622
2755A622m416Q46M074k61l739p0M284j48m366l16M321L97l936o48M250Q60m477
$$ 1622 -2794 -1948 2126 1865 -1874 -1944 2340 2192 -2174 -2490 1831 2228 -1708 -2356 1894 2754 -1723
2772a723p06M609P86m638p44M847Q42n028q20M954J181n300q52M752J042m444
$$ -1723 -2429 2180 2966 -1672 -2416 2431 3273 -1755 -2575 2379 3560 -1740 -2592 2160 3202 -1242
2788a242j355M669J319m693j332M543J594m616j688M996J164m534j457M230J524
$$ -1242 -2597 2072 3391 -1302 -2634 1909 3503 -1113 -2801 2195 3359 -1175 -2632 1598 3122
2803C122m244j580M232K011m750j324L893J665l719j890L500K019l505k099L440
$$ 3122 -1122 -2702 1530 3541 -1209 -2533 1360 3025 -694 -2584 916 2935 -570 -2669 771
2818G71K163l369k278L116K437k879k735K779K695k691l007K584L613l015l372
$$ 771 2934 -435 -2713 403 2840 -39 -2774 5 2700 9 -2998 -414 3199 184 -3188
2833c188K483L484k702l187K450L400k244l672K159L417j777m109K309L979k519
$$ -3188 -705 2779 77 -3110 -660 2740 496 -3176 -1017 2400 623 -3486 -1177 2802 283
2848B83l953K404L994k067m445K339M185j825m550J871M351j992m197K018M566
$$ 283 -3670 -1266 2728 661 -3784 -1445 2740 915 -3635 -1764 2587 595 -3602 -1584 2982
2863B982k466m218K240M148j987l686J688L780j865l437J532L399r81m180J448
$$ 2982 516 -3702 -1462 2686 699 -2987 -1299 2481 616 -2821 -1289 2110 1129 -3051 -1603
2878a603L731j399l079Q20L676n70l721N29L364k25l428L04L595K16l899j43L722
$$ -1603 2128 729 -2350 -1530 2146 1576 -2145 -1616 1748 1523 -1905 -1601 1994 2210 -1689 -1832 1890
2895A890J40l445n79L739L02l809l00M402M02l978q27L624J365m001r23L554J528
$$ 1890 2030 -1415 -1994 1745 2047 -1762 -2062 2340 2742 -1236 -2063 1561 2926 -1075 -1998 1556 3084
2912C084m054j357L697J447m049j148M183J482m348j505M196J858m277j611M258
$$ 3084 -970 -2327 1370 2817 -1232 -2380 1803 3285 -1063 -2568 1628 3486 -791 -2402 1856
2927A856J609m204k290M602J341l758j486L666J641m031j007L105J522k812k049
$$ 1856 3465 -739 -3029 1573 2914 -844 -2330 1336 2977 -1054 -2061 1044 2566 -246 -2295
2942b295L498J681l403j874L080J801k783j886K935J650k510k195K571K207k408
$$ -2295 1203 2884 -519 -2393 687 2488 -295 -2181 754 2404 -106 -2301 270 2477 69
2957F9k445K204K379k105k784K296K746k243k897K192L002k373k989K185L099
$$ 69 -2376 -172 2207 102 -2682 -386 2360 117 -2780 -588 2414 41 -2948 -763 2336
2972B336k134l001J470L744k017l550J881L744j742l870J801L761j917l789J980
$$ 2336 202 -2799 -1329 2415 398 -3152 -1271 2473 731 -3139 -1338 2423 506 -3283 -1303
2987a303L746k165l513J899L740k036l268J544L765j773l617J486L970j576l684
$$ -1303 2443 278 -3235 -1336 2404 368 -2900 -1356 2409 636 -2981 -1495 2475 899 -2785
3002b785J531L385j228l696J651L255o67l735Q65L653j147l408R39L408o18l188
$$ -2785 -1254 2131 903 -2793 -1142 2113 1446 -2289 -1424 2229 1082 -2326 -1387 2021 1403 -1785
3018a785M64L075k12k977J69L054O7l114k58K993M46l091o13L399K63k863o29
$$ -1785 -1321 1754 1542 -1435 -1266 1788 1855 -1259 -1517 1476 1922 -1169 -1782 1617 1880 -983 -1612
3035a612L551M94l091j080L279J409l944j291L639J747l712j213L312J180l699
$$ -1612 1939 2433 -658 -1738 1541 2950 -994 -2285 1354 3101 -611 -1824 1488 2668 -1031
3050a031j073L434J710l601j307L376J471l714j579L724J449l428j720L388J556
$$ -1031 -2104 1330 3040 -561 -1868 1508 2979 -735 -2314 1410 2859 -569 -2289 1099 2655
3065B655l347j555L405J424l161j485K932J457l046j257K710J565k723j991K786
$$ 2655 -692 -2247 1158 2582 -579 -2064 868 2325 -721 -1978 732 2297 -426 -2417 369
3080C69J892k444j873K111K287k538k324K174K502k047k483J907K286j672k731
$$ 369 2261 -183 -2056 55 2342 -196 -2520 -346 2156 109 -2374 -467 1819 147 -2584
3095b584K121K400j598k706J729K501j589k586J668K700j752l164J591L479j743
$$ -2584 -463 1937 339 -2367 -638 1863 274 -2312 -644 2056 304 -2860 -1269 2210 467
3110D67k932J595L030j173l750J213L620j349l434J386L381j449l358J334L687
$$ 467 -2465 -870 2160 987 -2763 -1550 2070 721 -2713 -1327 2054 605 -2753 -1419 2268
3125B268j625l298J529L096j462k996J253L252j129l337J402K666q61k794P40
$$ 2268 643 -2655 -1126 1970 508 -2488 -1235 2017 888 -2449 -1047 1619 758 -2036 -1296
3140a296K982q65k928P30L335q65k938N31L077m54k893J32K791K37k982jK887
$$ -1296 1686 821 -2107 -1377 1958 1093 -1845 -1314 1763 1309 -1584 -1452 1339 1576 -1406 -1407 1480
3157A480K76k894m37K714Q03k919o39L009M81k424j057K979R75l118j251L027
$$ 1480 1756 -1138 -1575 1139 1942 -977 -1616 1393 1874 -550 -1607 1372 2347 -771 -2022 1005
3173A005J245l112r15K996J505l148j442K983J318l190j197L363J361l460j387
$$ 1005 2250 -862 -1777 1219 2724 -424 -1866 1117 2435 -755 -1952 1411 2772 -688 -2075
3188b075L355J235k715j967L494Q23k943j300L050J567l329j138K869J477k912
$$ -2075 1280 2515 -200 -2167 1327 2150 -793 -2093 957 2524 -805 -1943 926 2403 -509
3203e09j761L288J186k688j457K539J533k588j579K600J473k229j884K183J996
$$ -509 -2270 1018 2204 -484 -1941 598 2131 -457 -2036 564 2037 -192 -2076 107 2103
3218B103k175k287K211J936j941j730J369K451j747k337J540K281j176k707J142
$$ 2103 -72 -2359 -148 1788 -153 -1883 -514 1937 190 -2147 -607 1674 498 -2209 -1067
3233a067K594j089k408J031L142j854k623R82K809q63l001J133L180j499k704
$$ -1067 1527 438 -1970 -939 2203 349 -2274 -1292 1517 654 -2347 -1214 1966 467 -2237
3248b237J040K951q38l138Q56L356j275l223J285K927r67k977P41K994o20k972
$$ -2237 -1197 1754 916 -2222 -1366 1990 715 -2508 -1223 1704 737 -2240 -1499 1495 875 -2097
3264b097O93L207o50k992P04K766m53l238P63K931o63k877M96K622m7l049P01
$$ -2097 -1404 1803 1153 -1839 -1135 1631 1178 -2060 -1297 1634 971 -1906 -1410 1212 1165 -1884 -1183
3281a183K618K3k644J12K682k11k072q28K730N79k662l76K141R91k550p58K614
$$ -1183 1435 1458 -1186 -1074 1608 1397 -675 -1503 1227 1806 -856 -1232 909 1900 -650 -1408 1206
3298A206O79k431j161K694J028k428j135K917P41k929q08K703J398k794j403K612
$$ 1206 1885 -546 -1707 987 2015 -413 -1548 1369 2110 -819 -1627 1076 2474 -320 -1723 889
3314H89J352k270j885K694J550k374j963K658J786k569j701K717J335k918j347
$$ 889 2241 -29 -1914 780 2330 -44 -2007 651 2437 -132 -1833 884 2219 -699 -2046
3329b046K966J485k737j477K623R88j897j747K520J553k418j582K139J561k319
$$ -2046 920 2405 -332 -1809 814 1802 -95 -1842 678 2231 -187 -1769 370 1931 -388
3344c88j423K157J601k230j658J825J944k333j265J596J585j371k093J732J724
$$ -388 -1811 346 1947 -283 -1941 -116 1828 -505 -1770 -174 1411 40 -2053 -321 1403
3359A403j315j659R06J961r88k219J053J995r93k136J330K211r92k617J264K172
$$ 1403 88 -1571 -665 1296 308 -1911 -858 1137 144 -1992 -662 1549 557 -2060 -796 1376
3375A376n84k970Q33K882j046k647J112K746o04l214O22L017o11k908M61L056
$$ 1376 792 -2178 -1345 1537 491 -2156 -1044 1702 1098 -2116 -1494 1523 912 -1996 -1535 1521
3391A521n58l111J002K898r66k500O39K617n15k844N85K605m11k759O36K496m34
$$ 1521 963 -2148 -1146 1752 786 -1714 -1075 1542 1027 -1817 -1232 1373 962 -1797 -1161 1335 901
3408I01k409J83K746l11k131J11J973J82k005P7J779K82k091k68K106K31k280
$$ 901 -1508 -1325 1421 1110 -1021 -910 1063 1245 -760 -683 1096 1378 -713 -981 1125 1356 -924
3425i24o7K379M28k543m11K072P59j995r98K219P79k033q53K336L97j509j711
$$ -924 -991 1388 1816 -727 -1138 934 1693 -302 -1300 919 1698 -335 -1188 1148 1545 36 -1675
3442a675K284J373k377p38J862J204j833j605K366J307k355j462K213J855k686
$$ -1675 609 1982 -395 -1133 729 1933 100 -1505 861 2168 -187 -1649 564 2419 -267
3457b67j629K061J820k024j852K581J281k133j681K304J539k060j626J830J627
$$ -267 -1896 165 1985 -39 -1891 690 1971 -162 -1843 461 2000 -60 -1686 144 1771
3472A771j978j410J716J485j804j623J878J459j660j332J232J716j614j585J576
$$ 1771 -207 -1617 99 1584 -220 -1843 35 1494 -166 -1498 -266 1450 -164 -1749 -173
3487a73J243j018j859R44K144j187k037J391J699o47k285Q20K023l25k439O53
$$ -173 1070 52 -1807 -863 1281 94 -1943 -552 1147 500 -1785 -965 1058 733 -1706 -1053
3503a053K187p12k172O79K372o05k404P36K496n36k719P67K259o95k260L89K644
$$ -1053 1134 422 -1750 -1071 1301 696 -1708 -972 1524 988 -1731 -964 1295 600 -1660 -1271 1373
3520A373m91k735L77K919p18k617P36K705q69k199L49K497l57k654O38K531m44
$$ 1373 882 -1853 -1476 1443 725 -1892 -1156 1549 680 -1519 -1170 1327 970 -1684 -1046 1485 1041
3537A041k295M14K073k35k129J28K574o86j967K82J866Q5k244p4K170J05j645
$$ 1041 -1254 -840 1233 998 -1131 -1003 1571 885 -1082 -800 1066 1151 -1093 -1167 1003 1108 -537
3554e37p11K480M06k168m94K030N97j803r48K102P85k196q48K020J070k017j166
$$ -537 -1248 1232 1638 -530 -1024 1006 1603 -200 -1148 954 1739 -457 -1305 715 1785 -232 -1398
3571a398K032J079j888j170J895J426k183j168K052J011j872j332K053J551k331
$$ -1398 634 1713 -175 -1345 550 1976 -207 -1375 677 1688 -184 -1516 537 2088 -243
3586b43j144J869J076j609j662J991J405j982j168J794J177j754j319J962J403
$$ -243 -1387 482 1558 -51 -1713 278 1683 -299 -1467 327 1504 -250 -1569 393 1796
3601A796j928k020K411J472j994j237J330J694j465j640J402J577j498j574J396
$$ 1796 -132 -2152 259 1731 -263 -1500 -170 1524 59 -1581 -179 1398 -100 -1674 -278
3616b78J382j113j612J161J542o60k078R53J923j009j992R98J963r63j444L08
$$ -278 1104 -9 -1621 -460 1082 422 -1656 -703 1220 211 -1781 -783 1180 217 -1227 -919
3632i19K209r39k064N83K296p84k047M31K770r92k095L87K631p13k283N10K349
$$ -919 1290 351 -1713 -1130 1166 382 -1665 -1234 1536 544 -1551 -1164 1467 754 -1529 -1019 1330
3649A330n41k612Q73J699J50k177J3K595n62k317J56K708m23k364M27K286j48
$$ 1330 789 -1823 -950 749 899 -1278 -1265 1330 768 -1549 -1393 1315 892 -1472 -1045 1241 1093
3666A093k391K77K056r2j844J95J948k93k001K20J586K91k039K94J738J21j734
$$ 1093 -1298 -1021 1035 943 -901 -706 1242 949 -1052 -832 754 1045 -994 -700 1038 1159 -575
3683e75l15J979J43j658n29J985O08k208m85J562R98j636r39J695J091j883j008
$$ -575 -890 1089 1232 -426 -955 1030 1638 -570 -1055 507 1505 -131 -1070 625 1716 -167 -1175
3700a175J848R65j742r33J533Q02o80j565J457J322j723j587J628J719j985q50
$$ -1175 673 1638 -104 -1037 496 1298 618 -947 510 1832 109 -1478 150 1869 -116 -966
3716i66J142J600j737j285J664J215j631j432J729J531j851j478J689J327j347
$$ -966 176 1776 39 -1246 418 1633 2 -1430 299 1830 -21 -1499 190 1517 170
3731A70j645J600J462j758j315J208J671j519j166J217J110q46j738J322J277
$$ 170 -1475 125 1587 -171 -1486 -278 1393 -126 -1292 -75 1035 189 -1549 -227 1050
3746A050j141j529J259J140l94j846J280J313q35j700P18J439l42j982Q31J738
$$ 1050 -91 -1620 -361 779 385 -1461 -181 1132 297 -1403 -685 754 412 -1570 -739 999
3762I99r15j257L16J897n46j773M26J544M5j964M4J743K47j974Q7J568J42j800
$$ 999 84 -1173 -857 1040 494 -1279 -853 691 736 -1228 -1184 559 806 -1168 -1081 487 629 -1171
3780a171Q1K339n03k039q5K415J84k263l20K675m66k181P9K093P7k062L63K004
$$ -1171 -1090 1249 746 -1293 -1378 1037 1221 -1042 -1362 1313 847 -1334 -1255 838 915 -1147 -784 1220
3798A220m45j968L17J853M88j917p05K230Q4k013k5J905K42j820M4J732j65j569
$$ 1220 775 -1193 -876 977 1465 -452 -1157 1073 1157 -856 -881 1024 1266 -554 -510 1222 1057 -512
3816e12j61J570O58j665n15J368N62j632m77J294R65j560n27J468N84j657o20
$$ -512 -673 897 1555 -110 -625 743 1305 -327 -804 490 1455 -105 -632 836 1420 -237 -857
3833h57J449J024j759j124J738J313j789j165J867Q06j664j058J510R43j069j403
$$ -857 592 1616 -143 -1267 471 1784 -5 -1170 697 1503 -161 -1219 291 1234 165 -1238
3849a238J777J162j877j218J548J454j837j060J602J107j339j432J147J539j488
$$ -1238 539 1701 -176 -1394 154 1608 -229 -1289 313 1420 81 -1351 -204 1335 -153
3864a53j231J198J409j586q51Q60J212p70j361Q24J590j219j437J103J447r70
$$ -153 -1384 -186 1223 -363 -1214 -354 858 88 -1273 -449 1141 -78 -1515 -412 1035 65
3880F5j440Q47J310p79j019P33R31n24j037J45J626o45j302K28J564m1j993M13
$$ 65 -1375 -528 782 3 -1016 -283 648 124 -913 -768 858 213 -1089 -861 703 662 -1331 -918
3898i18J450J8j834O15J311nj832L67J492L67k047l05K170J38k211K4J794J88
$$ -918 532 550 -1284 -669 642 637 -1195 -828 664 1031 -1016 -1321 849 987 -1224 -1200 594 782
3916G82j815J70J740q6j859K41J775J42j993k98K201j11j874m5J975K5k040M15
$$ 782 -1033 -863 877 791 -1068 -827 948 1090 -903 -1201 1000 889 -985 -1030 945 970 -1070 -655
3934f55J418K23j753k32K015l5j547l16J828L96j677k73J356K24j177n42J241
$$ -655 763 986 -767 -999 1016 981 -566 -882 946 1342 -335 -608 748 972 -205 -747 494
3951D94N77j253p45J570O63j156q69J375O28j282q99J636K98j008p91J073J089
$$ 494 1071 -182 -927 643 1306 150 -719 656 1284 2 -897 739 1037 29 -762 311 1400
3968A400j318p71P91J103p85j557J321J155j408o88J114J237j612j220J296J346
$$ 1400 82 -689 102 1205 420 -1137 184 1339 -69 -757 357 1594 -18 -1238 58 1404
3984A404j818p38J115J504j573j048J323J092j442j009J264J485j396j381J060
$$ 1404 -414 -1152 -37 1467 -106 -1154 169 1261 -181 -1190 74 1559 163 -1218 -158
3999a58J134j221j147J199J522j554r43J159Q83p81r54N31J088o64j109P14J127
$$ -158 976 -245 -1392 -193 1329 -225 -1168 -9 874 93 -861 -330 758 94 -1015 -301 826
4016H26q61j075L88J604p30j030L06J314l55j520O21R18j83j209L8J494L84k064
$$ 826 -35 -1110 -722 882 152 -878 -572 742 387 -1133 -512 406 223 -986 -948 546 930 -1134
4034a134q7J768K23j663L6J292L32j690nJ747nj878O4J602j16j168k36J800k65
$$ -1134 -1221 547 770 -893 -857 435 767 -923 -928 819 814 -1064 -1000 602 486 -682 -918 882 617
4053F17j410LJ735j13j507m78J673L73j686L07J452l00j325K76J055J09j298k99
$$ 617 -793 -790 945 832 -675 -1153 520 893 -793 -486 966 666 -659 -383 672 781 -517 -816
4071h16J588K04j481j02J258O40j471n19J080M48q11n87J193L73j068l26P67O72
$$ -816 772 976 -505 -607 651 1291 -180 -699 381 829 18 -569 624 997 -71 -397 370 1042
4089A042j231l54J105M79j038o71J239N39r48q53J227N62j087j161J455O03p55
$$ 1042 -189 -543 562 1041 3 -668 571 1110 162 -691 536 1098 11 -1150 305 908 153
4106A53j371J463R76j024j243J125J229j057j321Q47J493j164j132R48J179q81
$$ 153 -1218 245 1221 197 -1046 79 1308 251 -1070 -223 1270 106 -1026 -78 1101 220
4122B20j614J171J368r70j405J034J128p86j443Q33J556j077j056O01J210n08
$$ 220 -1394 -223 1145 175 -1230 -196 932 146 -1297 -464 1092 15 -1041 -440 770 262
4138B62j518Q35J178q35p50M04J052l84j434M06J365j56j174P6J112l93j087L30
$$ 262 -1256 -421 757 -78 -828 -424 628 244 -1190 -784 581 425 -749 -673 439 46 -1041 -711
4156g11J316j08j415P2J258l49r54r6J629k14j085l35J386n2j147k2J153K95j229
$$ -711 605 497 -918 -846 412 63 -891 -987 642 428 -657 -992 394 342 -805 -827 326 621 -608
4175f08k73J404L83j748k69J591M91j799j27J267O94j776n7J409L54j275l47J586
$$ -608 -881 523 906 -842 -1111 480 971 -828 -955 312 1006 -770 -827 582 936 -339 -686 900
4193I00O6j468l73J565J74j249m26J586L06j561m83J150M50j366K29J012N74j363
$$ 900 966 -502 -875 690 864 -385 -811 775 1081 -480 -963 187 637 -729 -500 512 1086 -277
4211b77m87J179N25j254m49J014P30r23p61J033L09m23q15R20P00q24q62Q96R91
$$ -277 -764 415 940 -314 -763 251 981 58 -703 330 639 216 -599 321 1021 197 -665 231 1222
4230A222j034j038J144Q08q97j264J054J312q66j143P51R92n93j647J304J056
$$ 1222 188 -850 294 1102 205 -1059 -5 1307 441 -702 49 1041 448 -1199 105 1161
4246A161r11r77M41J088m87j484P34J616j364j109R59J227n67j243L12J517q16
$$ 1161 250 -727 -286 802 315 -1169 -435 1181 -183 -1292 -333 894 327 -916 -604 913 97
4263I7j120O88J160o37j204Q08J215r15j120N18J335p37q49J91J490q75j283O15
$$ 97 -1023 -335 825 188 -1016 -208 1007 92 -1028 -510 825 88 -761 -570 920 45 -1238 -623
4281f23J279k96j257N65R18l40j431N08J041j56j239K79J014L09j164k09J205
$$ -623 656 360 -897 -332 586 246 -1185 -677 364 208 -1031 -752 262 571 -593 -802 403
4298D03K19j246k12J087M59j481R5P13O40j327o4R70J011j834l19J328N22j581
$$ 403 622 -624 -836 251 710 -771 -676 37 677 -650 -714 256 1267 -567 -886 442 964 -617
4316f17k55J435N48j797k88J539L59j443k08J329J22j311j25J508k9j212m24J613
$$ -617 -872 563 1111 -686 -974 565 924 -519 -727 602 724 -587 -712 796 767 -445 -869 744
4334G44K61j091o29J227M99j015m49R94M64j096l18Q12L16j071m89R92Q62j026
$$ 744 1005 -86 -715 512 1011 -4 -453 541 1005 -91 -409 403 719 -352 -841 151 1013 -13
4352a3p52P58J035j021l92P33N09m24r50P46Q82q33j200R97Q83p33p41K23J069
$$ -13 -765 -7 1028 7 -385 348 857 433 -517 229 1111 278 -922 75 958 225 -516 -293 776
4371G76m43q46L89J114n35j356N84J303o58j343R61R32o41j259P93J191o54j137
$$ 776 333 -513 -124 990 455 -901 -317 986 328 -1015 -54 878 237 -1022 -229 962 308 -829
4389h29N64J123o40j039L77J175m90j210N62J053o30j039N15J169q27j129Q19
$$ -829 -265 858 218 -821 -444 731 241 -969 -407 646 16 -1023 -508 661 -166 -1295 -476
4406d76J019n18o03rR13k40r34M05P27K02j269L57P93nj174o6J131J2p35j7Q64
$$ -476 543 25 -578 -587 326 86 -848 -443 284 486 -783 -426 367 362 -812 -878 253 265 -470 -487 377
4427C77k94l12l62Q22J98j052m1P77O74j379l44J109J67j090j17J455K2j251r4
$$ 377 83 -229 -591 231 429 -623 -664 113 787 -592 -936 173 340 -750 -867 588 610 -641 -735
4446g35J035K83j163j50J458K93j314m47R33J053j524n38J068Q53j412n52J353
$$ -735 300 583 -580 -730 728 1021 -293 -740 193 1246 -278 -816 252 1105 -307 -859 494
4463D94M87r17n55J073J83q75q15J278M81j034n41R47P81j089o10Q51L30o81q0
$$ 494 981 64 -491 582 765 -110 -925 353 834 -200 -741 206 987 -102 -712 139 469 -212 -292
4482b92M86N62m58o91L31Q59m39p25P11M80q41o73R01M77n03q13K08J276n02j187
$$ -292 194 756 298 -393 -62 797 358 -367 344 824 -17 -690 211 688 185 -628 -420 856 354 -833
4502h33O71J075m79j041L50Q77k39r14K76P87j14j294O45J206n97j469O40J325
$$ -833 -162 913 434 -607 -257 620 381 -533 -257 530 416 -878 -233 973 376 -1093 -453 872
4520H72n48j184N12J078n95j189P30J270q84j232N42R98j78j007K86J235l30j415
$$ 872 324 -860 -348 730 135 -1054 -324 946 62 -1170 -628 370 192 -815 -529 706 376 -1039
4538a039O84O24m14l33j07Q15Nr29j45J273n9j064r3J334N5j228J64N92J40r62
$$ -1039 -355 269 -145 -478 -585 230 235 -694 -839 434 375 -689 -782 552 607 -621 -457 135 275 -687
4558f87M1J286m22q98O1J126kj350n3J297k4r19j30P32N11j014l03J120L4r30
$$ -687 -646 640 218 -680 -619 507 505 -845 -898 399 375 -544 -674 58 569 -445 -748 372 406 -524
4578e24l28J086P47j190n00P15N56q21l59P15O86n47p72Q52M04q76m77J244P7
$$ -524 -852 234 981 -209 -709 6 562 -259 -618 97 783 236 -536 316 720 -156 -633 611 688
4597F88q57k45P61K25n72k80N70N30r02j28O23L11q54m45P02R95j102m91O68O09
$$ 688 -169 -414 347 572 0 -280 290 820 -82 -210 413 724 -130 -575 127 1122 20 -471 197 806
4617H06n53r19O78P97o11o45N58O51l98j053Q85O34l80o72K59M15k0j032K85J176
$$ 806 253 -666 12 809 198 -447 111 762 364 -689 196 830 450 -222 37 452 432 -600 -315 861
4637H61p71r51Q59Q84p86r39Q91Q03o25q40J40J089p8j518P79R51m09j102N49
$$ 861 90 -861 -2 882 96 -843 48 851 226 -614 -474 615 537 -981 -202 749 340 -762 -213
4656b13P12m27q41K68J109n73n83j11J252n96o90L62Q73l20q31J80R97l50r67
$$ -213 499 72 -769 -501 608 35 -548 -659 593 -3 -693 -331 542 222 -609 -429 568 218 -749
4675g49K26P97R2r81n0R08j02q04j72J142k03p12OQ17L19p84k76K32Q35j025j50
$$ -749 -523 274 366 -615 -665 243 141 -663 -835 307 104 -608 -602 215 534 -250 -526 -294 541 -484 -634
4696f34Q07L6n83l31P92K38q56k35R13N34j123l04R85P10j339k35P79Q85j179
$$ -634 173 209 -374 -705 87 325 -531 -766 147 681 -442 -746 239 949 -390 -625 154 1039 -140
4715a40n84J037N42r63l79R90O02j166l05P67K70q13m85R04P48j049n21P11P52
$$ -140 -724 313 855 -108 -487 503 1105 -61 -366 401 671 -142 -627 277 1025 -24 -545 166 918
4734I18q92o05R77N47q40l56Q22J26p89m71P51N95p52o08M85R38p10o59M18J138
$$ 918 26 -579 398 945 105 -251 571 697 -92 -563 188 783 31 -577 -92 846 136 -523 -105 1033
4754A033r01o49N21Q04l89q45O02K20L00j125L93Q04m88p69M50K44k4p12J19J290
$$ 1033 132 -517 4 808 419 -426 176 396 696 -429 -36 768 280 -489 -39 205 181 -531 -412 878
4774H78k62j176L49J015m53j125K31J374m97j177N40O79k14p88L36O15k7r78O0
$$ 878 616 -560 -211 804 351 -774 -543 831 334 -843 -303 376 162 -626 -290 325 298 -680 -620
4793f20J226k27j015K34Q71l69j077L49Q80P0j063K61P13K0n48n8O21l42n74J12
$$ -620 606 379 -636 -402 469 100 -977 -628 252 322 -741 -480 233 253 -295 -353 268 -74 -648 -536
4813e36N67J66q22K92P72O4r56JP61j21p86J38L99O15q81m31Q97K42o13m07Q06
$$ -536 31 197 -625 -333 439 503 -453 -452 309 188 -598 -460 -61 554 -327 -758 139 381 -232 -639 167
4834A67K04m81n53R05K08p10k95Q97K4n13l05P05N40p37p19O59P12p27p38J031
$$ 167 371 -110 -663 242 450 -260 -555 342 366 -147 -452 253 793 56 -663 -4 708 -19 -757 274
4854B74O47j002k05K10R67p38p23P31N30o25n91R15M16o48o94R54nj88r92J054
$$ 274 921 -81 -286 -76 891 153 -570 161 691 66 -525 390 806 158 -536 418 413 225 -767 287
4874B87P13p57l75M29K75m49l14K21Q60n84o35K97M03l37l46N7P03j20o59K15
$$ 287 1000 243 -132 297 572 123 -191 30 890 306 -329 -32 371 34 -312 -255 448 328 -331 -116
4894a16P80l83o30J14O29o0p84K48O90m44n91N8R52j17j181N96M57k05m92l0R44
$$ -116 664 281 -349 -235 394 334 -450 -202 488 44 -547 -489 463 346 -835 -239 218 13 -479 -509 435
4915D35j86o09k42R68k03o20m0Q42j26q86K63O36M0o53l1J040n20o86K33O40k16
$$ 435 249 -360 -602 366 163 -457 -497 345 219 -667 -404 232 272 -381 -412 628 108 -578 -345 295 79
4936G9p90O3P08K34p29k84R70J86q94j62P12K36q69n8N33L43p52J07P44J7p79
$$ 79 -711 -648 60 294 -435 -719 251 437 -457 -619 93 329 -540 -598 -65 278 -474 -367 377 394 -385
4957c85n3M99K78m29p32J065M50p82o85Q50N53m86n31N76L95r18o4O51K94n90
$$ -385 -438 61 339 -90 -822 243 693 -89 -774 76 629 143 -388 188 583 -335 -399 252 546 -44
4977d4m77O24K19l17n79P27O07q96l23O84N73j017l03N68L65l56m93N79P36o36
$$ -44 -521 103 322 5 -574 153 760 -136 -459 225 798 -219 -522 46 411 55 -438 141 877 241
4997B41n07O05J62m49j42K17M86l38r03Q03O56q05n68L94Q43n66o24O72K84j46
$$ 241 -266 339 501 52 -90 127 613 275 -628 175 831 26 -542 -148 695 129 -495 177 461 315
5017C15r24P29O09n56l34L26K41j5j129O58P04k83p42M1O84M02r75J7Q51m21n62
$$ 315 -609 120 729 173 -161 165 406 391 -738 -80 624 341 -401 -360 324 726 -249 -232 619 198 -364
5038c64k8P83k54o59n6O14O09r88O4P13o2q39j69R32M2r48j50J084j3j030N34
$$ -364 -392 391 137 -522 -578 36 645 -343 -279 434 372 -467 -636 296 338 -610 -760 324 311 -719 -185
5059a85L23J77j033L34O09j53m89j95P06K20q73j76P62K48o62R4N61j86j09l02
$$ -185 138 315 -718 -384 225 72 -417 -612 94 314 -559 -735 27 275 -387 -293 268 82 -27 -329
5079c29N63K27q85j00M93K18l90O1L69L96p40l15O36J66o86M49J8L25o42n67P03
$$ -329 234 461 -424 -524 -31 187 -203 -142 227 623 -117 -432 204 370 -316 133 151 476 -166 -733 -30
5100c0M42k48p72L83O13k08l62J42O60o75m89M77N51m76k91L23N95n55m06K29
$$ -30 412 164 -608 -225 388 180 -182 -40 620 -55 -544 -67 484 8 -283 40 635 80 -326 -97
5120i7P97j25r51M55N59m85n04Q13j02O8p31K17P81l19k63j65O77m33q54P16L24
$$ -97 700 575 -376 79 638 153 -351 462 360 428 -303 -86 695 376 113 -52 625 192 -662 54 378
5141C78j71o58N35O03q20m49P56N42o37l87K07M41j19n70Q7Q42l50n15j34Q14
$$ 378 207 -451 84 687 -133 -582 174 716 79 -308 -101 340 221 -349 -262 580 230 -285 -419 395
5161C95j08q34K25J048m75p58L66L11J18m27l9N35q5p24o3Q21n0o34j96P56K41
$$ 395 287 -547 -322 726 251 -507 -141 170 288 -139 -178 357 272 -452 -515 306 256 -378 -574 182 423
5182D23q39l59J019L47j354N2Q56j19n00J16O62q0q55J96M97J78p82k1P56l7n93
$$ 423 -416 -775 244 591 -763 -711 145 26 -474 -358 304 224 -631 -435 62 240 -542 -563 193 156 -437
5203d37j74M28J67l39k24O16K04n39l98P13K60o16k38P54M55j170o1M77M27n05
$$ -437 -611 -183 -16 -355 -579 37 241 -298 -696 17 277 -339 -577 177 632 -538 -599 -122 305 -200
5223b00k99N03K22j10n51L71P08p85R5M8M02k38p86L47P44m18o09L07P61m69m64
$$ -200 -499 4 226 116 -435 -64 644 -141 -46 2 404 166 -620 -273 471 53 -556 -249 512 43 -421
5244d21M09M20j42o69O78K52m92n19M61M42l50n93R36J00k56m11L60N76q33m51
$$ -421 -12 408 266 -403 275 527 35 -484 -23 419 69 -524 412 512 256 -155 205 781 -52 -503
5264e03N05P11o26m53N25K82j55n66L57M25k88m81J77M47q8l62K72K01m31k53
$$ -503 2 713 87 -366 159 441 286 -280 77 502 214 -267 -90 357 269 -93 179 380 -51 -304
5284c04K14N52k27l66K7L98rm53k0N07j62k71k20M44j05k99n57J170o2n15p9N53
$$ -304 -90 462 235 -131 -104 294 285 -168 -188 319 157 -114 -334 110 5 -294 -851 319 257 -258 -337 216
5306B16K13o77j06L92l1o19M53L62L07j007j98P01K67p17o7Q08j46o03M0L78J18
$$ 216 429 -248 -354 38 7 -612 -159 203 510 -497 -695 6 273 -444 -511 297 151 -452 -412 -34 84
5327H4o94J86O06J40n67o0N76j32k71k51N32j02l79n9L83O26j037j00P64J8n00
$$ 84 -610 -424 182 322 -245 -305 271 139 -132 -383 149 47 -332 -391 -8 618 -419 -519 245 263 -237
5348b37r8K87M07r47o8P39R7m47j87N56M21n74j02n3L25k32l12M44J89k88l14
$$ -237 -335 -48 359 -588 -656 83 180 -267 -454 102 523 -51 -153 -206 119 -113 -425 19 208 -80 -394
5369c94O64M04l58n71k1Q17Kj053P76J95k36n54M62P55p64k67M36N61n45k03o
$$ -394 270 674 316 -255 -276 541 543 -510 266 461 225 -329 133 888 124 -143 293 854 309 106 100
5390A00O03o64l59L50M70n81j13J23L94j37m04M13J70m50k54L02L09K00q10M60
$$ 100 703 39 -320 30 500 -81 -194 -71 323 186 -218 195 365 -85 -339 -37 272 472 -338 122
5410A22L79m13K4k54M00j5p69P02J5j47k46J07K64j95l37J20M73J55o94l07P26
$$ 122 501 88 112 -142 258 243 -526 176 191 44 -202 -95 169 -26 -363 -243 230 385 -309 -616 110
5431A10p5l97J33M25k57k83k9O14M6n88k1L89K08p20J14N77R6m89o22R37J4l90
$$ 110 35 -362 -229 196 -61 -344 -373 241 287 -301 -322 67 275 -445 -331 246 342 -147 -769 168 182 -208
5453b08j04N67j76n41J47M69J45o62j17N40M42o61k60O43o8n26j87P39J74n13
$$ -208 -312 255 79 -462 -315 154 299 -363 -480 60 502 -159 -419 224 156 -370 -557 182 356 -157
5473a57m79N48K76m26l5K28O0m09K42J85K89k20m94N63O1l02k58O65j67l27l71
$$ -157 -636 -88 188 -238 -273 -45 15 -394 -152 33 322 102 -392 171 232 -70 -328 337 170 -157 -528
5494e28L71O98n11l73K45N13j30n92M06J6l00p5L44J81o2o84M33O78l87n77O78
$$ -528 -157 541 30 -343 -98 415 285 -307 99 115 -185 -260 84 265 203 -481 -48 630 243 -334 344
5515C44O5j82o47L6P83k09n04N28N30m55q44L92O53l63l41M26K94k72l71j73Q74
$$ 344 409 227 -420 -384 399 190 -314 214 744 289 -555 -163 490 127 -214 212 506 234 -137 -310 564
5536E64n07o76N93M14J22o42k21R52l14q28N72J28pk87k13Q12k96m76K00P16n50
$$ 564 57 -619 -26 388 510 -132 -353 599 285 -543 29 157 150 -137 -350 462 166 -310 -110 606 56
5557E6m93L91K05q7n42L48J06kl14P3J97M64q51J8L81qm11M0L72N42p65k50N43
$$ 56 -437 -46 159 72 -470 -122 -16 -18 -332 -259 -62 402 -449 -431 -50 -58 -469 -429 -57 485 -280 -530 13
5580A3K70p57k13P04N49j128J20O47K06p62Q5K00J71m52j16Q80j76o38j26P00
$$ 13 283 -474 -687 17 566 -562 -442 205 411 -351 -266 -66 105 -347 -463 417 241 -397 -523 177
5600A77L14q90l3O62J12o34Q3K71K25n48J24j60O98n95k02N40K68o15J44R3j72
$$ 177 491 -399 -432 230 342 -292 -209 62 287 -261 -137 -297 401 -194 -396 144 412 -203 -59 34 -138
5621a38K32l61J92K52j50m35J93L64l18L2Q4L42j11m31K73O43m18n52N04l4L8
$$ -138 94 -267 -75 177 27 -408 -215 149 -169 -137 -53 289 178 -253 20 663 245 -307 197 163 201
5642B01l79K67L66l62l12M48K33m4l85m2N45k90n51K74O83l27m18j7M64j15p66
$$ 201 -178 89 455 93 -219 229 462 418 33 -9 536 246 -305 -31 652 325 -93 -110 354 239 -527
5663e27M33L60j48k50J70P10o40k13J31N48o15j64K91K10k12k80P1M67k23m06
$$ -527 -94 266 118 -132 38 748 108 -105 26 574 -41 -205 86 296 84 -196 -125 342 119 -287
5683b87M2R31n32l13j23O82j87l64o2K69J97l54k02L93q3m01k3N79j07r3l68L64
$$ -287 -245 686 154 -159 -282 400 213 -151 -213 56 253 -101 -303 90 7 -394 -417 162 55 -38 -406 -42
5705d2J89o47J34M48j47l60N2N09L9m33l07N09K27p80k05J035J81o71k91Q22j20
$$ -42 147 -500 -366 82 -65 -425 -373 136 175 -258 -565 -56 171 -609 -814 221 402 -269 -560 262 142
5726A42m75k13N09J90l70o6L97J88o59J44n0M36j96l69L82K91k07m51K81M07m36
$$ 142 -333 -546 -37 153 -217 -283 114 302 -357 -213 -263 173 -23 -392 -10 281 74 -377 -96 311 -125
5747a25k18K97K25o5n25O27nk75j95K31K71l12L8p0K75j68l06J98M76p3l59l3
$$ -125 -343 -46 179 114 -411 216 211 -64 -259 -28 243 -69 -31 -101 174 6 -300 -102 374 301 -58 -91
5769i1N65k86o17N14L13j37l25j31N86m37j31K00M26k00n22L15N39l71m58J71
$$ -91 474 188 -429 85 398 261 -64 -195 391 -46 -177 23 449 249 -273 42 581 210 -248 -77
5789g7M10k30l40M30M15j80m54m3P82m29n96K60P49o02j02j79K51K58n59o5M67
$$ -77 333 103 -237 193 608 428 -26 -69 713 284 -312 -52 697 95 -7 -186 65 323 -236 -301 166
5810A66K33o73Q3P32m40k79J73J68P7l36Q6K97j11m01k99M47r1L2l3Q1L50m17
$$ 166 399 -274 -191 541 101 -178 -5 163 240 -96 -10 287 176 -225 -524 -77 -168 -136 -169 -88 262 -155
5832a55m59P28Q8l67k13K31J77k72j81N69k7m25l62O20Q1k55j23N29L96k40q49
$$ -155 -614 114 202 -165 -378 -147 30 -242 -423 146 119 -306 -668 -48 33 -222 -345 184 580 340 -509
5853e09K80N16j94n61N45L3m50pM73N7n99K77j82M13l69m6M66K38l47p10O66K49
$$ -509 -229 287 93 -468 77 110 -340 -347 126 183 -416 -139 -321 92 -277 -323 143 381 34 -676 -10 239
5875B39J64n00N5M78p04k07M64J90o4k58J20L28j47o79M49O11m84j53m2M24j06
$$ 239 403 -97 -42 436 -268 -475 -11 179 115 -143 -23 305 158 -521 -72 539 55 -98 -140 284 178
5896A78k66K4M41j61m46J80L41j39j92K23J9K69p26L29nK44l0j72N91o66n06N22
$$ 178 -88 -64 377 216 -230 -50 291 152 -40 183 202 471 -255 74 69 313 283 111 702 36 -470 52
5918E2K05k4n48N31M53n53l19K61L84j47k40l55R69m0r29L08N42k72l77k8K87
$$ 52 257 233 -315 216 669 116 -203 58 442 295 55 -300 669 629 -300 8 550 278 -99 -127 160
5939A60k25MJ42L59j62n85J83K19K55m32J58N3N1n15M90Pl28N2kL51L9p5m33K47
$$ 160 -65 -61 81 440 278 -307 -124 95 350 -82 76 129 180 -335 155 162 -166 -114 -116 235 274 199 -234 13
5963A3K56k24l96K37J90k10j27K82M1k43j22K66L58n75j6q7O33n35m3L96K57l76
$$ 13 269 45 -351 -114 76 -134 -261 21 62 -181 -303 -37 321 -254 -270 -357 276 -259 -302 94 351 -25
5985b5m66P34K66o60l15K43J27j0k79L73M70m49n38M04L37m21KL8N48l39n33K41
$$ -25 -491 243 509 -151 -466 -223 -96 -106 -385 -12 458 9 -529 -125 212 -209 -207 -169 379 40 -493 -252
6007b52M85k91k68M68jk38m99L75O22l28k73K33r9J90k85K14L51k18l05J51L10
$$ -252 233 -58 -326 142 141 -97 -596 -221 401 73 -200 33 -66 124 -161 53 404 186 -119 32 342
6028C42j35l81L54R0Q5n91R3N56j22o62N07J34Nj73oK25j99l57J64J98N6n58K62
$$ 342 207 -174 180 270 355 -236 -143 413 291 -371 136 270 275 102 96 321 122 -235 -71 127 183 -375 -113
6051a13L47O4n96K38O85j99n21j29N14J1l46OJ64J59n21q9P26j85m17m3L43j1
$$ -113 234 298 -298 -60 625 426 -95 -224 290 301 -45 -39 125 284 -237 -326 400 215 -202 -245 98 87
6073H7pj56J27J16k44l9N44q6l53k13M4K9j84M37j17K12m05J64o3L28o21L11r
$$ 87 80 -76 51 167 -77 -116 428 342 -11 -224 -180 -151 -335 102 -15 197 -208 -44 -107 221 -400 -89 -98
6096i8K11j17k21J05J0k04kK25J21r9l35M41M2k33j53J76M53q01J47M48r5l21
$$ -98 113 -4 -225 -120 -110 -314 -316 -91 30 -69 -404 37 79 -154 -307 -131 322 -479 -332 116 21 -300
6118c00l84P16O0j05rJ10K54p80J29M10J35k93k07M19K05m07j86M25nJ4o24L47
$$ -300 -684 32 92 -13 -22 88 342 -438 -309 101 236 -57 -264 155 360 -47 -233 192 187 201 -423 -76
6140g6M26n21k75N25l0k79J33J76J79K5l21L0J47n9L7l10M53k50k00j49O95l21
$$ -76 350 -171 -446 79 49 -230 -97 79 258 283 -38 -8 139 80 117 -193 260 10 -190 -339 356 35
6162C5j60K01K56l53K6j38K33J53l73OL11J14m72J57M37m29k10Q2L44j05l48L50
$$ 35 -125 76 332 -21 5 -133 100 253 -120 -114 197 311 -161 -4 433 4 -206 -124 220 115 -233 117
6184A17K75l24k28K03L72k41k92j38N77l4k63l19P92l97j34n6M52j82m98M50q3
$$ 117 392 68 -160 43 415 174 -118 -256 321 287 24 -295 497 100 -34 -90 362 180 -318 132 49
6205D9r1k35L1L77J41o30L59K52k48k34k5J82R4j60J04J92l05oK3j46Q10p78k53
$$ 49 -42 -277 -246 131 272 -358 1 253 5 -229 -254 -72 22 -138 -34 158 -147 -153 -130 -276 534 -244 -497
6228d97K39N00l13l46N41q4j67k18Q4M56n51J28K45L73l24p15L05M80k72j08K15
$$ -497 -258 242 -71 -417 124 40 -127 -345 -261 195 -356 -228 17 390 66 -649 -344 136 -136 -244 -29
6249b9K06l86j38K61L49k24m07J02N45l44k51J60L63j94k81K41K23j94k35L65
$$ -29 177 -209 -347 -86 263 39 -368 -266 279 -65 -316 -156 207 13 -268 -27 196 2 -233 132
6269A32J39j06m61J27K42K70p68M73J52k08J66l10L98m19J23O7J1J62m05J09M26
$$ 132 271 165 -296 -169 73 343 -425 48 200 -8 158 -152 246 -173 -50 17 28 190 -215 -106 320
6290C20j94l85L03M34l77k44K31K32k51q9k97N04P5l77j11N01M8o75J91K35J86
$$ 320 126 -259 44 478 101 -143 88 320 69 -20 -317 187 262 -115 -226 275 323 -352 -161 74 260
6311B60l06M9M24q1k26k11M50l73k45L62j01K00m36N37j03P9n87J68N76j27k20
$$ 260 -46 3 427 346 120 -91 359 -14 -259 103 2 202 -234 303 200 279 -308 -140 436 309 89
6332H9m15O37j25l64R3L18K1l06j45k1J46k50r7O75j90k72o6R4L41m13L4L07J72
$$ 89 -326 311 186 -178 -85 233 254 -52 -197 -218 -72 -322 -419 256 66 -206 -272 -178 163 -250 -216 91 263
6355B63n08k22K18M98m99K09J36J1R8p58M77K36n90M23n1K22Q3l82L54m5k17l14
$$ 263 -245 -467 -249 249 -250 -41 95 106 204 -554 -77 159 -431 -8 -59 163 246 -136 218 173 -44 -358
6377c58n6L42P2j51p2L34j32p7j77M94m45j06L73R1l99J69K65R2l13j34L15n9
$$ -358 -414 -72 0 -151 -223 111 -21 -98 -275 219 -226 -332 41 132 -267 -98 167 259 -54 -188 127 68
6399F8j11k57L21J31k5j94L12k22o0k06M06r9J03l57L68l50K38O4o5K10M3n13
$$ 68 -43 -300 21 152 127 -67 245 23 -37 -243 163 64 167 -190 178 -172 66 130 65 275 318 -195
6421a95K55J66j88o0k3K44R4j90j48M40m26J29M8L18m17n3NK79O7o29K32K19o3
$$ -195 60 226 38 -22 -45 199 293 103 -45 395 -31 98 146 464 47 -6 -1 278 345 -284 -52 167 104
6444A04j99K30K60r1n74m2N39N0k26m00M22K57m68J04L38k61r1m6L14n3k64r0
$$ 104 -95 135 395 304 -270 -312 227 277 51 -349 73 330 -138 -34 304 43 -48 -94 220 167 -97 -187
6466a87K52j7k94QL79J89m58MM40k30k79ML35k72q2j33K91J56n0m06M22k01k01
$$ -187 65 48 -246 -238 141 330 -128 -124 316 86 -193 -189 146 -126 -208 -341 -50 106 56 -350 72 -129 -330
6489c30N3K51K78j63m85K68J83l57r2J99N48n00j12Q7K58K28o55J69N16l68k02
$$ -330 -277 -26 252 89 -396 -128 55 -302 -394 -195 353 -147 -259 -172 86 314 -341 -172 344 -24 -226
6510b26K49J4k85j45J91K80j56k08J19K00N7l75K29J80J8k33K25J72k37l47K58
$$ -226 23 37 -248 -393 -202 78 -78 -286 -167 33 90 -285 -56 124 142 -91 134 306 69 -278 -20
6531b0J18J76p63L29L66j24k32L56P5l04K95j42r7K0j77jO14m86l75L85L32k99
$$ -20 98 274 -489 -160 206 82 -150 206 281 -23 272 130 33 53 -124 -125 489 3 -372 13 345 46
6553D6j4R5K17n39J64k2K42%n91M57K40O1k49o88R53J0m08L21j63k6l54J68N68
$$ 46 32 127 344 -195 -31 -53 189 189 -402 55 295 356 107 -581 372 382 -26 295 132 106 -248 -80 488
6576D88l12l9n49O04p9l01J76Q4Qq5Q7K90m6l40k93L43j12K37k58L46N4l55l9
$$ 488 176 137 -412 192 113 -188 -12 72 80 -5 82 372 326 -14 -307 36 -76 161 -97 249 303 -52 -91
6599i1K42o6j64Q7K37l7j41r4K87Q8n17R3K48l25j39J30O8J86l25J95K12kn56
$$ -91 151 85 -79 8 245 208 67 -27 260 348 -169 -76 172 -153 -292 -162 -94 92 -233 -38 174 172 -384
6622c84j5L47J87m74J50K28j4N4l29m1M08l72J9MJ73Rk09K76k71M03j47k06Nj45
$$ -384 -399 -52 135 -339 -189 39 25 79 -250 -291 117 -255 -236 -232 -59 -50 -259 17 -254 149 2 -204 -199 -344
6646c44J82K69k12o1K1J82j30K50k94R2K78j46j29r4L96k07k03O1M43l94j41J26
$$ -344 -162 107 -105 -166 -145 37 -93 157 -137 -45 233 87 -42 -136 260 53 -150 -89 354 -40 -181 -55
6668e5J01p7JL07J75m3o04j25K73L21l92l9M65j57j70j45P36k65n37M10p6K8l69
$$ -55 46 -31 -30 277 452 409 -195 -320 -47 274 -118 -157 308 151 -19 -164 572 307 -230 180 104 132 -237
6691b37K49K26l10n6J93M81m34j20K9L90m30j56R5L21j42j30J71J71k48j25OL9
$$ -237 12 238 -72 -128 65 546 112 -8 21 411 -19 -175 -80 241 99 -31 140 311 63 -62 -56 -17
6713a7R9l49N37q7k11l45K07L92j62k05J33L19l5o70M98J9K11N0l42N6P4k60l90
$$ -17 82 -267 270 183 -28 -373 -166 226 64 -141 -8 311 276 -394 104 123 334 384 42 98 172 -88 -478
6736d78P53k41l64N3r9K45K04j50K07O5m90J53M4J66j95k21O07n9j49k81m4K59
$$ -478 275 34 -330 -277 -376 -131 73 -77 130 195 -295 -142 -98 68 -127 -348 259 200 51 -230 -274 -15
6758a5m83K54L29J10m14p2O9J56k6k8k59N07k70MJ42J67k39R4k24J25Pj32J82
$$ -15 -498 -244 85 195 -219 -291 -222 -66 -92 -120 -379 128 -142 -138 4 171 -68 26 -198 -73 -66 -198 -16
6781a6k47J81k31L54L35m83J11K99k8k48l32L51R8k48Np7M42q0%J20j66k50M4
$$ -16 -263 -82 -313 41 376 -107 4 303 275 27 -305 46 144 -104 -99 -176 266 186 186 306 140 -110 -66
6804f6M90m46J98j72l6J06k35M80q0R0j18k73M5K79J77l27k09L94k3n26J65J03
$$ -66 424 -22 176 4 -32 74 -161 319 239 329 211 -62 -17 262 439 112 -97 297 274 -252 -87 16
6826A6J17j27J54j55L78m37K06N10l41l09N2K23J56o05K1N13l63j05n2M59J17
$$ 16 133 6 160 5 383 -54 152 662 321 12 64 287 443 -162 -141 372 9 -96 -148 311 428
6847D28m06P2J76r4l82oM90j49j75j37N07j77l90J01J17j07k5K8J26k8k7O6O5
$$ 428 22 94 270 176 -206 -212 278 129 -46 -183 324 147 -243 -142 -25 -132 -157 -129 -3 -31 -58 8 73
6870G3j65no9L51j64K11l87J40L94o67k0L34K04l14j48J05N9J9n3k92K90J01l34
$$ 73 -92 -97 -166 185 21 232 -155 -15 379 -288 -308 26 230 -84 -232 -127 -68 -49 -102 -394 -104 -3 -337
6893c37L44K7o7O1l92N10l10k55M47k0p7J57k44J81N3l89L09j39J81l44K24J44
$$ -337 7 34 -33 28 -364 146 -164 -419 28 8 -69 88 -156 25 78 -311 -2 -141 40 -304 -80 64
6915F4k46J3K45q6p8J3J84k1j14M7l3M07k70n6j17P7j2q0M3j31K71m28k8L17j16
$$ 64 -182 -169 76 -10 -88 -75 109 88 -26 21 -12 395 125 69 -48 29 17 -63 -20 -151 120 -308 -336 -19 -135
6940a35O2q4M03j4j97L16j36l8j13k74M25L3J17l98J67J32j70m8q2J29k55M1J08
$$ -135 -73 -157 246 232 35 351 215 177 64 -210 215 248 365 -33 134 266 96 48 -34 95 -160 -119 -11
6963a1L63k64j06L24k47J32j18J76O4m44L8P8P2l06L56j68L21j72j59J35k00q1
$$ -11 352 88 -18 306 59 191 73 249 313 -131 -93 -15 57 -249 107 -61 260 88 -71 64 -136 -217
6985b17K63K49l04Q8k04J98o7k30L7Q5J8J24k31J04J83k07k37K08K87l89M2L52
$$ -217 46 295 -9 79 -125 73 6 -224 -187 -102 -84 40 -191 -87 96 -111 -348 -140 147 -242 -200 152
7007A52r0m17R8R3lJ07R4k57L03p0j58J12j03J27K7L14m98L79n13J27R9p4K1O1
$$ 152 62 -355 -257 -164 -167 -60 34 -223 80 10 -148 -36 -139 -12 15 329 -169 210 -303 -176 -77 -151 -130 -69
7031f9R2r3O4%M8J44j28M3Mk82o2J87J4J89m41R1M72q2k95r8O19l81L8k19L31
$$ -69 23 -70 -6 -6 42 186 58 101 105 -177 -239 -52 -38 151 -290 -199 273 191 -104 -202 417 36 74 -145 186
7056A86m45L12J53J46k00j28l3J50R3l77L27R8J41o57P9M43k51m2K46l87K24R3
$$ 186 -259 53 206 352 152 24 -9 141 234 -143 184 282 423 -234 -155 288 37 -5 241 -146 78 171
7078A71m1k21P9J04k21L82k20J9j28PJ67J36n16L50J54j92O4L2l1Q7K22j09K38
$$ 171 130 -91 -12 92 -129 253 33 52 -76 -69 98 234 -282 68 222 30 94 126 95 182 404 295 533
7101E33p88K79J87J45m10p9L12K1l13J8K5j65K1L07k2k1m82N38K48r9r8j52n8
$$ 533 -255 24 211 356 -54 -133 179 200 -113 -95 -70 -235 -214 93 71 50 -432 106 354 255 157 5 -53
7124e3lk6J09N1o3m7j65L54r5l45R7L60k4j42o3J94j9r7k70M03m22L1M7L56l79
$$ -53 -56 -82 27 78 15 -32 -197 157 62 -283 -186 174 150 8 -55 139 120 23 -247 156 -266 -235 -188 168 -211
7149b11R6J40O1L09m42j03L17k30q7n8J46O2k28J34K33J86l52j45r1N65j10n41
$$ -211 -115 25 86 395 -47 -150 167 -63 -150 -208 -62 0 -228 -94 139 325 -27 -172 -263 302 192 -349
7171c49K6L55r8j39P9M60l16j09K86k06L52m05QK08k93K02l09K86q9K47j10K51
$$ -349 -323 32 -66 -205 -126 334 18 -91 195 -11 341 -64 -56 152 -141 61 -248 38 -51 196 86 337
7193C37l20O2q2J18N8j46J50l4k40J92q1j61L16j0qj4j2m6P6L2j03k20P3N3j24
$$ 337 17 79 -3 115 173 27 177 143 -97 95 14 -147 169 159 151 137 125 79 155 187 84 -136 -63 -10 -134
7218a34j50J20J08%J7J0j5J28j68j9J63j8j68q5J75m3K75n2nj29J11o7J5M39n60
$$ -134 -284 -164 -56 -56 -39 -29 -44 84 -84 -103 60 42 -126 -211 -36 -79 196 144 139 10 121 54 69 508 -52
7243e2N9K28j14k62N9r0K42k78J91P3m8N9l44K01L8L06k59K0l5P6k69M66k9l63
$$ -52 7 235 121 -141 -82 -172 70 -208 -17 56 8 67 -277 -76 -38 268 9 29 -6 70 -199 267 238 -125
7267a25j66N35q8j52j57J60l37K93P3j19L2K73m97L60m4m0k16j00L08n0j50L7
$$ -125 -291 244 156 4 -153 7 -330 -37 36 -83 -51 222 -275 85 41 1 -215 -315 -7 -57 -207 -170
7289a70K39o5j1Q2K04k86L6k1m7N4j41k20L93k9O2O7k67J88k03j70N35k32j49
$$ -170 69 4 -7 75 279 -7 29 8 -39 15 -126 -346 47 18 80 147 -120 68 -135 -305 230 -2 -151
7312a51K9K2K26lk20M84k07Ol45L17j84j01J51L6J81l66j37N65j66p7j96J10K68
$$ -151 -122 -100 126 123 -97 387 180 186 -159 158 -26 -127 24 60 241 -125 -262 303 137 60 -136 -26 242
7335B42k48j08K11n5j60M60m24M2R9N0q0j3J22R0N3m26J72Q3M7qn0k40K06J59
$$ 242 -6 -114 97 42 -118 342 -82 -40 59 109 29 16 138 228 281 -145 27 110 157 149 99 -141 65 224
7359B24J18m26K43O1k31j73J26L91l59Q4j79K07%l10L01J66l52j04L88n0l09L40
$$ 224 342 -84 159 220 -11 -184 -58 333 -26 58 -121 86 86 -224 77 243 -109 -213 175 125 -184 156
7381A56J14m63M4l7L49P0m68L40l20L38n4k53J27o0j71j4M13j33J09j20j95Q3
$$ 156 270 -193 -149 -186 163 233 -235 105 -215 123 69 -184 -57 -117 -288 -302 111 -22 87 -33 -228 -145
7403a45J06l33L28J4j34K65J5Q4k89j4J40j21O8R5j73J33k44L4P6N0j76K24k24
$$ -145 -39 -372 -44 -30 -164 101 116 200 -89 -103 37 -84 -16 79 -94 39 -205 -171 -95 -45 -221 3 -221
7426b21J94J86k81k28K62J03j91r5K76K1K80m95N09k40l28N24k31J1l22K49RJ47
$$ -221 -27 159 -122 -350 -88 15 -176 -271 5 26 306 -189 320 80 -248 276 45 56 -266 -17 -8 139
7448A39k91j00O95m89l80M33j0J97l75o4K99r0K70o1l1l42K10k60N03k12j92N4
$$ 139 -152 -252 443 -46 -426 7 -3 194 -181 -245 54 -36 234 173 142 -200 10 -250 253 41 -151 -97
7470i7J23L98l89j52M11O5j38n14N16l45P4j5L54o05N2L01j80K75j80j07N8L85
$$ -97 26 424 35 -117 294 359 221 -293 223 -122 -48 -63 291 -314 -262 39 -141 134 -46 -153 -95 290
7492B90J09m71q0L09k83J27K57j01r5p7J97q5K8k29J85K06q3l18K66k04J17k49
$$ 290 399 -72 -152 157 -126 1 258 157 62 -15 182 97 125 -104 81 287 204 -114 152 -52 65 -184
7514a84O4K42P5n43J5L28J61j39J55r1k78J09J19K35m56JJ29J93j36n8J94l35
$$ -184 -120 122 197 -346 -331 -3 158 19 174 83 -195 -86 33 268 -188 -187 -58 135 -1 -59 135 -200
7536b00J31J59o8j17K5%o7o3N55m30k56K90r7n8m9M53l71k5M9L09j59m19M71l2
$$ -200 -69 90 22 -95 -70 -70 -137 -200 355 -75 -331 -41 -138 -196 -245 208 -163 -188 -139 170 11 -408 63 31
7560C1o4K11k58K99p5k27l3N6k44K93o5K35k25L4M9O7k23J66L7N28k77m39K75
$$ 31 -33 178 -80 219 144 -83 -116 -60 -304 -11 -76 159 -66 -32 17 84 -139 27 64 592 315 -124 151
7583A51k24N4j91K21N1K39m47K36R8k2j43k44L14j55k86J77J09J9R9j16K53k22
$$ 151 -73 -19 -210 11 62 301 -146 90 188 166 23 -221 93 -62 -348 -171 -62 -43 56 -60 193 -29
7605b9J16J06k58J60K3k24P8j1J8M5n6J29K88m76J64J44N5m13J84P6m54J08K82
$$ -29 87 193 -65 95 118 -106 -28 -39 -21 24 -32 97 385 -91 73 217 272 -141 43 119 -335 -227 55
7628E5K9j72J13k10J20L7J50k04L20r8k54L57n1l9l54L32L0j95O9J47j21j02m6
$$ 55 84 -88 25 -185 -65 -28 122 -82 238 140 -114 243 192 153 -201 131 161 -34 35 182 61 -41 -87
7651h7QR2j01j16K81L73p69M44j62J31k82j86O68k07j07J68p0j15p3J29j65J54
$$ -87 -79 13 -88 -204 77 450 -319 125 -37 94 -188 -374 294 87 -20 148 78 -37 -110 19 -146 8
7673Hj15K82l26K9K64m02K63J10j44K16K9j24P3j72k46M87k93K22k18K20L7k90
$$ 8 -107 175 -151 -122 142 -260 3 113 -31 185 214 90 163 -9 -255 232 -61 161 -57 163 200 -90
7695i0m7K27j47lO4K28k59q2J33l93N52l40K99k09J87m32J9J96K56j91o5l8J25
$$ -90 -137 90 -57 -60 4 232 -27 -109 24 -369 183 -157 142 -67 120 -312 -293 -97 159 -32 -97 -135 -10
7718a0k48K22j1j7m3P3L4K37m01J29L33j35l36n0N02k63O1j0n9J63k77j28J72
$$ -10 -258 -36 -47 -64 -107 -34 0 237 -164 -35 298 163 -173 -223 279 16 77 67 8 171 -106 -234 -62
7741f2J82Pk83K41O4p3m3L95j93l2l20J96J92k76O9K0K83m94Q9k42M15N5l47M44
$$ -62 120 127 -156 85 149 76 33 428 235 203 -117 79 271 -5 64 84 367 -127 -38 -280 135 190 -157 287
7765B87j16m57Q4R0K58r0k17J84J91j49j41r8M30m29J89R5j07j63n7M32l14M9
$$ 287 171 -286 -202 -112 146 56 -161 23 214 65 -76 -174 256 -173 16 111 4 -159 -216 216 -98 -49
7787d9n7K14j49n9j28M31k73P6m29L6N97k45m20M00K62m70J77m32L86J26m7k41
$$ -49 -106 108 -41 -100 -228 203 -70 6 -423 -387 210 -35 -455 -55 207 -263 -86 -518 -132 -6 -53 -294
7809b94L55J43l81M02l15J33n5K86l48n7P3J76j77j03q3j3L30k28L06R0j90K7
$$ -294 61 204 -177 225 -90 43 -12 274 -74 -131 -58 118 -59 -162 -245 -258 72 -156 150 240 50 77
7831G7j40J64k9j46J63o6n5K99k70j53L73Q4l57k07L56J33k61j51M99k35j72j96
$$ 77 -63 101 72 -74 89 23 -32 267 -3 -156 217 301 -56 -263 93 226 -35 -186 313 78 -94 -290
7853b90M50K06j85k91j03J03PK08o5J17q0k8J4L22k11r6k91M36o15K93N9n4N09
$$ -290 160 366 181 -110 -213 -110 -103 105 40 157 77 49 63 385 174 78 -213 223 -392 -99 -40 -94 415
7876D15l02K67j82j70l64M35Q3n1j55NM2k56m4N99j36j46l8L6P7j00L9j21L3l5
$$ 415 113 380 198 28 -336 99 182 131 -24 -19 23 -233 -277 322 186 40 2 38 115 15 54 -67 -34 -69
7900f9J52J68j45p8k35k4K31k95M4J81j9N5J5n7M18j91n94K41J12K67k82J50j48
$$ -69 83 251 106 28 -207 -231 0 -295 -251 -70 -89 -34 -19 -76 342 151 -443 -202 -90 177 -105 45 -103
7923a03M8j25R2O3K67l66r0K55K21m07p9O0m9K32o0l8o7N6K24q9Pk08J52J90m81
$$ -103 -55 -180 -88 -25 242 -124 -214 41 262 -145 -224 -164 -213 19 -41 -79 -146 -90 134 45 52 -156 -4 186 -295
7948b95J78K7J57Q6j82J4K9j1j15q1J33R4o7l6J2N8K9K3L8k07L4m9J46j6J03l47
$$ -295 -117 -90 67 153 -29 -15 14 3 -112 -193 -60 34 -33 -69 -57 1 30 53 91 -116 -82 -131 15 -1 102 -245
7974b45M24k87k27P22k51r0n8K50j92k28K26o5L31m45m3K39J48Q4m01L68j58O5
$$ -245 179 -108 -335 387 136 46 -12 238 46 -182 44 -21 310 -135 -178 61 209 293 -108 260 102 167
7996A67j50J18k82M82k16j16R4L5J29k94j43Q7j00L80j17j36N9j88M15j86O5r8
$$ 167 17 135 -147 335 119 3 97 132 261 -33 -176 -89 -189 191 74 -62 -3 -191 224 38 103 5
8018EK33k05m08L23j68N43m9l69K79j28r7m9Q8k8K1Q9L35j70m04J29R5J54l36
$$ 5 238 33 -375 -52 -220 323 274 -95 184 56 -41 -90 -2 -30 -9 80 415 245 -159 -30 65 219 -117
8041a17J68K57k74l57J57K5P2j93L31M6l22K77j16j43L45k04j83J03L02k93J71
$$ -117 51 308 34 -323 -166 -141 -69 -262 69 115 -207 70 -46 -189 156 -48 -231 -128 174 -119 52
8062E2r6p6O3j03M1Q3R8k82K75k08Q2k26J34O0M2M2p8K56o07M13j85QJ48j44J07
$$ 52 -44 -120 -57 -160 -119 -36 62 -220 55 -153 -71 -297 -163 -103 -61 -19 -97 159 -448 -35 -220 -212 -64 -208 -101
8087a01K7j35K31k61L19m9k49q5L01P8J4r9J55j0m68M96l05R5J13j34J73k14K59
$$ -101 -74 -209 22 -239 80 31 -218 -303 -2 76 90 -9 146 136 -332 164 -141 -46 67 -67 106 -108 151
8110A51n9p7j06KL85l01K22k71k23M11J07m02R7L69l64J17n9J69J60l60O2L0Q5
$$ 151 92 15 -91 -89 296 -5 217 -54 -277 134 241 -161 -64 305 -59 58 -1 168 328 -32 30 60 145
8133A45k37J2K23k38J05K47k35M6p9J54oj94j19L06J91k90k68J24K56l00K11K2
$$ 145 -92 -80 143 -95 10 257 22 68 -11 143 137 -57 -176 130 321 31 -237 -113 143 -157 54 76
8155G6j34K04Rk52N4j56o3J24n5K51j46p9j5J92j67M73m30K82l77J69q2k37M96
$$ 76 -58 146 155 -97 -43 -199 -262 -138 -193 58 -88 -167 -182 10 -157 316 -114 168 -209 -40 -122 -359 137
8178A37j01k39L26o5l86J28J86k2R1m72M25L6k12
$$ 137 36 -203 123 58 -328 -200 -14 -36 55 -417 8 44 -168
8191a68
$$ Imaginary data points
##PAGE= N=2
##DATA TABLE= (X++(I..I)), XYDATA
0@%%%%%%%Qj6J6j6K4l2L2m0N6o4P2q8J04j20J37j61J92k17K42k79L19l62M10m58
$$ 0 0 0 0 0 0 0 0 8 -8 8 -8 16 -16 16 -24 32 -32 40 -48 56 -64 73 -88 104 -113 129 -150 169 -193 217 -241
31b41N14n78O44p18Q03q93R89j097J218j348J490j651J831k026K245k498K785
$$ -241 273 -305 339 -379 424 -469 520 -577 641 -707 783 -868 963 -1063 1182 -1316 1469
48A469l112L494l950M497n166O015p134Q671j0925J4562k1383L8400j53090k80718
$$ 1469 -1643 1851 -2099 2398 -2768 3247 -3887 4784 -6141 8421 -12962 25438 -127652 -408370
62d08370L75717J98419l37392k46555L08253K24326k71588k27921K62784K32111
$$ -408370 -32653 165766 -171626 -418181 -109928 114398 -157190 -385111 -122327 109784
72A09784k03422j99685K08650K02475j64985j68672J78464J74437j49140j60949
$$ 109784 -93638 -293323 -84673 117802 -47183 -215855 -37391 137046 -12094 -173043
82a73043J42951J54788j30022j52981J18346J47674j08271j51216R7126J54674
$$ -173043 -30092 124696 -5326 -158307 -39961 107713 -558 -151774 -54648 100026
92A00026q0260j50070Q2867J69720n4180j57920O3389J80625l6536j67780M7161
$$ 100026 19766 -130304 -47437 122283 68103 -89817 -26428 154197 117661 -50119 -2958
103b958J89962k6643j89508J9462J91582j4652j95436L650J84714j6761k05171
$$ -2958 187004 160361 -29147 -9685 181897 167245 -28191 -24541 160173 143412 -61759
114f1759l172J88971j0054k00299m65J81892k1116j92617K0724J91579k9118j95617
$$ -61759 -64931 124040 113986 -86313 -86778 95114 73998 -118619 -97895 93684 64566 -131051
126a31051K8971J91201l5273j90212M0974J93427m1262j95000L7284J92211l3932
$$ -131051 -102080 89121 53848 -136364 -95390 98037 56775 -138225 -100941 91270 57338
137E7338j87442L1784J82504l0029j78705K5369J73910j9077j65900J6296J61956
$$ 57338 -130104 -98320 84184 54155 -124550 -99181 74729 55652 -110248 -93952 68004
148F8004p574j53517M244J51669Q304j41101j1163J41974K4400j33272l0447J31526
$$ 68004 60430 -93087 -88843 62826 71130 -69971 -81134 60840 85240 -48032 -78479 53047
160E3047M2839j22115m4678J21731N1495j20318n6507J20940O5011j18817p1242
$$ 53047 95886 -26229 -70907 50824 102319 -17999 -74506 46434 111445 -7372 -78614
171g8614J17958P2555j21832p8496J25325Q5833j30076r5707J27649R7689j30086
$$ -78614 39344 111899 -9933 -88429 36896 122729 -7347 -103054 24595 122284 -7802
182g802j02433J30804J04447j34811j11099J31795J11702j30995j12385J28828
$$ -7802 -110235 20569 125016 -9795 -120894 10901 122603 -8392 -120777 8051
192H051J10362j30230j11947J28234J11797j25971j12213J23195J10920j20938
$$ 8051 118413 -11817 -123764 4470 116267 -9704 -121917 1278 112198 -8740
202h740j11196J16879J10426j12223j10467J06636J08266j01964j09084R5102
$$ -8740 -119936 -3057 107369 -4854 -115321 -8685 99581 -2383 -111467 -16365
212a6365J06888q8064j05626Q0487J04483p5660j04460P0658J07198o2357j07332
$$ -16365 90523 2459 -103167 -22680 81803 6143 -98317 -27659 79539 17182 -90150
223i0150N6644J08807m8860j07539M6491J12358l9646j14289L4563J16909k8363
$$ -90150 -33506 75301 26441 -81098 -34607 77751 38105 -76184 -41621 75288 46925
234D6925j16812K4582J19013k2657j22999J8478J24811j4745j27040J1987J28367
$$ 46925 -69887 -45305 73708 51051 -71948 -53470 71341 56596 -70444 -58457 69910
245F9910j1173j30558R148J34571o171j34457M900J36213l073j35783L141J36424
$$ 69910 58737 -71821 -62673 71898 65727 -68730 -63830 72383 69310 -66473 -63332 73092
257G3092n23j35872j545J33551J976j33205l523J30990L837j30241o649J27308
$$ 73092 72569 -63303 -64848 68703 70679 -62526 -66049 64941 68778 -61463 -68112 59196
269E9196P578j25156q712J23672J1645j20795j3913J18724J7577j13681j8983
$$ 59196 66774 -58382 -67094 56578 68223 -52572 -66485 52239 69816 -43865 -62848
280f2848J12349K2128j08585k5691J05728K9845j02549l3511R9016L5362r7773
$$ -62848 49501 71629 -36956 -62647 43081 72926 -29623 -63134 35882 71244 -26529
291b6529m0040R5033M2313r3478m6524R0659M9200r0336n2678Q8408N6395q6741
$$ -26529 -66569 28464 70777 -22701 -69225 21434 70634 -19702 -72380 16028 72423 -14318
303a4318o0200Q4557O3431q3758o5837Q2540O9531q2058p2557Q0443P3857p9593
$$ -14318 -74518 10039 73470 -10288 -76125 6415 75946 -6112 -78669 1774 75631 -3962
315c962p6200P8912P7089p7999p9363P7032Q0503p4944q1538P3291Q2565p1897
$$ -3962 -80162 -1250 75839 -2160 -81523 -4491 76012 1068 -80470 -7179 75386 3489
327C489q3103P0868Q4873o8265q4871O6610Q5556o4746q5026O3293Q5409o0539
$$ 3489 -79614 -8746 76127 7862 -77009 -10399 75157 10411 -74615 -11322 74087 13548
339A3548q5341N7944Q5448n5142q5445N1703Q5492m9128q5882M6511Q5909m3211
$$ 13548 -71793 -13849 71599 16457 -68988 -17285 68207 19079 -66803 -20292 65617 22406
351B2406q7144L9778Q7409l7204q7685L3433Q7542l1348q7660K8006Q8166k5138
$$ 22406 -64738 -24960 62449 25245 -62440 -29007 58535 27187 -60473 -32467 55699 30561
363C0561q8695K1317Q8912j8722q8722J5414R0008j2683r0924R517R1973o806
$$ 30561 -58134 -36817 52095 33373 -55349 -39935 50073 37390 -53534 -44017 47956 41150
375D1150r1393M677R2149k977r1961J241R2759J731r2415m421R2703O919r1539
$$ 41150 -50243 -45566 46583 43606 -48355 -47114 45645 47376 -45039 -49460 43243 50162 -41377
388d1377q635R2001J0839r1612j2504R1870J4993r1492j6416R0995J8134q9692
$$ -41377 -50012 41989 52828 -38784 -51288 40582 55575 -35917 -52333 38662 56796 -32896
400c2896j9051Q9454K0530q8241k2381Q6625K4942q5482k6057Q3906K7228q2993
$$ -32896 -51947 37507 58037 -30204 -52585 34040 58982 -26500 -52557 31349 58577 -24416
412b4416k9553Q1902L1297q0576l3096P8419L4915p7369l6353P6050L7051p4190
$$ -24416 -53969 27933 59230 -21346 -54442 23977 58892 -18477 -54830 21220 58271 -15919
424a5919l9489P2550M0800o9939m2827O8066M4277o6453m6895O5408M8540o3951
$$ -15919 -55408 17142 57942 -11997 -54824 13242 57519 -8934 -55829 9579 58119 -5832
436e832n0916O2003N1958o0121n3665N8790N4368n7848n6312N6371N8227n4333
$$ -5832 -56748 5255 57213 -2908 -56573 2217 56585 -1263 -57575 -1204 57023 2690
448B690n9662N1754O0826n0668o2203M9034O3366m7902o5187M6658O6429m5474
$$ 2690 -56972 -5218 55608 4940 -57263 -8229 55137 7235 -57952 -11294 55135 9661
460I661o6955M3678O7482m2967o8378M1590O9240l9802o9995L7611P0161l5666
$$ 9661 -57294 -13616 53866 10899 -57479 -15889 53351 13549 -56446 -18835 51326 15660
472A5660p0373L4049P0904l2624p1330L0705P1676k8196p1993K6784P1295k5338
$$ 15660 -54713 -20664 50240 17616 -53714 -23009 48667 20471 -51522 -24738 46557 21219
484B1219p0527K3658P0923k1368p1265J9026P1590j6436p1000J3947P1366j1910
$$ 21219 -49308 -25650 45273 23905 -47360 -28334 43256 26820 -44180 -30233 41133 29223
496B9223p1595R595P1960p062p1269M548P1422l238p0228J243P0538J128p1013
$$ 29223 -42372 -32777 39183 32121 -39148 -34600 36822 33584 -36644 -35401 35137 36265 -34748
509c4748k810P1066N407p1074p131P1329R340p1480j1246P1824J3395p1578j5217
$$ -34748 -37558 33508 38915 -32159 -39290 32039 41379 -30101 -41347 30477 43872 -27706 -42923
522d2923P1347J6845p0247j7948O9843J9084o9328k0063O8490K2222o8021k3110
$$ -42923 28424 45269 -24978 -42926 26917 46001 -23327 -43390 25100 47322 -20699 -43809
534d3809O6668K4884o6682k5106O6347K6710o5845k8183O3942K9800o2385l0045
$$ -43809 22859 47743 -18939 -44045 22302 49012 -16833 -45016 18926 48726 -13659 -43704
546d3704O0446L1164n9478l2591N7711L3785n5353l5266N3317L6021n2644l6915
$$ -43704 16742 47906 -11572 -44163 13548 47333 -8020 -43286 10031 46052 -6592 -43507
558d3507N1378L8805n0234m0900M8381M2182m6751m3683M4726M5589m3664m7036
$$ -43507 7871 46676 -3558 -44458 3923 46105 -646 -44329 397 45986 2322 -44714
570d4714M1776M8278l9969m9712L7926N0577l6752n2245L5922N3295l5825n4130
$$ -44714 -2938 45340 5371 -44341 -6415 44162 7410 -44835 -8913 44382 8557 -45573
582d5573L4637N4947l4090n6321L2880N7349l1483n8339L0524N9059k9491o0108
$$ -45573 -10936 44011 9921 -46400 -13520 43829 12346 -45993 -15469 43590 14099 -46009
594d6009K8043O0379k6259n9905K4811N9133k4411n8983K3666N9638k2558n8846
$$ -46009 -17966 42413 16154 -43751 -18940 40193 15782 -43201 -19535 40103 17545 -41301
606d1301K0442N8510j9570n8312J8671N8642j6728n8813J3769N8269j0966n7497
$$ -41301 -20859 37651 18081 -40231 -21560 37082 20354 -38459 -24690 33579 22613 -34884
618c4884R753N6601p750n6134M912N6020k414n5053J143N4397N73n5175k313N5614
$$ -34884 -25131 31470 23720 -32414 -27502 28518 26104 -28949 -27806 26591 27164 -28011 -30324 25290
632B5290M733n5230o606N5208R034n6085j0670N6590J3046n5942j5476N5669J6551
$$ 25290 30023 -25207 -31813 23395 32429 -23656 -34326 22264 35310 -20632 -36108 19561 36112
645C6112n5245j7552N5579J9519n5412k0254N4764K0413n4953k0242N5912K1722
$$ 36112 -19133 -36685 18894 38413 -16999 -37253 17511 37924 -17029 -37271 18641 40363
657D0363n6447k2556N5483K3643n4387k4287N4297K4758n3115k6307N2232K7017
$$ 40363 -16084 -38640 16843 40486 -13901 -38188 16109 40867 -12248 -38555 13677 40694
669D0694m9681k6998M8086K6858m7601k7452M6509K8201m4481k8782M3181K8609
$$ 40694 -8987 -35985 12101 38959 -8642 -36094 10415 38616 -5865 -34647 8534 37143
681C7143m2229k9593M0712L1479l8029l3652L5787L4502l4103l5687L2407L7573
$$ 37143 -5086 -34679 6033 37512 -517 -34169 1618 36120 2017 -33670 -1263 36310
693C6310l1151l8779K8290L9459k6837m0277K6652M1050k5627m3322K4708M4019
$$ 36310 5159 -33620 -5330 34129 7292 -32985 -6333 34717 9090 -34232 -9524 34495
705C4495k4066m5052K3438M6699k3428m8965K2160N0249k0819n0549K0408N0288
$$ 34495 10429 -34623 -11185 35514 12086 -36879 -14719 35530 14711 -35838 -15430 34858
717C4858k0735n0901K0092N1217j9079n0455J8579M9431j9414m9657J9561N0253
$$ 34858 14123 -36778 -16686 34531 15452 -35003 -16424 33007 13593 -36064 -16503 33750
729C3750j8100n0530J7415M9319j6936m9642J6647M9494j4383m9319J1891M7635
$$ 33750 15650 -34880 -17465 31854 14918 -34724 -18077 31417 17034 -32285 -20394 27241
741B7241j0367m5420R707M4995q241m4759N812M3488l784m2286K875M2669j892
$$ 27241 16874 -28546 -18839 26156 17915 -26844 -21032 22456 18672 -23614 -20739 21930 20038
754B0038m3340o71M3493L748m2514o307M2298P964m2679j0463M3417J2822m1705
$$ 20038 -23302 -23973 19520 23268 -19246 -25553 16745 24709 -17970 -28433 14984 27806 -13899
767a3899j5273M1785J5826m1758j6771M3346J8239m3596j9515M3556J9982m3887
$$ -13899 -29172 12613 28439 -13319 -30090 13256 31495 -12101 -31616 11940 31922 -11965
779a1965j9993M5211K1545m5187k3638M5083K3786m3902k3302M4139K3745m4444
$$ -11965 -31958 13253 34798 -10389 -34027 11056 34842 -9060 -32362 11777 35522 -8922
791h922k4225M2985K4464m1482k3398M1539K2289m1659k2488M0773K3521l9667
$$ -8922 -33147 9838 34302 -7180 -30578 10961 33250 -8409 -30897 9876 33397 -6270
803f270k2786L7754K2659l7123k3426L6015K4895l3069k6011L0452K6124k9358
$$ -6270 -29056 8698 31357 -5766 -29192 6823 31718 -1351 -27362 3090 29214 -144
815a44k6316K7982K7354k6545k8291K4082K8434k2671k9141K2045L0621k1027
$$ -144 -26460 1522 28876 2331 -25960 -1878 26556 3885 -25256 -3211 27410 6383
827F383l2909J8699L4286j7020l5552J6163L7324j5957l9031J3785M0366j2776
$$ 6383 -26526 -7827 26459 9439 -26113 -9950 27374 11417 -27614 -13829 26537 13761
839A3761m0108J1812M1061j2974m1764J2365M2463j1364m3184J1728M2741j2366
$$ 13761 -26347 -14535 26526 13552 -28212 -15847 26616 15252 -27932 -16204 26537 14171
851A4171m3923J2463M4921j1304m5257J0654M4524j0968m3855J0988M3901j0396
$$ 14171 -29752 -17289 27632 16328 -28929 -18275 26249 15281 -28574 -17586 26315 15919
863A5919m2897Q912M1397q664l9991R168L9182q134l9339O260L8778n190l7373
$$ 15919 -26978 -18066 23331 14667 -25324 -16156 23026 14892 -24447 -18187 20591 15401 -21972
876b1972M493L6848l223l6966J126L6441J111l5424j950L4166L508l3255n788
$$ -21972 -17479 19369 16146 -20820 -19694 16747 17858 -17566 -19516 14650 18158 -15097 -20885
889b0885L3454P669l2454q877L1988R936l2653j1343L3152J4044l3495j5170L3636
$$ -20885 12569 20238 -12216 -21093 10895 20831 -11822 -23165 9987 24031 -9464 -24634 9002
902I002J5637l3305j6966L4449J8549l4296k0164L3774K0851l3652k0714L4240
$$ 9002 24639 -8666 -25632 8817 27366 -6930 -27094 6680 27531 -6121 -26835 7405
914G405K1551l4616k2096L4066K2791l3494k2230L3805K1786l4380k1810L3544
$$ 7405 28956 -5660 -27756 6310 29101 -4393 -26623 7182 28968 -5412 -27222 6322
926F322K3052l2312k2900L1625K2521l1289k2885L0958K2794k9105k2964K7522
$$ 6322 29374 -2938 -25838 5787 28308 -2981 -25866 5092 27886 -1219 -24183 3339
938C339K2641k6889k2170K5557K3130k4799k2923K2520K3474k1573k3956K0639
$$ 3339 25980 -909 -23079 2478 25608 809 -22114 406 23880 2307 -21649 -1010
950a010K4710j9551k5510J7529K5915j5922k7023J5141K7522j3952k8587J2475
$$ -1010 23700 4149 -21361 -3832 22083 6161 -20862 -5721 21801 7849 -20738 -8263
962h263K9240j1310l0227J0983L0498j0577l1266R265L2125q192l2821P231L3797
$$ -8263 20977 9667 -20560 -9577 20921 10344 -20922 -11657 20468 12276 -20545 -13314 20483
975B0483q080l4224P407L5093o807l4884N303L5373n795l5293N721L5309n038
$$ 20483 12403 -21821 -14414 20679 13872 -21012 -15709 19664 13869 -21424 -15703 19606 14568
988A4568l5525M451L5200m540l4848M364L4707l995l4578K943L3755k078l3056
$$ 14568 -20957 -16506 18694 14154 -20694 -16330 18377 14382 -20196 -17253 16502 14424 -18632
1001a8632K011L2706j421l2164J82L1697M07l0635j431L0230K335k9760k913K8942
$$ -18632 -16621 16085 14664 -17500 -17318 14379 14786 -15849 -17280 12950 15285 -14475 -17388 11554
1015A1554M204k8315m971K7465O271k7370p245K7240Q733k6479j0071K6373J0763
$$ 11554 15758 -12557 -17528 9937 16208 -11162 -18407 8833 17566 -8913 -18984 7389 18152
1028A8152k5691j1775K6227J2681k5597j4330K5747J4845k5760j4819K5720J6281
$$ 18152 -7539 -19314 6913 19594 -6003 -20333 5414 20259 -5501 -20320 5400 21681
1040B1681k5768j6998K5345J7835k4832j8513K5380J8692k5141j9160K5149J9599
$$ 21681 -4087 -21085 4260 22095 -2737 -21250 4130 22822 -2319 -21479 3670 23269
1052B3269k4803j9379K4762J9240k4578j9631K4467J9679k3589j9826K2712K0307
$$ 23269 -1534 -20913 3849 23089 -1489 -21120 3347 23026 -563 -20389 2323 22630
1064B2630k2068k0795K1557K0758k0798k0788J9983K0974j9393k1217J9089K0849
$$ 22630 562 -20233 1324 22082 1284 -19504 479 21453 2060 -19157 -68 20781
1076B0781j7936k1112J6859K1096j6024k1543J5119K1783j4111k2332J2644K2897
$$ 20781 2845 -18267 -1408 19688 3664 -17879 -2760 19023 4912 -17420 -4776 18121
1088A8121j1936k3155J1385K3319j0590k4481R581K4912r055k4791Q147K4958
$$ 18121 6185 -16970 -5585 17734 7144 -17337 -7756 17156 8101 -16690 -8543 16415
1100A6415p913k5141O668K5805o017k6309N246K6789m894k7347M350K7673l655
$$ 16415 8502 -16639 -9971 15834 9817 -16492 -11246 15543 10649 -16698 -12348 15325 11670
1113A1670k8100L344K8045l152k8084K354K8278k384k7752J705K7418p59k7878
$$ 11670 -16430 -13086 14959 11807 -16277 -13923 14355 11971 -15781 -14076 13342 12583 -15295
1126a5295O13K7769k67k7507k16K7278Q69k7215r00K6484J662k6180k277K6169
$$ -15295 -14682 13087 12820 -14687 -14903 12375 13244 -13971 -14871 11613 13275 -12905 -15182 10987
1140A0987K518k5536l198K4891M146k4429m739K4073N777k3707o396K3383P017
$$ 10987 13505 -12031 -15229 9662 13808 -10621 -15360 8713 14490 -9217 -15613 7770 14787
1153A4787k3014p403K2332Q703k2264r225K1876R891k1227j0629K1284J1325k0474
$$ 14787 -8227 -15630 6702 15405 -6859 -16084 5792 15683 -5544 -16173 5111 16436 -4038
1166d038j2213K0174J3104j9762j3997J9684J4865j9478j5494J9579J5905j9421
$$ -4038 -16251 3923 17027 -2735 -16732 2952 17817 -1661 -17155 2424 18329 -1092
1178a092j6190J9486J6455j9086j6368J8619J6965j8513j7613J8278J8402j8160
$$ -1092 -17282 2204 18659 -427 -16795 1824 18789 276 -17337 941 19343 1183
1190A183j8657J7923J8849j7412j9037J6928J9071j6493j9224J6214J8703j5309
$$ 1183 -17474 449 19298 1886 -17151 -223 18848 2355 -16869 -655 18048 2739
1202B739j8584J4617J9115j4571j9132J3660J9515j3470j9322J2582J9496j1929
$$ 2739 -15845 -1228 17887 3316 -15816 -2156 17359 3889 -15433 -2851 16645 4716
1214D716k0028J1431J9985j0624k0137R387K0440q994k0093P927K0113p483k0316
$$ 4716 -15312 -3881 16104 5480 -14657 -5270 15170 6176 -13917 -5990 14123 6640 -13676
1227a3676O665K0179n561k0853M769K0968m302k1463L820K2000l453k2295K477
$$ -13676 -7011 13168 7607 -13246 -8477 12491 8189 -13274 -9454 12546 9093 -13202 -10725
1240a0725K2496j986k2644J181K3028j100k2942J56K2886L40k2782q43K3464N71
$$ -10725 11771 9785 -12859 -11678 11350 10250 -12692 -12536 10350 10690 -12092 -12935 10529 11100
1254A1100k3333p31K3450J032k3866r82K3033J966k3314k256K3563K501k2885
$$ 11100 -12233 -12964 10486 11518 -12348 -13330 9703 11669 -11645 -13901 9662 12163 -10722
1267a0722k828K2425L508k2185m174K1696M477k1033m514K0661M591k0146n138
$$ -10722 -13550 8875 12383 -9802 -13976 7720 12197 -8836 -13350 7311 11902 -8244 -13382
1280a3382K0073N782j9533o311J9393O680j8396q005J8602Q553j7918r134J7049
$$ -13382 6691 12473 -7060 -13371 6022 12702 -5694 -13699 4903 13456 -4462 -13596 3453
1293C453J0332j6662j0417J5897J1634j5915j1966J5703J2363j5349j2628J5095
$$ 3453 13785 -2877 -13294 2603 14237 -1678 -13644 2059 14422 -927 -13555 1540
1305A540J3567j5300j4071J5559J4602j5381j5230J5015J5942j5032j5991J4366
$$ 1540 15107 -193 -14264 1295 15897 516 -14714 301 16243 1211 -14780 -414
1317d14J6995j4024j6854J3743J6991j3904j6852J3581J6923j3301j7118J3535
$$ -414 16581 2557 -14297 -554 16437 2533 -14319 -738 16185 2884 -14234 -699
1329f99J6537j3248j6704J3207J6764j2255j7540J1822J7085j1197j7430J0921
$$ -699 15838 2590 -14114 -907 15857 3602 -13938 -2116 14969 3772 -13658 -2737
1341b737J7222r810j7784R450J6886q511j6430P837J6259p474j6689O909J7095
$$ -2737 14485 4675 -13109 -3659 13227 4716 -11714 -3877 12382 4908 -11781 -4872 12223
1354A2223o305j7114N502J6897m724j7794L784J8215k823j8731K601J7987j445
$$ 12223 5918 -11196 -5694 11203 6479 -11315 -7531 10684 7861 -10870 -8269 9718 8273
1367H273j8658Q54J9081l51j9274k21J8901L74j8876o16J9258J096k0115j487
$$ 8273 -10385 -9531 9550 9199 -10075 -10296 8605 8979 -9897 -10513 8745 9841 -10274 -11761
1381a1761K0331J635k0432j995K0695K346k0939k901K0688L409k0112l821K0326
$$ -11761 8570 10205 -10227 -12222 8473 10819 -10120 -13021 7667 11076 -9036 -12857 7469
1394G469L476k0305l522J9948L604j8916l847J9287L276j8933l550J8826M328
$$ 7469 10945 -9360 -12882 7066 10670 -8246 -12093 7194 10470 -8463 -12013 6813 11141
1407A1141j8488m854J7612N262j7069n236J6245O690j5825p191J5238P161j4135
$$ 11141 -7347 -12201 5411 10673 -6396 -11632 4613 11303 -4522 -11713 3525 10686 -3449
1420c449p597J3995Q070j3598q643J3019R529j2723r938J3043J0809j3355j1152
$$ -3449 -11046 2949 11019 -2579 -11222 1797 11326 -1397 -11335 1708 12517 -838 -11990
1433a1990J2690J2242j1988j2759J2106J2796j1715j3763J1263J4957j1098j4324
$$ -11990 700 12942 954 -11805 301 13097 1382 -12381 -1118 13839 2741 -11583
1445a1583J0661J5001j1585j5132J1681J5771j1491j5927J1437J5653j1547j5783
$$ -11583 -922 14079 2494 -12638 -957 14814 3323 -12604 -1167 14486 2939 -12844
1457a2844J1215J6548j0857j6604R986J6415j0215j5567R873J5538r454j5905
$$ -12844 -1629 14919 4062 -12542 -2556 13859 3644 -11923 -2050 13488 4034 -11871
1469a1871Q971J5151q283j4673Q293J4494q682j4322P443J4379o251j4355N002
$$ -11871 -2900 12251 3968 -10705 -2412 12082 3400 -10922 -3479 10900 4649 -9706 -4704
1482d704J4681n110j4434L901J4786k743j4944K179J4108j394j5135J867J4760
$$ -4704 9977 4867 -9567 -5666 9120 6377 -8567 -6388 7720 6326 -8809 -6942 7818
1495G818n68j5219n5J4994P05j6229k58J5810J770j6724k495J6621L140j6872
$$ 7818 7250 -7969 -8024 6970 7675 -8554 -8812 6998 8768 -7956 -10451 6170 9310 -7562
1509g562l326J7535L682j8052l930J7644L781j7274l604J7489L365j7558m066
$$ -7562 -10888 6647 10329 -7723 -11653 5991 9772 -7502 -11106 6383 9748 -7810 -11876
1522a1876J7462M398j6865m166J6830M169j7385m555J7204N235j6600n065J5841
$$ -11876 5586 9984 -6881 -11047 5783 9952 -7433 -11988 5216 10451 -6149 -11214 4627
1535D627N052j5691m687J5297N267j4245n765J3738N376j3208n398J2781O439
$$ 4627 9679 -6012 -10699 4598 9865 -4380 -10145 3593 8969 -4239 -9637 3144 9583
1548I583j2357p153J2028P104j1028p773J1231Q741j1475q758J0482R170r034
$$ 9583 -2774 -9927 2101 9205 -1823 -9596 1635 10376 -1099 -9857 625 9795 761
1561G61r660Q894J0119q940j1369Q876J1881q143j2036Q304J2383q636j3204Q810
$$ 761 -8899 -5 10114 1174 -10195 -1319 10562 2419 -9617 -1313 11070 2434 -10770 -1960
1575a960J4327q664j4029Q267J4149q603j4847R071J4714q126j5108Q190J4477
$$ -1960 12367 3703 -10326 -2059 12090 3487 -11360 -2289 12425 4299 -10809 -2619 11858
1588A1858p934j4592Q251J4977q474j4560P671J4087p298j4002P393J4283p633
$$ 11858 3924 -10668 -2417 12560 4086 -10474 -2803 11284 3986 -10016 -2623 11660 4027
1601D027j4185O845J3251n766j3008N625J3082n679j3229M764J3040l904j2482
$$ 4027 -10158 -3313 9938 4172 -8836 -3211 9871 4192 -9037 -4273 8767 4863 -7619
1614g619L086J2360l030j2599K471J2561j475j2103K8J2316j50j2906k16J3342
$$ -7619 -4533 7827 4797 -7802 -5331 7230 5755 -6348 -6320 5996 5846 -7060 -7276 6066
1628F066J158j3557j745J3035K328j3403k577J3520L134j3663l833J3697M065
$$ 6066 7224 -6333 -8078 4957 7285 -6118 -8695 4825 7959 -5704 -9537 4160 8225
1641H225j3958m101J4777M228j5032m989J5378M473j4690m720J4559M622j4598
$$ 8225 -5733 -9834 4943 9171 -5861 -10850 4528 9001 -5689 -10409 4150 8772 -5826
1654e826n197J5219N155j4453n452J4567M847j3817n416J4143N416j3439n662
$$ -5826 -11023 4196 9351 -5102 -10554 4013 8860 -4957 -10373 3770 9186 -4253 -9915
1667i915J3186N127j2574n358J2361N969j1625o192J1049O372j0764o568J0360
$$ -9915 3271 8398 -4176 -9534 2827 8796 -2829 -9021 2028 8400 -2364 -8932 1428
1680A428O916r850p246R516P850r464p622R007Q071q248q843Q149R375p424r795
$$ 1428 8344 -1506 -8752 764 8614 -850 -8472 535 8606 358 -8485 -336 9039 1615 -8180
1695h180P300R753o995j0377P255J0753o728j0738O377J1291p058j1366O389J2900
$$ -8180 -880 8873 1878 -8499 -1244 9509 2781 -7957 -1580 9711 2653 -8713 -2324 10576
1709A0576o548j2667N766J2731n747j2625O065J3059o166j3318N657J3387n749
$$ 10576 4028 -8639 -2873 9858 4111 -8514 -2449 10610 4444 -8874 -3217 10170 4421
1722D421j2938N479J3040n535j3299N543J2682n150j2749N419J2443n058j2762
$$ 4421 -8517 -3038 10002 4467 -8832 -3289 9393 4243 -8506 -3087 9356 4298 -8464
1735h464M951J1950l805j2144L777J1733l239j1902K565J1888k151j1729J812
$$ -8464 -3513 8437 4632 -7512 -3735 7998 4759 -7143 -4578 7310 5159 -6570 -4758
1748d758J1412j809j1145O51J1718n41j1229l93J1221L39j1292p90J1160J646
$$ -4758 6654 4845 -6300 -5649 6069 5528 -5701 -6094 5127 5466 -5826 -6616 4544 6190
1762F190j1662j989J1441K330j1299k981J2014L003j2112l470J1933L998j1910
$$ 6190 -5472 -7461 3980 6310 -4989 -7970 4044 7047 -5065 -8535 3398 7396 -4514
1775d514m154J1755M308j1933m739J1980N126j1869n362J2336N247j2047n890
$$ -4514 -8668 3087 7395 -4538 -9277 2703 7829 -4040 -9402 2934 8181 -3866 -9756
1788i756J2603N480j2244n387J2035N138j1344n610J1387N849j1287n544J0532
$$ -9756 2847 8327 -3917 -9304 2731 7869 -3475 -9085 2302 8151 -3136 -8680 1852
1801A852N812j0640n729J0216O442j0111o146R712O489r292o705R264O532q291
$$ 1852 7664 -2976 -8705 1511 7953 -2158 -8304 1408 7897 -1395 -8100 1164 7696 -595
1815e95p029P983P238p700p021P176P850p345p728O647Q526o367q361N975Q854
$$ -595 -7624 359 7597 -103 -7124 52 7902 557 -7171 -524 8002 1635 -6726 -751 8103
1830H103o005r194N481R576n289r583N265R801m828j0394M901J0510m689j0827
$$ 8103 2098 -7096 -1615 7961 2672 -6911 -1646 8155 3327 -7067 -2166 8344 3655 -7172
1844g172M303J1307m577j0543L975J1201m123j1593L960J1534m121j1334L928
$$ -7172 -2869 8438 3861 -6682 -2707 8494 4371 -7222 -3262 8272 4151 -7183 -3255
1857c255J1641l952j1474L916J1158l542j1317L275J1191l080j1388K418J1697
$$ -3255 8386 4434 -7040 -3124 8034 4492 -6825 -3550 7641 4561 -6827 -4409 7288
1870G288k558j1166K049J1134k089j0753J664J0458j104j0466R92R940n41j0058
$$ 7288 4730 -6436 -4387 6747 4658 -6095 -4431 6027 4923 -5543 -4551 5389 4848 -5210
1884e210R8R689N12r948j081J0215Q75r920j302R560K112j0189k160R855K438
$$ -5210 -5112 4577 5089 -4859 -5940 4275 5150 -4770 -6072 3488 5600 -4589 -6749 3106 5544
1899E544r392l055R406L205r208l545R272M296j0024m372J0052M512j0006n026
$$ 5544 -3848 -6903 2503 5708 -3500 -7045 2227 6523 -3501 -7873 2179 6691 -3315 -8341
1913h341J0295M745r843n190J0076N460j0093n540R923N319r288n567R474N782
$$ -8341 1954 6699 -3144 -8334 1742 7202 -2891 -8431 1492 6811 -2477 -8044 1430 7212
1927G212r217o258R400N964q879o213R011O413r076n908Q701O180q600o189Q155
$$ 7212 -2005 -8263 1137 7101 -1778 -7991 1020 7433 -1643 -7551 1150 7330 -1270 -7459 696
1942F96O407p746o422P509O764p062p063O956O786o055p316O448P003n907p311
$$ 696 7103 -643 -7065 444 7208 146 -6917 39 6825 770 -6546 -98 6905 998 -6313
1957f313N642P604n344p811M920Q412m999q074M331Q586l546q934L535R010l515
$$ -6313 -671 6933 1589 -6222 -1302 7110 2111 -5963 -1632 6954 3408 -5526 -1991 7019 3504
1972C504r289L160R449l035r682L206R561k921r790L001R949k706j0650L000J0249
$$ 3504 -5785 -2625 6824 3789 -5893 -2687 6874 3953 -5837 -2836 7113 4407 -6243 -3243 7006
1987G006k528j0383K207J0510k360j0249J970J0621j950j0380J690R926j715j0131
$$ 7006 4478 -5905 -3698 6812 4452 -5797 -3827 6794 4844 -5536 -3846 6080 4365 -5766
2001e766J541R953j537r806J516J0104j734r549P18R375k19r300L3Q666P93r218
$$ -5766 -4225 5728 4191 -5615 -4099 6005 4271 -5278 -4560 4815 4596 -4704 -4671 3995 4788 -4430
2017d430l65Q574Q13q568j117Q005J700q365j898Q468J925q055k777Q327L134
$$ -4430 -4795 3779 4592 -3976 -5093 2912 4612 -3753 -5651 2817 4742 -3313 -6090 2237 5371
2032E371q376l438Q122L752p934m237Q045M512q195m630Q348M497q171m999Q517
$$ 5371 -3005 -6443 1679 5431 -2503 -6740 1305 5817 -2378 -7008 1340 5837 -2334 -7333 1184
2047A184M946q194n014Q355N041q263n490Q869N158q366n678Q235N735q081o008
$$ 1184 6130 -2064 -7078 1277 6318 -1945 -7435 1434 6592 -1774 -7452 783 6518 -1563 -7571
2062g571Q558N440p671n559P064O201p266n872P323N758p174n411O307N947o478
$$ -7571 987 6427 -1244 -6803 261 6462 -804 -6676 647 6405 -769 -6180 127 6074 -404
2077d04n510O295N931n866o692O166O413n249o536M867O513m387o658L749P107
$$ -404 -5914 381 6312 446 -6246 -80 6333 1084 -5452 -585 5928 1541 -5117 -1368 5739
2092E739l713o648L460O830l111p528L136P528k579p838K709P913k174q487K352
$$ 5739 2026 -4622 -1162 5668 2557 -4971 -1835 5693 3114 -4724 -2015 5898 3724 -4763 -2411
2107b411Q800k466q827J744R101j814q734J632Q885j659r069J461R288j497r183
$$ -2411 6389 3923 -4904 -3160 5941 4127 -4607 -2975 5910 4251 -4818 -3357 5931 4434 -4749
2122d749J450R000j445r301J273R364j168r365J399Q998j201r054R08Q750m57
$$ -4749 -3299 5701 4256 -5045 -3772 5592 4424 -4941 -3542 5456 4255 -4799 -3891 4859 4402
2137D402q853L19Q121N8q312M22P975N5p856n64P668M37p706m36P102R15o677
$$ 4402 -4451 -4132 3989 4047 -4265 -3843 4132 4187 -3669 -4233 3435 3872 -3834 -4270 2832 3747 -2930
2154b930j850P060K068o929k766O837K942p132l108O991L510o664l503O417L682
$$ -2930 -4780 2280 4348 -2581 -5347 1490 4432 -2700 -5808 1183 4693 -1971 -5474 943 4625
2169D625o576m209O866M511o985m527O863M816p252m682O837N807p233n712O570
$$ 4625 -1951 -6160 706 5217 -1768 -6295 568 5384 -1868 -6550 287 6094 -1139 -6851 -281
2184b81O104p185n371P274N470o904n933P098N257o434n534O879N378o933n180
$$ -281 5823 -1362 -6733 541 6011 -893 -6826 272 5529 -905 -6439 440 5818 -1115 -6295
2199f295O512N560o459m810N612N586n971n373N628N244m831n314M922N147m560
$$ -6295 217 5777 -682 -5492 120 5706 -265 -5638 -10 5234 403 -4911 11 5158 598
2214E98n606M369O027m247n199L371N363l233n771L159O592l083o563K616O336
$$ 598 -5008 -639 5388 1141 -4058 -687 4676 1443 -4328 -1169 5423 2340 -4223 -1607 4729
2229D729k053o675K344O631j963o444Q95P168r99p517J392P651j096q281O95Q328
$$ 4729 2676 -3999 -1655 4976 3013 -3431 -2536 4632 3633 -3884 -2492 5159 4063 -4218 -3523 4805
2245D805p97q089J181P744q62q428N41Q989o65q535L95Q665o98q282O04P900j25
$$ 4805 4008 -4081 -2900 4844 3982 -4446 -3905 5084 4419 -4116 -3721 4944 4246 -4036 -3432 4468 4343
2262D343q092J75Q009m59q079L35Q063m06p669K46P226k35p191N9O750O88p150
$$ 4343 -3749 -3574 4435 3976 -4103 -3768 4295 3889 -3780 -3534 3692 3457 -3734 -3675 3075 3763 -3387
2279c387p64O261J644o485j528O604J444o166k011N810K257n622k511N603K665
$$ -3387 -4151 2110 3754 -2731 -4259 2345 3789 -2377 -4388 1422 3679 -1943 -4454 1149 3814
2294C814n888l031N552L764n502l924N626L948n749m273N793M717n622m794N426
$$ 3814 -2074 -5105 447 4211 -1291 -5215 411 4359 -1390 -5663 130 4847 -775 -5569 -143
2309a43M724n727m848N957N427n777n378N641N037n735m731N449N444n926n507
$$ -143 4581 -1146 -5994 -37 5390 -387 -5765 -124 4913 -822 -5553 -104 5340 -586 -6093
2324f093N763N442n373n327N830N118n843n562N995N326n290n068N226M882m757
$$ -6093 -330 5112 -261 -5588 242 5360 -483 -6045 -50 5276 -14 -5082 144 5026 269
2339B69n060M156M939l417n013M009M550l150n301L540N000k902m938K484M938
$$ 269 -4791 -635 4304 887 -4126 -117 4433 1283 -4018 -478 4522 1620 -3318 -834 4104
2354D104k232n226K109N668j452o061J417N995j513n909R30O387r47o400N32O521
$$ 4104 1872 -3354 -1245 4423 2971 -3090 -1673 4322 2809 -3100 -2170 4217 3270 -3130 -2598 3923
2370C923l49o719O56O481j32p103K12P113kp223J96P338n75p129l5P604J71p753
$$ 3923 3574 -3145 -2489 3992 3860 -3243 -3031 4082 4080 -3143 -2947 4391 3816 -3313 -3348 4256 4427 -3326
2388c326j83P436k16p468j37P426L00p081n35O939L38o936j43O746J68o473p72
$$ -3326 -3509 3927 3711 -3757 -3894 3532 3832 -3249 -3784 3155 3493 -3443 -3586 3160 3328 -3145 -3917
2405c917O508R06o429q25O021J038n524j793N937J267n462j792N793J738n233
$$ -3917 2591 3497 -2932 -3757 2264 3302 -2222 -4015 1922 3189 -2273 -4065 1728 3466 -1767
2420a767k667N513K121m726k893N000K848m811l186M833L736m785l858M776L777
$$ -1767 -4434 1079 3200 -1526 -4419 581 3429 -1382 -4568 265 4001 -784 -4642 134 3911
2435C911m548m236M799M328m839m456M667M652m835m427M499M917m467m990M267
$$ 3911 -637 -4873 -74 4254 -585 -5041 -374 4278 -557 -4984 -485 4432 -35 -5025 -758
2450g58M972m602m399M603M952m877m784M606M908m409n041M552M849m536m767
$$ -758 4214 -388 -4787 -184 4768 -109 -4893 -287 4621 212 -4829 -277 4572 36 -4731
2465d731M341N065m112m653L793M607l385n101L617M787l207m524K942M705k553
$$ -4731 -390 4675 563 -4090 -297 4310 925 -4176 -559 4228 1021 -3503 -561 4144 1591
2480A591m967K361M685k053m786K060M747j524n152J562N194j414n209J111N161
$$ 1591 -3376 -1015 3670 1617 -3169 -1109 3638 2114 -3038 -1476 3718 2304 -2905 -1794 3367
2495C367o17n444M79N789n79n423j23N976o9o065K28N939K95o429j61O601j52
$$ 3367 2750 -2694 -2215 3574 2995 -2428 -2551 3425 3356 -2709 -2481 3458 3753 -2676 -2837 3764 3612
2512C612o033m16O266L04o591k77O387P21o516q19O467K65n992m91O098N62o372
$$ 3612 -2421 -2837 3429 3733 -2858 -3135 3252 3973 -2543 -3362 3105 3370 -2622 -3113 2985 3547 -2825
2529b825m36N856R49o254o18N731Q58n758j150N663J202n377j199M872J645n284
$$ -2825 -3261 2595 3544 -2710 -3328 2403 3261 -2497 -3647 2016 3218 -2159 -3358 1514 3159 -2125
2545b125j504M958J900m972j952M817J837m774j965M563K232m344k646M412K645
$$ -2125 -3629 1329 3229 -1743 -3695 1122 2959 -1815 -3780 783 3015 -1329 -3975 437 3082
2560C082m173l256M395L267m043l416M037L299l568m022M091L710l472m023L492
$$ 3082 -1091 -4347 48 3315 -728 -4144 -107 3192 -376 -4398 -307 3403 -69 -4092 -600
2575f00M362l902m153L227M655l497m360L779M355l932m460L850M746l630n124
$$ -600 3762 -140 -4293 -1066 3589 92 -4268 -489 3866 -66 -4526 -676 4070 440 -4684
2590d684M303M576l828m668L706M581l275m799L506M761l375m460K818N006l406
$$ -4684 -381 4195 367 -4301 -595 3986 711 -4088 -582 4179 804 -3656 -838 4168 762
2605G62l929K542M698k725m488K598M177k239m495K323M804k270m441J590M381
$$ 762 -3167 -625 4073 1348 -3140 -542 3635 1396 -3099 -776 4028 1758 -2683 -1093 3288
2620C288j157m373J092M470j078m648O96M899n97m864N94M713j60n272L71M654
$$ 3288 2131 -2242 -1150 3320 2242 -2406 -1710 3189 2592 -2272 -1678 3035 2875 -2397 -2026 2628
2636B628M01n029l17N351L6m998p63N790L05n360o15N374L87m968j248N500J008
$$ 2628 3029 -2000 -2317 3034 3070 -1928 -2691 3099 3404 -1956 -2571 2803 3190 -1778 -3026 2474 3482
2653C482n561r21N542O71n265j312N475J598n883j307N484J267n651j017M974
$$ 3482 -2079 -3000 2542 3213 -2052 -3364 2111 3709 -2174 -3481 2003 3270 -2381 -3398 1576
2668A576J458m994j349M964J452m842j436M572J439m657j716M592J770m363j883
$$ 1576 3034 -1960 -3309 1655 3107 -1735 -3171 1401 2840 -1817 -3533 1059 2829 -1534 -3417
2683c417M085K140l998k351L990K465l814k589L298K726l137k804L153K706k899
$$ -3417 668 2808 -1190 -3541 449 2914 -900 -3489 -191 2535 -602 -3406 -253 2453 -446
2698d46l115L118L371l418l330L256L739k983m106L378L997l103m511K925M532
$$ -446 -3561 -443 2928 -490 -3820 -564 3175 192 -3914 -536 3461 358 -4153 -1228 3304
2713C304k584m559K840M391k646m763K869M583k657m308K459M430k568m394K764
$$ 3304 720 -3839 -999 3392 746 -4017 -1148 3435 778 -3530 -1071 3359 791 -3603 -839
2728h39M711k680m557K293M389j892m691K232M829k581m143J861M780k179m291
$$ -839 3872 1192 -3365 -1072 3317 1425 -3266 -1034 3795 1214 -2929 -1068 3712 1533 -2758
2743b758J907L932j811l712J640M047j206m201R69M094q81m228P83M190k14m469
$$ -2758 -851 3081 1270 -2442 -802 3245 2039 -2162 -1193 2901 2020 -2208 -1425 2765 2551 -1918
2759a918L26M502k35m454j46L954P45m120q40M597L30m547l87M368N81m351p04
$$ -1918 -1592 2910 2675 -1779 -1925 2029 2774 -1346 -2186 2411 2741 -1806 -2193 2175 2756 -1595 -2299
2776b299M328J003m864p21M613R50m757j248M985J204m796j321M442J501m664
$$ -2299 2029 3032 -1832 -2553 2060 3010 -1747 -2995 1990 3194 -1602 -2923 1519 3020 -1644
2791a644j534M635J549m530j570M549J463m594j335M435J468m668j378M042J545
$$ -1644 -3178 1457 3006 -1524 -3094 1455 2918 -1676 -3011 1424 2892 -1776 -3154 888 2433
2806B433l876j671M011J775m081j971L969J795l293k152L115K216l272k222L245
$$ 2433 -1443 -3114 897 2672 -1409 -3380 589 2384 -909 -3061 54 2270 -1002 -3224 21
2821B1K190l074k191K866K766l256k582K519L315k853l045K618L300k433l399
$$ 21 2211 -863 -3054 -188 2578 -678 -3260 -741 2574 -279 -3324 -706 2594 161 -3238
2836c238K318L565k356l493K228L417j915l729K253L857k351l954K501M254k384
$$ -3238 -920 2645 289 -3204 -976 2441 526 -3203 -950 2907 556 -3398 -897 3357 973
2851I73m356K202M223k262m144K474M311k293m215K128M269j964m082J923L543
$$ 973 -3383 -1181 3042 780 -3364 -890 3421 1128 -3087 -959 3310 1346 -2736 -813 2730
2866B730j286m179J934L813j471l784J498L948j798l696J049M231j199l690J108
$$ 2730 1444 -2735 -801 3012 1541 -2243 -745 3203 1405 -2291 -1242 2989 1790 -1900 -792
2881g92L542q39l651N53L682n25l679M12L485l30l538J60L823O8l764l03L647
$$ -792 2750 1911 -1740 -1187 2495 1970 -1709 -1297 2188 1858 -1680 -1520 2303 2371 -1393 -1696 1951
2898A951P21l820q15L752Q98l906o26L764N34l724q90L945J075m112j098L888
$$ 1951 2672 -1148 -1963 1789 2687 -1219 -1845 1919 2453 -1271 -2161 1784 2859 -1253 -2351 1537
2914A537J017l983j006M051J224m086j386L919J364m281j067L956J442m013j877
$$ 1537 2554 -1429 -2435 1616 2840 -1246 -2632 1287 2651 -1630 -2697 1259 2701 -1312 -3189
2929c189M160J351l817j283L910J508l875j849L868J480l374j637L345J694l442
$$ -3189 971 2322 -1495 -2778 1132 2640 -1235 -3084 784 2264 -1110 -2747 598 2292 -1150
2944a150j864L499J573k681k141K920K007l001j981K549K428k686k467K616K513
$$ -1150 -3014 485 2058 -623 -2764 156 2163 -838 -2819 -270 2158 -528 -2995 -379 2134
2959B134k697k163K192K801k317k725K110K998k083l147K170K869j759l491K297
$$ 2134 -563 -2726 -534 2267 -50 -2775 -665 2333 250 -2897 -727 2142 383 -3108 -811
2974h11K960j782l139K000L144j676l392J662M060k069l419J370L782j917l458
$$ -811 2149 367 -2772 -772 2372 696 -2696 -1034 3026 957 -2462 -1092 2690 773 -2685
2989b685J759L968k144l425J869L284j592l428J668L711j418l771J294L495j397
$$ -2685 -926 3042 898 -2527 -658 2626 1034 -2394 -726 2985 1567 -2204 -910 2585 1188
3004A188l360J225L556j039l709R51L613o79l333Q09L124m73l522N39L275p9l577
$$ 1188 -2172 -947 2609 1570 -2139 -1188 2425 1746 -1587 -778 2346 1873 -1649 -1110 2165 2086 -1491
3021a491L98L070L97l839J3L315M51l467p19L632K22l007q83L323P52l121j144
$$ -1491 -1093 1977 2374 -1465 -1452 1863 2314 -1153 -1872 1760 1982 -1025 -1908 1415 2167 -954 -2098
3038b098L432J052l441j241L525J508l755j292L705J026l510j308L704J091l394
$$ -2098 1334 2386 -1055 -2296 1229 2737 -1018 -2310 1395 2421 -1089 -2397 1307 2398 -996
3053i96j364L091J969l782j453L730J380l965j338L537J421l417j249L046J781
$$ -996 -2360 731 2700 -1082 -2535 1195 2575 -1390 -2728 809 2230 -1187 -2436 610 2391
3068B391l423j927L444J744l255j544K965J176k485j544K757J641k390k004K580
$$ 2391 -1032 -2959 485 2229 -1026 -2570 395 1571 -914 -2458 299 1940 -450 -2454 126
3083A26J878k759j792K313K456k565j941J827K334j874k657K108K443j610k891
$$ 126 2004 -755 -2547 -234 2222 -343 -2284 -457 1877 3 -2654 -546 1897 287 -2604
3098b604J816K507j520k819J640K986j502k845J308L161j201l321J825K814j410
$$ -2604 -788 1719 199 -2620 -980 2006 504 -2341 -1033 2128 927 -2394 -569 2245 835
3113H35l201J394L456j256l514J489L351j612k825P44L847j551l282J131L343
$$ 835 -2366 -972 2484 1228 -2286 -797 2554 942 -1883 -1139 2708 1157 -2125 -994 2349
3128B349j023l644J342L426j428l249J302L760j514l332J129L235q14l275J013
$$ 2349 1326 -2318 -976 2450 1022 -2227 -925 2835 1321 -2011 -882 2353 1539 -1736 -723
3143g23K660k34l001K50L272p18l115R35K547k84k732l4K892M7k813k52K493J159
$$ -723 1937 1703 -1298 -1048 2224 1506 -1609 -674 1873 1589 -1143 -1177 1715 1762 -1051 -1303 1190 2349
3161B349l411m72K952O76l119o77L206N87k926j486L261J059k960j316L255J405
$$ 2349 -1062 -1534 1418 2094 -1025 -1702 1504 2091 -835 -2321 940 1999 -961 -2277 978 2383
3177B383l099j400K795J315l035r92K975J115l071j443K933J843l303j674L514
$$ 2383 -716 -2116 679 1994 -1041 -2033 942 2057 -1014 -2457 476 2319 -984 -2658 856
3192H56J136l098j495K973J630k918j486K779J435k768j324K790J362k713j297
$$ 856 1992 -1106 -2601 372 2002 -916 -2402 377 1812 -956 -2280 510 1872 -841 -2138
3207b138K229J532k612j441K460J553j940k050K318J690j951j848J697K062j851
$$ -2138 91 1623 -989 -2430 30 1583 -357 -2407 -89 1601 -350 -2198 -501 1561 -290
3222b90j717J083K605j623k094J512K225j365k564J487K645j485k621J276K715
$$ -290 -2007 -924 1681 58 -2036 -524 1701 336 -2228 -741 1904 419 -2202 -926 1789
3237A789j059k968P48L635j285l037J073L015r64k983J410L073j404k829R26L056
$$ 1789 730 -2238 -1490 2145 860 -2177 -1104 1911 947 -2036 -626 2447 1043 -1786 -860 2196
3253B196r26l563J564K878j100l066J186L086q98l482J361L015q03l185Q26K892
$$ 2196 1270 -2293 -729 2149 1049 -2017 -831 2255 1357 -2125 -764 2251 1448 -1737 -911 1981
3269A981m20l006O21L206j129k908O62L099o02k934N49K487J07k634r7K833j34
$$ 1981 1561 -1445 -824 2382 1253 -1655 -993 2106 1504 -1430 -881 1606 1713 -921 -1018 1815 1681
3286A681k438m42K489M43k588j01J834O45k112r06K659Q99k653q68K412R97k332
$$ 1681 -757 -1199 1290 1733 -855 -956 878 1523 -589 -1495 1164 2063 -590 -1458 954 1951 -381
3303c81j586K674J100k499j286K882J446k937j396K648J187k607j182K549J320
$$ -381 -1967 707 1807 -692 -1978 904 2350 -587 -1983 665 1852 -755 -1937 612 1932
3318A932k342j840K678J670l159j232K732J431k603j537K572J531k381j467K456
$$ 1932 -410 -2250 428 2098 -1061 -2293 439 1870 -733 -2270 302 1833 -548 -2015 441
3333D41J277j944k262K380J418k052j676K358J777k351j645J989J957j939k188
$$ 441 1718 -226 -2488 -108 1310 -742 -2418 -60 1717 -634 -2279 -290 1667 -272 -2460
3348b460K347J425j437j581J515J635j584j669J092K140j057k373J425K154j182
$$ -2460 -113 1312 -125 -1706 -191 1444 -140 -1809 -717 1423 366 -2007 -582 1572 390
3363C90k274J125K197r17k174Q79K507j265k629J505K359p07k783O61K865q59
$$ 390 -1884 -759 1438 521 -1653 -774 1733 468 -2161 -656 1703 996 -1787 -1126 1739 880
3379H80k746J041K354l34k900N43L402r49k987P08L067o91k691N02K781q53k348
$$ 880 -1866 -825 1529 1195 -1705 -1162 2240 1291 -1696 -988 2079 1388 -1303 -801 1980 1127 -1221
3396a221K79L042o14k978O60K820r10k454N57K456J5k639q0K979n62k327J24K048
$$ -1221 -942 2100 1486 -1492 -832 1988 1078 -1376 -819 1637 1652 -987 -1067 1912 1350 -977 -853 1195
3414A195K13k591K73K409J7k398j9K053O18k290q18K426P83k603o81K614L33j891
$$ 1195 1408 -1183 -910 1499 1516 -882 -901 1152 1770 -520 -1338 1088 1871 -732 -1413 1201 1534 -357
3432c57j050K073J074k283j206K553Q40k089j045J949P81j684j485K384J486k717
$$ -357 -1407 666 1740 -543 -1749 804 1644 -445 -1490 459 1240 -444 -1929 455 1941 -776
3448g76j215K370J445k463j565K293J362j824j620K399J366k724j201K448J628
$$ -776 -1991 379 1824 -639 -2204 89 1451 -373 -1993 406 1772 -952 -2153 295 1923
3463A923k430j701K355J479k770r92J627J984j977j533K095J401j739j560J672
$$ 1923 -507 -2208 147 1626 -1144 -2136 -509 1475 -502 -2035 60 1461 -278 -1838 -166
3478a66J667j783j661J470J980j424k064J588J725j306j750J274J576j057j661
$$ -166 1501 -282 -1943 -473 1507 83 -1981 -393 1332 26 -1724 -450 1126 69 -1592
3493a592J309J585q13k066P46J994r20j686P21K316j037k090R86J763n95k027
$$ -1592 -283 1302 489 -1577 -831 1163 243 -1443 -722 1594 557 -1533 -547 1216 621 -1406
3509a406J18K677o40j859J11K584n43k355Q52J948n06k333N78K310j61k699K49
$$ -1406 -1288 1389 749 -1110 -999 1585 1042 -1313 -461 1487 981 -1352 -774 1536 1375 -1324 -1075
3526a075K832n28k226K20K542n02k244M08J997k29k246L03K320j54k617L24K312
$$ -1075 1757 1229 -997 -777 1765 1263 -981 -573 1424 1195 -1051 -748 1572 1418 -1199 -875 1437
3543A437K8k137MK083k34k123J34K236p7k046l80K323j1j829n29K088N14j962
$$ 1437 1465 -672 -668 1415 1181 -942 -808 1428 1351 -695 -1075 1248 1237 -592 -1121 967 1481 -481
3561d81l91J685N30k160l73J312J407j979p61J854Q98k022r85J941J097j606j862
$$ -481 -872 813 1343 -817 -1190 122 1529 -450 -1211 643 1541 -481 -1466 475 1572 -34 -1896
3578a896K269J198k239j323K206J307k161j111J774J428k127j050J719J717k130
$$ -1896 373 1571 -668 -1991 215 1522 -639 -1750 24 1452 -675 -1725 -6 1711 -419
3593d19j683J956J562j938j262J772J512j784j667J753J297j575j389J777R66
$$ -419 -2102 -146 1416 -522 -1784 -12 1500 -284 -1951 -198 1099 -476 -1865 -88 878
3608H78j546j507J654J835j627j232J063J412j035j415J154J610j007j924J271
$$ 878 -668 -2175 -521 1314 -313 -1545 -482 930 -105 -1520 -366 1244 237 -1687 -416
3623d16J466r45j400N20J950q28j732R15J602m17k003O23K177r07k063P80J985
$$ -416 1050 105 -1295 -775 1175 347 -1385 -470 1132 715 -1288 -665 1512 605 -1458 -678 1307
3640A307k50k309P24K090n27k371M76K500l93k420m2K627j88k416M48K481n58
$$ 1307 1057 -1252 -528 1562 1035 -1336 -860 1640 1247 -1173 -1215 1412 1224 -1192 -744 1737 1179
3657A179k399J87K375j49k003MK090j17k010O0J947J50k235N6K263l93j858qK106
$$ 1179 -1220 -1033 1342 1193 -810 -806 1284 1167 -843 -783 1164 1314 -921 -865 1398 1005 -853 -861 1245
3676A245M67k335kJ775R5j894k33J959J21j650n16J767N63j965m20J595M61j430
$$ 1245 1712 -623 -625 1150 1245 -649 -882 1077 1198 -452 -968 799 1362 -603 -1023 572 1033 -397
3694c97p18J544N88j270r05J658Q37j624j337K042P73j853n77J282J413k054r83
$$ -397 -1115 429 1017 -253 -1158 500 1337 -287 -1624 418 1191 -662 -1239 43 1456 -598 -1581
3711a581J678J522j773j591J824J319j660j690J666J736j890r88J514J309j629
$$ -1581 97 1619 -154 -1745 79 1398 -262 -1952 -286 1450 -440 -1428 86 1395 -234
3726b34j544J714J402j660j568J678J399j606j147J303J543j475j556J698Q69
$$ -234 -1778 -64 1338 -322 -1890 -212 1187 -419 -1566 -263 1280 -195 -1751 -53 816
3741H16r41j221J175J333j200j341R19J339p07j327P57J271r75j068Q27J827j104
$$ 816 -125 -1346 -171 1162 -38 -1379 -460 879 172 -1155 -398 873 -102 -1170 -343 1484 380
3758C80j467L52J780k64j997N90J800m99j678J01K103k58k357M76J962O2j999
$$ 380 -1087 -735 1045 781 -1216 -626 1174 675 -1003 -902 1201 943 -1414 -938 1024 1086 -913
3775i13L95J582k34j570k63K522l17k259J21K428m29j950J02K082k04j913N2K075
$$ -913 -518 1064 830 -740 -1003 1519 1202 -1057 -936 1492 1063 -887 -785 1297 1093 -820 -768 1307
3793A307o1k092M63J556m1k186M26K115n2j939j70J613N2j513l04J869m4j457
$$ 1307 1246 -846 -383 1173 1132 -1054 -628 1487 1435 -504 -674 939 991 -522 -826 1043 999 -458
3811d58o4J645k07j593K7J162K54j260l96J277N75j193o12J325N20j211r90J703
$$ -458 -522 1123 916 -677 -650 512 766 -494 -890 387 962 -231 -843 482 1002 -209 -1199 504
3829E04Q14j699j123J534R96j115j292J699R29j477j231J369J031j293j145J687
$$ 504 1318 -381 -1504 30 1026 -89 -1381 318 1247 -230 -1461 -92 939 -354 -1499 188
3845A88J431j984j457J757J133j496j287J780J327j550j387J156J340j488j149
$$ 188 1619 -365 -1822 -65 1068 -428 -1715 65 1392 -158 -1545 -389 951 -537 -1686
3860a686J403J310j541p34Q86J583j521j458J698J079j439r90J005J309j145j156
$$ -1686 -283 1027 -514 -1248 -362 1221 -300 -1758 -60 1019 -420 -1410 -405 904 -241 -1397
3876a397J061J389r99j128N80J383p78j205O52J307o40j443O60J539n97j326N47
$$ -1397 -336 1053 54 -1074 -494 889 111 -1094 -442 865 225 -1218 -558 981 384 -942 -395
3893c95J351m45j331J68J698l73j567L60J534j70j644J06J876l0k127K43J912
$$ -395 956 511 -820 -652 1046 673 -894 -534 1000 830 -814 -708 1168 1138 -989 -746 1166
3910A166k53j741n2K149O3k050K01J506K58k151K73J774r1j903M03K010o10j805
$$ 1166 913 -828 -880 1269 1332 -718 -517 989 1247 -904 -631 1143 1052 -851 -448 1562 952 -853
3928h53K48K058l93k090L20J779J5j604j48J810j24j632J4J687J10j853n6J524
$$ -853 -605 1453 1060 -1030 -710 1069 1084 -520 -668 1142 1018 -614 -600 1087 1197 -656 -712 812
3946H12K29j829Q1J444K17j323n36J322P37j188p38J132R24j638n59J221P15j083
$$ 812 1041 -788 -707 737 954 -369 -905 417 1154 -34 -772 360 1284 -354 -913 308 1023 -60
3964f0r49J184P86j383o99J118J261j409r76J196J095j237j218J418J292j433
$$ -60 -1009 175 961 -422 -1121 -3 1258 -151 -1127 69 1164 -73 -1291 127 1419 -14
3980a4j353J390J288j382j375J109J128r39j100O57J525r89j672J322J142r48
$$ -14 -1367 23 1311 -71 -1446 -337 791 -148 -1248 -591 934 -55 -1727 -405 737 -211
3996b11j182J067J322j231j271J095J354j220j179R59J171p55j192O95J438m49
$$ -211 -1393 -326 996 -235 -1506 -411 943 -277 -1456 -497 674 -81 -1273 -578 860 411
4012D11j467N14J202m70j529Q02J578o61r96L50J050m24q07m0J259K8j718N82
$$ 411 -1056 -542 660 190 -1339 -537 1041 380 -616 -266 784 360 -447 -487 772 800 -918 -336
4030c36J333k44j634L38J549J88j800rJ638l68j380j4J697P7j760K65J599N4j981
$$ -336 997 753 -881 -543 1006 1194 -606 -615 1023 655 -725 -739 958 1035 -725 -460 1139 1193 -788
4049g88K4J972K0j936jJ728J97j919K61J394K26j663o5J365L20j716J36Q53N58
$$ -788 -764 1208 1228 -708 -709 1019 1216 -703 -442 952 1178 -485 -550 815 1135 -581 -445 408 966
4068I66j392m21J678J21j390k08J488K06j157o97J455L29j237l88J301J17r63
$$ 966 -426 -847 831 952 -438 -646 842 1048 -109 -806 649 978 -259 -647 654 771 -192
4085a92o09Q17P94r92n96R61Q04j093l30P89M46o71j137J078J049j099r62O99
$$ -192 -801 16 810 -182 -778 183 987 -106 -436 353 799 128 -1009 69 1118 19 -943 -244
4103b44J130j145j053J060J184o48j375Q65R77o18j496J444R40j193j205Q98J402
$$ -244 886 -259 -1312 -252 932 284 -1091 -226 751 133 -1363 81 1021 -172 -1377 -479 923
4120I23p33j449O79J605j250j067R19J313j065j079P57J433j165q19O44J291j050
$$ 923 190 -1259 -580 1025 -225 -1292 -373 940 -125 -1204 -447 986 -179 -998 -354 937 -113
4137a13j066O75J002n25j255J021J103n38j560Q85J286p77p09r8J481n07j264
$$ -113 -1179 -504 498 -27 -1282 -261 842 304 -1256 -371 915 138 -571 -669 812 305 -959
4154i59N32J092j32j228K37J086j27r58q7J128J7j275J16J644k95j105l29J332
$$ -959 -427 665 533 -695 -458 628 501 -457 -544 584 601 -674 -558 1086 791 -314 -643 689
4172F89M42j576j72J490q9j195m51J472O26j532m21J570K11j713M8J561J31j745
$$ 689 1131 -445 -617 873 784 -411 -862 610 1236 -296 -717 853 1064 -649 -601 960 1091 -654
4190f54j09J408N51j518n63J534L31j474k7J508K66j327n69J118M45j399j24J091
$$ -654 -763 645 1196 -322 -885 649 980 -494 -521 987 1253 -74 -643 475 920 -479 -603 488
4208D88L44r25p48R07Q32j053p83J251O13q45j089J299M58j135m39Q69Q93j143
$$ 488 832 -93 -841 66 898 -155 -938 313 926 81 -1008 291 749 -386 -825 44 937 -206
4226b06q06P89P84p83p04Q17Q44j016n76M05J309o17j318Q30J119r05j248J029
$$ -206 -1012 -223 561 -222 -926 -109 735 -281 -857 -452 857 240 -1078 -248 871 -34 -1282 -253
$$ [...]
8191a05
##END NTUPLES=NMR FID
##END=
