##TITLE=1H_SAM_22.BBSX1_THF 1.4
 CDCl3, 8 sc, 
 6.5.2019
##JCAMPDX= 6.0         $$ Bruker NMR JCAMP-DX V2.0
##DATA TYPE= NMR FID
##DATA CLASS= NTUPLES
##ORIGIN= UXNMR, Bruker Analytische Messtechnik GmbH
##OWNER= root
$$ XWIN-NMR		Version 3.5
$$ Mon May  6 14:12:54 2019 Russian Standard Time (UT+4h)  she@DPX200
##.OBSERVE FREQUENCY= 200.1315
##.OBSERVE NUCLEUS= ^1H
##.DELAY= (6, 6)
##.ACQUISITION MODE= SIMULTANEOUS
##.ACQUISITION SCHEME= undefined
##.AVERAGES= 8
##.DIGITISER RES= 18
##SPECTROMETER/DATA SYSTEM= spect
##.PULSE SEQUENCE= zg30
##.SOLVENT NAME= CDCl3
##.SHIFT REFERENCE= (INTERNAL, CDCl3, 0, 15.7039)
##AUDIT TRAIL= $$ (NUMBER, WHEN, WHO, WHERE, WHAT)
$$ ##TITLE= Audit trail, XWIN-NMR		Version 3.5
$$ ##JCAMPDX= 5.01
$$ ##ORIGIN= Bruker BioSpin GmbH
$$ ##OWNER= she
$$ F:/spectra/data/she/nmr/H-F/1/audita.txt
$$ ##AUDIT TRAIL=  $$ (NUMBER, WHEN, WHO, WHERE, WHAT)
(   1,<2019-05-06 14:11:42.17 +0400>,<she>,<DPX200>,
      <created by zg, POWCHK disabled, PULCHK disabled
       configuration hash MD5:
       00 E9 B6 7A A2 85 ED C7 34 08 36 98 17 FE 4E 26
       data hash MD5: 16K
       54 E3 89 B4 D9 47 0E C3 32 98 A0 74 B6 6A 3B EE>)
$$ ##END=
$$ 
$$ hash MD5
$$ CC 06 45 13 06 F2 71 D4 65 0A D1 20 41 A8 C7 95
##$RELAX= 
##$RELAX= 
##$RELAX= 
##$RELAX= 
##$RELAX= 
##$RELAX= 
$$ Bruker specific parameters
$$ --------------------------
##$DU= <F:/spectra>
##$EXPNO= 1
##$NAME= <H-F>
##$PROCNO= 1
##$TYPE= <nmr>
##$USER= <she>
##$AMP= (0..31)
100 100 100 100 100 100 100 100 100 100 100 100 100 100 100 100 100 100 
100 100 100 100 100 100 100 100 100 100 100 100 100 100 
##$AQSEQ= 0
##$AQ_mod= 1
##$AUNM= <au_zg>
##$AUTOPOS= <>
##$BF1= 200.13
##$BF2= 200.13
##$BF3= 200.13
##$BF4= 200.13
##$BF5= 200.13
##$BF6= 200.13
##$BF7= 200.13
##$BF8= 200.13
##$BYTORDA= 1
##$CFDGTYP= 0
##$CFRGTYP= 5
##$CHEMSTR= <none>
##$CNST= (0..31)
1 1 145 1 1 1 1 1 1 1 1 1 1 1 1 1 1 1 1 1 1 1 1 1 1 1 1 1 1 1 1 1 
##$CPDPRG= <>
##$CPDPRG1= <>
##$CPDPRG2= <>
##$CPDPRG3= <>
##$CPDPRG4= <mlev>
##$CPDPRG5= <mlev>
##$CPDPRG6= <mlev>
##$CPDPRG7= <mlev>
##$CPDPRG8= <mlev>
##$CPDPRGB= <>
##$CPDPRGT= <>
##$D= (0..31)
0 1.2 0 0 0 0 0 0 0 0 0 0.03 0 0 0 0 0 0 0 0 0 0 0 0 0 0 0 0 0 0 0 0 
##$DATE= 1557137501
##$DBL= (0..7)
120 120 120 120 120 120 120 120 
##$DBP= (0..7)
150 150 150 150 150 150 150 150 
##$DBP07= 0
##$DBPNAM0= <>
##$DBPNAM1= <>
##$DBPNAM2= <>
##$DBPNAM3= <>
##$DBPNAM4= <>
##$DBPNAM5= <>
##$DBPNAM6= <>
##$DBPNAM7= <>
##$DBPOAL= (0..7)
0.5 0.5 0.5 0.5 0.5 0.5 0.5 0.5 
##$DBPOFFS= (0..7)
0 0 0 0 0 0 0 0 
##$DE= 6
##$DECBNUC= <off>
##$DECIM= 24
##$DECNUC= <off>
##$DECSTAT= 4
##$DIGMOD= 1
##$DIGTYP= 9
##$DL= (0..7)
0 120 120 120 120 120 120 120 
##$DP= (0..7)
150 150 150 150 150 150 150 150 
##$DP07= 0
##$DPNAME0= <>
##$DPNAME1= <>
##$DPNAME2= <>
##$DPNAME3= <>
##$DPNAME4= <>
##$DPNAME5= <>
##$DPNAME6= <>
##$DPNAME7= <>
##$DPOAL= (0..7)
0.5 0.5 0.5 0.5 0.5 0.5 0.5 0.5 
##$DPOFFS= (0..7)
0 0 0 0 0 0 0 0 
##$DQDMODE= 0
##$DR= 18
##$DS= 0
##$DSLIST= <SSSSSSSSSSSSSSS>
$$ [...]
##$SUBNAM2= <"">
##$SUBNAM3= <"">
##$SUBNAM4= <"">
##$SUBNAM5= <"">
##$SUBNAM6= <"">
##$SUBNAM7= <"">
##$SUBNAM8= <"">
##$SUBNAM9= <"">
##$SW= 24.9337058887773
##$SWIBOX= (0..15)
0 0 2 0 0 0 0 0 0 0 0 0 0 0 0 0 
##$SW_h= 4990.01996007984
##$TD= 16384
##$TD0= 1
##$TE= 0
##$TE2= 300
##$TE3= 300
##$TEG= 300
##$TL= (0..7)
0 120 120 120 120 120 120 120 
##$TP= (0..7)
150 150 150 150 150 150 150 150 
##$TP07= 0
##$TPNAME0= <>
##$TPNAME1= <>
##$TPNAME2= <>
##$TPNAME3= <>
##$TPNAME4= <>
##$TPNAME5= <>
##$TPNAME6= <>
##$TPNAME7= <>
##$TPOAL= (0..7)
0.5 0.5 0.5 0.5 0.5 0.5 0.5 0.5 
##$TPOFFS= (0..7)
0 0 0 0 0 0 0 0 
##$TUNHIN= 0
##$TUNHOUT= 0
##$TUNXOUT= 0
##$USERA1= <user>
##$USERA2= <user>
##$USERA3= <user>
##$USERA4= <user>
##$USERA5= <user>
##$V9= 5
##$VALIST= <valist>
##$VCLIST= <CCCCCCCCCCCCCCC>
##$VD= 0
##$VDLIST= <DDDDDDDDDDDDDDD>
##$VPLIST= <PPPPPPPPPPPPPPP>
##$VTLIST= <TTTTTTTTTTTTTTT>
##$WBST= 1024
##$WBSW= 4
##$XGAIN= (0..3)
0 0 0 0 
##$XL= 0
##$YL= 0
##$YMAX_a= 226506
##$YMIN_a= -261574
##$ZGOPTNS= <>
##$ZL1= 120
##$ZL2= 120
##$ZL3= 120
##$ZL4= 120
##$ABSF1= 10
##$ABSF2= 0
##$ABSG= 5
##$ABSL= 3
##$ALPHA= 0
##$AQORDER= 0
##$ASSFAC= 0
##$ASSFACI= 0
##$ASSFACX= 0
##$ASSWID= 0
##$AUNMP= <proc_1d>
##$AZFE= 0.1
##$AZFW= 0.1
##$BCFW= 1
##$BC_mod= 2
##$BYTORDP= 1
##$COROFFS= 0
##$CY= 11.3945322036743
##$DATMOD= 1
##$DC= 2
##$DFILT= <>
##$DTYPP= 0
##$F1P= 18.9103706918063
##$F2P= -1.10871071338519
##$FCOR= 0.5
##$FTSIZE= 0
##$FT_mod= 4
##$GAMMA= 1
##$GB= 0.15
##$INTBC= 1
##$INTSCL= 1
##$ISEN= 128
##$LB= 0.24
##$LEV0= 0
##$LPBIN= 0
##$MAXI= 10000
##$MC2= 0
##$MEAN= 0
##$ME_mod= 0
##$MI= 1.114404
##$NCOEF= 0
##$NC_proc= 0
##$NLEV= 6
##$NOISF1= 3.799351
##$NOISF2= 2.8
##$NSP= 1
##$NTH_PI= 0
##$NZP= 0
##$OFFSET= 15.70392
##$PC= 1
##$PHC0= -8856.343
##$PHC1= 19.60026
##$PH_mod= 1
##$PKNL= yes
##$PPARMOD= 0
##$PSCAL= 0
##$PSIGN= 0
##$REVERSE= no
##$SF= 200.130013532006
##$SI= 16384
##$SIGF1= 3
##$SIGF2= 2
##$SINO= 400
##$SIOLD= 16384
##$SREGLST= <1H.CDCl3>
##$SSB= 0
##$STSI= 0
##$STSR= 0
##$SW_p= 3612.71676300578
##$SYMM= 0
##$S_DEV= 0
##$TDeff= 0
##$TDoff= 0
##$TI= <>
##$TILT= no
##$TM1= 0
##$TM2= 0
##$TOPLEV= 0
##$USERP1= <user>
##$USERP2= <user>
##$USERP3= <user>
##$USERP4= <user>
##$USERP5= <user>
##$WDW= 1
##$XDIM= 8192
##$YMAX_p= 0
##$YMIN_p= 0
$$ End of Bruker specific parameters
$$ ---------------------------------
##NTUPLES= NMR FID
##VAR_NAME=  TIME,          FID/REAL,        FID/IMAG
##SYMBOL=    X,             R,               I
##VAR_TYPE=  INDEPENDENT,   DEPENDENT,       DEPENDENT
##VAR_FORM=  AFFN,          ASDF,            ASDF
##VAR_DIM=   8192,          8192,            8192
##UNITS=     SECONDS,       ARBITRARY UNITS, ARBITRARY UNITS
##FACTOR=    0.0002004,     1,               1
##FIRST=     0,             0,               0
##LAST=      1.6414764,     0,               0
##MIN=       0,             -261574,         0
##MAX=       1.6414764,     226506,          0
$$ Real data points
##PAGE= N=1
##DATA TABLE= (X++(R..R)), XYDATA
0 0 0 0 0 0 0 0 6 -8 8 -8 16 -16 24 -24 32 -40 48 -56 66 -80 94 -109 125 -146 168 -191 220 -249 283 -319
30 -319 359 -404 454 -508 567 -632 703 -781 866 -960 1063 -1178 1302 -1444 1599 -1773 1970
47 1970 -2194 2451 -2749 3098 -3519 4035 -4681 5525 -6671 8333 -10976 15836 -27789 120298
61 120298 97049 -93840 119763 226506 51854 -119763 31881 152240 9173 -150809
71 -150809 -37232 83437 -18134 -150524 -60324 49288 -26078 -132339 -54709 45669 -13545
82 -13545 -105708 -42667 45768 -7083 -95291 -46316 35814 -9353 -99074 -65112 15876 -20272
94 -20272 -110882 -84545 4288 -17946 -109350 -89233 7811 423 -89680 -73676 32255 36767
106 36767 -55022 -48196 57509 68288 -22425 -21710 79399 87710 -7304 -11813 82362 86189 -6488
119 -6488 -8466 79118 70731 -22672 -15968 72135 57131 -34661 -21160 67234 45287 -47646 -27240
132 -27240 65199 43163 -50369 -31699 59091 38693 -52788 -35992 52518 35368 -53367 -42609
144 -42609 39603 28465 -53616 -47655 29826 24337 -52637 -54069 18748 23030 -47218 -55654 12871
157 12871 26740 -39233 -56087 8520 31145 -29279 -51708 10113 38125 -21231 -49197 12456
169 12456 46107 -12615 -46003 15993 53001 -9533 -47911 18761 62012 -4068 -48744 18824
181 18824 65331 -3292 -51223 19448 69296 -840 -52462 16758 67696 -1887 -52134 16796
193 16796 67167 -2626 -54347 14179 64265 -3048 -52707 13712 62260 -3709 -52854 10624
205 10624 59652 -1039 -49662 7207 55190 103 -48775 1865 50018 1659 -47381 -3423
217 -3423 43647 1263 -48212 -10213 39367 3804 -47369 -15461 35235 6015 -45782 -18719
229 -18719 35675 11891 -43241 -21560 35088 16762 -40597 -22283 37229 20777 -40617 -26133
241 -26133 35652 22695 -40019 -27539 35765 23421 -42181 -31646 34908 25106 -41331 -32179
253 -32179 35082 26429 -40430 -31991 36439 29421 -37175 -30155 36160 29470 -35926 -29248 35252
266 35252 28873 -34568 -30116 32111 27615 -34434 -30888 29235 26921 -32618 -32121 26856 27033 -29562
280 -29562 -31051 25767 29482 -24855 -29452 24574 31868 -19773 -27848 23544 34031 -16404 -28633
293 -28633 20750 35079 -13810 -29795 18516 35557 -13052 -31628 16296 36734 -10595 -33107
305 -33107 13921 37135 -9281 -34255 12413 38878 -7425 -35450 10568 39595 -6582 -36312
317 -36312 9636 39740 -6698 -37824 7467 39289 -6106 -38314 5754 38130 -5600 -38508
329 -38508 4234 38307 -4120 -37982 3381 37587 -2835 -37286 2603 37549 -735 -35790
341 -35790 1749 36969 834 -34326 219 35900 2690 -33346 -1303 35293 4865 -32562
353 -32562 -3575 34484 6239 -31995 -5988 32666 7574 -31842 -7983 31410 8848 -31583
365 -31583 -10843 29752 9802 -31203 -13243 28156 11106 -31333 -15921 26994 12006 -31452
377 -31452 -17666 26113 12900 -31289 -19232 25504 14407 -30514 -20651 24520 15156 -29850
389 -29850 -21622 23897 16333 -29173 -22384 23898 17979 -27699 -22332 23174 18932 -26297 -22032
402 -22032 23359 20163 -24815 -21770 22614 21591 -22318 -21858 21731 22414 -20677 -21877 21132 23607
416 23607 -19702 -22310 20138 24173 -17307 -22157 18922 24844 -16153 -22579 17659 25522 -13948
429 -13948 -22773 16288 26248 -12293 -22996 15507 27450 -10359 -23766 13755 28008 -9231
441 -9231 -23826 13111 28456 -7695 -24726 10843 29150 -6111 -24968 9427 29232 -5000
453 -5000 -25557 7977 29611 -4048 -26399 6762 29670 -3200 -26660 5761 29525 -2122
465 -2122 -26974 3869 29058 -1108 -27260 1725 28433 -563 -27590 130 27719 142
477 142 -27570 -792 27129 1418 -27321 -1930 26431 1486 -26945 -3438 25427 3008
489 3008 -26683 -5411 24454 3789 -26334 -7004 23869 5219 -26193 -8526 23130 6153
501 6153 -25139 -9914 21654 7014 -24971 -11037 21322 8301 -24758 -12838 20901 9734
513 9734 -24531 -14051 20432 10822 -23936 -14979 20235 12109 -23033 -15854 19415 12904 -22096
526 -22096 -16262 19073 13710 -21690 -16862 18932 14752 -20975 -17275 18199 15365 -19996 -17178
539 -17178 17931 16659 -18814 -17535 17058 17131 -16417 -17154 16431 18051 -15032 -17389 15340 18953
553 18953 -13402 -17375 15134 19332 -12422 -17735 14136 20576 -10768 -18223 12883 21027 -9073
566 -9073 -18545 11842 22195 -7590 -19143 10092 22673 -6357 -19424 9064 23246 -5364
578 -5364 -19927 8439 23569 -4732 -20501 7697 23839 -3946 -21338 6720 24412 -3392
590 -3392 -21608 5630 24457 -2881 -22225 4195 24187 -2214 -21434 3931 23157 -2295
602 -2295 -21962 3215 22721 -1602 -21555 1868 21830 -1269 -21738 832 21628 28
614 28 -21535 -1267 20361 1008 -20785 -2141 19648 1878 -20667 -4061 18025 3270 -19508
627 -19508 -5066 17845 3884 -20241 -7111 17481 5311 -20041 -8589 17477 5855 -20227
639 -20227 -10055 16812 7865 -19442 -11124 16238 7924 -19761 -12183 16567 9240 -19515 -12149
652 -12149 16172 9007 -19685 -12235 17211 10344 -19786 -12946 16698 10218 -18554 -12731 16940
665 16940 11050 -17892 -12973 15621 11309 -16004 -11731 15520 11482 -15385 -12225 14361 12343
678 12343 -13640 -11507 13950 12492 -12997 -12358 13299 14087 -10723 -12502 11736 14454 -9249 -13297
692 -13297 10723 16070 -7417 -13899 8845 16324 -6474 -13722 9035 17286 -5507 -14871 8054
705 8054 17953 -4432 -15483 7712 19521 -4173 -16934 6061 19940 -3389 -16913 6022
717 6022 19977 -3228 -17664 5299 19842 -2492 -17007 5688 19349 -3932 -17260 5138
729 5138 19276 -2848 -17651 4490 18555 -3436 -17711 4028 18409 -2153 -17443 2160
741 2160 16641 -2022 -16415 1990 15973 -856 -16013 -124 14639 -154 -15320 -638
753 -638 14484 276 -16464 -3124 13974 2084 -15297 -4138 13936 2682 -15973 -6841 13049
766 13049 4708 -15249 -7621 12533 5341 -15788 -8781 13299 6307 -15966 -9306 13462 5879
779 5879 -16955 -9324 14196 7394 -16662 -10274 13412 7268 -16203 -10013 14309 8305 -15558
792 -15558 -10208 13213 8062 -14980 -8598 14107 7938 -14820 -9068 13950 8105 -13837 -8310
805 -8310 13238 8467 -12853 -8771 12455 9676 -10408 -8708 10703 9910 -9640 -8731 10650 10851
819 10851 -8057 -8715 9546 10621 -7198 -9119 9205 12426 -6340 -10758 7542 13380 -5046
832 -5046 -11356 7671 15161 -4406 -12873 5951 15073 -3569 -12155 6378 15356 -3586 -13610
845 -13610 5736 16063 -2991 -13591 5717 16059 -4267 -14740 5279 16851 -2743 -14548
857 -14548 4774 15759 -3706 -14662 4562 15742 -2740 -14421 3469 14221 -3114 -13694
869 -13694 3907 14435 -2941 -13934 2229 13172 -2443 -13288 1627 12904 -1588 -13552
881 -13552 -569 12041 32 -12877 -996 11272 208 -12814 -2940 10446 1850 -12370
893 -12370 -3677 10544 1987 -13110 -5197 11308 3363 -13125 -6179 10678 3531 -13299 -7121
906 -7121 11468 5315 -13555 -7930 10692 5091 -13475 -7566 11523 5931 -13733 -8409 10885
919 10885 5786 -13009 -7684 11547 5953 -13143 -8342 11436 6692 -12152 -7348 11325 6950
932 6950 -11841 -7976 10711 7322 -10497 -7405 10142 6869 -9537 -7375 9733 7896 -8115
945 -8115 -7193 8591 8427 -7774 -7613 8203 9304 -6198 -8024 7375 9451 -5308 -7762 7112
959 7112 10696 -4337 -8902 5987 11163 -3712 -8555 5938 12043 -2973 -9986 5005 12698 -2297
973 -2297 -10074 4900 13005 -2355 -10663 4503 13418 -1691 -10738 4011 13146 -2068 -11179 3827
987 3827 13451 -1568 -11336 3005 12959 -1712 -11575 3140 12759 -1280 -11596 2243 11909
1000 11909 -1426 -11310 1676 11271 -921 -11216 471 10931 -700 -10865 91 10381
1012 10381 -271 -10935 -792 9843 409 -10844 -1600 9187 822 -10674 -2866 8870 1364
1025 1364 -10529 -3639 8293 2033 -10729 -4035 8437 2310 -10662 -5152 8401 2998 -10911
1038 -10911 -5587 8412 3416 -10799 -6129 8236 3958 -10463 -6487 8563 4647 -10377 -6708
1051 -6708 8470 4886 -10312 -6539 8830 5225 -9820 -6400 8882 5518 -9227 -6578 8511
1064 8511 5910 -8652 -6619 8017 6274 -8000 -6232 7695 6138 -7497 -6265 7481 6847 -6501
1078 -6501 -6135 7188 7101 -5729 -6209 6831 7700 -4940 -6355 6131 7879 -4133 -6389 6051
1092 6051 8701 -3945 -6753 5455 8851 -3227 -6976 5172 9388 -2845 -7232 4772 9824
1105 9824 -2315 -7784 4155 9970 -2034 -7917 4028 10099 -1958 -8538 3766 10081 -1602
1118 -1602 -8568 3484 10182 -1571 -8588 2800 9999 -1433 -8894 2292 9928 -1352 -9057
1131 -9057 2121 9535 -1595 -9333 1584 9364 -1247 -8896 900 8914 -1027 -8910 430 8389
1145 8389 -1112 -9026 -401 7751 -262 -8894 -1147 7436 -2 -9228 -1295 7440 265 -8804 -2322
1160 -2322 7195 599 -9212 -2776 6973 1023 -8758 -3378 6981 1663 -8980 -3963 7073 2162
1174 2162 -9230 -4329 6991 2710 -8628 -4511 7178 2801 -8472 -4378 7038 3355 -8398
1187 -8398 -4829 7382 3836 -8201 -5126 6827 4345 -8129 -4908 7316 4496 -7180 -4544
1200 -4544 7178 4568 -6788 -4705 6958 5170 -6042 -4817 6825 5492 -6032 -4707 6891
1213 6891 5657 -5293 -4981 6242 6317 -4520 -4812 5732 6469 -3790 -4882 5230 6409 -3163 -5132
1228 -5132 5242 7046 -2670 -5146 4484 7337 -2807 -5687 4821 8035 -2376 -6090 3971 8074
1242 8074 -1932 -6460 3465 8390 -1466 -6492 2906 8373 -1403 -6761 2772 8251 -1545 -7038 2462
1257 2462 7994 -1738 -7451 2123 8321 -1313 -7447 1968 7682 -1487 -7705 1119 7738 -1248 -7485
1272 -7485 727 6986 -1425 -7290 414 6737 -959 -7470 91 6378 -1237 -7445 -443 6098 -467
1287 -467 -7876 -1404 6033 -10 -7593 -2235 5678 384 -7327 -2163 5620 600 -7531 -2834 5158
1302 5158 1045 -7304 -3039 5714 1597 -7640 -3877 5734 2240 -7566 -3916 5781 2644 -7296 -3996
1317 -3996 5859 3368 -6641 -4114 5594 3100 -6594 -4071 6058 3808 -6413 -4093 5964 3781
1331 3781 -6319 -4064 6177 4235 -5806 -3986 5733 4588 -5342 -4059 5572 4322 -5021 -3960
1345 -3960 5198 4888 -3963 -3442 5337 4821 -3892 -3660 4748 5538 -3532 -3753 4817 5839 -2916 -4596
1361 -4596 4207 6177 -1993 -4446 3698 6546 -1791 -4597 3249 6964 -1393 -5020 3012 6487 -1398
1376 -1398 -5338 3263 7324 -1554 -5467 2922 7063 -979 -5947 2459 7486 -1095 -6159 1821 7242
1391 7242 -933 -6344 1964 6746 -1536 -6787 1468 6716 -1209 -6300 1375 6317 -1256 -6526 1090
1406 1090 6489 -803 -6906 212 5425 -1241 -6782 3 5326 -651 -6091 -738 4624 -267 -6379
1421 -6379 -1209 4470 80 -6227 -1886 4773 197 -6204 -2354 4839 607 -6444 -3088 4533 1467
1436 1467 -6183 -3055 4799 1681 -6659 -3803 4469 2060 -6020 -3504 4746 2115 -6125 -3410 5422
1451 5422 3029 -6196 -3659 5367 2573 -6275 -3411 5602 3306 -5595 -3694 4981 3311 -5497 -3204
1466 -3204 5519 3651 -5304 -3371 4894 3478 -4480 -2922 5422 3848 -4213 -2976 4951 4206 -3615
1481 -3615 -2593 4516 4178 -3418 -3200 3663 4646 -2390 -3156 3576 5072 -2135 -3462 3374 5080 -1758
1497 -1758 -3817 3081 5365 -1587 -4005 3140 6272 -1143 -4478 2234 5735 -1096 -4886 2319 6678
1512 6678 -1208 -5320 1835 6093 -985 -5166 2187 6378 -1117 -5430 1772 5986 -1264 -5528 1607
1527 1607 5872 -1445 -5874 1353 6035 -1109 -5367 1322 5108 -1270 -5784 791 5189 -1156 -5180
1542 -5180 383 4502 -1084 -5396 -106 4378 -644 -5350 -569 3895 -481 -5441 -934 4009 -68
1557 -68 -5382 -1486 3806 259 -5191 -2066 3735 1062 -5502 -2608 3736 1386 -5190 -2605 4174
1572 4174 1077 -5594 -3078 4473 1821 -5226 -2898 4305 2101 -5666 -3253 4754 2519 -5353 -3472
1587 -3472 4362 2403 -5233 -3030 4844 2488 -5209 -2809 4596 2683 -4759 -2443 5209 2788 -4590
1602 -4590 -2846 4642 3132 -4012 -2363 4498 3123 -3668 -2550 4264 3290 -2953 -2330 4003 3367 -2818
1618 -2818 -2274 3633 3840 -1952 -2443 2971 3783 -1855 -2812 2894 4583 -1478 -3187 2832 4446 -1469
1634 -1469 -3580 3146 5100 -1106 -3842 2228 5037 -1206 -3753 2445 5360 -1245 -4519 1946 5483
1649 5483 -888 -4580 2019 5181 -1409 -4734 1823 5302 -1759 -4459 1846 4689 -1727 -4733 1572
1664 1572 4578 -1499 -4979 1115 4447 -1634 -5047 1052 4362 -1371 -5064 521 3648 -1362 -4778
1679 -4778 461 4117 -1138 -4742 -635 3263 -822 -4550 -532 3553 -298 -4925 -1621 3445 -67
1694 -67 -4742 -1392 3374 148 -4974 -1738 3425 572 -4824 -2298 3328 708 -4710 -2201 3922
1709 3922 1272 -4749 -2373 3624 1391 -4776 -2260 3967 1906 -4515 -2468 3901 1657 -4476 -2164
1724 -2164 4168 2295 -4297 -2063 4421 2255 -4061 -1723 4357 2233 -3949 -1698 4065 2254 -3523
1739 -3523 -1409 4070 2296 -3073 -1582 3706 2812 -2461 -1775 4001 3179 -2684 -1609 3658 2978 -1941
1755 -1941 -1796 3416 3166 -1670 -2266 3301 3406 -1876 -2408 2349 3965 -1193 -2915 2539 4348 -1511
1771 -1511 -3029 2469 4227 -1332 -3055 2421 4032 -1331 -3542 2340 4093 -1374 -3594 1809 4446
1786 4446 -1760 -3609 1760 4119 -1722 -3714 1720 4071 -1686 -3760 1425 3912 -1589 -3948 1044
1801 1044 3466 -1858 -4063 563 3472 -1517 -4134 775 3206 -1146 -4207 255 2844 -1406 -4314
1816 -4314 -32 2856 -1290 -4184 -661 2819 -674 -4213 -948 2703 -714 -4158 -807 2600 -324
1831 -324 -4314 -1342 3055 -23 -4253 -1308 3262 229 -4114 -1550 2927 830 -3789 -1678 3521
1846 3521 1028 -3985 -1673 3327 1206 -4297 -1550 3389 1191 -3766 -1417 3656 1570 -4039 -1653
1861 -1653 3497 1623 -3289 -1479 3991 1628 -3076 -1486 3695 2117 -3057 -1553 3467 2396 -2870
1876 -2870 -1486 3502 2269 -2526 -1381 3796 2574 -2616 -1573 3319 2505 -2062 -1284 3169 2820 -1715
1892 -1715 -1928 3011 2966 -1925 -2010 2464 3285 -1219 -2134 2067 3136 -1558 -2385 2345 3273 -1340 -2476
1909 -2476 2321 3497 -1222 -2640 2092 3516 -1588 -2971 1781 3310 -987 -3195 1421 3199 -1642
1924 -1642 -3275 1538 3329 -1192 -3490 1261 3250 -1757 -3506 1093 2983 -1450 -3447 738 3023
1939 3023 -1341 -3460 298 2648 -1258 -3703 148 2700 -1173 -3679 260 2582 -1158 -3486 52
1954 52 2201 -1051 -3676 -771 2670 -751 -3698 -778 2410 -730 -3571 -976 2360 50 -3469
1969 -3469 -1129 2777 287 -3411 -934 2799 420 -3393 -1136 2788 681 -3338 -1468 2625 1074
1984 1074 -3571 -1273 3264 1163 -3446 -1356 3432 878 -3116 -1071 2907 1152 -2816 -985 2961
1999 2961 1680 -2566 -1013 3277 1901 -2814 -970 3358 1764 -2544 -1031 3482 2218 -2226 -880
2014 -880 3081 1974 -1863 -1051 2837 2459 -1576 -1196 2658 2327 -1520 -1379 2576 2497 -1516 -1276 2577
2031 2577 2542 -1177 -1654 2306 2678 -1337 -1950 1957 2864 -1198 -2005 2046 3100 -1265 -1983 1801 2759
2048 2759 -1146 -2722 1553 2935 -1432 -2774 1660 2947 -1500 -2994 1064 2937 -1366 -3016 1107
2063 1107 2656 -1545 -3026 756 2563 -1458 -3143 763 1958 -1554 -3051 614 2173 -1457 -3007
2078 -3007 760 2414 -1112 -3142 -124 1994 -747 -3042 -157 1764 -840 -3191 -512 1553 -432
2093 -432 -3255 -643 1733 -343 -3017 -631 2133 -395 -3015 -873 2378 138 -3165 -553 2333
2108 2333 551 -3070 -890 2525 656 -2658 -1144 2541 612 -2865 -958 2529 693 -2897 -582
2123 -582 2664 1009 -2950 -689 2973 1444 -2458 -772 2898 1077 -2473 -776 3119 1593 -2186
2138 -2186 -900 3039 1346 -2060 -426 2812 1649 -1610 -591 2649 1720 -1572 -487 2691 1832
2153 1832 -1662 -712 2498 2036 -1403 -501 2168 1829 -1476 -1292 2163 2144 -1122 -1264 1805 1945 -1117
2170 -1117 -1494 1793 2376 -1096 -2002 1523 2424 -1198 -1944 1705 2516 -1542 -2344 1428 2321 -1427 -2293
2187 -2293 1199 2358 -1376 -2502 1608 2204 -1167 -2674 1039 2400 -1598 -2585 820 1943 -1571
2202 -1571 -2666 935 2072 -1710 -2770 299 1761 -1273 -2725 441 1800 -1429 -2927 287 1657
2217 1657 -825 -2431 93 1447 -1038 -2769 -39 1849 -660 -2568 -531 1657 -318 -3051 -681
2232 -681 2032 -309 -2826 -842 1791 -12 -2630 -348 2147 320 -2694 -915 2250 519 -2523
2247 -2523 -726 2357 434 -2450 -640 2556 922 -2495 -553 2659 737 -2503 -691 2762 990
2262 990 -2235 -607 2923 793 -2169 -490 2757 1287 -2379 -393 2668 938 -1841 56 2424
2277 2424 1200 -1746 -283 2419 1429 -1207 -456 2291 1563 -1209 -714 2248 1751 -996 -765 2124
2293 2124 1641 -1136 -1045 1563 1845 -1125 -1115 1380 1663 -1025 -1356 1828 2101 -1131 -1580 1407 2044 -1108
2311 -1108 -1719 1383 2185 -1312 -2070 1359 2044 -1201 -1734 1112 2167 -1246 -2018 1048 1798 -1379 -1848
2328 -1848 936 1843 -1594 -2667 1004 1806 -1579 -2315 838 1594 -1731 -2338 384 1557 -1097 -2288
2344 -2288 334 1407 -1140 -2499 -16 1279 -1362 -2448 165 1131 -887 -2234 -61 1567 -716
2359 -716 -2104 -399 1455 -436 -2262 -478 1605 -77 -2532 -656 1497 -249 -2223 -445 1799
2374 1799 -142 -2258 -841 1840 269 -2391 -474 1802 299 -2168 -623 2305 549 -2142 -573
2389 -573 2478 614 -2163 -122 2375 858 -1937 -373 2242 669 -1712 -254 2375 1124 -1861
2404 -1861 -380 2226 902 -1428 -189 2461 1235 -1400 -430 2008 1294 -1367 -328 2370 1171
2419 1171 -1340 -258 1877 1335 -765 -612 1660 1570 -868 -765 1631 1738 -1048 -1043 1653 1300 -1232
2436 -1232 -977 1455 1807 -862 -1349 1361 2006 -1076 -1545 1316 1640 -1298 -1786 1067 1886 -1354 -1734
2453 -1734 1213 1842 -1099 -2057 1089 1801 -1308 -2277 832 1864 -1556 -2106 785 1519 -1188 -2034 802
2470 802 1558 -1632 -2199 476 1298 -1039 -2123 289 1132 -1312 -2280 202 1359 -963 -2286 -115
2486 -115 1208 -659 -2088 -217 1482 -800 -2018 -383 1548 -360 -1931 -388 1304 -301 -1978
2501 -1978 -367 1621 -191 -1966 -440 1722 78 -1737 -465 1794 239 -1796 -363 1897 487
2516 487 -1926 -518 2005 452 -2225 -13 1971 679 -1868 -178 2281 579 -1963 -395 2307
2531 2307 1089 -1778 -179 2203 841 -1466 -317 2214 1152 -1445 -61 2062 1198 -935 -234
2546 -234 1838 890 -1218 -345 1707 990 -1085 -577 1763 1185 -855 -654 1710 1330 -926 -729 1506
2563 1506 1505 -894 -848 1256 1348 -1175 -937 1440 1586 -764 -1278 1184 1413 -1111 -1499 890 1688 -1252
2581 -1252 -1423 1196 1608 -1064 -1915 903 1334 -1102 -1873 956 1435 -1350 -1931 1042 1384 -1433 -1651
2598 -1651 756 901 -1131 -1697 430 1619 -1190 -1810 632 923 -1351 -2147 487 1263 -1235 -2119 -24
2615 -24 1319 -784 -1970 -35 1167 -1026 -1807 69 787 -373 -1946 -290 847 -462 -1978 -264
2631 -264 1053 -223 -1727 -151 1273 -201 -1828 -511 1696 216 -1852 -322 1576 74 -1787
2646 -1787 -467 1719 347 -1500 -364 1936 331 -1651 -182 1911 527 -1663 -125 2384 821
2661 821 -1615 -80 2110 855 -1622 -190 2158 932 -1213 -142 1662 978 -1230 23 2207
2676 2207 940 -1134 3 1865 1107 -1168 -73 1818 904 -1204 -338 1737 994 -924 -558 1517
2692 1517 1112 -708 -430 1601 1492 -988 -704 1583 1621 -879 -1066 1086 1505 -796 -1504 1204 1805
2709 1805 -943 -1406 871 1171 -1221 -1228 771 1312 -751 -1661 926 1456 -1195 -1571 753 1263 -1063
2726 -1063 -1828 941 1259 -994 -1566 940 1056 -1006 -1663 602 962 -1388 -1662 216 864 -840 -1459
2743 -1459 241 756 -1337 -1804 194 799 -1131 -1846 301 1150 -729 -1248 51 937 -679 -1603 -130
2760 -130 767 -497 -1709 69 1099 7 -1679 67 1153 -423 -1260 -258 1162 3 -1276 -28
2776 -28 1368 202 -1588 -176 1524 269 -1311 -305 1352 516 -1369 -97 1814 549 -1220 -219
2792 -219 1872 680 -1303 -218 1602 468 -1074 -113 1692 630 -1244 -108 1746 833 -1241 -267
2808 -267 1649 1015 -984 186 1451 474 -1107 -57 1649 778 -875 -228 1551 1225 -965 -576 1230
2825 1230 997 -519 -540 1022 938 -812 -531 1111 1036 -831 -513 1222 1018 -770 -890 926 900 -926
2843 -926 -988 748 1185 -962 -1042 974 966 -879 -1434 688 1010 -542 -1399 513 1148 -823 -1675 258
2861 258 900 -1101 -1718 533 1055 -1185 -1467 761 386 -1350 -1384 334 886 -994 -1587 362 664 -1008
2879 -1008 -1339 465 939 -616 -1374 129 880 -555 -1335 146 928 -753 -1313 79 692 -536 -1382
2896 -1382 -328 1074 -209 -1489 -262 980 -64 -1348 -29 991 -136 -1457 159 1321 352
2911 352 -1090 -95 1257 -15 -1195 -38 1453 365 -1576 -159 1612 216 -1086 357 1490
2926 1490 442 -1059 152 1559 542 -1063 16 1628 545 -1281 -101 1620 558 -845 -170
2941 -170 1394 688 -729 270 1682 642 -852 -93 1160 726 -612 -256 1094 768 -750 33 795
2958 795 845 -601 -337 993 998 -894 -586 1070 744 -844 -717 737 953 -903 -565 1089 973 -475
2976 -475 -969 726 1060 -907 -975 901 842 -965 -1227 706 1069 -853 -1295 477 1045 -994 -1381 707
2994 707 950 -949 -1152 466 663 -902 -1426 491 754 -851 -1487 593 660 -1145 -1200 112 760 -983
3012 -983 -1065 -40 1023 -988 -1253 -18 648 -843 -1131 256 627 -481 -1388 -2 636 -568 -1209
3029 -1209 107 540 -311 -1255 -102 1262 -245 -1261 -295 1281 -209 -1108 -80 960 298 -1046
3045 -1046 -265 1327 385 -881 203 1461 127 -1312 -64 1510 186 -1071 82 1557 376
3060 376 -1011 -227 1529 553 -1040 370 1451 382 -895 222 1429 507 -1075 205 1487 751
3076 751 -754 -225 1371 414 -417 147 920 637 -732 -84 1158 750 -670 -145 856 856 -298 -230 796
3095 796 439 -655 -615 620 670 -580 -553 767 942 -757 -764 1003 986 -1017 -683 660 867 -778 -995
3114 -995 781 265 -638 -1287 492 465 -685 -1312 605 866 -953 -1147 560 528 -1198 -963 378 767
3132 767 -796 -1155 314 397 -997 -816 244 609 -1076 -1442 139 636 -821 -844 402 696 -833 -714
3150 -714 30 686 -485 -914 94 855 -462 -1165 -59 715 -432 -972 270 855 -198 -812 -113 690
3168 690 -121 -844 -90 720 381 -1057 -31 1096 -236 -1175 19 1018 370 -732 -123 1277 584 -1047
3186 -1047 67 1478 216 -669 245 1060 -7 -668 442 1612 451 -770 256 1388 397 -526
3202 -526 102 1207 694 -477 334 949 607 -570 346 1049 239 -437 -29 1045 401 -713 281 976
3220 976 597 -684 25 1039 635 -901 -253 531 622 -650 -590 503 639 -389 -685 388 436 -592
3238 -592 -488 834 574 -783 -741 674 738 -902 -678 427 277 -733 -955 605 463 -969 -975 425
3256 425 733 -988 -922 330 92 -1155 -830 377 666 -1075 -798 198 413 -893 -983 339 447 -916
3274 -916 -883 461 285 -695 -690 160 186 -944 -1107 120 487 -560 -991 -33 419 -481 -808 224 596 -425
3294 -425 -826 17 425 -189 -845 156 644 80 -991 65 818 26 -854 227 1036 -122 -961 38
3312 38 630 340 -551 15 973 128 -600 174 987 399 -461 121 1173 -10 -741 162 1033 224 -573 147
3332 147 922 371 -752 468 1175 599 -540 152 1310 154 -378 -160 1020 314 -588 86 1084 391
3350 391 -288 -86 892 602 -592 -259 870 592 -384 -315 868 482 -410 -235 753 563 -476 -241 469
3369 469 610 -698 -413 755 824 -485 -715 632 494 -741 -798 410 603 -567 -1073 574 471 -722
3387 -722 -771 223 372 -1090 -924 293 511 -923 -1097 167 320 -471 -704 307 299 -880 -1059 149 400
3406 400 -719 -933 170 533 -861 -1130 183 -106 -603 -857 245 535 -285 -879 192 432 -407 -724
3424 -724 8 535 -186 -713 208 667 -230 -554 67 517 37 -730 90 1042 -11 -429 -56 724 129 -679
3444 -679 -157 772 84 -716 274 842 1 -654 192 1279 241 -811 232 923 133 -689 111 1128
3462 1128 132 -473 254 1168 341 -325 191 1101 164 -660 129 1130 247 -414 16 1090 148 -636 112
3481 112 885 351 -801 12 571 410 -469 -144 871 424 -503 -207 707 501 -687 -417 461 466 -257 -379
3501 -379 271 513 -736 -378 450 307 -784 -753 236 94 -658 -673 147 493 -835 -669 276 684 -818
3520 -818 -585 468 314 -652 -936 197 414 -745 -648 349 139 -758 -792 146 572 -725 -776 234 234 -586
3540 -586 -783 533 116 -803 -631 47 156 -763 -551 253 327 -660 -742 16 690 -415 -722 3 618 -430
3560 -430 -539 330 396 -196 -264 -59 592 -147 -510 358 530 55 -653 169 590 -125 -854 81 917 266 -930
3581 -930 -318 978 -40 -804 251 895 105 -355 239 895 -20 -631 327 999 442 -491 139 1011 485
3600 485 -503 74 965 284 -203 46 828 63 -560 260 931 256 -457 -155 667 241 -320 162 625 304
3620 304 -670 -273 704 284 -360 -23 756 448 -417 -223 767 255 -639 -216 691 330 -645 -456 196 64
3640 64 -584 -402 402 340 -577 -588 432 370 -532 -516 182 166 -562 -646 253 396 -866 -340 227 91 -690 -939
3662 -939 186 187 -300 -745 302 618 -546 -643 318 342 -564 -366 336 511 -765 -926 263 147 -318 -849
3682 -849 231 390 -473 -575 91 359 -471 -466 -137 357 -90 -847 99 511 111 -410 331 444 98 -267
3702 -267 453 794 -77 -374 -174 793 -175 -583 350 640 273 -440 90 977 324 -523 332 778 111 -424
3722 -424 204 803 347 -474 21 973 216 -496 196 925 170 -298 130 647 406 -330 -16 447 173 -298
3742 -298 191 953 356 -326 138 469 346 -341 -205 701 263 -335 -113 495 376 -308 -17 366 188 -425
3762 -425 -270 264 287 -488 -339 546 285 -462 -576 333 522 -394 -300 663 316 -608 -794 309 73 -450
3782 -450 -357 501 509 -672 -362 333 -134 -699 -787 164 137 -778 -492 2 99 -705 -585 166 43 -730 -603 208
3804 208 208 -637 -610 299 29 -718 -728 97 149 -538 -509 315 398 -144 -577 -62 611 122 -230 220 392 -256
3826 -256 -770 305 399 -241 -275 176 678 -108 -285 286 568 154 -447 10 910 112 -553 318 852 275
3846 275 -239 578 393 354 -440 23 692 183 -557 -78 826 254 -384 197 437 311 -272 251 843 195
3866 195 -394 98 490 292 -603 -15 786 182 -305 158 849 224 -73 97 684 160 -180 -6 562 87
3886 87 -252 -199 525 127 -83 173 278 635 -446 450 283 -20 -88 -117 262 67 -578 -271 231 -38 -700
3907 -700 -241 146 -30 -570 -648 171 316 -629 -509 22 130 -799 -366 233 254 -475 -560 53 131 -660 -527
3928 -527 418 22 -466 -663 67 95 -787 -639 88 -78 -593 -465 187 54 -610 -597 -3 191 -254 -112 90
3949 90 -52 -169 -521 242 332 -224 -430 56 -25 -407 -434 245 81 -405 -537 249 224 115 -257 103 483 -182
3971 -182 -82 418 774 70 7 223 853 -31 -397 254 703 67 -495 364 514 -8 -144 191 512 140
3991 140 -316 414 802 -89 -438 64 665 132 -196 -46 794 111 -205 41 389 60 -242 -60 509 -40
4011 -40 -61 73 307 80 -342 76 467 249 -282 46 279 -87 -87 133 138 235 -186 -447 353 99 -307 -155
4033 -155 145 -35 -464 -376 486 98 -333 -93 323 23 -329 -189 366 -67 -417 -341 -13 133 -473 -421 207
4054 207 214 -786 -582 94 184 -456 -463 357 402 -638 -516 243 -18 -570 -278 164 -57 -285 -463 143 229 -114
4076 -114 -365 218 201 -575 -423 371 68 -221 -409 398 464 -352 -611 223 74 -137 -83 -8 358 0 -124
4097 -124 302 482 -34 -185 95 488 11 -442 86 425 141 -43 -103 674 169 -129 36 542 156 -542
4117 -542 115 506 -86 -407 439 850 0 -119 -66 647 175 -337 243 653 22 -163 313 607 141 10
4137 10 -57 615 259 -353 354 744 137 -333 301 398 334 -171 -133 241 -23 -253 -142 220 177 -261 189 443
4159 443 199 -195 -91 333 -127 -419 -94 -15 86 -375 -206 191 102 -588 -280 109 251 -338 -227 238 79
4180 79 -339 -506 30 -47 -804 -484 323 -5 -624 -421 -18 -37 -348 -358 122 -128 -45 -372 18 -113 -498 -400
4202 -400 -187 207 -595 -300 332 -16 -592 -485 386 228 -362 -38 74 154 -472 -436 112 491 -360 -467 230
4223 230 -35 -64 62 227 498 -182 -24 231 300 8 -50 -158 668 233 87 162 457 -189 -488 252 531
4244 531 -13 19 358 790 283 -171 52 542 387 85 134 744 0 -362 83 331 283 -532 149 662 -3
4265 -3 24 337 640 -201 -356 342 409 -33 -388 154 487 19 -149 193 393 -141 -503 206 136 -38 -346 -111
4287 -111 234 -310 -431 -323 261 381 -251 -119 -253 -101 -254 -227 186 -44 -242 -610 204 283 -734 -339
4307 -339 98 37 -677 -290 162 41 -316 -214 230 142 -283 -83 -93 161 -255 -264 226 -272 -514 -196 34 -147
4329 -147 -335 -357 157 177 -228 -427 381 283 -376 -408 130 116 -252 -257 143 273 -149 -208 27 60 -279 -278 48 -11
4353 -11 -644 -296 110 280 2 -181 -25 422 -323 -332 134 242 -79 -375 218 532 75 -513 172 166 51 13
4375 13 -4 513 -80 -115 263 521 312 -225 10 281 10 -245 -51 637 -19 68 320 619 87 -40 322
4396 322 774 211 -98 68 458 179 -375 154 665 -79 -132 195 154 1 -177 207 320 217 -16 -444 -156
4417 -156 -206 -317 46 139 -127 -334 -117 300 -24 56 -203 124 169 -274 -31 10 183 -583 -411 95 -14 -383
4439 -383 -284 404 297 -65 -211 118 13 -193 -364 93 -244 -571 -237 294 87 -417 -645 -1 -11 -147 -176
4460 -176 -10 31 -396 52 159 20 -535 -364 17 -121 -271 -247 -22 251 -353 -206 187 257 -173 -116 210
4481 210 165 -154 -66 247 122 -147 -184 86 263 264 9 15 139 -120 85 198 122 77 -361 218 399 -240 -123
4504 -123 234 254 28 -159 176 310 -45 88 55 464 -80 -217 -47 508 -28 -98 224 540 54 -186 318
4525 318 379 17 -48 109 525 100 -46 25 361 241 -158 204 435 157 -330 71 383 77 -45 -74 483
4546 483 -21 -77 -10 284 -69 -420 113 210 383 -372 -96 180 -93 -162 7 137 86 -442 -20 100 -99 -456
4568 -456 -115 114 -53 -516 -363 92 -1 -330 130 295 -34 -167 -551 40 -161 -228 -361 136 254 -353 -90
4589 -90 157 177 -392 -269 282 -53 -134 -200 262 220 -290 -229 54 114 -491 -479 248 -79 -132 -8 -12 238 -340 -356
4613 -356 111 5 -303 -38 373 -77 -138 117 176 177 106 -50 -44 296 -168 -332 128 381 -316 -182 108 281
4635 281 118 -32 131 223 81 -94 147 231 -167 -50 260 577 138 25 392 326 137 111 183 614 234 -359
4657 -359 -80 217 -261 -94 199 259 129 71 172 203 181 -59 77 -1 92 -292 126 117 243 -274 134 88 -49
4680 -49 -233 414 165 -93 -150 316 133 -219 -478 -66 163 -103 -191 -161 71 67 -78 -77 -83 161 52 -287 280
4703 280 -321 -297 21 71 -259 -175 -305 318 10 -571 -192 -9 41 -457 8 248 171 -333 -273 9 36 -332
4725 -332 68 240 170 -391 -219 -31 222 -418 -308 -4 -122 -270 -38 163 245 -393 -92 372 -9 -108 116
4746 116 57 71 -165 -23 422 75 29 -230 102 83 -101 -2 302 544 19 -19 180 251 63 -121 271 308 -30
4769 -30 118 226 428 114 135 -23 241 18 -52 -167 118 162 -56 199 112 -7 -1 330 531 -6 -312 171
4791 171 100 14 -76 191 372 430 52 202 307 35 -169 122 300 81 3 -179 114 -82 -269 80 11 -59
4813 -59 -375 -33 515 118 -160 253 160 30 -127 39 -43 -118 -216 -130 294 -31 -158 -197 227 -291 -344 134 172
4836 172 119 -167 29 188 -287 -35 -205 -41 -152 -73 -494 40 -244 -407 -258 47 296 -51 -668 99 -140
4857 -140 -400 -357 218 -12 -347 -214 267 134 -166 226 81 92 -178 -139 2 303 -223 -32 280 -4 -173
4878 -173 -121 388 249 76 98 153 -14 -361 -50 8 182 -9 -285 285 26 -60 -99 181 165 192 43 344 -86
4901 -86 71 -31 135 506 -74 -286 149 448 14 -195 493 379 -49 127 163 138 32 207 284 274 -249 -157
4923 -157 80 46 296 77 321 272 301 -9 382 432 -161 -320 -4 101 -72 -195 174 -95 -90 -32 141 299
4945 299 10 -387 149 154 139 -38 21 317 41 -104 -28 411 19 32 83 195 -89 -134 -109 239 -4 -223 -223 8
4969 8 -54 -192 -197 -281 -190 -572 -171 -177 -78 -102 -399 -35 -21 -599 -139 51 106 -17 -19 -25 31 -262 -385 -175 131 -47
4995 -47 -22 -33 58 -193 -86 -56 69 -58 -161 37 169 -141 -90 -4 162 121 102 31 200 -217 -156 297 103 126
5019 126 34 440 99 -308 6 -9 167 -51 -64 168 108 -344 -27 487 191 -79 -274 145 178 63 12 332
5041 332 98 110 289 231 387 -149 -285 221 230 81 170 -104 368 34 -192 242 393 -114 177 168 350 205
5063 205 -214 -1 249 189 -210 254 248 109 79 -34 53 -33 -126 -23 93 -32 -177 7 -54 -147 -36 -174 -46
5086 -46 -235 -53 -18 346 -240 -668 70 74 38 -341 249 101 -212 242 -156 226 -247 -415 -394 250 -135 -287
5108 -287 -333 16 -423 -306 -333 -92 -29 -329 -265 92 -180 44 -74 -31 14 97 -311 149 -6 -128 87 107 270
5131 270 -44 134 287 192 -328 -107 344 -66 12 -313 365 168 -227 -139 13 350 54 -99 449 162 -79
5152 -79 213 15 207 -33 -35 121 127 -177 6 -166 91 -10 -97 213 183 273 73 4 292 -2 68 -26 66 -107
5176 -107 69 108 281 133 155 146 390 240 138 104 226 -51 -307 159 -91 -320 -122 -35 77 -34 -265 -221
5198 -221 58 -126 -180 150 229 10 -304 340 230 -312 86 -186 185 148 -88 -140 -85 321 -240 217 -254 112
5220 112 -102 -93 38 93 -166 -258 228 -381 -310 -441 219 -307 141 126 59 222 69 -239 -450 219 66 -306
5242 -306 -12 -16 -153 -275 -403 38 -17 -47 148 -285 -264 -167 62 -295 -295 -15 76 48 -67 7 -75 71 -181 -32
5266 -32 150 -49 -99 -84 -22 -91 -64 5 148 93 -44 84 142 -117 -106 71 508 253 138 -258 -119 118 -41
5289 -41 120 334 151 -23 -221 -24 248 -34 -57 -80 301 -121 -240 216 46 -42 124 55 -184 64 -173 251
5311 251 46 233 168 535 333 -274 -119 127 -81 231 -142 187 200 -10 103 42 93 261 -100 -1 243 53
5333 53 48 90 111 102 -154 200 24 -491 18 -249 388 -37 95 93 42 -142 -253 146 -42 -231 -251 -68 134 -261
5357 -261 -92 -43 42 258 -296 6 41 -401 263 -406 -206 17 49 -69 15 2 -214 -222 64 7 -349 2 330
5380 330 60 -228 220 46 -21 -192 -196 136 93 -377 -156 -213 141 13 -198 108 100 228 64 -18 77 49 -214
5403 -214 30 108 -466 -103 220 182 -251 -160 123 284 -201 -47 135 -186 -106 -15 26 161 253 58 -33 36 126
5426 126 -70 230 331 39 65 333 276 155 185 345 181 -326 167 322 111 134 210 152 274 76 29 181
5448 181 35 -281 77 -19 -80 60 -99 -95 -65 129 -299 -246 168 -286 280 -137 190 203 -194 137 169 180 371
5471 371 143 95 -34 -317 56 166 -65 -155 -21 -8 -253 -183 -122 139 149 -330 -455 68 -355 -25 -159 251
5493 251 -162 -204 108 206 -142 79 -120 282 -180 -202 -270 54 -163 -156 -104 10 -10 -401 -7 198 -21 -166 -237
5516 -237 39 127 -143 -239 146 -43 -146 -237 -90 388 -352 7 27 129 174 -576 281 81 -345 -37 127 6
5538 6 95 44 154 326 -194 138 35 66 -82 -200 412 16 12 53 142 167 -112 -95 149 7 53 -412 -131 119
5562 119 140 -28 -144 -47 450 18 153 -75 120 37 296 66 149 -33 -108 134 -15 64 -74 447 -71 197
5584 197 99 -178 263 13 14 131 -6 -61 -135 415 -247 -200 120 376 1 -192 -153 223 249 -69 166 -11 209
5607 209 -277 -62 19 119 -64 377 259 9 -207 -177 -23 81 -166 -165 28 -46 111 88 160 -91 150 -107
5629 -107 60 5 -347 -93 -349 265 -59 -303 -240 -276 -205 70 -259 -209 -272 -3 -28 -19 -321 -214 -29 -309 -213
5652 -213 -225 -38 -32 -136 -85 186 59 -138 -61 -90 57 -220 -12 5 -62 -11 -198 34 199 263 102 139 110 215
5676 215 19 -74 101 -36 -9 334 20 -15 -77 122 -38 75 212 163 135 145 304 7 211 -9 112 223
5698 223 331 150 -31 95 71 67 -56 113 89 121 -78 465 241 196 -74 -27 268 447 -148 358 68 -79
5720 -79 75 329 366 -178 -151 -63 80 196 -128 132 333 33 -205 264 319 -68 -103 -63 76 23 -26 31 209
5743 209 175 -191 109 261 70 -183 -1 90 142 49 -199 257 -1 -186 -40 -108 104 -254 27 208 -93 -86
5765 -86 -206 -15 -301 -39 -262 -172 -129 -111 150 190 -172 -165 108 145 -191 -65 67 -50 -181 -58 104 71 -1
5788 -1 -302 -70 272 -42 -142 -74 24 -130 -371 64 -15 231 59 -80 83 -94 -154 -41 120 120 -96 264 345
5811 345 -36 6 -190 252 251 258 20 162 -265 -110 -44 429 229 90 -202 -121 -17 -102 261 -192 46 -14 -247
5834 -247 -145 79 -247 48 235 60 305 18 369 95 235 18 206 609 378 -65 -28 446 30 -194
5854 -194 124 67 19 95 183 -148 160 -97 158 -16 45 -107 -84 -279 -165 29 -128 456 -243 -142 190 150
5876 150 -121 -18 203 97 -90 -331 -38 -180 94 -327 -6 309 -5 -84 -191 -143 -139 -96 78 -46 -440 -158
5898 -158 85 -89 51 -322 300 317 -138 221 -212 -8 -44 -388 -40 457 95 101 -170 335 187 -38 -132 -76
5920 -76 65 32 -269 36 190 -274 -59 107 269 -314 -293 116 -219 -246 194 183 -42 204 21 -255 193 13
5942 13 -67 -52 -125 -84 14 -154 49 -61 143 222 30 -90 2 66 76 15 37 -203 -166 -138 72 -57 68 236 83
5967 83 -154 112 98 -35 -39 359 91 -148 117 -152 89 -92 -131 229 -342 -84 43 190 -496 -48 17 73
5989 73 57 -52 213 21 -232 258 -78 55 -63 -71 -196 -233 -93 92 79 -123 -94 13 -137 70 17 -263 99
6012 99 55 -122 -196 46 91 -21 -302 -234 -52 -67 -98 157 93 -9 -301 -56 -292 100 -186 4 103 -100 -286
6035 -286 -492 -324 -8 -118 45 -262 199 -161 -223 -100 11 195 79 -3 -102 -156 -33 163 214 -14 -51 -37
6057 -37 32 42 -306 158 97 34 103 170 -71 -322 141 129 -106 58 -72 1 64 13 -342 151 125 164 -52 336
6081 336 113 291 124 115 -54 53 67 176 39 146 -22 -64 239 179 -114 105 151 4 253 -13 207 -57
6103 -57 156 183 115 3 -219 25 -53 337 42 204 -35 -61 9 80 43 -262 -207 102 64 -152 -265 213 185 61
6127 61 -148 221 161 -94 -82 -244 265 -124 -2 -255 -258 -264 -203 -6 -149 -16 94 95 173 -144 -57 -233 333 24
6151 24 -90 88 115 130 -60 -56 17 -220 102 385 -34 -48 -407 -185 -49 59 180 -111 -154 46 -158 -209 -1
6174 -1 242 -399 -256 174 -183 -348 303 60 302 -190 -177 -62 114 119 165 200 299 133 238 300 19 -2 21 179
6198 179 -126 -283 -4 280 103 -56 27 -95 -235 -182 17 144 225 -27 -24 25 240 224 21 215 -13 -48 307
6221 307 70 -67 172 30 -90 258 78 -33 3 -40 -36 -28 -69 206 -89 131 157 115 0 -248 15 -165 -22
6244 -22 -160 103 -149 243 -114 192 -15 -80 -308 20 39 -28 -268 109 247 -33 -119 86 -205 -34 67 26
6266 26 280 -143 -364 118 96 -279 -540 315 29 60 -20 -100 51 31 -2 -104 39 -183 -137 -225 191 -159 -54
6289 -54 -134 103 -164 -294 -403 -138 -30 -132 -71 75 85 -209 75 -7 101 -149 -137 356 82 -519 1 -18
6311 -18 0 -15 -74 7 153 54 -174 -171 222 329 131 -71 -134 -193 103 -344 -219 -123 -128 35 187 266 -101 -110 184
6336 184 91 -332 -33 128 124 -25 -88 56 59 55 210 107 219 5 -269 220 145 -8 217 188 -98 128 161 88
6360 88 120 -258 -105 60 17 209 245 104 32 -257 -69 158 126 35 191 -29 131 73 -81 160 -181 -175 254
6383 254 279 -62 92 77 1 -224 18 -254 221 -16 -200 -108 50 -304 -125 -81 12 27 53 -93 197 277 -215
6406 -215 -232 -253 -503 -59 63 -1 78 329 151 89 -96 195 -350 3 -132 -163 147 202 -41 -195 383 -114
6428 -114 -300 105 -106 109 202 181 -273 -153 232 13 121 154 -161 -4 -153 10 -59 -178 -11 -8 322 3
6450 3 115 140 -100 -114 -228 -227 109 -189 -154 107 132 -207 174 169 307 287 -3 -226 240 -50 250 150 68 31
6474 31 -68 187 -136 155 -100 414 195 -296 24 -237 -92 188 -81 189 -136 -50 47 -113 -226 164 4
6495 4 52 282 86 -46 -232 -77 122 -79 -254 170 203 -43 181 103 -262 -149 -265 -38 -79 -106 -169 -40 -1
6518 -1 -29 338 -63 16 -249 -79 -143 -209 157 344 -179 170 -138 69 -120 -100 -19 -129 -131 -175 -149 -88 -89 -25 17 -55
6544 -55 -188 226 -334 -97 366 157 129 -273 -52 188 -120 -24 -423 -189 -210 -47 343 -114 22 190 -153
6565 -153 -213 -13 131 -121 -351 -47 56 69 302 50 200 307 -223 -52 -216 182 237 90 21 -89 225
6586 225 119 -95 89 -184 -340 80 172 69 -27 -52 212 -87 -19 141 44 -248 81 54 58 -176 10 -150 -260
6609 -260 35 55 -4 -130 49 -59 -88 -24 219 150 -36 198 66 -384 -137 -186 -45 100 69 -172 -58 -269
6631 -269 -123 25 64 40 147 9 42 -75 56 120 -54 94 -96 10 86 21 -114 104 -299 105 373 182
6653 182 279 -272 -246 -64 33 175 203 -35 44 -191 -86 141 34 54 -138 -51 214 -197 190 -144 35 221
6675 221 -184 145 11 102 95 -119 -16 -435 -32 187 -188 6 -175 -145 -26 -106 -48 39 191 -104 -128 158 62
6698 62 -138 -132 46 -9 -42 36 -209 -83 -16 82 115 44 -250 -187 -170 -456 89 22 107 213 198 -158 -32 -262 -6
6723 -6 134 188 332 -143 -275 60 -303 143 -30 306 87 -135 -193 -72 -178 37 -195 -102 41 -224 279 -235
6745 -235 11 231 -175 -2 -36 -160 -86 100 147 -37 -169 -128 167 157 353 47 35 47 -182 77 2 -34 136
6768 136 -346 -25 171 86 216 -55 -131 105 -8 -8 -52 -183 -243 11 120 66 -30 91 409 9 158 127 -136
6791 -136 -3 138 -38 -148 -12 -118 117 17 153 -4 -103 288 203 77 41 55 228 296 259 -21 24 -112
6813 -112 0 114 -101 -241 35 -43 -25 78 -38 158 -9 -19 280 -51 21 216 -287 -84 126 -28 54 398
6835 398 -23 -267 245 -152 149 20 214 -236 188 -203 -201 65 -120 32 -42 -112 30 -270 -14 -116 -332
6856 -332 -13 -136 -189 191 130 -4 -186 -287 -72 -145 -87 -110 -22 142 0 51 -135 -327 189 -205 -137 -82 114
6879 114 -60 35 -279 111 216 77 -56 -262 -10 -210 -98 -120 -82 198 299 97 174 13 2 -221 31 103
6901 103 78 -275 103 102 136 18 -180 149 211 190 -308 53 -160 146 -109 333 125 -283 364 189 -28 191
6923 191 26 -19 -198 141 80 34 -245 102 32 -43 119 -203 136 -6 68 79 11 -102 -272 299 8 42 -86
6946 -86 77 -61 -179 137 -249 -132 63 -390 -187 186 188 252 -138 312 -189 -127 123 -214 -40 72 111 -87
6968 -87 -111 35 197 260 -122 297 219 5 79 176 279 67 -75 23 -254 5 26 224 62 8 255 -362 23
6991 23 21 -161 104 -20 128 -116 11 114 98 79 45 -89 -32 -230 55 16 125 5 156 -72 277 136 -75
7014 -75 124 -63 -319 -134 145 -244 148 256 -97 -102 19 274 291 131 -239 106 67 -159 51 10 -270 -177
7036 -177 -21 177 -7 150 215 150 57 170 -201 11 331 97 37 61 34 5 -78 3 -32 -101 -72 -35 2 -134 -17
7061 -17 -13 39 -7 63 73 244 -220 83 185 166 153 132 -121 -225 63 -28 215 -139 139 -147 -17 318 -34 131
7085 131 -173 -99 -92 267 -7 216 -133 -105 2 -44 196 -35 33 -38 362 -133 -122 145 35 -42 26 -30 67 62 132
7110 132 28 34 63 -223 72 -195 133 -248 -50 -13 -66 115 139 124 96 -214 285 -42 126 175 114 -28 -143
7133 -143 102 5 -176 -73 101 -231 -48 176 434 -214 140 55 75 100 -7 128 22 -410 77 274 66
7154 66 -287 -15 154 116 128 17 49 136 27 -39 105 -218 -63 -77 225 -45 130 79 74 255 -59 198 20
7177 20 156 -63 -113 175 -86 17 -175 44 171 94 -67 148 28 -91 -159 41 -9 60 -23 -29 242 181 9
7200 9 -229 47 -176 -140 218 -35 193 -5 95 -115 155 -196 -129 251 -269 228 221 -34 65 -70 244 -162
7222 -162 -65 39 -27 85 13 250 32 -232 -17 45 -29 -141 -135 -180 -203 239 -42 -187 181 -149 77 -90 115
7245 115 -166 -345 262 87 124 -400 205 311 46 29 318 -12 -226 -183 13 -26 56 372 88 -233 -401 -128
7267 -128 -118 50 -131 49 117 198 252 -221 45 -72 -36 84 99 296 104 213 477 14 202 -63 -316 196
7289 196 57 -15 44 -73 -145 -195 309 -73 -199 -9 62 -64 -35 -243 103 294 133 40 122 55 -324 -299 154
7312 154 -72 -198 -184 144 -296 258 122 1 249 117 -5 28 65 85 -256 -134 -137 78 273 30 151 18
7334 18 -33 -81 -77 137 9 107 -285 -291 -148 27 -129 -186 -207 -29 230 165 -253 181 74 -7 300 113 30 -77
7358 -77 -73 183 -166 410 -40 -201 -177 -187 12 114 -80 -77 -121 223 -132 -118 -52 -141 -205 -134 173 49 128 159 119
7383 119 -178 19 16 193 107 -343 158 31 221 91 -131 -161 -3 151 -26 -102 -55 -25 332 52 -42 85 44
7406 44 -202 -113 -193 197 -284 51 -105 -45 -203 185 33 -422 124 -21 53 58 -97 178 -445 44 -294 -24
7428 -24 23 -76 -293 -113 -218 -20 -103 -79 34 -200 -97 240 -111 -92 -33 -388 202 -78 109 -18 210 -90
7450 -90 -71 5 -108 -126 -25 118 233 -28 72 33 82 28 -165 257 -16 217 -308 283 82 -89 -100 33 -60
7473 -60 -15 -226 -104 28 -10 -103 -157 165 290 -245 -53 266 172 177 279 46 -207 -229 -184 114 31 -5 22 122
7497 122 140 -461 177 -40 -94 31 168 -29 10 -218 183 -72 -170 -241 163 372 332 -114 -218 35 -58 246
7519 246 100 -184 -45 -63 -186 -163 93 -286 -78 -365 -113 -97 63 276 94 -137 -97 107 -101 156 207 185
7541 185 -27 -95 8 -15 -94 155 78 389 -119 80 -51 293 143 56 -110 118 189 -182 160 -1 214 -198
7563 -198 88 -209 -216 59 30 -197 -206 -79 127 -24 -6 215 36 86 -51 78 146 -94 -412 -141 218 212 -5
7586 -5 126 -92 -19 458 -297 -156 206 -136 71 -5 -52 -248 35 136 148 42 8 -304 111 52 115 64 33 -71
7610 -71 101 88 -50 -5 -9 321 -116 -275 288 151 -35 64 -277 70 -21 -146 -85 118 -337 -109 156 139 33
7633 33 -100 -86 44 -169 -151 -122 143 -56 256 -276 182 -196 -37 137 217 -195 -76 121 -19 -75 162 -155
7655 -155 30 348 -426 100 178 -201 35 -73 -18 101 -53 20 -69 44 107 202 70 90 361 140 77 162 -78
7678 -78 12 26 -118 70 152 84 361 -70 -183 -154 -133 -149 85 165 7 -326 4 94 142 65 212 -100 -89 127
7702 127 173 -101 141 104 -169 93 -102 -169 17 60 273 12 3 64 70 93 96 90 103 -51 -74 5 210 -12 31 -288
7728 -288 20 -256 54 -169 241 212 -52 -72 -230 90 -210 39 38 -152 -70 -60 119 10 -100 51 -139 165
7750 165 6 236 103 -15 92 -112 -438 3 -41 -91 -302 -165 -81 314 -193 -53 -194 -257 68 -262 -310 -120
7772 -120 144 -69 -43 -119 -164 -32 -27 -68 -88 -9 -19 -75 48 45 -330 -164 -211 252 5 83 19 -258 64 -54 11
7797 11 208 -95 -136 27 288 -15 304 286 146 -50 54 39 140 -106 -15 -464 -92 5 -177 356 -218 57
7819 57 -190 -166 -105 -35 -232 -84 -168 219 -212 -132 62 -330 18 -145 96 -59 296 -186 70 -289 -351 69
7841 69 -277 20 61 43 -119 143 26 266 8 147 277 211 88 157 300 317 -139 151 -138 157 -163 -316
7863 -316 30 95 170 -154 142 -36 -78 45 -74 114 158 -221 -49 -97 -372 74 56 -65 -101 143 16 -251
7885 -251 7 -102 -100 -200 192 -88 -64 -27 206 79 335 -192 -290 67 167 216 98 107 105 295 42 310 25
7908 25 9 172 -34 -193 -42 204 218 37 -201 -42 -88 96 132 74 4 -152 -120 -14 -249 -44 210 -283 -52
7931 -52 111 -232 103 -1 18 -129 96 -27 -185 -11 447 293 69 227 5 186 -431 -127 124 -158 33
7952 33 -68 238 -126 -329 -115 67 62 -287 60 -266 135 149 247 115 124 -67 55 125 275 -149 -251 -63 470
7975 470 158 -23 -289 -216 -91 -28 26 -119 -91 -143 32 -172 -135 61 -139 -38 55 42 -79 -32 84 259 -346
7998 -346 -334 420 257 204 214 286 -66 81 187 -46 277 -74 -18 46 -67 318 -85 -125 141 -176 -142 132 203
8021 203 22 -34 43 -307 254 19 187 10 153 175 -125 169 -63 335 -119 -62 122 288 108 358 39
8042 39 419 -19 -72 259 72 -102 -135 -42 15 -127 -163 -25 130 -33 -87 115 -121 171 -240 209 -23 -31 49
8065 49 -69 -80 -91 321 265 -19 -80 21 128 32 245 117 48 70 -31 -79 -123 -81 240 281 220 74 41 83 326
8090 326 -63 40 207 -17 -91 141 -44 60 372 -52 44 -22 188 112 137 9 14 -235 35 53 259 258 -160
8113 -160 -176 -21 169 112 -117 -41 -215 73 -193 -12 -47 -129 -149 4 -237 -66 18 -156 140 223 292 -559 -295
8136 -295 -173 16 -36 350 -169 -58 37 -155 -67 139 -54 -200 -187 22 -192 -152 46 109 1 103 -83 134
8158 134 261 45 18 -225 -278 73 76 17 310 -257 -133 -236 146 116 16 196 -209 24 -321 -87 74 124
8180 124 81 -164 -176 316 -1 -72 -287 33 217 -114 -44
8191d4
$$ Imaginary data points
##PAGE= N=2
##DATA TABLE= (X++(I..I)), XYDATA
0 0 0 0 0 0 0 0 0 0 -8 0 -8 8 -8 8 -16 16 -22 24 -30 32 -40 44 -52 60 -68 78 -88 102 -114 128 -144 163 -180
33 -180 202 -226 252 -280 309 -344 380 -421 467 -516 571 -634 703 -783 874 -978 1102 -1249
51 -1249 1426 -1646 1930 -2310 2842 -3644 4993 -7680 15071 -75711 -247432 -38823 80128
64 80128 -108390 -261574 -95596 44034 -97477 -238731 -103459 40714 -57224 -178948
74 -178948 -74565 52065 -22190 -125022 -41428 64905 782 -93803 -30471 59012 2192
85 2192 -86710 -35719 48763 2031 -83580 -42563 44000 12373 -69957 -33802 60913 42510
97 42510 -42295 -15551 84871 76915 -11671 4768 106633 103120 5478 7022 105016 106270 5472
110 5472 -2724 88715 87899 -14923 -26526 63221 62256 -35473 -42619 43218 36980 -56293 -50424 38246
124 38246 26103 -65308 -51857 38125 19585 -70607 -49353 42948 21753 -71249 -51253 40756
136 40756 21437 -69989 -51340 38596 21688 -67072 -53205 32901 22080 -59010 -49463 31269
148 31269 26625 -49478 -46404 29977 34666 -35223 -40727 30812 43246 -22518 -36765 29846 51137
161 51137 -10109 -31947 29564 55016 -5003 -32333 28125 59115 -855 -34853 25024 59719
173 59719 -2420 -40731 23363 63933 -3690 -48394 17612 62806 -6429 -53779 15093 63575
185 63575 -7783 -59291 9995 60617 -8976 -60247 8732 58535 -11390 -62916 5664 56850
197 56850 -11256 -61421 4995 53850 -12285 -61809 3028 51914 -9881 -59310 -1087 47027
209 47027 -9713 -57909 -5149 43163 -6498 -54969 -9425 39043 -4012 -52172 -11225 38543
221 38543 2033 -47968 -13483 37638 7706 -42800 -14084 39485 14128 -39655 -17058 38953
233 38953 19472 -37818 -19289 38879 21482 -38845 -23920 37576 24051 -38555 -25806 37510
245 37510 24918 -39436 -27444 39081 29104 -36660 -27633 39666 31012 -35574 -27210 40845 33198
258 33198 -34667 -28174 38745 31880 -34366 -28115 36637 30082 -34365 -29533 33767 29319 -32554
271 -32554 -28427 32817 30405 -29720 -27618 31998 32270 -25261 -26107 31210 33783 -21779 -25693 28084
285 28084 34144 -18536 -26508 24202 33169 -17443 -29116 20553 33343 -16038 -31232 16857 33130
298 33130 -15474 -33376 15096 34536 -13227 -34922 12123 35017 -11633 -35904 10761 36087
310 36087 -10413 -37622 8110 36362 -9589 -38988 6776 36486 -9486 -40529 5868 36958
322 36958 -8371 -39850 4881 37224 -7121 -39541 4015 37453 -4992 -38457 3221 37711
334 37711 -3435 -37658 2372 37398 -2071 -36832 935 36093 -568 -36139 -772 34419
346 34419 982 -35145 -3185 33130 1888 -34962 -5386 31877 3863 -34921 -8276 30311
358 30311 4699 -34287 -10174 29318 6241 -33825 -12083 28280 7676 -32618 -13564 27607
370 27607 10306 -31669 -15462 27734 12470 -30780 -16358 27718 13995 -29554 -16894 27887
382 27887 16543 -28054 -17428 27769 18174 -26749 -17540 27702 19649 -25318 -18086 27619 21607
395 21607 -24117 -18050 27613 22655 -22744 -17985 27396 23342 -21676 -18574 26140 24139 -20431
408 -20431 -18985 24610 24322 -19493 -20294 23339 24761 -18205 -21076 21760 25423 -16757 -21174 20270
422 20270 25414 -16224 -22091 18619 25772 -14267 -22641 16647 25904 -13136 -23974 14670 26251
435 26251 -12026 -25258 12864 26252 -11132 -25502 11247 26117 -10151 -26732 9171 26805
447 26805 -8842 -27266 7315 26531 -7890 -28303 5791 27152 -6997 -29213 4140 26919
459 26919 -6196 -29398 3022 26754 -5578 -29912 1826 26479 -4138 -29960 -137 26165
471 26165 -2903 -29711 -1205 25781 -1919 -29465 -2172 25599 -813 -29092 -3537 24956
483 24956 133 -28176 -4459 24580 1621 -27849 -5663 24056 3189 -26591 -6652 23857
495 23857 4890 -26112 -7827 23440 6504 -24806 -9090 22840 7663 -24460 -9419 22611
507 22611 9329 -23395 -10678 22674 10996 -22745 -11502 22906 12966 -21630 -12409 22469
519 22469 14307 -20927 -13488 22291 15445 -19762 -13571 21830 15845 -19177 -13933 21765 16856
532 16856 -18321 -14514 21161 17924 -17671 -14678 21020 18634 -16411 -15184 19871 19233 -15175
545 -15175 -15159 18437 19557 -14178 -15817 16681 19903 -13047 -16609 15674 19719 -12149 -17198 14708
559 14708 20083 -11182 -18456 12805 20394 -9991 -18664 11261 21081 -8710 -20051 9091 21003
572 21003 -7995 -20495 7710 21196 -7453 -21668 6884 21416 -7076 -22407 6061 21786
584 21786 -7064 -23558 4646 21971 -5820 -23952 3413 22226 -5346 -24495 2618 22056
596 22056 -4165 -23933 1701 20936 -4199 -23951 1453 20589 -3748 -23576 283 19855
608 19855 -3033 -23086 -71 20256 -1871 -22968 -2131 19355 -304 -21782 -2936 18912
620 18912 509 -21374 -4195 17930 2493 -19828 -5435 17621 3274 -19788 -6815 17927
632 17927 5233 -19372 -7654 17754 6546 -19335 -8683 18455 8517 -18792 -9837 18092
644 18092 9526 -17993 -9967 18221 10938 -17641 -10220 18041 11342 -17259 -10034 19200 12087
657 12087 -17586 -10676 18942 12684 -16326 -10163 18922 13005 -16110 -10591 18133 13482 -14091
670 -14091 -10058 17430 13283 -14283 -10129 16804 13682 -12607 -10478 15228 13507 -12398 -10984
683 -10984 14477 14700 -10512 -12391 12376 14722 -9161 -12819 11509 15644 -7928 -14178 9083
696 9083 15845 -6733 -13984 8371 16303 -6764 -15678 6930 16801 -6337 -16624 6057 17593
709 17593 -6097 -18678 4916 18215 -4904 -18270 4189 18261 -5583 -19532 3656 18561
721 18561 -4865 -19138 3458 16865 -5517 -19015 3487 17601 -5199 -19547 2521 16965
733 16965 -5350 -19384 2474 16835 -4566 -19533 1014 15412 -3226 -17573 743 14844
745 14844 -2802 -17373 -969 13948 -1338 -16149 -1186 13676 -861 -16848 -2873 14229
757 14229 1474 -16059 -3898 13642 2757 -16105 -5892 13913 5168 -14890 -6734 13085
769 13085 5900 -14398 -6791 14350 7247 -14642 -7747 14564 7883 -14965 -7106 16196 9006
782 9006 -15233 -8385 15890 9564 -14136 -7737 15996 9762 -14118 -8143 15884 10339 -12711
795 -12711 -7125 15810 9304 -13087 -6872 15559 10021 -12320 -6608 14684 9525 -11787 -6982
808 -6982 14437 10906 -9948 -7891 11999 10687 -9092 -8093 11439 10782 -8318 -8712 9507 10399
822 10399 -7515 -9666 9285 11373 -7002 -10972 7466 12548 -5841 -11811 6579 12885 -5486
835 -5486 -14007 5155 14124 -4933 -13879 4701 13851 -5051 -14769 4201 14471 -4948 -15138
848 -15138 3919 14188 -5484 -16080 4015 14997 -5275 -16528 3059 14397 -5394 -16180
860 -16180 3211 14064 -4702 -16087 2368 12750 -4452 -15195 2149 12925 -4680 -15245
872 -15245 775 11944 -3697 -14583 764 11867 -3009 -14648 -710 11697 -1293 -13520
884 -13520 -1589 10910 -138 -13216 -2549 11072 1897 -12508 -3517 10833 2186 -12410 -4136
897 -4136 11612 3710 -12443 -5175 11372 4686 -11823 -5269 12288 6312 -12141 -6478 12230
910 12230 6748 -11652 -6265 13235 7430 -12067 -6637 13274 7616 -11435 -6048 13362 7759
923 7759 -11613 -6343 13457 8768 -10597 -5955 12840 8309 -10354 -6289 12654 8710 -9304
936 -9304 -6110 11427 8204 -8602 -5993 10851 8869 -7700 -6399 9645 8522 -7221 -6702 8895
950 8895 9200 -6106 -7606 7734 9761 -5513 -7850 6967 10211 -5077 -8818 5614 10494 -4112
964 -4112 -9761 4839 10593 -3943 -11059 4234 11592 -3599 -11232 3593 11181 -3897 -12129 3031
978 3031 11755 -3427 -12432 2280 11392 -3473 -12916 2183 11661 -3360 -13250 1260 11470
991 11470 -3072 -13113 1438 11231 -3598 -13219 489 10606 -2839 -12867 683 10116 -2492
1004 -2492 -12503 -116 9770 -1754 -11854 -724 9235 -1040 -11544 -1423 9171 -34 -11096
1017 -11096 -1881 8697 298 -10680 -2549 8884 1299 -10240 -3116 8642 2311 -9637 -3610
1030 -3610 9168 3145 -9896 -4215 9283 3770 -9695 -4142 9648 4794 -9312 -4921 9939
1043 9939 5727 -8820 -4768 10037 5997 -8926 -5183 10236 6497 -8392 -4966 10063 6525
1056 6525 -8567 -5030 10209 7064 -7735 -4596 9652 7118 -7473 -4910 9569 7424 -6739
1069 -6739 -5252 8945 7631 -6535 -5093 8869 7737 -6325 -5440 8118 7711 -5882 -5750 7138
1083 7138 7805 -4905 -6350 6294 7931 -4732 -6806 5621 8418 -4368 -7079 4958 8407 -4026
1097 -4026 -7526 4513 8485 -3991 -8027 3857 8689 -3563 -8667 2951 8715 -3187 -9326
1110 -9326 2874 8987 -3407 -9663 2032 8770 -3390 -10289 2169 8246 -3075 -10267 1487
1123 1487 8453 -2913 -10319 841 8504 -2831 -10451 886 8337 -2421 -10431 699 8228
1136 8228 -2383 -10121 -24 7959 -2066 -9860 -493 7805 -1275 -9629 -594 7590 -974 -9376
1150 -9376 -1078 7449 -272 -9223 -1348 7793 407 -8534 -1646 7635 1008 -8360 -1847 7790 1813
1165 1813 -8149 -2358 7954 2435 -7813 -2840 8078 3287 -7732 -2823 8179 3803 -7470
1178 -7470 -3153 8246 4401 -7281 -3069 8404 4577 -6782 -3717 8863 5170 -6636 -3719
1191 -3719 8546 5390 -6381 -3724 8129 5552 -6261 -3799 8200 5717 -5994 -3605 7925
1204 7925 5744 -5681 -4011 7084 6326 -5375 -4139 7135 6350 -4817 -4449 6574 6410 -4589
1218 -4589 -5344 5552 6607 -4123 -4843 4841 6146 -3989 -5765 4535 6117 -3858 -6049 3987
1232 3987 6423 -3561 -6723 3666 6664 -3761 -7265 2998 6848 -3235 -7394 2402 6642 -2801
1246 -2801 -7741 1900 6828 -2712 -8232 1204 6968 -2661 -8441 1378 6886 -3034 -8674 1061 6801
1261 6801 -3040 -8228 418 6735 -2606 -8597 496 6795 -2415 -8666 283 6521 -1748 -7838 -173
1276 -173 6418 -1841 -7925 71 6369 -1183 -7526 -395 6223 -488 -7360 -732 6396 531 -7287
1291 -7287 -1463 6352 849 -6831 -1601 6451 1408 -6362 -1936 6275 2206 -6174 -1940 6840 2665
1306 2665 -6155 -2687 6998 3279 -6269 -2321 7145 3668 -6204 -3143 7284 4586 -5543 -2699
1320 -2699 6926 4539 -5627 -3191 7259 4564 -5408 -3119 7015 4676 -5414 -2993 7378 4688
1334 4688 -5185 -3504 6850 5167 -4650 -3333 6216 5059 -4298 -3527 5438 5328 -4183 -3506 5211
1349 5211 4959 -3957 -4128 5009 5228 -3617 -4001 4043 4906 -3097 -4961 3783 5526 -3024 -5462 2964
1365 2964 5575 -2787 -5631 2486 5687 -2471 -6018 1894 5470 -2560 -6274 1864 5728 -2617 -6887
1380 -6887 1452 5982 -2892 -7227 1341 6425 -2510 -7502 658 6117 -2016 -7825 570 5923 -2199
1395 -2199 -7462 375 5719 -2259 -7276 495 5292 -2282 -7195 605 5812 -1673 -7197 -67 5401
1410 5401 -1427 -7138 -123 5611 -751 -6519 -908 4979 -284 -5737 -311 5013 77 -5398 -1022
1425 -1022 5278 745 -5399 -1378 5674 1884 -5672 -1850 5643 2523 -5446 -1941 5607 2885 -5246
1440 -5246 -2538 5562 3423 -4851 -2386 5781 3537 -5061 -2102 6420 3907 -5317 -2401 6291 3782
1455 3782 -5001 -2194 6846 4168 -4992 -2509 6119 4379 -4487 -2474 6331 4348 -4191 -2762 5629
1470 5629 4078 -4108 -2134 5568 4011 -4127 -2755 4847 4302 -3606 -2717 4556 3758 -3166 -3505 4224
1486 4224 4221 -2349 -3659 3215 4300 -2562 -3996 3099 4405 -2674 -4337 2496 4441 -2444 -5041 2366
1502 2366 4851 -2172 -5688 1612 5111 -1870 -5906 1045 5271 -2326 -6166 1015 5285 -2200 -6057
1517 -6057 1022 5170 -2588 -6581 683 5367 -2079 -6724 749 4964 -2546 -6928 748 5246 -1810
1532 -1810 -6555 190 4437 -1976 -6120 656 4628 -1437 -5750 38 4248 -1409 -5753 271 4611
1547 4611 -1025 -5411 -405 4273 -323 -4924 -634 4612 33 -4964 -1267 4138 1032 -4534 -1251
1562 -1251 4426 1196 -4710 -1657 4835 2154 -4290 -1792 4942 2212 -4526 -1753 5360 2909 -4315
1577 -4315 -1879 5437 3024 -4354 -1952 5594 3420 -4476 -2081 5538 3334 -4372 -1873 5853 3359
1592 3359 -4376 -1812 5442 3730 -3770 -1623 5325 3332 -4046 -1972 5107 3453 -3170 -1846 4714
1607 4714 3348 -3674 -2149 4529 3516 -2982 -2263 3738 3032 -2934 -2687 3567 3295 -2536 -2829 2800
1623 2800 3221 -2400 -3200 2681 4096 -2470 -4060 2012 3754 -2144 -4119 1937 4006 -1955 -4706
1638 -4706 1403 3828 -1963 -4798 1190 3918 -2116 -5497 1234 4338 -2311 -5401 1064 4554 -2574
1653 -2574 -5656 1109 4369 -2261 -5657 1011 4183 -2467 -5518 1103 4440 -1890 -5241 852 3911
1668 3911 -1841 -5182 500 3990 -1590 -5173 274 3680 -1428 -4637 446 3717 -1215 -4806 -129
1683 -129 3890 -541 -3917 -357 3950 -291 -4546 -359 3802 439 -4297 -730 3815 740 -4038
1698 -4038 -682 4410 1265 -4022 -1033 4173 1764 -4157 -1297 4890 1854 -3544 -1105 4639 2374
1713 2374 -3925 -1054 4954 2715 -3684 -1184 4895 2452 -3576 -1326 4748 2504 -3668 -1373 4905
1728 4905 2952 -3733 -967 4867 2790 -3364 -1310 4627 2551 -3531 -1460 4128 2419 -3098 -1684
1743 -1684 3909 2889 -2787 -1781 3459 2326 -2917 -2094 3345 2979 -2741 -2523 2671 2559 -2286 -2598
1759 -2598 2726 2842 -2263 -3221 1733 2915 -2539 -3575 2035 3050 -2451 -3706 1523 3164 -1901
1774 -1901 -4167 1637 3152 -2579 -4444 1262 3325 -2191 -4392 974 3247 -2704 -4666 1018 3192
1789 3192 -2126 -4830 968 3303 -2378 -4442 1063 3171 -2012 -4569 890 2906 -1947 -4860 815
1804 815 2992 -1591 -4426 91 3339 -1340 -4514 517 3548 -1214 -3952 149 3251 -735 -3778
1819 -3778 -79 3272 -284 -3344 -5 3102 462 -3318 -40 3819 522 -3501 -155 3873 928
1834 928 -3456 -484 3985 1000 -3126 -333 4276 1859 -2957 -714 4648 1581 -3141 -580 4328
1849 4328 2251 -3213 -660 4445 1806 -2900 -729 4625 1921 -3081 -720 4588 2437 -2886 -843
1864 -843 4248 2140 -2918 -1134 3920 2238 -2855 -1117 3806 2211 -2800 -991 3545 2299 -2646
1879 -2646 -1294 3189 2301 -2526 -1818 3044 2238 -2323 -1784 2796 2037 -2259 -2327 2592 2041 -2527 -2609
1896 -2609 2158 1915 -2155 -2534 1643 2254 -2565 -2936 1416 2717 -2279 -3321 1450 2636 -2223 -3509
1912 -3509 1326 2652 -2309 -3832 947 2468 -2612 -3997 1124 2612 -2039 -4048 874 2717 -1818
1927 -1818 -3806 851 2674 -2216 -3915 660 2958 -2025 -3912 795 2810 -1500 -3877 492 2864
1942 2864 -1149 -3513 222 2851 -1215 -3479 333 2776 -959 -3044 424 2676 -534 -3183 397
1957 397 3164 -137 -2910 114 2905 278 -2721 -224 3304 605 -3010 -89 3435 831 -2505
1972 -2505 -653 3493 1013 -2603 -388 3410 1480 -2474 -422 4175 1655 -2939 -402 4097 1801
1987 1801 -3052 -1087 3575 1987 -2995 -726 3486 1930 -2354 -586 3607 1658 -2637 -908 3501
2002 3501 1863 -2734 -873 3417 1621 -2375 -1069 3333 1688 -2446 -1390 2873 1966 -2368 -1517
2017 -1517 2476 1918 -2114 -1667 2135 1705 -2138 -2134 2071 1749 -2360 -2194 1897 2097 -2141 -2383 1739
2034 1739 2070 -1991 -2871 1164 2276 -1672 -2912 979 2099 -1956 -3194 999 1966 -2188 -3171 932
2050 932 1982 -1987 -3486 889 2157 -1932 -3479 783 2631 -1722 -3586 786 2507 -1835 -3506
2065 -3506 712 2386 -1369 -3238 835 2525 -1722 -3101 526 2268 -1420 -2789 699 2330 -1410
2080 -1410 -2784 700 2549 -348 -2730 357 2820 -467 -2526 409 2783 47 -2199 183 2562
2095 2562 279 -2310 254 2644 524 -2271 -418 3187 884 -2304 -351 3203 977 -2343 -458
2110 -458 3394 945 -2095 -134 3138 1487 -2350 -491 3230 1503 -2015 -390 3483 1373 -2317
2125 -2317 15 3212 1732 -1976 -594 3283 1376 -2309 -456 2966 1823 -2169 -902 2780 1533
2140 1533 -2209 -707 2514 1248 -2212 -647 2617 1252 -1875 -702 1911 1586 -2209 -1253 2120
2155 2120 1705 -1841 -1767 1726 1222 -1685 -1799 1301 1539 -2014 -2096 1092 1552 -2007 -2012 1277 1771 -1918
2173 -1918 -2617 1138 1638 -1775 -2775 828 1985 -1752 -2976 676 2029 -2028 -2918 813 2007 -1805
2189 -1805 -2855 927 2130 -1791 -2899 1082 1703 -1875 -2711 1092 1618 -1644 -2777 911 1927 -1419
2205 -1419 -2799 935 2101 -1003 -2569 459 1749 -1124 -2284 631 2110 -445 -2069 468 2187
2220 2187 -361 -1913 374 2290 -135 -2083 282 2325 -84 -2032 277 2760 281 -2148 79
2235 79 2484 849 -2009 55 2567 606 -2173 -143 2936 1279 -1832 -249 2696 1134 -2472
2250 -2472 96 3026 1481 -1998 -253 2686 992 -2005 -405 3166 1297 -1792 -363 2755 1141
2265 1141 -2122 -190 2781 795 -2174 -479 2934 343 -1933 -168 2697 810 -1714 -793 2169
2280 2169 922 -1794 -733 1903 999 -2121 -967 1671 807 -1804 -1315 1365 1228 -1813 -1935 1293
2296 1293 1334 -1825 -1746 791 1137 -1825 -2140 1089 1458 -1774 -2581 906 1524 -1474 -2344 875 1407 -1726
2314 -1726 -2627 381 1713 -1522 -2472 699 1746 -1765 -2879 605 1919 -1374 -2525 1057 2046 -1774
2330 -1774 -2268 673 1946 -1345 -2450 682 1660 -1295 -2198 700 1653 -1042 -1618 613 1657 -705
2346 -705 -2212 675 1895 -551 -1620 493 1524 -279 -1550 601 1697 -211 -1776 196 1835
2361 1835 -8 -1475 363 1919 289 -1924 186 2228 445 -1430 10 2462 526 -1672 -150
2376 -150 2536 899 -1736 194 2447 878 -1665 84 3032 1008 -1759 -89 2384 842 -2137
2391 -2137 119 2788 997 -1890 -472 2340 869 -1766 -126 2338 706 -1886 -410 2214 728
2406 728 -1792 -263 2057 590 -1585 -444 2265 1002 -1561 -741 1564 789 -1759 -986 1671 1049
2422 1049 -1846 -1112 1371 1088 -1721 -1521 1229 959 -1737 -1582 942 767 -1580 -1458 1236 871 -1674
2439 -1674 -1816 783 1154 -1504 -1918 714 1298 -1841 -2081 720 1350 -1604 -2073 746 1246 -1507 -2110
2456 -2110 1070 1540 -1451 -2161 705 1368 -1400 -2259 957 1520 -1546 -2049 728 1590 -1152 -1735 982
2473 982 1355 -740 -1731 759 1517 -734 -1549 776 1769 -851 -1800 481 1771 -569 -1637 667 1841
2490 1841 -121 -1635 187 1591 104 -1327 237 1777 225 -1583 166 2313 675 -1251 187
2505 187 2312 565 -1729 222 2588 1005 -1373 19 2360 630 -1394 339 2191 1024 -1167
2520 -1167 -149 2489 580 -1333 63 2332 1030 -1761 -108 2148 781 -1316 -132 2333 726
2535 726 -1609 -634 2097 540 -1406 -521 1935 975 -1481 -496 1687 479 -1624 -503 1521 689
2551 689 -1459 -1007 1317 740 -1616 -986 1351 804 -1791 -1267 979 970 -1449 -1342 1109 802 -1397 -1226
2569 -1226 692 860 -1500 -1349 630 774 -1688 -2039 850 1029 -1450 -1848 759 1140 -1564 -2171 731
2586 731 1068 -1680 -2076 465 1316 -1191 -1807 614 1097 -1030 -1753 334 1472 -1108 -2035 828 1555
2603 1555 -1032 -1865 478 1075 -968 -1783 897 1418 -787 -1704 547 1573 -457 -1353 377 1369 -155
2620 -155 -1092 571 1632 -254 -1527 509 1818 34 -1357 359 2104 170 -1179 203 1896
2635 1896 427 -1137 289 2243 605 -1248 331 2022 1039 -1225 226 2325 760 -1222 283
2650 283 2324 746 -1175 78 2080 912 -1425 -97 2271 781 -1308 -340 1886 919 -1344 183
2666 183 1872 685 -1202 -641 1434 370 -1615 -349 1749 768 -1465 -612 1312 713 -1541 -742
2682 -742 1438 408 -1408 -907 1121 297 -1626 -950 1044 565 -1300 -1348 735 758 -1485 -1530 477 748
2700 748 -1402 -1526 754 862 -1417 -1512 642 787 -1388 -1640 770 863 -1387 -1900 609 974 -1060 -1714
2718 -1714 361 1284 -1115 -1575 365 1021 -1306 -1646 412 816 -1259 -1774 595 1320 -1036 -1749 839
2735 839 961 -1002 -1348 503 1199 -732 -1512 496 1616 -569 -1110 823 1464 -595 -1224 795 1180
2752 1180 -676 -1358 566 1477 -180 -1010 509 1342 206 -963 400 1680 508 -1223 106 1713
2768 1713 362 -1063 593 2053 125 -943 643 1634 446 -1082 222 2171 519 -1066 -86
2783 -86 1779 810 -1361 -158 1918 874 -751 29 1839 723 -1288 157 1868 471 -1384 -113
2799 -113 1740 692 -1277 -60 1388 406 -1054 -158 1400 448 -1319 -477 1308 552 -1182 -698 905
2816 905 261 -944 -630 1052 374 -1054 -752 961 430 -1476 -1029 1090 650 -954 -1015 794 260 -1241
2834 -1241 -992 648 534 -1049 -1326 373 839 -1203 -1638 544 740 -1211 -1509 763 1026 -1233 -1749
2851 -1749 360 673 -1322 -1588 670 938 -1111 -1474 329 988 -1081 -1378 457 1071 -927 -1380 531
2868 531 1210 -939 -1068 477 842 -631 -1290 600 1376 -428 -1212 781 1158 -299 -1186 731 1316
2885 1316 -440 -1122 708 1421 -341 -1153 492 1421 223 -655 409 1355 92 -768 377 1506 539
2902 539 -1098 280 1456 269 -753 53 1593 544 -867 84 1638 363 -975 498 1841 601
2918 601 -979 86 1768 383 -889 298 1384 50 -1247 116 1444 295 -1236 -128 1260
2933 1260 529 -1144 -158 1489 509 -1036 -516 1171 545 -1114 -186 1419 321 -838 -142 781 431
2950 431 -1089 -623 798 121 -1054 -900 870 362 -1323 -803 407 409 -1391 -1045 544 -3 -1020 -1024
2968 -1024 186 195 -848 -1295 562 613 -907 -1366 413 627 -1161 -1397 520 715 -977 -1235 347 873
2986 873 -1243 -1135 475 638 -1088 -1152 548 431 -819 -1401 683 885 -903 -1119 597 984 -781
3003 -781 -628 815 1186 -606 -1218 517 777 -742 -921 599 960 -332 -836 657 1087 -292 -781
3020 -781 647 1112 -239 -854 431 1340 134 -1044 578 1207 140 -865 241 1422 339 -714
3036 -714 69 1284 304 -891 338 1368 248 -1028 205 1608 446 -700 48 1492 275 -885
3052 -885 284 1673 369 -853 186 1227 404 -1113 -197 1323 575 -1084 151 1150 603 -1159
3068 -1159 -69 1166 196 -1095 -56 925 247 -1194 -31 1090 231 -1110 -354 1059 -33 -926
3084 -926 -904 834 401 -1301 -795 646 174 -696 -548 307 385 -1320 -850 532 310 -1232 -832 516
3102 516 580 -1118 -777 343 326 -855 -993 344 240 -1126 -1278 247 751 -851 -1453 395 571 -926
3120 -926 -785 525 496 -1099 -1253 493 827 -901 -1145 643 925 -865 -988 258 872 -677 -841 632
3138 632 994 -851 -758 437 632 -427 -1002 317 796 -289 -576 629 969 -206 -592 752 917 -325
3156 -325 -504 474 1238 188 -527 352 1197 -255 -619 346 1097 137 -687 384 1230 496 -584 159 1142
3175 1142 524 -575 445 1553 103 -629 116 871 503 -983 158 1340 203 -804 -128 1295
3191 1295 270 -1142 70 1108 236 -846 147 1118 224 -1060 -332 1100 166 -1149 -33 763 50
3208 50 -759 -365 929 -126 -1075 -379 812 -51 -927 -87 424 -89 -1150 -382 643 296 -980 -477
3226 -477 592 72 -1102 -463 371 164 -843 -738 70 357 -703 -575 413 403 -891 -830 436 343 -904
3245 -904 -1000 102 806 -698 -804 442 454 -981 -911 576 503 -661 -1028 583 754 -820 -940 427
3263 427 731 -726 -1040 803 634 -672 -589 384 634 -451 -626 569 686 -542 -272 632 745 -326
3281 -326 -516 485 881 -283 -464 447 857 -6 -511 263 733 10 -481 124 991 29 -164 374 880
3300 880 254 -422 344 1096 246 -589 459 1174 338 -564 58 1183 619 -549 246 1210 475 -551 378
3319 378 951 505 -592 140 939 431 -624 264 936 -40 -1021 63 689 333 -486 -177 792 311 -642
3338 -642 -346 914 -133 -1018 -15 720 -250 -999 -406 590 12 -666 -1 653 -45 -1101 -321 294 188
3357 188 -928 -534 533 152 -869 -724 435 295 -604 -344 380 121 -833 -919 254 230 -646 -822 95
3376 95 599 -517 -890 735 428 -861 -855 380 511 -634 -1036 618 464 -751 -926 294 521 -680
3394 -680 -910 398 675 -493 -690 615 878 -647 -801 519 551 -665 -639 700 504 -243 -404 598
3412 598 778 -460 -498 524 770 -270 -584 728 783 -176 -508 651 819 -431 -448 683 942 58 -338
3431 -338 492 783 112 -447 365 915 249 -468 151 890 278 -464 272 1085 -18 -230 131 931 238 -781
3451 -781 -43 1177 -43 -545 20 556 195 -794 -90 1047 56 -772 -213 550 -84 -747 -7 844 -117
3470 -117 -933 103 483 -7 -845 -245 684 -8 -749 -34 769 -240 -773 -273 524 231 -928 -248 484
3489 484 -27 -709 -387 12 5 -1076 -366 412 39 -704 -505 454 -37 -791 -678 281 326 -1025 -857 417
3509 417 419 -828 -783 255 450 -880 -892 362 364 -704 -1002 171 610 -672 -1049 413 280 -944 -361
3528 -361 506 856 -469 -706 414 571 -479 -776 308 514 -386 -362 485 874 -143 -528 467 809 -175
3547 -175 -359 573 620 -240 -294 422 892 -326 -307 198 602 -69 -316 478 657 106 -93 283 753 238 -290
3568 -290 372 793 353 -274 269 857 173 -514 200 1076 213 -216 276 901 286 -456 290 608 387 -742
3588 -742 -151 865 481 -877 -10 665 -69 -536 191 847 -149 -581 64 745 139 -930 -458 610 -61
3607 -61 -838 -365 639 67 -780 -149 362 38 -699 -338 455 98 -822 -313 376 -224 -463 -386 346 166
3627 166 -772 -548 -20 -69 -618 -881 102 196 -810 -380 42 179 -757 -570 220 292 -636 -684 354 403 -792
3648 -792 -775 246 280 -687 -921 242 423 -954 -518 418 230 -394 -590 278 127 -451 -485 497 514 -622
3668 -622 -537 273 533 -405 -57 521 596 -220 -183 356 757 -47 -333 578 608 -190 -488 299 773 -138 -485
3689 -485 352 621 -158 -377 640 665 76 -27 365 835 160 -360 484 622 -28 -383 325 1007 278 -111
3709 -111 156 746 286 -299 -164 667 60 -490 234 781 -82 -707 -169 809 142 -778 198 741 89 -759
3729 -759 -36 721 -69 -654 -143 450 124 -443 -97 354 74 -728 -461 450 -66 -782 -242 442 -43 -449
3749 -449 -327 69 -36 -665 -321 241 -24 -460 -302 332 1 -788 -500 506 83 -801 -681 245 145 -698
3769 -698 -297 -52 -127 -842 -377 335 437 -284 -730 266 188 -429 -743 339 197 -301 -524 199 279 -613 -164
3790 -164 476 329 -599 -325 -37 652 -323 -473 191 656 -289 -330 611 585 -450 -464 326 543 -282 -139 302
3811 302 391 -94 -374 113 597 -151 -296 388 485 296 -260 456 887 -87 -93 184 680 -51 -167 171 633
3832 633 199 -465 227 529 301 -125 380 485 81 -429 72 878 171 -390 390 603 -216 -627 227 731
3852 731 24 -361 338 824 25 -519 415 559 -59 -697 -272 564 89 -545 279 376 -256 -340 170 388 -151
3873 -151 -393 -246 249 -404 -680 -196 272 -365 -792 -182 -193 -22 -453 -535 146 88 -459 -232 -16 87 -488
3894 -488 -318 216 200 -506 -734 184 -65 -113 -96 -51 292 -540 -619 330 285 -398 -407 251 209 -166 -380 286 498
3917 498 -307 -353 73 283 -645 -303 284 496 -401 -194 226 286 -558 -258 493 380 -225 -258 328 652 -142
3938 -142 -501 538 473 -145 -79 668 566 15 109 554 585 -412 -405 621 557 136 -389 140 342 13 -274 240
3960 240 792 47 -297 497 441 -22 -85 503 523 114 -213 149 631 112 -396 297 329 100 -579 60 785
3981 785 168 -394 397 388 147 -550 -53 600 -234 -521 117 362 -143 -355 -280 256 -79 -572 -58 583 -384
4002 -384 -622 -51 188 -429 -483 -169 522 -88 -519 -275 226 38 -510 -331 286 -218 -610 -458 172 -213
4022 -213 -495 -67 -173 -106 -649 -304 137 -184 -740 -231 84 -177 -423 -261 360 211 -474 -446 29 337 -584
4043 -584 -677 175 266 -438 -335 269 314 -369 -386 397 231 -453 -202 458 212 -353 -406 245 276 -271 -325 189
4065 189 465 -221 -152 377 163 -178 -39 427 257 -298 -162 520 528 -359 394 360 754 -240 -226 303 597 -161
4087 -161 -123 375 560 -13 -155 270 504 -12 203 445 432 39 -33 278 523 100 -147 392 509 343 -225
4108 -225 177 500 47 -301 88 311 213 -198 172 603 119 -502 115 637 -214 -525 104 525 -61 -228
4128 -228 190 140 -6 -682 49 320 42 -433 -137 431 -323 -565 -157 182 -25 -600 42 53 -167 -573 -94
4149 -94 132 -162 -666 -441 19 -226 -344 -166 -239 -10 -282 -263 64 46 -240 -399 136 51 -365 -261 181 162
4171 162 -312 -339 178 12 -625 -345 133 -81 -286 -423 468 98 -196 -111 79 260 -469 -526 322 82 -364
4192 -364 -234 242 184 -315 -58 402 527 -71 -203 380 200 -387 -90 187 341 62 -231 504 445 -262 -32
4213 -32 417 665 -9 19 579 691 70 -26 189 399 -33 -100 463 135 331 -118 312 550 -132 -387 227
4234 227 581 -106 -177 268 442 14 -199 287 186 -365 -107 -67 164 27 -307 -218 616 177 131 379 493
4255 493 -404 -439 8 225 -143 -335 102 440 -304 -152 -25 324 166 -493 -219 195 -67 -894 -80 484
4275 484 173 -637 30 173 -205 -215 -326 209 -146 -523 -140 251 -61 -294 -503 -181 1 -414 -201 102
4295 102 -47 -441 -104 221 -147 -420 -367 96 100 -460 -341 7 -100 -379 -395 292 149 -358 -212 280 159
4316 159 -227 -129 162 178 -503 -239 269 -65 -183 -293 453 257 -419 24 510 230 -239 -99 352 309 -122
4337 -122 -216 376 446 -108 58 325 310 -108 -45 290 385 -1 -288 176 457 -230 -13 277 441 7 9 304
4359 304 382 -142 -307 274 230 -173 -149 282 312 -132 -303 -51 313 330 -532 365 287 26 -189 324 330 -50 -412
4382 -412 377 379 -98 -171 -247 476 -278 -412 301 -137 196 -484 -185 144 -34 -376 -158 10 -169 -379 89
4403 89 252 -86 -566 -111 -21 -262 -507 -120 321 -218 -304 -75 354 45 -152 95 400 -517 -585 -260 305
4424 305 -83 -724 -193 -2 -199 -76 -375 235 -23 -220 -273 91 -15 -149 -271 468 375 -577 -388 360 55
4445 55 -209 -273 37 154 -176 -164 273 310 3 -281 562 371 -38 -283 209 379 211 -394 473 73 -69
4466 -69 -293 341 420 107 52 366 332 -113 -55 88 454 -480 -158 331 180 43 105 205 253 -104 68 179
4488 179 522 2 -69 87 574 109 -169 241 348 65 -234 368 329 -23 5 163 -16 242 -177 65 217
4509 217 -188 -626 159 73 73 -13 10 227 72 -345 69 7 -285 -282 21 170 -397 -326 -287 161 -74 -319 -86
4532 -86 509 -6 -294 -256 55 -264 -453 -102 -29 -105 -89 263 389 -269 -472 -169 213 -311 -559 -130 11 17
4554 17 -307 -90 274 53 -535 -404 96 -198 155 -149 -82 165 -358 -281 328 175 -502 -172 -19 29 -331
4575 -331 -100 294 318 -341 13 26 -157 -300 -122 299 142 -100 -270 81 167 131 -241 222 306 -193 61 325
4597 325 274 37 -53 432 101 83 -190 244 248 -157 -13 234 359 83 427 290 371 80 -12 153 481 -241
4619 -241 -298 450 583 -4 80 423 361 -77 52 426 143 19 32 150 365 -141 -216 -13 240 -48 87 108
4641 108 541 67 -346 159 383 -73 -266 -67 290 183 -493 -43 -67 -224 -519 111 299 -13 -393 -160
4661 -160 -112 -259 -268 -163 363 -259 -299 -329 217 -259 -244 -194 -168 -208 -479 -23 253 44 -449 -36 -65 -201 -384
4684 -384 -275 -8 -73 -238 110 317 146 -446 -195 -22 -13 -379 -249 -275 -82 -231 -359 372 3 -289 -158
4705 -158 389 -263 -191 -54 63 121 -228 -153 12 147 -222 -374 426 215 -193 94 58 86 -228 40 149 -112
4727 -112 -246 -315 257 273 -286 -247 338 306 -49 -102 277 138 39 73 208 481 -18 160 81 393 -271 -9 144
4750 144 212 4 179 340 402 -201 -171 135 369 60 -198 355 91 141 59 98 264 53 19 302 204 -16 121
4773 121 357 547 -311 -149 79 193 120 -309 32 241 77 -94 -216 -82 -135 -66 -460 157 -200 -503 -89
4794 -89 168 -383 -427 9 152 -210 -418 6 111 -73 -420 82 145 -322 -392 171 214 -235 -584 -37 141 -496
4816 -496 -136 -222 -29 -189 -244 86 -21 -219 -124 -203 -47 113 -411 -11 -18 -7 -492 -202 -60 7 -168 -235 109
4839 109 -242 -333 52 369 -47 47 -16 -98 122 147 -368 -71 29 -341 -42 345 180 -143 -192 224 182 -212
4861 -212 -40 228 130 -155 97 89 25 -71 -140 217 311 0 58 378 190 158 -81 326 19 88 -55 346 216
4884 216 -87 -225 49 383 78 186 -71 315 -39 25 65 170 -203 -78 577 -4 134 103 423 218 -23
4905 -23 -130 98 -78 130 -301 113 524 -44 -161 -310 6 -232 -282 363 132 -348 -78 -26 132 -275 -186
4926 -186 -12 -30 -35 -393 -94 153 193 -493 -10 2 -239 -417 32 222 30 -400 -277 467 -238 -319 -127 -77
4948 -77 -149 -442 8 15 -206 -340 -66 55 -314 -258 28 -95 -116 -219 48 -152 -360 -310 -65 162 -72 -394
4970 -394 -104 251 102 -158 9 -118 -213 -110 241 98 35 -331 70 -47 -251 -254 -118 232 256 164 -154 12
4992 12 235 -275 24 285 34 7 80 -49 170 128 102 186 161 21 76 339 445 -198 119 134 -38 -154 -174
5015 -174 231 204 -38 98 468 -336 177 53 -280 185 173 -185 149 168 -107 -135 -18 465 108 -40 -58 115
5037 115 -208 -114 -89 111 -195 -193 -35 69 72 -66 214 146 -547 -181 -206 223 63 -449 42 -140 -15 -69 -40
5060 -40 -277 -131 -89 80 -3 -227 -200 65 -47 -75 -153 -161 304 -85 75 -35 -218 -140 -390 -44 -175 161 -298
5083 -298 -259 116 -78 -213 30 117 105 -286 -173 -152 60 -185 -239 -283 -297 -186 -251 -20 152 190 -247 242 -302
5106 -302 -213 -112 102 231 164 29 172 131 -9 -232 -3 263 -224 -111 106 163 -56 -26 168 225 -66 -40
5128 -40 258 -70 -39 -229 235 -58 -29 -101 134 148 -189 -104 453 378 164 26 382 221 -126 -122 56 199 129
5151 129 -180 386 124 -264 -80 130 171 -117 -265 106 -27 -104 179 180 203 10 12 37 -5 75 -93 61 235
5174 235 30 -174 123 190 -199 -28 -163 179 91 -326 43 81 44 -16 -280 210 19 -422 -209 325 -65 -108
5196 -108 -47 65 -413 -174 227 -122 -133 -490 -31 249 69 -170 -25 -188 24 -374 162 81 -117 -383 -3
5217 -3 57 -166 58 -127 -92 -341 -3 -94 149 19 190 -198 -228 -304 -216 -61 313 232 67 -22 59 -70 -80 72
5241 72 173 -38 -279 63 314 16 -252 -144 85 181 109 -87 93 193 141 -144 308 133 -169 -238 223 108
5263 108 -45 -171 2 155 125 -9 212 330 -142 -286 79 118 -32 -174 408 208 160 288 -56 281 55
5284 55 61 258 238 -84 -16 273 166 171 78 219 239 18 309 114 37 120 -207 101 -216 -112 -83 -23 27 -43 -91
5309 -91 -160 244 195 -208 236 233 -57 -9 -135 15 -177 -65 73 -110 84 -500 -101 107 248 -101 -27 -34 -50
5332 -50 -283 -279 113 -260 -520 -85 39 -89 -36 -90 131 -126 45 128 214 -117 -179 -9 -40 -84 -244 157 -200
5355 -200 77 40 -285 103 40 -291 -174 296 106 -190 -165 -28 -339 -110 -227 -33 214 -248 -301 81 75 -57
5377 -57 -178 -111 16 74 3 123 -131 -44 -31 213 -164 -302 88 87 344 -242 165 473 570 13 12 -179 472 -232
5401 -232 96 266 104 69 -53 420 75 -117 40 294 278 91 174 179 185 -420 176 182 10 241 -46 232 285
5424 285 445 -368 258 287 65 123 174 98 120 -225 25 69 8 -183 161 313 -443 54 196 35 -378 -102
5446 -102 -320 247 109 -176 82 143 -509 -140 26 108 -110 -98 -5 -298 -288 31 5 -118 -182 -283 70 -30
5468 -30 7 -508 -105 412 207 -77 -178 -10 -184 142 -264 140 -169 -130 -27 -133 -88 -134 5 1 -74 -5 340
5491 340 -74 -147 -88 173 130 179 85 -56 96 -146 -334 -19 66 -16 -147 -60 296 172 -99 -133 63 72 -4 -300
5515 -300 172 -142 -217 47 149 199 273 -211 204 163 -146 318 106 246 -328 233 88 -38 110 216 23
5536 23 -193 152 -110 72 -8 37 22 195 79 -401 274 66 297 -306 86 121 72 -53 -91 162 198 -324 320
5559 320 88 -46 175 -75 98 145 -61 -146 -71 213 -35 -321 70 -66 84 -149 205 101 -119 -82 -74 123
5581 123 -214 -46 -179 -167 -127 -278 -35 110 -279 -256 -177 132 36 -149 267 -44 -126 -276 -8 5 -86 22 -145
5604 -145 20 4 -32 48 -283 -416 159 -87 -100 175 -36 -164 66 102 -15 260 169 -123 52 -61 395 -183
5626 -183 -164 351 27 -74 -60 35 -129 -98 6 -172 51 114 150 43 -162 251 -41 -173 437 16 -98 -72
5648 -72 50 72 -127 85 406 200 3 23 198 101 78 137 -55 -78 -154 -68 -278 95 -105 143 138 189 -95 -146
5672 -146 248 156 76 -72 39 102 -105 -214 42 90 -166 -26 38 -265 48 31 94 -35 85 152 46 27 23 -91
5696 -91 150 -224 68 87 18 -2 -20 -454 -238 134 108 -8 -78 154 -27 126 233 85 -196 59 -57 55
5718 55 -98 -230 -49 -44 23 4 -201 -173 -54 128 -126 -213 -195 -258 17 123 -3 -153 -77 -10 -130 -76 -23 -253
5742 -253 216 -28 -23 -9 -81 -185 62 280 -79 -24 -177 -197 32 -16 -103 41 19 -145 16 -34 37 -114 71 247
5766 247 140 -3 234 30 -217 63 39 281 -110 148 160 109 186 -258 233 -67 146 72 124 350 107 252
5788 252 -179 -40 9 -198 22 -26 -232 118 -34 197 -266 -60 215 283 24 -157 184 85 230 -38 -148
5809 -148 -10 -27 55 -13 135 -6 92 28 -99 386 -254 37 167 91 23 -310 -40 3 68 -136 -38 -59 -20 167
5833 167 -3 -12 -392 246 196 78 161 -215 283 112 44 -207 -12 48 354 46 12 -264 -60 -130 301 -42 151
5856 151 -151 -87 37 -124 -99 -192 -60 122 -132 228 275 76 -272 -53 -170 86 -49 -104 145 -103 -474 -195
5878 -195 -161 -54 -293 2 -339 -173 -303 -109 -14 38 -87 -286 205 4 -95 -197 213 71 13 3 106 -214
5900 -214 6 13 83 -93 17 -14 94 91 -301 325 264 292 76 16 203 188 -149 -271 42 330 60 -140 -134 239
5924 239 -39 55 -30 60 34 -168 109 28 113 -133 -93 105 -378 -410 2 -19 222 30 229 181 -153 -119 94 89
5948 89 -336 -159 65 -83 -217 75 251 123 96 157 114 243 28 177 10 89 323 -45 209 124 -42 230
5970 230 65 41 -276 83 -104 28 -151 4 157 28 110 331 219 -24 -2 -56 41 263 -75 2 -70 -61 -123
5993 -123 67 -38 -108 -172 128 37 -72 40 69 19 43 157 -72 -321 19 71 -40 266 179 -100 46 98 58
6016 58 -285 -199 -31 80 -35 -175 -44 -100 -133 -90 -303 98 78 282 198 -39 59 -35 -33 383 177 -36 175 135
6040 135 144 -224 -187 375 136 -35 18 105 -143 -204 26 -102 15 154 141 -52 270 -7 -63 -5 -72 99 141 203
6064 203 34 -169 10 383 -81 39 -95 57 -42 -57 -44 -21 174 135 -52 -51 110 -296 72 -242 77 53 112
6087 112 -82 -132 124 -132 100 229 -116 174 -224 -14 -104 -279 76 111 -194 -7 -126 -61 -223 -20 38 210
6109 210 73 67 -53 -73 -374 -13 99 -349 10 -14 -11 37 -153 -116 247 -4 66 112 -92 65 -199 -96 33
6132 33 -67 132 -190 132 248 -43 53 150 -53 16 -146 41 -119 158 -151 0 -91 12 -280 186 -61 -295
6154 -295 37 -16 150 147 -227 -241 78 -59 -79 409 -124 73 23 -273 -29 61 54 307 125 256 -69 283 90
6177 90 -90 -327 -124 110 -50 148 73 -17 -26 144 32 267 -9 165 310 236 -172 118 -230 -53 -91 -186 157
6200 157 -29 59 -55 132 276 178 -44 242 -75 210 60 261 111 268 -13 299 312 -136 -77 -237 -185 -215
6222 -215 -218 -84 -57 -174 -202 -217 113 -75 76 89 -146 247 107 -53 8 -57 -415 156 -146 148 32 -313 -132
6245 -132 53 97 -156 -229 210 -33 -390 -140 5 153 -323 45 46 -31 -148 525 -137 -197 -144 -161 173 132 47
6268 47 -258 -6 -148 241 282 -98 42 223 94 -114 -35 -75 113 65 -88 -135 -130 260 138 -221 155 89 44
6291 44 251 66 99 -43 -30 -103 -152 231 89 -274 -174 209 172 112 -13 68 59 161 74 -130 114 -191 20 8
6315 8 -252 -126 344 -64 -13 11 -35 2 -30 -104 140 206 0 193 41 70 124 124 67 7 -126 -66 334 211 129 29
6341 29 231 48 68 106 -74 -18 -311 115 141 -54 -117 116 -74 204 -129 -20 119 207 62 180 171 131 -57
6364 -57 -225 64 -251 -224 151 122 -55 247 -130 -270 -143 193 -185 -121 -124 -100 -408 83 -262 -320 -55 -278 -150
6387 -150 -147 -258 -1 9 -66 -116 -82 -216 107 -71 135 -282 15 -226 103 37 -47 -235 -288 -16 41 -99 -42 57
6411 57 -360 -230 -161 203 89 -243 137 -216 55 -274 -41 23 -127 -249 -103 -55 -154 -97 -185 200 47 -24 -70
6434 -70 44 -77 -176 192 19 176 -53 3 33 91 -101 -295 107 -121 -54 161 -73 -208 -164 201 -86 174
6456 174 1 232 249 75 97 105 134 -123 -96 -198 44 -59 -125 34 119 225 45 -111 147 91 -8 -161 70
6479 70 -127 67 6 -50 -327 133 -86 -19 -105 -19 29 97 88 -123 -252 37 -113 -140 144 -82 -299 78 231 -35
6503 -35 21 196 -110 -175 33 -284 -270 100 128 -105 -10 -74 -139 44 -133 -232 -263 164 -188 -45 -336 -273 80 -312
6527 -312 -129 -52 -254 -118 -276 75 -49 -94 -88 -305 130 -61 221 -90 -127 -26 137 9 -116 -122 -141 57 106
6550 106 145 -86 125 -186 22 -73 189 354 -120 246 86 15 33 -220 -39 -200 34 162 201 -204 121 7
6572 7 -44 252 -130 17 50 148 141 337 -243 36 245 -24 113 -89 -67 -93 85 294 -146 -69 19 -251 70 65
6596 65 159 -138 180 117 250 -151 38 91 8 -304 219 40 -124 37 81 256 -37 -34 -56 31 -100 -137 -369 165
6620 165 45 70 -171 -91 -12 -178 -18 -68 73 10 110 94 -154 138 -31 -180 -179 -7 -94 197 75 -196 343
6643 343 29 256 -212 -119 -235 -53 -203 66 56 -65 -220 -47 113 -81 146 -90 -30 49 -41 -90 26 277
6665 277 123 -79 -403 55 -14 -33 13 -2 142 -167 11 -9 -182 480 54 18 62 -163 -195 -73 -185 -93 -32
6688 -32 54 -36 139 35 94 186 19 191 72 44 209 -91 330 -12 172 6 -62 120 213 -92 -51 152 -389
6711 -389 -349 -88 -144 68 -48 153 21 -170 -20 109 -243 -178 -370 168 134 15 -77 130 -64 12 -131 -95
6733 -95 50 -9 202 -119 -48 -52 13 161 -158 -241 88 134 8 41 160 -15 192 -156 -9 15 19 -62 -185 -123 149
6758 149 -6 10 117 60 6 -123 -115 3 48 -222 -211 54 8 -131 -7 12 -100 238 -226 -202 -178 -213 65 -75
6782 -75 -226 48 -128 -24 -3 118 93 114 -85 -216 -164 -309 -322 -50 -47 -36 -139 48 -174 -119 109 -67 85
6805 85 -83 50 5 -222 -167 -164 -16 208 -83 281 27 -49 62 -141 -146 -35 105 60 -227 -177 -46 -168 82
6828 82 -317 58 33 -96 -155 -92 -44 31 163 151 44 121 57 189 -211 73 -60 170 56 93 50 235 143 54
6852 54 52 142 207 -74 186 -183 94 103 -9 64 97 -69 -88 -177 272 259 6 -124 -177 132 -254 -135 92 31 243
6877 243 -39 157 -49 -16 249 82 -141 109 -120 114 -149 59 -35 -430 201 -210 265 -411 -70 17 64
6898 64 50 -49 -181 -126 -97 -25 -143 238 38 -285 -140 -75 -544 -503 -35 134 87 -205 -30 -172 -253 277 -159
6921 -159 -32 110 -146 175 -93 -118 -188 -62 538 21 217 12 -70 -112 305 -127 -157 -165 -229 -153 -38 -121 14
6944 14 78 251 66 -22 -91 -218 -37 -47 211 -36 -14 -107 -64 -225 244 -165 96 -129 -11 -241 148 -47 66
6967 66 188 -257 -225 -389 -60 240 140 38 203 -67 -91 11 100 -202 44 407 248 23 78 211 -182 -4
6989 -4 357 283 174 -207 242 -15 77 -116 -209 128 -25 -47 64 -24 -167 173 12 5 -57 -178 349 180 132 293
7013 293 9 104 -70 7 159 -129 103 -138 -153 200 44 82 -414 20 255 -70 -325 -276 -54 -201 -133 -172
7035 -172 -163 142 73 126 121 54 -93 -26 -34 -441 -69 -176 35 39 -47 -46 -199 -142 -9 132 90 95 -98 118 302 -43
7061 -43 36 -58 118 -89 -235 -121 69 59 -187 99 -296 -241 152 86 149 -237 -243 60 -20 -83 83 -14 -15 131 -68
7086 -68 -117 107 176 11 190 178 157 167 -214 92 -156 108 -425 288 123 237 537 -110 186 126 -248 220
7108 220 120 -51 -299 -130 -105 -42 364 228 -378 -119 245 214 108 81 104 -135 218 2 -392 -66 -79 -193
7130 -193 100 -179 -28 -184 -147 266 134 -36 -64 -75 28 195 -298 -64 -376 109 -118 -145 171 114 80 -174
7152 -174 154 -4 78 164 98 -124 104 -92 -134 -273 328 73 93 -60 76 -110 -16 -52 274 -121 -58 -120 296
7175 296 150 73 -85 -421 -396 -27 -66 122 -195 -212 244 -24 43 -60 296 -50 -268 -39 -113 -116 -129 -87 -176 -224
7199 -224 130 -134 4 -104 23 192 232 102 -146 210 143 -102 -78 76 -94 173 -66 -22 39 -196 -160 -72
7221 -72 47 11 78 4 157 -269 -70 -118 8 285 -109 121 130 -215 68 -160 58 73 -212 -35 213 93 -60
7244 -60 -294 178 181 -127 146 -82 -36 -27 -106 169 -38 340 -49 -152 294 -15 279 246 211 -110 -153 -66 -38 -70
7268 -70 -214 -303 12 219 43 -465 -167 -24 289 2 -69 170 -426 -64 -253 243 91 26 339 26 -52 1
7290 1 -261 -146 -225 177 43 210 141 60 -27 -42 403 77 40 2 280 -222 60 -155 -65 145 -95 -148 -143 -71 -2
7315 -2 463 235 229 -292 -158 -200 48 116 -108 64 -244 68 -259 -66 65 -196 -211 20 -1 -426 25 -99 103
7338 103 16 37 -159 -18 -71 -61 -102 343 -159 242 -117 97 -16 -41 -59 -96 62 117 306 132 -102 166 132
7361 132 33 -41 -119 154 6 183 159 38 -19 45 -153 -108 6 -103 -135 2 188 -124 118 46 -2 52 65 -1
7385 -1 -119 273 -195 -4 -22 66 78 -4 -214 134 23 -30 -123 -11 208 -140 -111 -34 -325 -102 -27 4 154 59
7409 59 61 -79 -92 -153 61 -164 229 81 -195 70 -111 132 64 244 -130 -8 -82 -270 -412 -291 2 -36 115
7432 115 134 -121 93 -117 173 212 -265 -6 -21 160 -65 -146 -4 36 52 -137 -4 -237 -151 201 -9 -85 62
7455 62 -89 -230 258 102 -75 -103 75 168 5 13 206 -97 -323 142 230 51 3 61 -31 341 -31 47 -266
7478 -266 65 213 -46 229 167 -90 -82 -324 99 -1 -66 4 14 142 -16 -84 -38 29 161 -146 -306 181 41
7501 41 -131 38 24 69 36 -269 158 332 131 83 115 37 -99 -78 353 9 151 -47 102 -226 -174 243 -92
7524 -92 151 186 141 -19 41 145 -52 -149 64 29 -237 219 -27 -94 -188 -78 -21 173 -167 64 -72 111 -194
7547 -194 -125 -55 -74 137 -21 210 167 -81 156 135 -273 -241 -176 -37 55 216 -97 -172 9 -7 -82 187 105 128
7571 128 56 -119 -71 91 135 15 386 140 210 76 -376 61 219 -176 -84 -80 -141 136 -203 -7 219 208 -10
7594 -10 -294 63 222 -115 -131 -152 75 -215 249 243 257 -15 211 188 305 -176 -55 108 -17 -86 27 -129 -42
7617 -42 67 51 -134 -109 18 -4 2 -96 -3 -173 -1 -296 -44 -27 82 444 56 -151 77 -152 126 -159 118
7640 118 -182 -253 127 -83 24 303 8 -173 215 -63 68 67 -91 125 -132 1 3 -14 -117 -48 188 127 287
7663 287 107 -1 104 296 -60 109 -76 240 -230 142 33 28 -113 -319 163 168 109 -12 135 -191 286 0
7685 0 -75 -263 -74 -246 -351 -83 168 -12 -44 -302 -104 311 -133 -111 211 80 206 -96 -50 -39 -55 -36 -118
7708 -118 -160 204 337 208 131 17 -58 317 -202 183 127 134 102 -12 42 58 -95 -75 27 301 -86 -248 -32
7731 -32 -7 18 -229 -81 -2 9 70 108 61 -38 200 118 -123 155 251 -202 -102 120 -66 89 25 197 -96 -60
7755 -60 -51 -260 14 335 91 -329 179 186 446 91 -169 -115 -78 -85 466 -1 -394 144 -6 284 97 -297 -2
7778 -2 -180 57 -31 227 21 232 2 68 -135 11 5 -292 -41 -267 -61 289 88 -52 337 -99 -50 286
7800 286 109 -296 -216 244 -99 -125 76 9 -252 -8 -224 -8 199 285 254 54 -288 -147 19 -252 33 -77
7822 -77 -3 122 117 28 161 -152 -265 253 145 159 -334 124 -113 -124 -45 -98 200 -206 92 188 134 118 10 153
7846 153 -22 98 -83 222 54 -130 239 -28 -265 -88 -8 -192 -6 151 54 35 98 80 -11 121 -206 -157
7868 -157 10 -286 -340 -85 -38 47 34 144 -129 163 -8 150 -294 232 81 -2 73 105 -177 -69 -176 -78 276
7891 276 178 36 -296 -113 -152 -140 96 123 -38 157 201 99 -46 310 -212 -289 -262 253 188 -10 34 -91 221
7914 221 225 -74 82 -252 -34 -78 84 92 -129 203 269 103 23 8 -114 -222 -127 24 235 -97 198 -3 131
7937 131 -104 136 -73 224 41 -61 -176 -143 -324 -56 178 9 276 -4 -128 -12 81 28 -260 -116 289
7958 289 281 -127 -212 171 -207 99 145 -1 -25 -51 108 98 -165 129 8 223 368 243 140 -310 1 -35 -74
7981 -74 70 164 -143 12 161 177 -278 77 -143 47 252 40 13 -75 54 -43 20 1 -192 -76 -172 -85 308
8004 308 273 -89 -363 -150 140 -54 -26 270 -61 -74 67 -56 -46 -309 50 -48 49 120 176 -57 289 94 -55
8027 -55 124 -10 8 2 150 188 204 98 -242 -90 242 158 190 -205 -3 -163 -212 65 7 -48 249 -49 -332 13
8051 13 110 -181 205 -19 105 -43 -131 -77 -112 148 82 -123 138 140 79 99 -19 48 -198 28 -180 9 -277 -124
8075 -124 122 -280 -125 20 -33 328 -224 14 98 72 -32 -76 -141 20 162 -51 142 97 -152 -222 42 133 54
8098 54 -8 253 -287 -53 68 -70 -292 -224 0 2 -251 66 -54 -19 -66 193 -143 247 23 -8 137 -129 -175
8121 -175 -93 170 -61 118 -260 -155 115 -218 -14 31 50 -51 357 -45 -166 -46 147 70 114 112 -52 -253
8143 -253 101 88 -42 -7 24 -120 292 -185 -55 48 38 24 246 -4 -135 199 -317 129 94 -166 14 -6
8165 -6 105 75 -249 -182 116 -226 -7 -135 72 -261 -18 325 -315 361 86 76 115 -13 -98 58 -220 81
8187 81 347 -247 146 123
8191A23
##END NTUPLES=NMR FID
##END=
